Console Output

Started by user Marc Nuri
Running as Marc Nuri
Running in Durability level: PERFORMANCE_OPTIMIZED
[Pipeline] Start of Pipeline
[Pipeline] node
Still waiting to schedule task
Waiting for next available executor
Agent basic-k7jqf is provisioned from template basic
---
apiVersion: "v1"
kind: "Pod"
metadata:
  annotations: {}
  labels:
    jenkins: "slave"
    jenkins/label: ""
  name: "basic-k7jqf"
spec:
  containers:
  - env:
    - name: "JENKINS_SECRET"
      value: "********"
    - name: "JENKINS_TUNNEL"
      value: "jenkins-discovery.jkube.svc.cluster.local:50000"
    - name: "JENKINS_AGENT_NAME"
      value: "basic-k7jqf"
    - name: "JENKINS_REMOTING_JAVA_OPTS"
      value: "-showversion -XshowSettings:vm -Xmx256m -Dsun.zip.disableMemoryMapping=true\
        \ -Dorg.jenkinsci.remoting.engine.JnlpProtocol3.disabled=true -Dorg.jenkinsci.plugins.gitclient.CliGitAPIImpl.useSETSID=true"
    - name: "JAVA_TOOL_OPTIONS"
      value: ""
    - name: "_JAVA_OPTIONS"
      value: ""
    - name: "OPENJ9_JAVA_OPTIONS"
      value: "-XX:+IgnoreUnrecognizedVMOptions -XX:+IdleTuningCompactOnIdle -XX:+IdleTuningGcOnIdle"
    - name: "JENKINS_NAME"
      value: "basic-k7jqf"
    - name: "JENKINS_AGENT_WORKDIR"
      value: "/home/jenkins/agent"
    - name: "JENKINS_URL"
      value: "http://jenkins-ui.jkube.svc.cluster.local/jkube/"
    image: "docker.io/eclipsecbi/jiro-agent-basic:remoting-4.2.1"
    imagePullPolicy: "Always"
    name: "jnlp"
    resources:
      limits:
        memory: "4096Mi"
        cpu: "2000m"
      requests:
        memory: "4096Mi"
        cpu: "1000m"
    securityContext:
      privileged: false
    tty: true
    volumeMounts:
    - mountPath: "/home/jenkins/.m2/toolchains.xml"
      name: "m2-dir"
      readOnly: true
      subPath: "toolchains.xml"
    - mountPath: "/home/jenkins/.mavenrc"
      name: "m2-dir"
      readOnly: true
      subPath: ".mavenrc"
    - mountPath: "/opt/tools"
      name: "volume-0"
      readOnly: false
    - mountPath: "/home/jenkins"
      name: "volume-2"
      readOnly: false
    - mountPath: "/home/jenkins/.m2/repository"
      name: "volume-3"
      readOnly: false
    - mountPath: "/home/jenkins/.m2/settings-security.xml"
      name: "m2-secret-dir"
      readOnly: true
      subPath: "settings-security.xml"
    - mountPath: "/home/jenkins/.m2/wrapper"
      name: "volume-4"
      readOnly: false
    - mountPath: "/home/jenkins/.m2/settings.xml"
      name: "m2-secret-dir"
      readOnly: true
      subPath: "settings.xml"
    - mountPath: "/home/jenkins/.ssh"
      name: "volume-1"
      readOnly: false
    - mountPath: "/home/jenkins/agent"
      name: "workspace-volume"
      readOnly: false
    workingDir: "/home/jenkins/agent"
  nodeSelector:
    beta.kubernetes.io/os: "linux"
  restartPolicy: "Never"
  securityContext: {}
  volumes:
  - name: "volume-0"
    persistentVolumeClaim:
      claimName: "tools-claim-jiro-jkube"
      readOnly: true
  - name: "m2-secret-dir"
    secret:
      secretName: "m2-secret-dir"
  - emptyDir:
      medium: ""
    name: "volume-2"
  - configMap:
      name: "m2-dir"
    name: "m2-dir"
  - configMap:
      name: "known-hosts"
    name: "volume-1"
  - emptyDir:
      medium: ""
    name: "workspace-volume"
  - emptyDir:
      medium: ""
    name: "volume-4"
  - emptyDir:
      medium: ""
    name: "volume-3"

Running on basic-k7jqf in /home/jenkins/agent/workspace/simplified-downloads-eclipse-release
[Pipeline] {
[Pipeline] stage
[Pipeline] { (Declarative: Tool Install)
[Pipeline] tool
[Pipeline] envVarsForTool
[Pipeline] tool
[Pipeline] envVarsForTool
[Pipeline] }
[Pipeline] // stage
[Pipeline] withEnv
[Pipeline] {
[Pipeline] stage
[Pipeline] { (Build)
[Pipeline] tool
[Pipeline] envVarsForTool
[Pipeline] tool
[Pipeline] envVarsForTool
[Pipeline] withEnv
[Pipeline] {
[Pipeline] withCredentials
Masking supported pattern matches of $KEYRING
[Pipeline] {
[Pipeline] sh
+ gpg --batch --import ****
gpg: directory '/home/jenkins/.gnupg' created
gpg: keybox '/home/jenkins/.gnupg/pubring.kbx' created
gpg: /home/jenkins/.gnupg/trustdb.gpg: trustdb created
gpg: key 0E606F96DD7DFCF7: public key "Eclipse JKube Project <jkube-dev@eclipse.org>" imported
gpg: To migrate 'secring.gpg', with each smartcard, run: gpg --card-status
gpg: key 0E606F96DD7DFCF7: secret key imported
gpg: Total number processed: 1
gpg:               imported: 1
gpg:       secret keys read: 1
gpg:   secret keys imported: 1
[Pipeline] sh
+ gpg --list-keys --with-colons
+ awk -F: '/fpr:/ {print $10}'
+ sort -u
+ echo -e '5
y
'
+ gpg --batch --command-fd 0 --expert --edit-key 457838CBDA81BC97AFA6CA2FE5873BA480DD8283 trust
Secret subkeys are available.

pub  rsa4096/0E606F96DD7DFCF7
     created: 2019-12-16  expires: 2024-12-14  usage: SCEA
     trust: unknown       validity: unknown
ssb  rsa4096/E5873BA480DD8283
     created: 2019-12-16  expires: 2024-12-14  usage: S   
[ unknown] (1). Eclipse JKube Project <jkube-dev@eclipse.org>

pub  rsa4096/0E606F96DD7DFCF7
     created: 2019-12-16  expires: 2024-12-14  usage: SCEA
     trust: unknown       validity: unknown
ssb  rsa4096/E5873BA480DD8283
     created: 2019-12-16  expires: 2024-12-14  usage: S   
[ unknown] (1). Eclipse JKube Project <jkube-dev@eclipse.org>

Please decide how far you trust this user to correctly verify other users' keys
(by looking at passports, checking fingerprints from different sources, etc.)

  1 = I don't know or won't say
  2 = I do NOT trust
  3 = I trust marginally
  4 = I trust fully
  5 = I trust ultimately
  m = back to the main menu


pub  rsa4096/0E606F96DD7DFCF7
     created: 2019-12-16  expires: 2024-12-14  usage: SCEA
     trust: ultimate      validity: unknown
ssb  rsa4096/E5873BA480DD8283
     created: 2019-12-16  expires: 2024-12-14  usage: S   
[ unknown] (1). Eclipse JKube Project <jkube-dev@eclipse.org>
Please note that the shown key validity is not necessarily correct
unless you restart the program.

+ echo+  -e '5
y
'
gpg --batch --command-fd 0 --expert --edit-key 6706B5C326A62956291B76680E606F96DD7DFCF7 trust
Secret subkeys are available.

gpg: checking the trustdb
gpg: marginals needed: 3  completes needed: 1  trust model: pgp
gpg: depth: 0  valid:   1  signed:   0  trust: 0-, 0q, 0n, 0m, 0f, 1u
gpg: next trustdb check due at 2024-12-14
pub  rsa4096/0E606F96DD7DFCF7
     created: 2019-12-16  expires: 2024-12-14  usage: SCEA
     trust: ultimate      validity: ultimate
ssb  rsa4096/E5873BA480DD8283
     created: 2019-12-16  expires: 2024-12-14  usage: S   
[ultimate] (1). Eclipse JKube Project <jkube-dev@eclipse.org>

pub  rsa4096/0E606F96DD7DFCF7
     created: 2019-12-16  expires: 2024-12-14  usage: SCEA
     trust: ultimate      validity: ultimate
ssb  rsa4096/E5873BA480DD8283
     created: 2019-12-16  expires: 2024-12-14  usage: S   
[ultimate] (1). Eclipse JKube Project <jkube-dev@eclipse.org>

Please decide how far you trust this user to correctly verify other users' keys
(by looking at passports, checking fingerprints from different sources, etc.)

  1 = I don't know or won't say
  2 = I do NOT trust
  3 = I trust marginally
  4 = I trust fully
  5 = I trust ultimately
  m = back to the main menu


pub  rsa4096/0E606F96DD7DFCF7
     created: 2019-12-16  expires: 2024-12-14  usage: SCEA
     trust: ultimate      validity: ultimate
ssb  rsa4096/E5873BA480DD8283
     created: 2019-12-16  expires: 2024-12-14  usage: S   
[ultimate] (1). Eclipse JKube Project <jkube-dev@eclipse.org>

[Pipeline] }
[Pipeline] // withCredentials
[Pipeline] withCredentials
Masking supported pattern matches of $GH_TOKEN
[Pipeline] {
[Pipeline] }
[Pipeline] // withCredentials
[Pipeline] sshagent
[ssh-agent] Using credentials genie.jkube (ssh://genie.jkube@projects-storage.eclipse.org)
[ssh-agent] Looking for ssh-agent implementation...
[ssh-agent]   Exec ssh-agent (binary ssh-agent on a remote machine)
$ ssh-agent
SSH_AUTH_SOCK=/tmp/ssh-uYa9nxPImjvb/agent.137
SSH_AGENT_PID=139
Running ssh-add (command line suppressed)
Identity added: /home/jenkins/agent/workspace/simplified-downloads-eclipse-release@tmp/private_key_4496990761115865607.key (/home/jenkins/agent/workspace/simplified-downloads-eclipse-release@tmp/private_key_4496990761115865607.key)
[ssh-agent] Started.
[Pipeline] {
[Pipeline] sh
+ echo 'Cloning Project with tag v1.0.0-rc-1'
Cloning Project with tag v1.0.0-rc-1
+ git clone https://github.com/eclipse/jkube.git
Cloning into 'jkube'...
+ cd jkube
+ git fetch origin v1.0.0-rc-1
From https://github.com/eclipse/jkube
 * tag                 v1.0.0-rc-1 -> FETCH_HEAD
+ git checkout v1.0.0-rc-1
Note: switching to 'v1.0.0-rc-1'.

You are in 'detached HEAD' state. You can look around, make experimental
changes and commit them, and you can discard any commits you make in this
state without impacting any branches by switching back to a branch.

If you want to create a new branch to retain commits you create, you may
do so (now or later) by using -c with the switch command. Example:

  git switch -c <new-branch-name>

Or undo this operation with:

  git switch -

Turn off this advice by setting config variable advice.detachedHead to false

HEAD is now at bfacf748 [RELEASE] Updated project version to 1.0.0-rc-1
+ mvn org.apache.maven.plugins:maven-help-plugin:3.2.0:evaluate '-Dexpression=project.version' -q -DforceStdout
+ PROJECT_VERSION='Apache Maven 3.6.3 (cecedd343002696d0abb50b32b541b8a6ba2883f)
Maven home: /opt/tools/apache-maven/latest
Java version: 1.8.0_252, vendor: AdoptOpenJDK, runtime: /opt/tools/java/adoptopenjdk/hotspot-jdk-8/1.8.0_252-b09/jre
Default locale: en_US, platform encoding: UTF-8
OS name: "linux", version: "3.10.0-1062.el7.x86_64", arch: "amd64", family: "unix"
1.0.0-rc-1'
+ echo 'Releasing project with version Apache Maven 3.6.3 (cecedd343002696d0abb50b32b541b8a6ba2883f)
Maven home: /opt/tools/apache-maven/latest
Java version: 1.8.0_252, vendor: AdoptOpenJDK, runtime: /opt/tools/java/adoptopenjdk/hotspot-jdk-8/1.8.0_252-b09/jre
Default locale: en_US, platform encoding: UTF-8
OS name: "linux", version: "3.10.0-1062.el7.x86_64", arch: "amd64", family: "unix"
1.0.0-rc-1 to downloads.eclipse.org'
Releasing project with version Apache Maven 3.6.3 (cecedd343002696d0abb50b32b541b8a6ba2883f)
Maven home: /opt/tools/apache-maven/latest
Java version: 1.8.0_252, vendor: AdoptOpenJDK, runtime: /opt/tools/java/adoptopenjdk/hotspot-jdk-8/1.8.0_252-b09/jre
Default locale: en_US, platform encoding: UTF-8
OS name: "linux", version: "3.10.0-1062.el7.x86_64", arch: "amd64", family: "unix"
1.0.0-rc-1 to downloads.eclipse.org
+ mvn clean install
Apache Maven 3.6.3 (cecedd343002696d0abb50b32b541b8a6ba2883f)
Maven home: /opt/tools/apache-maven/latest
Java version: 1.8.0_252, vendor: AdoptOpenJDK, runtime: /opt/tools/java/adoptopenjdk/hotspot-jdk-8/1.8.0_252-b09/jre
Default locale: en_US, platform encoding: UTF-8
OS name: "linux", version: "3.10.0-1062.el7.x86_64", arch: "amd64", family: "unix"
[INFO] Scanning for projects...
[INFO] ------------------------------------------------------------------------
[INFO] Reactor Build Order:
[INFO] 
[INFO] JKube                                                              [pom]
[INFO] JKube Kit :: Parent                                                [pom]
[INFO] JKube Kit :: Documentation                                         [jar]
[INFO] JKube Kit :: Common :: Test                                        [jar]
[INFO] JKube Kit :: Common                                                [jar]
[INFO] JKube Kit :: Common Maven                                          [jar]
[INFO] JKube Kit :: Config :: Image                                       [jar]
[INFO] JKube Kit :: Config :: Resource                                    [jar]
[INFO] JKube Kit :: Build :: API                                          [jar]
[INFO] JKube Kit :: Build :: Service :: Docker                            [jar]
[INFO] JKube Kit :: Build :: Service :: JIB                               [jar]
[INFO] JKube Kit :: Config :: Service                                     [jar]
[INFO] JKube Kit :: Generator :: API                                      [jar]
[INFO] JKube Kit :: Generator :: Java Exec                                [jar]
[INFO] JKube Kit :: Generator :: WildFly Swarm                            [jar]
[INFO] JKube Kit :: Generator :: Karaf                                    [jar]
[INFO] JKube Kit :: Generator :: WebApp                                   [jar]
[INFO] JKube Kit :: Enricher :: API                                       [jar]
[INFO] JKube Kit :: Enricher :: Generic                                   [jar]
[INFO] JKube Kit :: Enricher :: Specific                                  [jar]
[INFO] JKube Kit :: Profile                                               [jar]
[INFO] JKube Kit :: Resource :: Helm                                      [jar]
[INFO] JKube Kit :: Watcher :: API                                        [jar]
[INFO] JKube Kit :: Watcher :: Standard                                   [jar]
[INFO] JKube Kit :: Spring-Boot                                           [jar]
[INFO] JKube Kit :: Thorntail                                             [jar]
[INFO] JKube Kit :: Vert.x                                                [jar]
[INFO] JKube Kit :: Quarkus                                               [jar]
[INFO] JKube Kit :: Open Liberty                                          [jar]
[INFO] JKube Kit :: WildFly JAR                                           [jar]
[INFO] JKube Kit                                                          [pom]
[INFO] Kubernetes Maven Plugin :: Parent                                  [pom]
[INFO] Kubernetes Maven Plugin :: Plugin                         [maven-plugin]
[INFO] Kubernetes Maven Plugin :: Integration Tests                       [jar]
[INFO] Kubernetes Maven Plugin :: Documentation                           [jar]
[INFO] OpenShift Maven Plugin:: Parent                                    [pom]
[INFO] OpenShift Maven Plugin :: Plugin                          [maven-plugin]
[INFO] OpenShift Maven Plugin :: Integration Tests                        [jar]
[INFO] 
[INFO] ----------------------< org.eclipse.jkube:jkube >-----------------------
[INFO] Building JKube 1.0.0-rc-1                                         [1/38]
[INFO] --------------------------------[ pom ]---------------------------------
[INFO] 
[INFO] --- maven-clean-plugin:2.5:clean (default-clean) @ jkube ---
[INFO] 
[INFO] --- maven-enforcer-plugin:1.4.1:enforce (dependency-convergence) @ jkube ---
[INFO] 
[INFO] --- maven-install-plugin:2.4:install (default-install) @ jkube ---
[INFO] Installing /home/jenkins/agent/workspace/simplified-downloads-eclipse-release/jkube/pom.xml to /home/jenkins/.m2/repository/org/eclipse/jkube/jkube/1.0.0-rc-1/jkube-1.0.0-rc-1.pom
[INFO] 
[INFO] -----------------< org.eclipse.jkube:jkube-kit-parent >-----------------
[INFO] Building JKube Kit :: Parent 1.0.0-rc-1                           [2/38]
[INFO] --------------------------------[ pom ]---------------------------------
[INFO] 
[INFO] --- maven-clean-plugin:2.5:clean (default-clean) @ jkube-kit-parent ---
[INFO] 
[INFO] --- maven-enforcer-plugin:1.4.1:enforce (dependency-convergence) @ jkube-kit-parent ---
[INFO] 
[INFO] --- maven-failsafe-plugin:2.19.1:integration-test (default) @ jkube-kit-parent ---
[INFO] No tests to run.
[WARNING] File encoding has not been set, using platform encoding UTF-8, i.e. build is platform dependent! The file encoding for reports output files should be provided by the POM property ${project.reporting.outputEncoding}.
[INFO] 
[INFO] --- maven-failsafe-plugin:2.19.1:verify (default) @ jkube-kit-parent ---
[WARNING] File encoding has not been set, using platform encoding UTF-8, i.e. build is platform dependent! The file encoding for reports output files should be provided by the POM property ${project.reporting.outputEncoding}.
[INFO] 
[INFO] --- maven-install-plugin:2.4:install (default-install) @ jkube-kit-parent ---
[INFO] Installing /home/jenkins/agent/workspace/simplified-downloads-eclipse-release/jkube/jkube-kit/parent/pom.xml to /home/jenkins/.m2/repository/org/eclipse/jkube/jkube-kit-parent/1.0.0-rc-1/jkube-kit-parent-1.0.0-rc-1.pom
[INFO] 
[INFO] ------------------< org.eclipse.jkube:jkube-kit-doc >-------------------
[INFO] Building JKube Kit :: Documentation 1.0.0-rc-1                    [3/38]
[INFO] --------------------------------[ jar ]---------------------------------
[INFO] 
[INFO] --- maven-clean-plugin:2.5:clean (default-clean) @ jkube-kit-doc ---
[INFO] 
[INFO] --- maven-enforcer-plugin:1.4.1:enforce (dependency-convergence) @ jkube-kit-doc ---
[INFO] 
[INFO] --- maven-resources-plugin:2.6:resources (default-resources) @ jkube-kit-doc ---
[INFO] Using 'UTF-8' encoding to copy filtered resources.
[INFO] skip non existing resourceDirectory /home/jenkins/agent/workspace/simplified-downloads-eclipse-release/jkube/jkube-kit/doc/src/main/resources
[INFO] 
[INFO] --- maven-compiler-plugin:3.6.2:compile (default-compile) @ jkube-kit-doc ---
[INFO] No sources to compile
[INFO] 
[INFO] --- maven-resources-plugin:2.6:testResources (default-testResources) @ jkube-kit-doc ---
[INFO] Using 'UTF-8' encoding to copy filtered resources.
[INFO] skip non existing resourceDirectory /home/jenkins/agent/workspace/simplified-downloads-eclipse-release/jkube/jkube-kit/doc/src/test/resources
[INFO] 
[INFO] --- maven-compiler-plugin:3.6.2:testCompile (default-testCompile) @ jkube-kit-doc ---
[INFO] No sources to compile
[INFO] 
[INFO] --- maven-surefire-plugin:2.19.1:test (default-test) @ jkube-kit-doc ---
[INFO] No tests to run.
[INFO] 
[INFO] --- maven-jar-plugin:2.4:jar (default-jar) @ jkube-kit-doc ---
[WARNING] JAR will be empty - no content was marked for inclusion!
[INFO] Building jar: /home/jenkins/agent/workspace/simplified-downloads-eclipse-release/jkube/jkube-kit/doc/target/jkube-kit-doc-1.0.0-rc-1.jar
[INFO] 
[INFO] --- asciidoctor-maven-plugin:1.5.5:process-asciidoc (output-html) @ jkube-kit-doc ---
[INFO] Using 'UTF-8' encoding to copy filtered resources.
[INFO] ignoreDelta true
[INFO] Copying 2 resources
[INFO] Copying file inc/diagrams/module-overview.puml
[INFO] Copying file inc/diagrams/overview.plantuml
java.io.IOException: Cannot run program "/usr/bin/dot": error=2, No such file or directory
	at java.lang.ProcessBuilder.start(ProcessBuilder.java:1048)
	at java.lang.Runtime.exec(Runtime.java:620)
	at net.sourceforge.plantuml.cucadiagram.dot.ProcessRunner$MainThread.startThreads(ProcessRunner.java:152)
	at net.sourceforge.plantuml.cucadiagram.dot.ProcessRunner$MainThread.runJob(ProcessRunner.java:112)
	at net.sourceforge.plantuml.api.TimeoutExecutor$MyThread.run(TimeoutExecutor.java:69)
Caused by: java.io.IOException: error=2, No such file or directory
	at java.lang.UNIXProcess.forkAndExec(Native Method)
	at java.lang.UNIXProcess.<init>(UNIXProcess.java:247)
	at java.lang.ProcessImpl.start(ProcessImpl.java:134)
	at java.lang.ProcessBuilder.start(ProcessBuilder.java:1029)
	... 4 more
java.io.IOException: Cannot run program "/usr/bin/dot": error=2, No such file or directory
	at java.lang.ProcessBuilder.start(ProcessBuilder.java:1048)
	at java.lang.Runtime.exec(Runtime.java:620)
	at net.sourceforge.plantuml.cucadiagram.dot.ProcessRunner$MainThread.startThreads(ProcessRunner.java:152)
	at net.sourceforge.plantuml.cucadiagram.dot.ProcessRunner$MainThread.runJob(ProcessRunner.java:112)
	at net.sourceforge.plantuml.api.TimeoutExecutor$MyThread.run(TimeoutExecutor.java:69)
Caused by: java.io.IOException: error=2, No such file or directory
	at java.lang.UNIXProcess.forkAndExec(Native Method)
	at java.lang.UNIXProcess.<init>(UNIXProcess.java:247)
	at java.lang.ProcessImpl.start(ProcessImpl.java:134)
	at java.lang.ProcessBuilder.start(ProcessBuilder.java:1029)
	... 4 more
[INFO] Rendered /home/jenkins/agent/workspace/simplified-downloads-eclipse-release/jkube/jkube-kit/doc/src/main/asciidoc/index.adoc
[INFO] 
[INFO] --- maven-failsafe-plugin:2.19.1:integration-test (default) @ jkube-kit-doc ---
[INFO] No tests to run.
[WARNING] File encoding has not been set, using platform encoding UTF-8, i.e. build is platform dependent! The file encoding for reports output files should be provided by the POM property ${project.reporting.outputEncoding}.
[INFO] 
[INFO] --- maven-failsafe-plugin:2.19.1:verify (default) @ jkube-kit-doc ---
[WARNING] File encoding has not been set, using platform encoding UTF-8, i.e. build is platform dependent! The file encoding for reports output files should be provided by the POM property ${project.reporting.outputEncoding}.
[INFO] 
[INFO] --- maven-install-plugin:2.4:install (default-install) @ jkube-kit-doc ---
[INFO] Installing /home/jenkins/agent/workspace/simplified-downloads-eclipse-release/jkube/jkube-kit/doc/target/jkube-kit-doc-1.0.0-rc-1.jar to /home/jenkins/.m2/repository/org/eclipse/jkube/jkube-kit-doc/1.0.0-rc-1/jkube-kit-doc-1.0.0-rc-1.jar
[INFO] Installing /home/jenkins/agent/workspace/simplified-downloads-eclipse-release/jkube/jkube-kit/doc/pom.xml to /home/jenkins/.m2/repository/org/eclipse/jkube/jkube-kit-doc/1.0.0-rc-1/jkube-kit-doc-1.0.0-rc-1.pom
[INFO] 
[INFO] --------------< org.eclipse.jkube:jkube-kit-common-test >---------------
[INFO] Building JKube Kit :: Common :: Test 1.0.0-rc-1                   [4/38]
[INFO] --------------------------------[ jar ]---------------------------------
[INFO] 
[INFO] --- maven-clean-plugin:2.5:clean (default-clean) @ jkube-kit-common-test ---
[INFO] 
[INFO] --- maven-enforcer-plugin:1.4.1:enforce (dependency-convergence) @ jkube-kit-common-test ---
[INFO] 
[INFO] --- maven-resources-plugin:2.6:resources (default-resources) @ jkube-kit-common-test ---
[INFO] Using 'UTF-8' encoding to copy filtered resources.
[INFO] skip non existing resourceDirectory /home/jenkins/agent/workspace/simplified-downloads-eclipse-release/jkube/jkube-kit/common-test/src/main/resources
[INFO] 
[INFO] --- maven-compiler-plugin:3.6.2:compile (default-compile) @ jkube-kit-common-test ---
[INFO] Changes detected - recompiling the module!
[INFO] Compiling 1 source file to /home/jenkins/agent/workspace/simplified-downloads-eclipse-release/jkube/jkube-kit/common-test/target/classes
[INFO] 
[INFO] --- maven-resources-plugin:2.6:testResources (default-testResources) @ jkube-kit-common-test ---
[INFO] Using 'UTF-8' encoding to copy filtered resources.
[INFO] skip non existing resourceDirectory /home/jenkins/agent/workspace/simplified-downloads-eclipse-release/jkube/jkube-kit/common-test/src/test/resources
[INFO] 
[INFO] --- maven-compiler-plugin:3.6.2:testCompile (default-testCompile) @ jkube-kit-common-test ---
[INFO] No sources to compile
[INFO] 
[INFO] --- maven-surefire-plugin:2.19.1:test (default-test) @ jkube-kit-common-test ---
[INFO] No tests to run.
[INFO] 
[INFO] --- maven-jar-plugin:2.4:jar (default-jar) @ jkube-kit-common-test ---
[INFO] Building jar: /home/jenkins/agent/workspace/simplified-downloads-eclipse-release/jkube/jkube-kit/common-test/target/jkube-kit-common-test-1.0.0-rc-1.jar
[INFO] 
[INFO] --- maven-failsafe-plugin:2.19.1:integration-test (default) @ jkube-kit-common-test ---
[INFO] No tests to run.
[WARNING] File encoding has not been set, using platform encoding UTF-8, i.e. build is platform dependent! The file encoding for reports output files should be provided by the POM property ${project.reporting.outputEncoding}.
[INFO] 
[INFO] --- maven-failsafe-plugin:2.19.1:verify (default) @ jkube-kit-common-test ---
[WARNING] File encoding has not been set, using platform encoding UTF-8, i.e. build is platform dependent! The file encoding for reports output files should be provided by the POM property ${project.reporting.outputEncoding}.
[INFO] 
[INFO] --- maven-install-plugin:2.4:install (default-install) @ jkube-kit-common-test ---
[INFO] Installing /home/jenkins/agent/workspace/simplified-downloads-eclipse-release/jkube/jkube-kit/common-test/target/jkube-kit-common-test-1.0.0-rc-1.jar to /home/jenkins/.m2/repository/org/eclipse/jkube/jkube-kit-common-test/1.0.0-rc-1/jkube-kit-common-test-1.0.0-rc-1.jar
[INFO] Installing /home/jenkins/agent/workspace/simplified-downloads-eclipse-release/jkube/jkube-kit/common-test/pom.xml to /home/jenkins/.m2/repository/org/eclipse/jkube/jkube-kit-common-test/1.0.0-rc-1/jkube-kit-common-test-1.0.0-rc-1.pom
[INFO] 
[INFO] -----------------< org.eclipse.jkube:jkube-kit-common >-----------------
[INFO] Building JKube Kit :: Common 1.0.0-rc-1                           [5/38]
[INFO] --------------------------------[ jar ]---------------------------------
[INFO] 
[INFO] --- maven-clean-plugin:2.5:clean (default-clean) @ jkube-kit-common ---
[INFO] 
[INFO] --- maven-enforcer-plugin:1.4.1:enforce (dependency-convergence) @ jkube-kit-common ---
[INFO] 
[INFO] --- maven-resources-plugin:2.6:resources (default-resources) @ jkube-kit-common ---
[INFO] Using 'UTF-8' encoding to copy filtered resources.
[INFO] Copying 1 resource
[INFO] 
[INFO] --- maven-compiler-plugin:3.6.2:compile (default-compile) @ jkube-kit-common ---
[INFO] Changes detected - recompiling the module!
[INFO] Compiling 57 source files to /home/jenkins/agent/workspace/simplified-downloads-eclipse-release/jkube/jkube-kit/common/target/classes
[WARNING] /home/jenkins/agent/workspace/simplified-downloads-eclipse-release/jkube/jkube-kit/common/src/main/java/org/eclipse/jkube/kit/common/util/ResourceUtil.java:[95,46] WRITE_NULL_MAP_VALUES in com.fasterxml.jackson.databind.SerializationFeature has been deprecated
[WARNING] /home/jenkins/agent/workspace/simplified-downloads-eclipse-release/jkube/jkube-kit/common/src/main/java/org/eclipse/jkube/kit/common/util/ResourceUtil.java:[94,46] WRITE_EMPTY_JSON_ARRAYS in com.fasterxml.jackson.databind.SerializationFeature has been deprecated
[INFO] /home/jenkins/agent/workspace/simplified-downloads-eclipse-release/jkube/jkube-kit/common/src/main/java/org/eclipse/jkube/kit/common/util/KubernetesHelper.java: Some input files use unchecked or unsafe operations.
[INFO] /home/jenkins/agent/workspace/simplified-downloads-eclipse-release/jkube/jkube-kit/common/src/main/java/org/eclipse/jkube/kit/common/util/KubernetesHelper.java: Recompile with -Xlint:unchecked for details.
[INFO] 
[INFO] --- maven-resources-plugin:2.6:testResources (default-testResources) @ jkube-kit-common ---
[INFO] Using 'UTF-8' encoding to copy filtered resources.
[INFO] Copying 15 resources
[INFO] 
[INFO] --- maven-compiler-plugin:3.6.2:testCompile (default-testCompile) @ jkube-kit-common ---
[INFO] Changes detected - recompiling the module!
[INFO] Compiling 33 source files to /home/jenkins/agent/workspace/simplified-downloads-eclipse-release/jkube/jkube-kit/common/target/test-classes
[INFO] 
[INFO] --- maven-surefire-plugin:2.19.1:test (default-test) @ jkube-kit-common ---

-------------------------------------------------------
 T E S T S
-------------------------------------------------------
Running org.eclipse.jkube.kit.common.util.KubernetesHelperTest
Tests run: 11, Failures: 0, Errors: 0, Skipped: 0, Time elapsed: 1.268 sec - in org.eclipse.jkube.kit.common.util.KubernetesHelperTest
Running org.eclipse.jkube.kit.common.util.ClassUtilTest
Tests run: 3, Failures: 0, Errors: 0, Skipped: 0, Time elapsed: 0.023 sec - in org.eclipse.jkube.kit.common.util.ClassUtilTest
Running org.eclipse.jkube.kit.common.util.XMLUtilTest
Tests run: 4, Failures: 0, Errors: 0, Skipped: 0, Time elapsed: 0.072 sec - in org.eclipse.jkube.kit.common.util.XMLUtilTest
Running org.eclipse.jkube.kit.common.util.FileUtilTest
Tests run: 9, Failures: 0, Errors: 0, Skipped: 1, Time elapsed: 0.041 sec - in org.eclipse.jkube.kit.common.util.FileUtilTest
Running org.eclipse.jkube.kit.common.util.MapUtilTest
Tests run: 3, Failures: 0, Errors: 0, Skipped: 0, Time elapsed: 0.001 sec - in org.eclipse.jkube.kit.common.util.MapUtilTest
Running org.eclipse.jkube.kit.common.util.SpringBootUtilTest
SLF4J: Failed to load class "org.slf4j.impl.StaticLoggerBinder".
SLF4J: Defaulting to no-operation (NOP) logger implementation
SLF4J: See http://www.slf4j.org/codes.html#StaticLoggerBinder for further details.
Tests run: 5, Failures: 0, Errors: 0, Skipped: 0, Time elapsed: 0.205 sec - in org.eclipse.jkube.kit.common.util.SpringBootUtilTest
Running org.eclipse.jkube.kit.common.util.Slf4jKitLoggerTest
Tests run: 5, Failures: 0, Errors: 0, Skipped: 0, Time elapsed: 0.015 sec - in org.eclipse.jkube.kit.common.util.Slf4jKitLoggerTest
Running org.eclipse.jkube.kit.common.util.OpenshiftHelperTest
Tests run: 19, Failures: 0, Errors: 0, Skipped: 0, Time elapsed: 0.339 sec - in org.eclipse.jkube.kit.common.util.OpenshiftHelperTest
Running org.eclipse.jkube.kit.common.util.TemplateUtilTest
Tests run: 1, Failures: 0, Errors: 0, Skipped: 0, Time elapsed: 0 sec - in org.eclipse.jkube.kit.common.util.TemplateUtilTest
Running org.eclipse.jkube.kit.common.util.ThorntailUtilTest
Tests run: 1, Failures: 0, Errors: 0, Skipped: 0, Time elapsed: 0.024 sec - in org.eclipse.jkube.kit.common.util.ThorntailUtilTest
Running org.eclipse.jkube.kit.common.util.IoUtilTest
Tests run: 3, Failures: 0, Errors: 0, Skipped: 0, Time elapsed: 0.001 sec - in org.eclipse.jkube.kit.common.util.IoUtilTest
Running org.eclipse.jkube.kit.common.util.ResourceUtilTest
Tests run: 1, Failures: 0, Errors: 0, Skipped: 0, Time elapsed: 0.012 sec - in org.eclipse.jkube.kit.common.util.ResourceUtilTest
Running org.eclipse.jkube.kit.common.util.CommandlineTest
Tests run: 8, Failures: 0, Errors: 0, Skipped: 0, Time elapsed: 0.002 sec - in org.eclipse.jkube.kit.common.util.CommandlineTest
Running org.eclipse.jkube.kit.common.util.PropertiesMappingParserTest
Tests run: 1, Failures: 0, Errors: 0, Skipped: 0, Time elapsed: 0.018 sec - in org.eclipse.jkube.kit.common.util.PropertiesMappingParserTest
Running org.eclipse.jkube.kit.common.util.AsciiDocParserTest
Tests run: 3, Failures: 0, Errors: 0, Skipped: 0, Time elapsed: 0.002 sec - in org.eclipse.jkube.kit.common.util.AsciiDocParserTest
Running org.eclipse.jkube.kit.common.util.PluginServiceFactoryTest
Tests run: 3, Failures: 0, Errors: 0, Skipped: 0, Time elapsed: 0.016 sec - in org.eclipse.jkube.kit.common.util.PluginServiceFactoryTest
Running org.eclipse.jkube.kit.common.util.LazyBuilderTest
Tests run: 2, Failures: 0, Errors: 0, Skipped: 0, Time elapsed: 0.003 sec - in org.eclipse.jkube.kit.common.util.LazyBuilderTest
Running org.eclipse.jkube.kit.common.util.EnvUtilTest
Tests run: 34, Failures: 0, Errors: 0, Skipped: 3, Time elapsed: 0.21 sec - in org.eclipse.jkube.kit.common.util.EnvUtilTest
Running org.eclipse.jkube.kit.common.util.YamlUtilTest
Tests run: 6, Failures: 0, Errors: 0, Skipped: 0, Time elapsed: 0.012 sec - in org.eclipse.jkube.kit.common.util.YamlUtilTest
Running org.eclipse.jkube.kit.common.util.Base64UtilTest
Tests run: 1, Failures: 0, Errors: 0, Skipped: 0, Time elapsed: 0.002 sec - in org.eclipse.jkube.kit.common.util.Base64UtilTest
Running org.eclipse.jkube.kit.common.archive.AssemblyFileSetUtilsProcessAssemblyFileSetTest
Tests run: 16, Failures: 0, Errors: 0, Skipped: 0, Time elapsed: 0.196 sec - in org.eclipse.jkube.kit.common.archive.AssemblyFileSetUtilsProcessAssemblyFileSetTest
Running org.eclipse.jkube.kit.common.archive.AssemblyFileSetUtilsTest
Tests run: 9, Failures: 0, Errors: 0, Skipped: 0, Time elapsed: 0.016 sec - in org.eclipse.jkube.kit.common.archive.AssemblyFileSetUtilsTest
Running org.eclipse.jkube.kit.common.archive.AssemblyFileUtilsTest
Tests run: 6, Failures: 0, Errors: 0, Skipped: 2, Time elapsed: 0.009 sec - in org.eclipse.jkube.kit.common.archive.AssemblyFileUtilsTest
Running org.eclipse.jkube.kit.common.AssemblyConfigurationTest
Tests run: 3, Failures: 0, Errors: 0, Skipped: 0, Time elapsed: 0.011 sec - in org.eclipse.jkube.kit.common.AssemblyConfigurationTest
Running org.eclipse.jkube.kit.common.service.MigrateServiceTest
Tests run: 4, Failures: 0, Errors: 0, Skipped: 0, Time elapsed: 0.091 sec - in org.eclipse.jkube.kit.common.service.MigrateServiceTest
Running org.eclipse.jkube.kit.common.ConfigsTest
Tests run: 20, Failures: 0, Errors: 0, Skipped: 0, Time elapsed: 0.1 sec - in org.eclipse.jkube.kit.common.ConfigsTest

Results :

Tests run: 181, Failures: 0, Errors: 0, Skipped: 6

[INFO] 
[INFO] --- maven-jar-plugin:2.4:jar (default-jar) @ jkube-kit-common ---
[INFO] Building jar: /home/jenkins/agent/workspace/simplified-downloads-eclipse-release/jkube/jkube-kit/common/target/jkube-kit-common-1.0.0-rc-1.jar
[INFO] 
[INFO] --- maven-failsafe-plugin:2.19.1:integration-test (default) @ jkube-kit-common ---
[WARNING] File encoding has not been set, using platform encoding UTF-8, i.e. build is platform dependent! The file encoding for reports output files should be provided by the POM property ${project.reporting.outputEncoding}.
[INFO] 
[INFO] --- maven-failsafe-plugin:2.19.1:verify (default) @ jkube-kit-common ---
[WARNING] File encoding has not been set, using platform encoding UTF-8, i.e. build is platform dependent! The file encoding for reports output files should be provided by the POM property ${project.reporting.outputEncoding}.
[INFO] 
[INFO] --- maven-install-plugin:2.4:install (default-install) @ jkube-kit-common ---
[INFO] Installing /home/jenkins/agent/workspace/simplified-downloads-eclipse-release/jkube/jkube-kit/common/target/jkube-kit-common-1.0.0-rc-1.jar to /home/jenkins/.m2/repository/org/eclipse/jkube/jkube-kit-common/1.0.0-rc-1/jkube-kit-common-1.0.0-rc-1.jar
[INFO] Installing /home/jenkins/agent/workspace/simplified-downloads-eclipse-release/jkube/jkube-kit/common/pom.xml to /home/jenkins/.m2/repository/org/eclipse/jkube/jkube-kit-common/1.0.0-rc-1/jkube-kit-common-1.0.0-rc-1.pom
[INFO] 
[INFO] --------------< org.eclipse.jkube:jkube-kit-common-maven >--------------
[INFO] Building JKube Kit :: Common Maven 1.0.0-rc-1                     [6/38]
[INFO] --------------------------------[ jar ]---------------------------------
Aborted by Marc Nuri
Sending interrupt signal to process
script returned exit code 143
[Pipeline] }
$ ssh-agent -k
unset SSH_AUTH_SOCK;
unset SSH_AGENT_PID;
echo Agent pid 139 killed;
[ssh-agent] Stopped.
[Pipeline] // sshagent
[Pipeline] }
[Pipeline] // withEnv
[Pipeline] }
[Pipeline] // stage
[Pipeline] }
[Pipeline] // withEnv
[Pipeline] }
[Pipeline] // node
[Pipeline] End of Pipeline
Finished: ABORTED