Console Output

Started calculate disk usage of build
Finished Calculation of disk usage of build in 0 seconds
Started calculate disk usage of workspace
Finished Calculation of disk usage of workspace in 0 seconds
[INFO] 
[INFO] --< org.glassfish.jersey.examples.osgi-http-service:functional-test >---
[INFO] Building jersey-examples-osgi-http-service-test 2.28-SNAPSHOT  [306/324]
[INFO] --------------------------------[ pom ]---------------------------------
[INFO] Downloading from eclipse.maven.central.mirror: https://repo.eclipse.org/content/repositories/maven_central/com/sun/grizzly/osgi/grizzly-httpservice-bundle/1.9.45/grizzly-httpservice-bundle-1.9.45.pom
[INFO] Downloaded from eclipse.maven.central.mirror: https://repo.eclipse.org/content/repositories/maven_central/com/sun/grizzly/osgi/grizzly-httpservice-bundle/1.9.45/grizzly-httpservice-bundle-1.9.45.pom (5.7 kB at 195 kB/s)
[INFO] Downloading from eclipse.maven.central.mirror: https://repo.eclipse.org/content/repositories/maven_central/com/sun/grizzly/grizzly-project/1.9.45/grizzly-project-1.9.45.pom
[INFO] Downloaded from eclipse.maven.central.mirror: https://repo.eclipse.org/content/repositories/maven_central/com/sun/grizzly/grizzly-project/1.9.45/grizzly-project-1.9.45.pom (21 kB at 782 kB/s)
[INFO] Downloading from eclipse.maven.central.mirror: https://repo.eclipse.org/content/repositories/maven_central/com/sun/grizzly/grizzly-http-servlet/1.9.45/grizzly-http-servlet-1.9.45.pom
[INFO] Downloaded from eclipse.maven.central.mirror: https://repo.eclipse.org/content/repositories/maven_central/com/sun/grizzly/grizzly-http-servlet/1.9.45/grizzly-http-servlet-1.9.45.pom (5.7 kB at 146 kB/s)
[INFO] Downloading from eclipse.maven.central.mirror: https://repo.eclipse.org/content/repositories/maven_central/com/sun/grizzly/grizzly-utils/1.9.45/grizzly-utils-1.9.45.pom
[INFO] Downloaded from eclipse.maven.central.mirror: https://repo.eclipse.org/content/repositories/maven_central/com/sun/grizzly/grizzly-utils/1.9.45/grizzly-utils-1.9.45.pom (6.8 kB at 242 kB/s)
[INFO] Downloading from eclipse.maven.central.mirror: https://repo.eclipse.org/content/repositories/maven_central/com/sun/grizzly/grizzly-lzma/1.9.45/grizzly-lzma-1.9.45.pom
[INFO] Downloaded from eclipse.maven.central.mirror: https://repo.eclipse.org/content/repositories/maven_central/com/sun/grizzly/grizzly-lzma/1.9.45/grizzly-lzma-1.9.45.pom (4.3 kB at 180 kB/s)
[INFO] Downloading from eclipse.maven.central.mirror: https://repo.eclipse.org/content/repositories/maven_central/com/sun/grizzly/grizzly-extra/1.9.45/grizzly-extra-1.9.45.pom
[INFO] Downloaded from eclipse.maven.central.mirror: https://repo.eclipse.org/content/repositories/maven_central/com/sun/grizzly/grizzly-extra/1.9.45/grizzly-extra-1.9.45.pom (3.0 kB at 123 kB/s)
[INFO] Downloading from eclipse.maven.central.mirror: https://repo.eclipse.org/content/repositories/maven_central/com/sun/grizzly/grizzly-comet/1.9.45/grizzly-comet-1.9.45.pom
[INFO] Downloaded from eclipse.maven.central.mirror: https://repo.eclipse.org/content/repositories/maven_central/com/sun/grizzly/grizzly-comet/1.9.45/grizzly-comet-1.9.45.pom (4.2 kB at 174 kB/s)
[INFO] Downloading from eclipse.maven.central.mirror: https://repo.eclipse.org/content/repositories/maven_central/com/sun/grizzly/grizzly-http/1.9.45/grizzly-http-1.9.45.pom
[INFO] Downloaded from eclipse.maven.central.mirror: https://repo.eclipse.org/content/repositories/maven_central/com/sun/grizzly/grizzly-http/1.9.45/grizzly-http-1.9.45.pom (5.0 kB at 174 kB/s)
[INFO] Downloading from eclipse.maven.central.mirror: https://repo.eclipse.org/content/repositories/maven_central/com/sun/grizzly/grizzly-framework/1.9.45/grizzly-framework-1.9.45.pom
[INFO] Downloaded from eclipse.maven.central.mirror: https://repo.eclipse.org/content/repositories/maven_central/com/sun/grizzly/grizzly-framework/1.9.45/grizzly-framework-1.9.45.pom (5.1 kB at 205 kB/s)
[INFO] Downloading from eclipse.maven.central.mirror: https://repo.eclipse.org/content/repositories/maven_central/com/sun/grizzly/grizzly-rcm/1.9.45/grizzly-rcm-1.9.45.pom
[INFO] Downloaded from eclipse.maven.central.mirror: https://repo.eclipse.org/content/repositories/maven_central/com/sun/grizzly/grizzly-rcm/1.9.45/grizzly-rcm-1.9.45.pom (4.3 kB at 178 kB/s)
[INFO] Downloading from eclipse.maven.central.mirror: https://repo.eclipse.org/content/repositories/maven_central/com/sun/grizzly/grizzly-portunif/1.9.45/grizzly-portunif-1.9.45.pom
[INFO] Downloaded from eclipse.maven.central.mirror: https://repo.eclipse.org/content/repositories/maven_central/com/sun/grizzly/grizzly-portunif/1.9.45/grizzly-portunif-1.9.45.pom (4.1 kB at 170 kB/s)
[INFO] Downloading from eclipse.maven.central.mirror: https://repo.eclipse.org/content/repositories/maven_central/com/sun/grizzly/osgi/grizzly-httpservice/1.9.45/grizzly-httpservice-1.9.45.pom
[INFO] Downloaded from eclipse.maven.central.mirror: https://repo.eclipse.org/content/repositories/maven_central/com/sun/grizzly/osgi/grizzly-httpservice/1.9.45/grizzly-httpservice-1.9.45.pom (6.1 kB at 254 kB/s)
[INFO] Downloading from eclipse.maven.central.mirror: https://repo.eclipse.org/content/repositories/maven_central/com/sun/grizzly/osgi/grizzly-httpservice-bundle/1.9.45/grizzly-httpservice-bundle-1.9.45.jar
[INFO] Downloading from eclipse.maven.central.mirror: https://repo.eclipse.org/content/repositories/maven_central/com/sun/grizzly/grizzly-utils/1.9.45/grizzly-utils-1.9.45.jar
[INFO] Downloading from eclipse.maven.central.mirror: https://repo.eclipse.org/content/repositories/maven_central/com/sun/grizzly/grizzly-lzma/1.9.45/grizzly-lzma-1.9.45.jar
[INFO] Downloading from eclipse.maven.central.mirror: https://repo.eclipse.org/content/repositories/maven_central/com/sun/grizzly/grizzly-comet/1.9.45/grizzly-comet-1.9.45.jar
[INFO] Downloading from eclipse.maven.central.mirror: https://repo.eclipse.org/content/repositories/maven_central/com/sun/grizzly/grizzly-http-servlet/1.9.45/grizzly-http-servlet-1.9.45.jar
[INFO] Downloaded from eclipse.maven.central.mirror: https://repo.eclipse.org/content/repositories/maven_central/com/sun/grizzly/grizzly-http-servlet/1.9.45/grizzly-http-servlet-1.9.45.jar (74 kB at 1.3 MB/s)
[INFO] Downloading from eclipse.maven.central.mirror: https://repo.eclipse.org/content/repositories/maven_central/com/sun/grizzly/grizzly-http/1.9.45/grizzly-http-1.9.45.jar
[INFO] Downloaded from eclipse.maven.central.mirror: https://repo.eclipse.org/content/repositories/maven_central/com/sun/grizzly/grizzly-lzma/1.9.45/grizzly-lzma-1.9.45.jar (55 kB at 939 kB/s)
[INFO] Downloading from eclipse.maven.central.mirror: https://repo.eclipse.org/content/repositories/maven_central/com/sun/grizzly/osgi/grizzly-httpservice/1.9.45/grizzly-httpservice-1.9.45.jar
[INFO] Downloaded from eclipse.maven.central.mirror: https://repo.eclipse.org/content/repositories/maven_central/com/sun/grizzly/grizzly-comet/1.9.45/grizzly-comet-1.9.45.jar (30 kB at 479 kB/s)
[INFO] Downloading from eclipse.maven.central.mirror: https://repo.eclipse.org/content/repositories/maven_central/com/sun/grizzly/grizzly-framework/1.9.45/grizzly-framework-1.9.45.jar
[INFO] Downloaded from eclipse.maven.central.mirror: https://repo.eclipse.org/content/repositories/maven_central/com/sun/grizzly/grizzly-utils/1.9.45/grizzly-utils-1.9.45.jar (509 kB at 5.5 MB/s)
[INFO] Downloading from eclipse.maven.central.mirror: https://repo.eclipse.org/content/repositories/maven_central/com/sun/grizzly/grizzly-rcm/1.9.45/grizzly-rcm-1.9.45.jar
[INFO] Downloaded from eclipse.maven.central.mirror: https://repo.eclipse.org/content/repositories/maven_central/com/sun/grizzly/grizzly-http/1.9.45/grizzly-http-1.9.45.jar (187 kB at 1.9 MB/s)
[INFO] Downloading from eclipse.maven.central.mirror: https://repo.eclipse.org/content/repositories/maven_central/com/sun/grizzly/grizzly-portunif/1.9.45/grizzly-portunif-1.9.45.jar
[INFO] Downloaded from eclipse.maven.central.mirror: https://repo.eclipse.org/content/repositories/maven_central/com/sun/grizzly/osgi/grizzly-httpservice/1.9.45/grizzly-httpservice-1.9.45.jar (67 kB at 660 kB/s)
[INFO] Downloaded from eclipse.maven.central.mirror: https://repo.eclipse.org/content/repositories/maven_central/com/sun/grizzly/osgi/grizzly-httpservice-bundle/1.9.45/grizzly-httpservice-bundle-1.9.45.jar (1.2 MB at 11 MB/s)
[INFO] Downloaded from eclipse.maven.central.mirror: https://repo.eclipse.org/content/repositories/maven_central/com/sun/grizzly/grizzly-framework/1.9.45/grizzly-framework-1.9.45.jar (245 kB at 2.1 MB/s)
[INFO] Downloaded from eclipse.maven.central.mirror: https://repo.eclipse.org/content/repositories/maven_central/com/sun/grizzly/grizzly-rcm/1.9.45/grizzly-rcm-1.9.45.jar (10 kB at 89 kB/s)
[INFO] Downloaded from eclipse.maven.central.mirror: https://repo.eclipse.org/content/repositories/maven_central/com/sun/grizzly/grizzly-portunif/1.9.45/grizzly-portunif-1.9.45.jar (20 kB at 151 kB/s)
[INFO] 
[INFO] --- maven-clean-plugin:2.5:clean (default-clean) @ functional-test ---
[INFO] 
[INFO] --- maven-enforcer-plugin:1.4.1:enforce (enforce-versions) @ functional-test ---
[INFO] 
[INFO] --- maven-checkstyle-plugin:2.16:check (verify) @ functional-test ---
[INFO] Starting audit...
Audit done.
[INFO] 
[INFO] --- maven-paxexam-plugin:1.2.4:generate-depends-file (generate-config) @ functional-test ---
[INFO] Created: /home/jenkins/workspace/Jersey_sign/examples/osgi-http-service/functional-test/target/classes/META-INF/maven/dependencies.properties
[INFO] 
[INFO] --- maven-resources-plugin:2.6:testResources (default) @ functional-test ---
[INFO] Using 'UTF-8' encoding to copy filtered resources.
[INFO] Copying 1 resource
[INFO] 
[INFO] --- maven-compiler-plugin:3.1:testCompile (test-compile) @ functional-test ---
[INFO] Changes detected - recompiling the module!
[INFO] Compiling 3 source files to /home/jenkins/workspace/Jersey_sign/examples/osgi-http-service/functional-test/target/test-classes
[WARNING] /home/jenkins/workspace/Jersey_sign/examples/osgi-http-service/functional-test/src/test/java/org/glassfish/jersey/examples/osgihttpservice/test/AbstractHttpServiceTest.java: /home/jenkins/workspace/Jersey_sign/examples/osgi-http-service/functional-test/src/test/java/org/glassfish/jersey/examples/osgihttpservice/test/AbstractHttpServiceTest.java uses unchecked or unsafe operations.
[WARNING] /home/jenkins/workspace/Jersey_sign/examples/osgi-http-service/functional-test/src/test/java/org/glassfish/jersey/examples/osgihttpservice/test/AbstractHttpServiceTest.java: Recompile with -Xlint:unchecked for details.
[INFO] 
[INFO] --- maven-surefire-plugin:2.18.1:test (test) @ functional-test ---
[WARNING] The parameter forkMode is deprecated since version 2.14. Use forkCount and reuseForks instead.
[INFO] Surefire report directory: /home/jenkins/workspace/Jersey_sign/examples/osgi-http-service/functional-test/target/surefire-reports

-------------------------------------------------------
 T E S T S
-------------------------------------------------------
Picked up JAVA_TOOL_OPTIONS: -XX:+UnlockExperimentalVMOptions -XX:+UseCGroupMemoryLimitForHeap
Running org.glassfish.jersey.examples.osgihttpservice.test.GrizzlyHttpServiceFelixTest
Picked up JAVA_TOOL_OPTIONS: -XX:+UnlockExperimentalVMOptions -XX:+UseCGroupMemoryLimitForHeap

Tests run: 1, Failures: 0, Errors: 1, Skipped: 0, Time elapsed: 1.918 sec <<< FAILURE! - in org.glassfish.jersey.examples.osgihttpservice.test.GrizzlyHttpServiceFelixTest
testHttpServiceMethod(org.glassfish.jersey.examples.osgihttpservice.test.GrizzlyHttpServiceFelixTest)  Time elapsed: 1.894 sec  <<< ERROR!
java.io.IOException: Error resolving artifact org.glassfish.jersey.core:jersey-common:jar:2.28-SNAPSHOT: Could not find artifact org.glassfish.jersey.core:jersey-common:jar:2.28-SNAPSHOT
	at org.ops4j.pax.url.mvn.internal.AetherBasedResolver.resolve(AetherBasedResolver.java:626)
	at org.ops4j.pax.url.mvn.internal.AetherBasedResolver.resolve(AetherBasedResolver.java:570)
	at org.ops4j.pax.url.mvn.internal.AetherBasedResolver.resolve(AetherBasedResolver.java:548)
	at org.ops4j.pax.url.mvn.internal.AetherBasedResolver.resolve(AetherBasedResolver.java:523)
	at org.ops4j.pax.url.mvn.internal.Connection.getInputStream(Connection.java:123)
	at java.net.URL.openStream(URL.java:1045)
	at org.ops4j.pax.exam.forked.provision.StreamUtils.streamCopy(StreamUtils.java:103)
	at org.ops4j.pax.exam.forked.provision.PlatformImpl.download(PlatformImpl.java:133)
	at org.ops4j.pax.exam.forked.ForkedTestContainer.downloadBundle(ForkedTestContainer.java:354)
	at org.ops4j.pax.exam.forked.ForkedTestContainer.installAndStartBundles(ForkedTestContainer.java:283)
	at org.ops4j.pax.exam.forked.ForkedTestContainer.start(ForkedTestContainer.java:165)
	at org.ops4j.pax.exam.spi.reactors.AllConfinedStagedReactor.invoke(AllConfinedStagedReactor.java:79)
	at org.ops4j.pax.exam.junit.impl.ProbeRunner$2.evaluate(ProbeRunner.java:267)
	at org.junit.runners.ParentRunner.runLeaf(ParentRunner.java:325)
	at org.junit.runners.BlockJUnit4ClassRunner.runChild(BlockJUnit4ClassRunner.java:78)
	at org.junit.runners.BlockJUnit4ClassRunner.runChild(BlockJUnit4ClassRunner.java:57)
	at org.junit.runners.ParentRunner$3.run(ParentRunner.java:290)
	at org.junit.runners.ParentRunner$1.schedule(ParentRunner.java:71)
	at org.junit.runners.ParentRunner.runChildren(ParentRunner.java:288)
	at org.junit.runners.ParentRunner.access$000(ParentRunner.java:58)
	at org.junit.runners.ParentRunner$2.evaluate(ParentRunner.java:268)
	at org.junit.runners.ParentRunner.run(ParentRunner.java:363)
	at org.ops4j.pax.exam.junit.impl.ProbeRunner.run(ProbeRunner.java:98)
	at org.ops4j.pax.exam.junit.PaxExam.run(PaxExam.java:93)
	at org.apache.maven.surefire.junit4.JUnit4Provider.execute(JUnit4Provider.java:283)
	at org.apache.maven.surefire.junit4.JUnit4Provider.executeWithRerun(JUnit4Provider.java:173)
	at org.apache.maven.surefire.junit4.JUnit4Provider.executeTestSet(JUnit4Provider.java:153)
	at org.apache.maven.surefire.junit4.JUnit4Provider.invoke(JUnit4Provider.java:128)
	at org.apache.maven.surefire.booter.ForkedBooter.invokeProviderInSameClassLoader(ForkedBooter.java:203)
	at org.apache.maven.surefire.booter.ForkedBooter.runSuitesInProcess(ForkedBooter.java:155)
	at org.apache.maven.surefire.booter.ForkedBooter.main(ForkedBooter.java:103)


Picked up JAVA_TOOL_OPTIONS: -XX:+UnlockExperimentalVMOptions -XX:+UseCGroupMemoryLimitForHeap
Running org.glassfish.jersey.examples.osgihttpservice.test.JettyHttpServiceFelixTest
Picked up JAVA_TOOL_OPTIONS: -XX:+UnlockExperimentalVMOptions -XX:+UseCGroupMemoryLimitForHeap

Tests run: 1, Failures: 0, Errors: 1, Skipped: 0, Time elapsed: 1.822 sec <<< FAILURE! - in org.glassfish.jersey.examples.osgihttpservice.test.JettyHttpServiceFelixTest
testHttpServiceMethod(org.glassfish.jersey.examples.osgihttpservice.test.JettyHttpServiceFelixTest)  Time elapsed: 1.795 sec  <<< ERROR!
java.io.IOException: Error resolving artifact org.glassfish.jersey.core:jersey-common:jar:2.28-SNAPSHOT: Could not find artifact org.glassfish.jersey.core:jersey-common:jar:2.28-SNAPSHOT
	at org.ops4j.pax.url.mvn.internal.AetherBasedResolver.resolve(AetherBasedResolver.java:626)
	at org.ops4j.pax.url.mvn.internal.AetherBasedResolver.resolve(AetherBasedResolver.java:570)
	at org.ops4j.pax.url.mvn.internal.AetherBasedResolver.resolve(AetherBasedResolver.java:548)
	at org.ops4j.pax.url.mvn.internal.AetherBasedResolver.resolve(AetherBasedResolver.java:523)
	at org.ops4j.pax.url.mvn.internal.Connection.getInputStream(Connection.java:123)
	at java.net.URL.openStream(URL.java:1045)
	at org.ops4j.pax.exam.forked.provision.StreamUtils.streamCopy(StreamUtils.java:103)
	at org.ops4j.pax.exam.forked.provision.PlatformImpl.download(PlatformImpl.java:133)
	at org.ops4j.pax.exam.forked.ForkedTestContainer.downloadBundle(ForkedTestContainer.java:354)
	at org.ops4j.pax.exam.forked.ForkedTestContainer.installAndStartBundles(ForkedTestContainer.java:283)
	at org.ops4j.pax.exam.forked.ForkedTestContainer.start(ForkedTestContainer.java:165)
	at org.ops4j.pax.exam.spi.reactors.AllConfinedStagedReactor.invoke(AllConfinedStagedReactor.java:79)
	at org.ops4j.pax.exam.junit.impl.ProbeRunner$2.evaluate(ProbeRunner.java:267)
	at org.junit.runners.ParentRunner.runLeaf(ParentRunner.java:325)
	at org.junit.runners.BlockJUnit4ClassRunner.runChild(BlockJUnit4ClassRunner.java:78)
	at org.junit.runners.BlockJUnit4ClassRunner.runChild(BlockJUnit4ClassRunner.java:57)
	at org.junit.runners.ParentRunner$3.run(ParentRunner.java:290)
	at org.junit.runners.ParentRunner$1.schedule(ParentRunner.java:71)
	at org.junit.runners.ParentRunner.runChildren(ParentRunner.java:288)
	at org.junit.runners.ParentRunner.access$000(ParentRunner.java:58)
	at org.junit.runners.ParentRunner$2.evaluate(ParentRunner.java:268)
	at org.junit.runners.ParentRunner.run(ParentRunner.java:363)
	at org.ops4j.pax.exam.junit.impl.ProbeRunner.run(ProbeRunner.java:98)
	at org.ops4j.pax.exam.junit.PaxExam.run(PaxExam.java:93)
	at org.apache.maven.surefire.junit4.JUnit4Provider.execute(JUnit4Provider.java:283)
	at org.apache.maven.surefire.junit4.JUnit4Provider.executeWithRerun(JUnit4Provider.java:173)
	at org.apache.maven.surefire.junit4.JUnit4Provider.executeTestSet(JUnit4Provider.java:153)
	at org.apache.maven.surefire.junit4.JUnit4Provider.invoke(JUnit4Provider.java:128)
	at org.apache.maven.surefire.booter.ForkedBooter.invokeProviderInSameClassLoader(ForkedBooter.java:203)
	at org.apache.maven.surefire.booter.ForkedBooter.runSuitesInProcess(ForkedBooter.java:155)
	at org.apache.maven.surefire.booter.ForkedBooter.main(ForkedBooter.java:103)



Results :

Tests in error: 
  GrizzlyHttpServiceFelixTest.testHttpServiceMethod ? IO Error resolving artifac...
  JettyHttpServiceFelixTest.testHttpServiceMethod ? IO Error resolving artifact ...

Tests run: 2, Failures: 0, Errors: 2, Skipped: 0

[ERROR] There are test failures.

Please refer to /home/jenkins/workspace/Jersey_sign/examples/osgi-http-service/functional-test/target/surefire-reports for the individual test results.
[JENKINS] Recording test results
[INFO] 
[INFO] --- maven-source-plugin:2.2.1:jar-no-fork (attach-sources) @ functional-test ---