Console Output

Started calculate disk usage of build
Finished Calculation of disk usage of build in 0 seconds
Started calculate disk usage of workspace
Finished Calculation of disk usage of workspace in 0 seconds
[INFO] 
[INFO] --------------< org.glassfish.jersey.core:jersey-client >---------------
[INFO] Building jersey-core-client 2.28-SNAPSHOT                       [11/324]
[INFO] --------------------------------[ jar ]---------------------------------
[INFO] Downloading from eclipse.maven.central.mirror: https://repo.eclipse.org/content/repositories/maven_central/org/mockito/mockito-all/1.10.19/mockito-all-1.10.19.pom
[INFO] Downloaded from eclipse.maven.central.mirror: https://repo.eclipse.org/content/repositories/maven_central/org/mockito/mockito-all/1.10.19/mockito-all-1.10.19.pom (930 B at 22 kB/s)
[INFO] Downloading from eclipse.maven.central.mirror: https://repo.eclipse.org/content/repositories/maven_central/org/mockito/mockito-all/1.10.19/mockito-all-1.10.19.jar
[INFO] Downloaded from eclipse.maven.central.mirror: https://repo.eclipse.org/content/repositories/maven_central/org/mockito/mockito-all/1.10.19/mockito-all-1.10.19.jar (1.2 MB at 14 MB/s)
[INFO] 
[INFO] --- maven-clean-plugin:2.5:clean (default-clean) @ jersey-client ---
[INFO] 
[INFO] --- maven-enforcer-plugin:1.4.1:enforce (enforce-versions) @ jersey-client ---
[INFO] 
[INFO] --- maven-checkstyle-plugin:2.16:check (verify) @ jersey-client ---
[INFO] Starting audit...
Audit done.
[INFO] 
[INFO] --- build-helper-maven-plugin:1.7:parse-version (parse-version) @ jersey-client ---
[INFO] 
[INFO] --- maven-istack-commons-plugin:2.6.1:rs-gen (default) @ jersey-client ---
Resources:
org/glassfish/jersey/client/internal/jdkconnector/localization.properties
org/glassfish/jersey/client/internal/localization.properties
Processing /home/jenkins/workspace/Jersey_sign/core-client/src/main/resources/org/glassfish/jersey/client/internal/jdkconnector/localization.properties
Processing /home/jenkins/workspace/Jersey_sign/core-client/src/main/resources/org/glassfish/jersey/client/internal/localization.properties
org/glassfish/jersey/client/internal/LocalizationMessages.java
org/glassfish/jersey/client/internal/jdkconnector/LocalizationMessages.java
[INFO] 
[INFO] --- build-helper-maven-plugin:1.7:add-source (default) @ jersey-client ---
[INFO] Source directory: /home/jenkins/workspace/Jersey_sign/core-client/target/generated-sources/rsrc-gen added.
[INFO] 
[INFO] --- maven-resources-plugin:2.6:resources (default-resources) @ jersey-client ---
[INFO] Using 'UTF-8' encoding to copy filtered resources.
[INFO] Copying 2 resources
[INFO] 
[INFO] --- maven-compiler-plugin:3.1:compile (default-compile) @ jersey-client ---
[INFO] Changes detected - recompiling the module!
[INFO] Compiling 56 source files to /home/jenkins/workspace/Jersey_sign/core-client/target/classes
[WARNING] /home/jenkins/workspace/Jersey_sign/core-client/src/main/java/org/glassfish/jersey/client/JerseyInvocation.java: Some input files use unchecked or unsafe operations.
[WARNING] /home/jenkins/workspace/Jersey_sign/core-client/src/main/java/org/glassfish/jersey/client/JerseyInvocation.java: Recompile with -Xlint:unchecked for details.
[INFO] 
[INFO] --- maven-resources-plugin:2.6:testResources (default-testResources) @ jersey-client ---
[INFO] Using 'UTF-8' encoding to copy filtered resources.
[INFO] Copying 1 resource
[INFO] 
[INFO] --- maven-compiler-plugin:3.1:testCompile (default-testCompile) @ jersey-client ---
[INFO] Changes detected - recompiling the module!
[INFO] Compiling 24 source files to /home/jenkins/workspace/Jersey_sign/core-client/target/test-classes
[WARNING] /home/jenkins/workspace/Jersey_sign/core-client/src/test/java/org/glassfish/jersey/client/JerseyInvocationTest.java: /home/jenkins/workspace/Jersey_sign/core-client/src/test/java/org/glassfish/jersey/client/JerseyInvocationTest.java uses unchecked or unsafe operations.
[WARNING] /home/jenkins/workspace/Jersey_sign/core-client/src/test/java/org/glassfish/jersey/client/JerseyInvocationTest.java: Recompile with -Xlint:unchecked for details.
[INFO] 
[INFO] --- maven-surefire-plugin:2.18.1:test (default-test) @ jersey-client ---
[INFO] Surefire report directory: /home/jenkins/workspace/Jersey_sign/core-client/target/surefire-reports
[INFO] parallel='classesAndMethods', perCoreThreadCount=true, threadCount=1, useUnlimitedThreads=false, threadCountSuites=0, threadCountClasses=0, threadCountMethods=0, parallelOptimized=true

-------------------------------------------------------
 T E S T S
-------------------------------------------------------
Picked up JAVA_TOOL_OPTIONS: -XX:+UnlockExperimentalVMOptions -XX:+UseCGroupMemoryLimitForHeap
Running org.glassfish.jersey.client.DefaultSslContextProviderTest
Tests run: 4, Failures: 0, Errors: 0, Skipped: 0, Time elapsed: 0.824 sec - in org.glassfish.jersey.client.DefaultSslContextProviderTest
Running org.glassfish.jersey.client.filter.HttpBasicAuthFilterTest
Tests run: 2, Failures: 0, Errors: 0, Skipped: 0, Time elapsed: 0.838 sec - in org.glassfish.jersey.client.filter.HttpBasicAuthFilterTest
Running org.glassfish.jersey.client.FixedMultiBoundaryParserTest
Tests run: 11, Failures: 0, Errors: 0, Skipped: 0, Time elapsed: 0.053 sec - in org.glassfish.jersey.client.FixedMultiBoundaryParserTest
Running org.glassfish.jersey.client.filter.ClientProviderInstanceInjectionTest
Tests run: 1, Failures: 0, Errors: 0, Skipped: 0, Time elapsed: 0.671 sec - in org.glassfish.jersey.client.filter.ClientProviderInstanceInjectionTest
Running org.glassfish.jersey.client.filter.EncodingFilterTest
Oct 09, 2018 9:30:11 AM org.glassfish.jersey.client.filter.EncodingFilter filter
WARNING: Value non-gzip of jersey.config.client.useEncoding client property will be ignored as it is not a valid supported encoding. Valid supported encodings are: [deflate, gzip, x-gzip]
Tests run: 7, Failures: 0, Errors: 0, Skipped: 0, Time elapsed: 1.309 sec - in org.glassfish.jersey.client.filter.EncodingFilterTest
Running org.glassfish.jersey.client.filter.CsrfProtectionFilterTest
Tests run: 2, Failures: 0, Errors: 0, Skipped: 0, Time elapsed: 0.664 sec - in org.glassfish.jersey.client.filter.CsrfProtectionFilterTest
Running org.glassfish.jersey.client.authentication.HttpDigestAuthFilterTest
Tests run: 5, Failures: 0, Errors: 0, Skipped: 0, Time elapsed: 0.03 sec - in org.glassfish.jersey.client.authentication.HttpDigestAuthFilterTest
Running org.glassfish.jersey.client.HttpUrlConnectorTest
Tests run: 4, Failures: 0, Errors: 0, Skipped: 2, Time elapsed: 0.792 sec - in org.glassfish.jersey.client.HttpUrlConnectorTest
Running org.glassfish.jersey.client.JerseyClientTest
Oct 09, 2018 9:30:11 AM org.glassfish.jersey.model.internal.CommonConfig register
WARNING: Attempt to register component of type class org.glassfish.jersey.client.JerseyClientTest$TestProvider to null or empty array of contracts  is ignored.
Oct 09, 2018 9:30:11 AM org.glassfish.jersey.model.internal.CommonConfig register
WARNING: Attempt to register component of type class org.glassfish.jersey.client.JerseyClientTest$TestProvider to null or empty array of contracts  is ignored.
Oct 09, 2018 9:30:11 AM org.glassfish.jersey.model.internal.CommonConfig register
WARNING: Attempt to register component of type class org.glassfish.jersey.client.JerseyClientTest$TestProvider to null or empty array of contracts  is ignored.
Oct 09, 2018 9:30:11 AM org.glassfish.jersey.model.internal.CommonConfig register
WARNING: Attempt to register component of type class org.glassfish.jersey.client.JerseyClientTest$TestProvider to null or empty array of contracts  is ignored.
Tests run: 11, Failures: 0, Errors: 0, Skipped: 0, Time elapsed: 0.927 sec - in org.glassfish.jersey.client.JerseyClientTest
Running org.glassfish.jersey.client.LinkTest
Tests run: 2, Failures: 0, Errors: 0, Skipped: 0, Time elapsed: 0.179 sec - in org.glassfish.jersey.client.LinkTest
Running org.glassfish.jersey.client.FixedBoundaryParserTest
Tests run: 7, Failures: 0, Errors: 0, Skipped: 0, Time elapsed: 0.056 sec - in org.glassfish.jersey.client.FixedBoundaryParserTest
Running org.glassfish.jersey.client.JerseyWebTargetTest
Oct 09, 2018 9:30:11 AM org.glassfish.jersey.model.internal.CommonConfig register
WARNING: Attempt to register component of type class org.glassfish.jersey.client.JerseyWebTargetTest$TestProvider to null or empty array of contracts  is ignored.
Oct 09, 2018 9:30:11 AM org.glassfish.jersey.model.internal.CommonConfig register
WARNING: Attempt to register component of type class org.glassfish.jersey.client.JerseyWebTargetTest$TestProvider to null or empty array of contracts  is ignored.
Oct 09, 2018 9:30:11 AM org.glassfish.jersey.model.internal.CommonConfig register
WARNING: Attempt to register component of type class org.glassfish.jersey.client.JerseyWebTargetTest$TestProvider to null or empty array of contracts  is ignored.
Oct 09, 2018 9:30:11 AM org.glassfish.jersey.model.internal.CommonConfig register
WARNING: Attempt to register component of type class org.glassfish.jersey.client.JerseyWebTargetTest$TestProvider to null or empty array of contracts  is ignored.
Tests run: 21, Failures: 0, Errors: 0, Skipped: 0, Time elapsed: 0.054 sec - in org.glassfish.jersey.client.JerseyWebTargetTest
Running org.glassfish.jersey.client.JerseyInvocationTest
Oct 09, 2018 9:30:11 AM org.glassfish.jersey.client.JerseyInvocation validateHttpMethodAndEntity
WARNING: Entity must be null for http method DELETE.
Oct 09, 2018 9:30:11 AM org.glassfish.jersey.client.JerseyInvocation validateHttpMethodAndEntity
WARNING: Entity must be null for http method DELETE.
Oct 09, 2018 9:30:11 AM org.glassfish.jersey.client.JerseyInvocation validateHttpMethodAndEntity
WARNING: Entity must be null for http method DELETE.
Tests run: 11, Failures: 0, Errors: 0, Skipped: 0, Time elapsed: 1.445 sec - in org.glassfish.jersey.client.JerseyInvocationTest
Running org.glassfish.jersey.client.JerseyCompletionStageRxInvokerTest
Tests run: 7, Failures: 0, Errors: 0, Skipped: 1, Time elapsed: 0.286 sec - in org.glassfish.jersey.client.JerseyCompletionStageRxInvokerTest
Running org.glassfish.jersey.client.spi.CachingConnectorProviderTest
Tests run: 1, Failures: 0, Errors: 0, Skipped: 0, Time elapsed: 0.057 sec - in org.glassfish.jersey.client.spi.CachingConnectorProviderTest
Running org.glassfish.jersey.client.ClientRequestTest
Tests run: 3, Failures: 0, Errors: 0, Skipped: 0, Time elapsed: 0.546 sec - in org.glassfish.jersey.client.ClientRequestTest
Running org.glassfish.jersey.client.ClientConfigTest
Oct 09, 2018 9:30:11 AM org.glassfish.jersey.internal.Errors logErrors
WARNING: The following warnings have been detected: WARNING: HK2 failure has been detected in a code that does not run in an active Jersey Error scope.
WARNING: HK2 service reification failed for [org.glassfish.jersey.client.ClientConfigTest$MyProvider] with an exception:
MultiException stack 1 of 2
java.lang.NoSuchMethodException: Cannot instantiate org.glassfish.jersey.client.ClientConfigTest$MyProvider class. Instantiation of non-static member classes is not supported.
	at org.glassfish.jersey.inject.hk2.JerseyClassAnalyzer.getConstructor(JerseyClassAnalyzer.java:119)
	at org.jvnet.hk2.internal.Utilities.getConstructor(Utilities.java:180)
	at org.jvnet.hk2.internal.ClazzCreator.initialize(ClazzCreator.java:129)
	at org.jvnet.hk2.internal.ClazzCreator.initialize(ClazzCreator.java:180)
	at org.jvnet.hk2.internal.SystemDescriptor.internalReify(SystemDescriptor.java:740)
	at org.jvnet.hk2.internal.SystemDescriptor.reify(SystemDescriptor.java:694)
	at org.jvnet.hk2.internal.ServiceLocatorImpl.reifyDescriptor(ServiceLocatorImpl.java:464)
	at org.jvnet.hk2.internal.ServiceLocatorImpl.narrow(ServiceLocatorImpl.java:2310)
	at org.jvnet.hk2.internal.ServiceLocatorImpl.access$1200(ServiceLocatorImpl.java:128)
	at org.jvnet.hk2.internal.ServiceLocatorImpl$10.compute(ServiceLocatorImpl.java:1395)
	at org.jvnet.hk2.internal.ServiceLocatorImpl$10.compute(ServiceLocatorImpl.java:1390)
	at org.glassfish.hk2.utilities.cache.internal.WeakCARCacheImpl.compute(WeakCARCacheImpl.java:128)
	at org.jvnet.hk2.internal.ServiceLocatorImpl.internalGetAllServiceHandles(ServiceLocatorImpl.java:1452)
	at org.jvnet.hk2.internal.ServiceLocatorImpl.getAllServices(ServiceLocatorImpl.java:818)
	at org.glassfish.jersey.inject.hk2.AbstractHk2InjectionManager.getAllInstances(AbstractHk2InjectionManager.java:170)
	at org.glassfish.jersey.inject.hk2.ImmediateHk2InjectionManager.getAllInstances(ImmediateHk2InjectionManager.java:30)
	at org.glassfish.jersey.internal.ContextResolverFactory$ContextResolversConfigurator.postInit(ContextResolverFactory.java:69)
	at org.glassfish.jersey.client.ClientConfig$State.lambda$initRuntime$2(ClientConfig.java:446)
	at java.util.Arrays$ArrayList.forEach(Arrays.java:3880)
	at org.glassfish.jersey.client.ClientConfig$State.initRuntime(ClientConfig.java:446)
	at org.glassfish.jersey.internal.util.collection.Values$LazyValueImpl.get(Values.java:317)
	at org.glassfish.jersey.client.ClientConfig.getRuntime(ClientConfig.java:802)
	at org.glassfish.jersey.client.ClientConfigTest.testCustomProvidersFeature(ClientConfigTest.java:135)
	at sun.reflect.NativeMethodAccessorImpl.invoke0(Native Method)
	at sun.reflect.NativeMethodAccessorImpl.invoke(NativeMethodAccessorImpl.java:62)
	at sun.reflect.DelegatingMethodAccessorImpl.invoke(DelegatingMethodAccessorImpl.java:43)
	at java.lang.reflect.Method.invoke(Method.java:498)
	at org.junit.runners.model.FrameworkMethod$1.runReflectiveCall(FrameworkMethod.java:50)
	at org.junit.internal.runners.model.ReflectiveCallable.run(ReflectiveCallable.java:12)
	at org.junit.runners.model.FrameworkMethod.invokeExplosively(FrameworkMethod.java:47)
	at org.junit.internal.runners.statements.InvokeMethod.evaluate(InvokeMethod.java:17)
	at org.junit.internal.runners.statements.RunBefores.evaluate(RunBefores.java:26)
	at org.junit.internal.runners.statements.RunAfters.evaluate(RunAfters.java:27)
	at org.junit.runners.ParentRunner.runLeaf(ParentRunner.java:325)
	at org.junit.runners.BlockJUnit4ClassRunner.runChild(BlockJUnit4ClassRunner.java:78)
	at org.junit.runners.BlockJUnit4ClassRunner.runChild(BlockJUnit4ClassRunner.java:57)
	at org.junit.runners.ParentRunner$3.run(ParentRunner.java:290)
	at org.apache.maven.surefire.junitcore.pc.Scheduler$1.run(Scheduler.java:387)
	at java.util.concurrent.Executors$RunnableAdapter.call(Executors.java:511)
	at java.util.concurrent.FutureTask.run(FutureTask.java:266)
	at java.util.concurrent.ThreadPoolExecutor.runWorker(ThreadPoolExecutor.java:1149)
	at java.util.concurrent.ThreadPoolExecutor$Worker.run(ThreadPoolExecutor.java:624)
	at java.lang.Thread.run(Thread.java:748)
MultiException stack 2 of 2
java.lang.IllegalArgumentException: Errors were discovered while reifying SystemDescriptor(
	implementation=org.glassfish.jersey.client.ClientConfigTest$MyProvider
	contracts={javax.ws.rs.ext.ContextResolver}
	scope=javax.inject.Singleton
	qualifiers={org.glassfish.jersey.internal.inject.Custom}
	descriptorType=CLASS
	descriptorVisibility=NORMAL
	metadata=
	rank=0
	loader=null
	proxiable=null
	proxyForSameScope=null
	analysisName=null
	id=61
	locatorId=68
	identityHashCode=2061551724
	reified=false)
	at org.jvnet.hk2.internal.SystemDescriptor.reify(SystemDescriptor.java:705)
	at org.jvnet.hk2.internal.ServiceLocatorImpl.reifyDescriptor(ServiceLocatorImpl.java:464)
	at org.jvnet.hk2.internal.ServiceLocatorImpl.narrow(ServiceLocatorImpl.java:2310)
	at org.jvnet.hk2.internal.ServiceLocatorImpl.access$1200(ServiceLocatorImpl.java:128)
	at org.jvnet.hk2.internal.ServiceLocatorImpl$10.compute(ServiceLocatorImpl.java:1395)
	at org.jvnet.hk2.internal.ServiceLocatorImpl$10.compute(ServiceLocatorImpl.java:1390)
	at org.glassfish.hk2.utilities.cache.internal.WeakCARCacheImpl.compute(WeakCARCacheImpl.java:128)
	at org.jvnet.hk2.internal.ServiceLocatorImpl.internalGetAllServiceHandles(ServiceLocatorImpl.java:1452)
	at org.jvnet.hk2.internal.ServiceLocatorImpl.getAllServices(ServiceLocatorImpl.java:818)
	at org.glassfish.jersey.inject.hk2.AbstractHk2InjectionManager.getAllInstances(AbstractHk2InjectionManager.java:170)
	at org.glassfish.jersey.inject.hk2.ImmediateHk2InjectionManager.getAllInstances(ImmediateHk2InjectionManager.java:30)
	at org.glassfish.jersey.internal.ContextResolverFactory$ContextResolversConfigurator.postInit(ContextResolverFactory.java:69)
	at org.glassfish.jersey.client.ClientConfig$State.lambda$initRuntime$2(ClientConfig.java:446)
	at java.util.Arrays$ArrayList.forEach(Arrays.java:3880)
	at org.glassfish.jersey.client.ClientConfig$State.initRuntime(ClientConfig.java:446)
	at org.glassfish.jersey.internal.util.collection.Values$LazyValueImpl.get(Values.java:317)
	at org.glassfish.jersey.client.ClientConfig.getRuntime(ClientConfig.java:802)
	at org.glassfish.jersey.client.ClientConfigTest.testCustomProvidersFeature(ClientConfigTest.java:135)
	at sun.reflect.NativeMethodAccessorImpl.invoke0(Native Method)
	at sun.reflect.NativeMethodAccessorImpl.invoke(NativeMethodAccessorImpl.java:62)
	at sun.reflect.DelegatingMethodAccessorImpl.invoke(DelegatingMethodAccessorImpl.java:43)
	at java.lang.reflect.Method.invoke(Method.java:498)
	at org.junit.runners.model.FrameworkMethod$1.runReflectiveCall(FrameworkMethod.java:50)
	at org.junit.internal.runners.model.ReflectiveCallable.run(ReflectiveCallable.java:12)
	at org.junit.runners.model.FrameworkMethod.invokeExplosively(FrameworkMethod.java:47)
	at org.junit.internal.runners.statements.InvokeMethod.evaluate(InvokeMethod.java:17)
	at org.junit.internal.runners.statements.RunBefores.evaluate(RunBefores.java:26)
	at org.junit.internal.runners.statements.RunAfters.evaluate(RunAfters.java:27)
	at org.junit.runners.ParentRunner.runLeaf(ParentRunner.java:325)
	at org.junit.runners.BlockJUnit4ClassRunner.runChild(BlockJUnit4ClassRunner.java:78)
	at org.junit.runners.BlockJUnit4ClassRunner.runChild(BlockJUnit4ClassRunner.java:57)
	at org.junit.runners.ParentRunner$3.run(ParentRunner.java:290)
	at org.apache.maven.surefire.junitcore.pc.Scheduler$1.run(Scheduler.java:387)
	at java.util.concurrent.Executors$RunnableAdapter.call(Executors.java:511)
	at java.util.concurrent.FutureTask.run(FutureTask.java:266)
	at java.util.concurrent.ThreadPoolExecutor.runWorker(ThreadPoolExecutor.java:1149)
	at java.util.concurrent.ThreadPoolExecutor$Worker.run(ThreadPoolExecutor.java:624)
	at java.lang.Thread.run(Thread.java:748)


Oct 09, 2018 9:30:11 AM org.glassfish.jersey.internal.Errors logErrors
WARNING: The following warnings have been detected: WARNING: HK2 failure has been detected in a code that does not run in an active Jersey Error scope.
WARNING: HK2 service reification failed for [org.glassfish.jersey.client.ClientConfigTest$MyProvider] with an exception:
MultiException stack 1 of 2
java.lang.NoSuchMethodException: Cannot instantiate org.glassfish.jersey.client.ClientConfigTest$MyProvider class. Instantiation of non-static member classes is not supported.
	at org.glassfish.jersey.inject.hk2.JerseyClassAnalyzer.getConstructor(JerseyClassAnalyzer.java:119)
	at org.jvnet.hk2.internal.Utilities.getConstructor(Utilities.java:180)
	at org.jvnet.hk2.internal.ClazzCreator.initialize(ClazzCreator.java:129)
	at org.jvnet.hk2.internal.ClazzCreator.initialize(ClazzCreator.java:180)
	at org.jvnet.hk2.internal.SystemDescriptor.internalReify(SystemDescriptor.java:740)
	at org.jvnet.hk2.internal.SystemDescriptor.reify(SystemDescriptor.java:694)
	at org.jvnet.hk2.internal.ServiceLocatorImpl.reifyDescriptor(ServiceLocatorImpl.java:464)
	at org.jvnet.hk2.internal.ServiceLocatorImpl.narrow(ServiceLocatorImpl.java:2310)
	at org.jvnet.hk2.internal.ServiceLocatorImpl.access$1200(ServiceLocatorImpl.java:128)
	at org.jvnet.hk2.internal.ServiceLocatorImpl$10.compute(ServiceLocatorImpl.java:1395)
	at org.jvnet.hk2.internal.ServiceLocatorImpl$10.compute(ServiceLocatorImpl.java:1390)
	at org.glassfish.hk2.utilities.cache.internal.WeakCARCacheImpl.compute(WeakCARCacheImpl.java:128)
	at org.jvnet.hk2.internal.ServiceLocatorImpl.internalGetAllServiceHandles(ServiceLocatorImpl.java:1452)
	at org.jvnet.hk2.internal.ServiceLocatorImpl.getAllServices(ServiceLocatorImpl.java:818)
	at org.glassfish.jersey.inject.hk2.AbstractHk2InjectionManager.getAllInstances(AbstractHk2InjectionManager.java:170)
	at org.glassfish.jersey.inject.hk2.ImmediateHk2InjectionManager.getAllInstances(ImmediateHk2InjectionManager.java:30)
	at org.glassfish.jersey.internal.ContextResolverFactory$ContextResolversConfigurator.postInit(ContextResolverFactory.java:69)
	at org.glassfish.jersey.client.ClientConfig$State.lambda$initRuntime$2(ClientConfig.java:446)
	at java.util.Arrays$ArrayList.forEach(Arrays.java:3880)
	at org.glassfish.jersey.client.ClientConfig$State.initRuntime(ClientConfig.java:446)
	at org.glassfish.jersey.internal.util.collection.Values$LazyValueImpl.get(Values.java:317)
	at org.glassfish.jersey.client.ClientConfig.getRuntime(ClientConfig.java:802)
	at org.glassfish.jersey.client.ClientConfigTest.testCustomProvidersFeature(ClientConfigTest.java:135)
	at sun.reflect.NativeMethodAccessorImpl.invoke0(Native Method)
	at sun.reflect.NativeMethodAccessorImpl.invoke(NativeMethodAccessorImpl.java:62)
	at sun.reflect.DelegatingMethodAccessorImpl.invoke(DelegatingMethodAccessorImpl.java:43)
	at java.lang.reflect.Method.invoke(Method.java:498)
	at org.junit.runners.model.FrameworkMethod$1.runReflectiveCall(FrameworkMethod.java:50)
	at org.junit.internal.runners.model.ReflectiveCallable.run(ReflectiveCallable.java:12)
	at org.junit.runners.model.FrameworkMethod.invokeExplosively(FrameworkMethod.java:47)
	at org.junit.internal.runners.statements.InvokeMethod.evaluate(InvokeMethod.java:17)
	at org.junit.internal.runners.statements.RunBefores.evaluate(RunBefores.java:26)
	at org.junit.internal.runners.statements.RunAfters.evaluate(RunAfters.java:27)
	at org.junit.runners.ParentRunner.runLeaf(ParentRunner.java:325)
	at org.junit.runners.BlockJUnit4ClassRunner.runChild(BlockJUnit4ClassRunner.java:78)
	at org.junit.runners.BlockJUnit4ClassRunner.runChild(BlockJUnit4ClassRunner.java:57)
	at org.junit.runners.ParentRunner$3.run(ParentRunner.java:290)
	at org.apache.maven.surefire.junitcore.pc.Scheduler$1.run(Scheduler.java:387)
	at java.util.concurrent.Executors$RunnableAdapter.call(Executors.java:511)
	at java.util.concurrent.FutureTask.run(FutureTask.java:266)
	at java.util.concurrent.ThreadPoolExecutor.runWorker(ThreadPoolExecutor.java:1149)
	at java.util.concurrent.ThreadPoolExecutor$Worker.run(ThreadPoolExecutor.java:624)
	at java.lang.Thread.run(Thread.java:748)
MultiException stack 2 of 2
java.lang.IllegalArgumentException: Errors were discovered while reifying SystemDescriptor(
	implementation=org.glassfish.jersey.client.ClientConfigTest$MyProvider
	contracts={javax.ws.rs.ext.ContextResolver}
	scope=javax.inject.Singleton
	qualifiers={org.glassfish.jersey.internal.inject.Custom}
	descriptorType=CLASS
	descriptorVisibility=NORMAL
	metadata=
	rank=0
	loader=null
	proxiable=null
	proxyForSameScope=null
	analysisName=null
	id=61
	locatorId=68
	identityHashCode=2061551724
	reified=false)
	at org.jvnet.hk2.internal.SystemDescriptor.reify(SystemDescriptor.java:705)
	at org.jvnet.hk2.internal.ServiceLocatorImpl.reifyDescriptor(ServiceLocatorImpl.java:464)
	at org.jvnet.hk2.internal.ServiceLocatorImpl.narrow(ServiceLocatorImpl.java:2310)
	at org.jvnet.hk2.internal.ServiceLocatorImpl.access$1200(ServiceLocatorImpl.java:128)
	at org.jvnet.hk2.internal.ServiceLocatorImpl$10.compute(ServiceLocatorImpl.java:1395)
	at org.jvnet.hk2.internal.ServiceLocatorImpl$10.compute(ServiceLocatorImpl.java:1390)
	at org.glassfish.hk2.utilities.cache.internal.WeakCARCacheImpl.compute(WeakCARCacheImpl.java:128)
	at org.jvnet.hk2.internal.ServiceLocatorImpl.internalGetAllServiceHandles(ServiceLocatorImpl.java:1452)
	at org.jvnet.hk2.internal.ServiceLocatorImpl.getAllServices(ServiceLocatorImpl.java:818)
	at org.glassfish.jersey.inject.hk2.AbstractHk2InjectionManager.getAllInstances(AbstractHk2InjectionManager.java:170)
	at org.glassfish.jersey.inject.hk2.ImmediateHk2InjectionManager.getAllInstances(ImmediateHk2InjectionManager.java:30)
	at org.glassfish.jersey.internal.ContextResolverFactory$ContextResolversConfigurator.postInit(ContextResolverFactory.java:69)
	at org.glassfish.jersey.client.ClientConfig$State.lambda$initRuntime$2(ClientConfig.java:446)
	at java.util.Arrays$ArrayList.forEach(Arrays.java:3880)
	at org.glassfish.jersey.client.ClientConfig$State.initRuntime(ClientConfig.java:446)
	at org.glassfish.jersey.internal.util.collection.Values$LazyValueImpl.get(Values.java:317)
	at org.glassfish.jersey.client.ClientConfig.getRuntime(ClientConfig.java:802)
	at org.glassfish.jersey.client.ClientConfigTest.testCustomProvidersFeature(ClientConfigTest.java:135)
	at sun.reflect.NativeMethodAccessorImpl.invoke0(Native Method)
	at sun.reflect.NativeMethodAccessorImpl.invoke(NativeMethodAccessorImpl.java:62)
	at sun.reflect.DelegatingMethodAccessorImpl.invoke(DelegatingMethodAccessorImpl.java:43)
	at java.lang.reflect.Method.invoke(Method.java:498)
	at org.junit.runners.model.FrameworkMethod$1.runReflectiveCall(FrameworkMethod.java:50)
	at org.junit.internal.runners.model.ReflectiveCallable.run(ReflectiveCallable.java:12)
	at org.junit.runners.model.FrameworkMethod.invokeExplosively(FrameworkMethod.java:47)
	at org.junit.internal.runners.statements.InvokeMethod.evaluate(InvokeMethod.java:17)
	at org.junit.internal.runners.statements.RunBefores.evaluate(RunBefores.java:26)
	at org.junit.internal.runners.statements.RunAfters.evaluate(RunAfters.java:27)
	at org.junit.runners.ParentRunner.runLeaf(ParentRunner.java:325)
	at org.junit.runners.BlockJUnit4ClassRunner.runChild(BlockJUnit4ClassRunner.java:78)
	at org.junit.runners.BlockJUnit4ClassRunner.runChild(BlockJUnit4ClassRunner.java:57)
	at org.junit.runners.ParentRunner$3.run(ParentRunner.java:290)
	at org.apache.maven.surefire.junitcore.pc.Scheduler$1.run(Scheduler.java:387)
	at java.util.concurrent.Executors$RunnableAdapter.call(Executors.java:511)
	at java.util.concurrent.FutureTask.run(FutureTask.java:266)
	at java.util.concurrent.ThreadPoolExecutor.runWorker(ThreadPoolExecutor.java:1149)
	at java.util.concurrent.ThreadPoolExecutor$Worker.run(ThreadPoolExecutor.java:624)
	at java.lang.Thread.run(Thread.java:748)


Tests run: 9, Failures: 0, Errors: 0, Skipped: 0, Time elapsed: 0.086 sec - in org.glassfish.jersey.client.ClientConfigTest
Running org.glassfish.jersey.client.CustomConnectorTest
Tests run: 2, Failures: 0, Errors: 0, Skipped: 0, Time elapsed: 0.12 sec - in org.glassfish.jersey.client.CustomConnectorTest
Running org.glassfish.jersey.client.ClientRxTest
Tests run: 4, Failures: 0, Errors: 0, Skipped: 1, Time elapsed: 0.071 sec - in org.glassfish.jersey.client.ClientRxTest
Running org.glassfish.jersey.client.AutoDiscoverableClientTest
Tests run: 10, Failures: 0, Errors: 0, Skipped: 1, Time elapsed: 0.256 sec - in org.glassfish.jersey.client.AutoDiscoverableClientTest
Running org.glassfish.jersey.client.ShutdownHookLeakTest
Tests run: 1, Failures: 0, Errors: 0, Skipped: 0, Time elapsed: 16.774 sec - in org.glassfish.jersey.client.ShutdownHookLeakTest
Running org.glassfish.jersey.client.JerseyClientBuilderTest
Tests run: 6, Failures: 0, Errors: 0, Skipped: 0, Time elapsed: 0.277 sec - in org.glassfish.jersey.client.JerseyClientBuilderTest
Running org.glassfish.jersey.client.WebTargetPropertiesTest
Tests run: 1, Failures: 0, Errors: 0, Skipped: 0, Time elapsed: 0.002 sec - in org.glassfish.jersey.client.WebTargetPropertiesTest

Results :

Tests run: 132, Failures: 0, Errors: 0, Skipped: 5

[JENKINS] Recording test results
[INFO] 
[INFO] --- maven-jar-plugin:2.4:jar (default-jar) @ jersey-client ---
[INFO] Building jar: /home/jenkins/workspace/Jersey_sign/core-client/target/jersey-client-2.28-SNAPSHOT.jar
[INFO] 
[INFO] --- maven-source-plugin:2.2.1:jar-no-fork (attach-sources) @ jersey-client ---
[INFO] Building jar: /home/jenkins/workspace/Jersey_sign/core-client/target/jersey-client-2.28-SNAPSHOT-sources.jar
[INFO] 
[INFO] --- maven-bundle-plugin:3.2.0:bundle (osgi-bundle) @ jersey-client ---