FailedConsole Output

Skipping 294 KB.. Full Log
s
04:26:35 testArrayIsAccessedByMethodInvocation2  Time elapsed: 0.045 s
04:26:35 testBug562291_1  Time elapsed: 0.056 s
04:26:35 testBug562291_2  Time elapsed: 0.048 s
04:26:35 testNameDetectionS  Time elapsed: 0.044 s
04:26:35 testNiceReductionArrayIsField  Time elapsed: 0.046 s
04:26:35 testCollectionIsNotArray  Time elapsed: 0.05 s
04:26:35 testCollectionsAccepted  Time elapsed: 0.047 s
04:26:35 testTwoIndexesNotAllowed  Time elapsed: 0.045 s
04:26:35 testBodyPrecondition344674_1  Time elapsed: 0.045 s
04:26:35 testBodyPrecondition344674_2  Time elapsed: 0.043 s
04:26:35 testBodyPrecondition344674_3  Time elapsed: 0.042 s
04:26:35 testBodyPrecondition344674_4  Time elapsed: 0.044 s
04:26:35 testBodyPrecondition344674_5  Time elapsed: 0.042 s
04:26:35 testBodyPrecondition344674_6  Time elapsed: 0.043 s
04:26:35 testBodyPrecondition344674_7  Time elapsed: 0.043 s
04:26:35 testBodyPrecondition344674_8  Time elapsed: 0.049 s
04:26:35 testBodyPrecondition344674_9  Time elapsed: 0.042 s
04:26:35 testArrayIsAssigned  Time elapsed: 0.043 s
04:26:35 testNameDetectionAllChildren  Time elapsed: 0.047 s
04:26:35 testCollectionsAccepted2  Time elapsed: 0.049 s
04:26:35 testCollectionsAccepted3  Time elapsed: 0.047 s
04:26:35 testBug231575_1  Time elapsed: 0.049 s
04:26:35 testNameDetectionProxies  Time elapsed: 0.052 s
04:26:35 testExpressionPrecondition01  Time elapsed: 0.052 s
04:26:35 testExpressionPrecondition02  Time elapsed: 0.042 s
04:26:35 testExpressionPrecondition03  Time elapsed: 0.043 s
04:26:35 testExpressionPrecondition04  Time elapsed: 0.041 s
04:26:35 testExpressionPrecondition05  Time elapsed: 0.043 s
04:26:35 testExpressionPrecondition06  Time elapsed: 0.042 s
04:26:35 testExpressionPrecondition07  Time elapsed: 0.043 s
04:26:35 testExpressionPrecondition08  Time elapsed: 0.042 s
04:26:35 testIndexBruteModified  Time elapsed: 0.043 s
04:26:35 testMatrix  Time elapsed: 0.049 s
04:26:35 testNameDetectionChildren  Time elapsed: 0.043 s
04:26:35 testAdditionalLocalIsNotReferenced  Time elapsed: 0.048 s
04:26:35 testInferPrimitiveTypeElement  Time elapsed: 0.045 s
04:26:35 testSimplestSmokeCase  Time elapsed: 0.049 s
04:26:35 testChildren  Time elapsed: 0.048 s
04:26:35 testMethodCall1  Time elapsed: 0.049 s
04:26:35 testMethodCall2  Time elapsed: 0.048 s
04:26:35 testMethodCall3  Time elapsed: 0.048 s
04:26:35 testWildcard1  Time elapsed: 0.049 s
04:26:35 testWildcard2  Time elapsed: 0.048 s
04:26:35 testBug129508_1  Time elapsed: 0.045 s
04:26:35 testBug129508_2  Time elapsed: 0.047 s
04:26:35 testBug129508_3  Time elapsed: 0.043 s
04:26:35 testBug129508_4  Time elapsed: 0.045 s
04:26:35 testNoAssignment  Time elapsed: 0.048 s
04:26:35 testWrongInitializer  Time elapsed: 0.045 s
04:26:35 testOutsideAssignment1  Time elapsed: 0.047 s
04:26:35 testOutsideAssignment2  Time elapsed: 0.047 s
04:26:35 testRawIterator  Time elapsed: 0.052 s
04:26:35 testCorrectIteratorMethod  Time elapsed: 0.057 s
04:26:35 testBug110599  Time elapsed: 0.058 s
04:26:35 testBug176502  Time elapsed: 0.049 s
04:26:35 testBug176595  Time elapsed: 0.043 s
04:26:35 testBug194639  Time elapsed: 0.049 s
04:26:35 testBug203693  Time elapsed: 0.049 s
04:26:35 testBug553634  Time elapsed: 0.05 s
04:26:35 testSplitAssignment  Time elapsed: 0.049 s
04:26:35 testBug510758_1  Time elapsed: 0.045 s
04:26:35 testBug510758_2  Time elapsed: 0.048 s
04:26:35 test487429  Time elapsed: 0.049 s
04:26:35 testIndirectUsage  Time elapsed: 0.048 s
04:26:35 testEnumeration  Time elapsed: 0.049 s
04:26:35 testIndentation skipped
04:26:35 testNested  Time elapsed: 0.048 s
04:26:35 testWrongIteratorMethod_bug411588  Time elapsed: 0.049 s
04:26:35 testWrongIteratorMethod  Time elapsed: 0.053 s
04:26:35 testBug563267  Time elapsed: 0.045 s
04:26:35 testReplaceReturnIfWithCondition2  Time elapsed: 0.062 s
04:26:35 testPushNegationDownBug117960  Time elapsed: 0.053 s
04:26:35 testInverseConditionalStatement1  Time elapsed: 0.057 s
04:26:35 testInverseConditionalStatement2  Time elapsed: 0.426 s
04:26:35 testConvertIfToSwitchBug392847  Time elapsed: 0.051 s
04:26:35 testConvertIfToSwitchBug393147  Time elapsed: 0.055 s
04:26:35 testConvertSwitchToIf  Time elapsed: 0.052 s
04:26:35 testSplitIfElseCondition  Time elapsed: 0.065 s
04:26:35 testAssignAndCastBug331195_1  Time elapsed: 0.048 s
04:26:35 testAssignAndCastBug331195_2  Time elapsed: 0.046 s
04:26:35 testAssignAndCastBug331195_3  Time elapsed: 0.063 s
04:26:35 testAssignAndCastBug331195_4  Time elapsed: 0.05 s
04:26:35 testAssignAndCastBug331195_5  Time elapsed: 0.05 s
04:26:35 testAssignAndCastBug331195_6  Time elapsed: 0.06 s
04:26:35 testAssignAndCastBug331195_7  Time elapsed: 0.07 s
04:26:35 testAssignAndCastBug331195_8  Time elapsed: 0.054 s
04:26:35 testConvertSwitchToIf2  Time elapsed: 0.051 s
04:26:35 testConvertSwitchToIf3  Time elapsed: 0.059 s
04:26:35 testPushNegationDown1  Time elapsed: 0.064 s
04:26:35 testPushNegationDown2  Time elapsed: 0.064 s
04:26:35 testPushNegationDown3  Time elapsed: 0.063 s
04:26:35 testAssignAndCastBug129336_1  Time elapsed: 0.059 s
04:26:35 testAssignAndCastBug129336_3  Time elapsed: 0.066 s
04:26:35 testReplaceReturnIfWithCondition  Time elapsed: 0.074 s
04:26:35 testInverseCondition1  Time elapsed: 0.087 s
04:26:35 testInverseCondition2  Time elapsed: 0.074 s
04:26:35 testInverseCondition3  Time elapsed: 0.089 s
04:26:35 testInverseCondition4  Time elapsed: 0.078 s
04:26:35 testInverseCondition5  Time elapsed: 0.087 s
04:26:35 testInverseCondition6  Time elapsed: 0.078 s
04:26:35 testConvertIfToSwitchBug393147_2  Time elapsed: 0.061 s
04:26:35 testAssignAndCast1  Time elapsed: 0.075 s
04:26:35 testAssignAndCast2  Time elapsed: 0.067 s
04:26:35 testSplitIfCondition1  Time elapsed: 0.073 s
04:26:35 testSplitIfCondition2  Time elapsed: 0.06 s
04:26:35 testSplitIfCondition3  Time elapsed: 0.071 s
04:26:35 testConvertSwitchToIfBug252040_1  Time elapsed: 0.042 s
04:26:35 testConvertSwitchToIfBug252040_2  Time elapsed: 0.051 s
04:26:35 testConvertSwitchToIfBug252104_1  Time elapsed: 0.05 s
04:26:35 testConvertSwitchToIfBug252104_2  Time elapsed: 0.051 s
04:26:35 testPullNegationUpBug117960  Time elapsed: 0.074 s
04:26:35 testRemoveExtraParentheses1  Time elapsed: 0.083 s
04:26:35 testRemoveExtraParentheses2  Time elapsed: 0.062 s
04:26:35 testConvertToIfReturn1  Time elapsed: 0.084 s
04:26:35 testConvertToIfReturn2  Time elapsed: 0.049 s
04:26:35 testConvertToIfReturn3  Time elapsed: 0.045 s
04:26:35 testConvertToIfReturn4  Time elapsed: 0.05 s
04:26:35 testAssignAndCastBug_104021  Time elapsed: 0.055 s
04:26:35 testAddParanoidalParentheses1  Time elapsed: 0.072 s
04:26:35 testInverseIfConditionEquals  Time elapsed: 0.065 s
04:26:35 testInverseIfCondition1  Time elapsed: 0.062 s
04:26:35 testInverseIfCondition2  Time elapsed: 0.054 s
04:26:35 testInverseIfCondition3  Time elapsed: 0.067 s
04:26:35 testInverseIfCondition4  Time elapsed: 0.068 s
04:26:35 testInverseIfCondition5  Time elapsed: 0.058 s
04:26:35 testInverseIfCondition6  Time elapsed: 0.078 s
04:26:35 testSplitOrCondition1  Time elapsed: 0.069 s
04:26:35 testSplitOrCondition2  Time elapsed: 0.057 s
04:26:35 testPickOutStringProposals1  Time elapsed: 0.048 s
04:26:35 testPickOutStringProposals2  Time elapsed: 0.047 s
04:26:35 testPickOutStringProposals3  Time elapsed: 0.053 s
04:26:35 testPickOutStringProposals4  Time elapsed: 0.045 s
04:26:35 testReplaceAssignConditionWithIf1  Time elapsed: 0.056 s
04:26:35 testReplaceAssignConditionWithIf2  Time elapsed: 0.058 s
04:26:35 testReplaceAssignConditionWithIf3  Time elapsed: 0.056 s
04:26:35 testReplaceAssignConditionWithIf4  Time elapsed: 0.057 s
04:26:35 testReplaceAssignConditionWithIf5  Time elapsed: 0.049 s
04:26:35 testReplaceAssignConditionWithIf6  Time elapsed: 0.052 s
04:26:35 testReplaceAssignConditionWithIf7  Time elapsed: 0.057 s
04:26:35 testReplaceAssignConditionWithIf8  Time elapsed: 0.05 s
04:26:35 testJoinAndIfStatements1  Time elapsed: 0.064 s
04:26:35 testJoinAndIfStatements2  Time elapsed: 0.058 s
04:26:35 testJoinAndIfStatements3  Time elapsed: 0.06 s
04:26:35 testJoinAndIfStatements4  Time elapsed: 0.055 s
04:26:35 testJoinOrIfStatementsBug335173  Time elapsed: 0.05 s
04:26:35 testInverseIfConditionUnboxing  Time elapsed: 0.056 s
04:26:35 testInnerAndOuterIfConditions1  Time elapsed: 0.057 s
04:26:35 testInnerAndOuterIfConditions2  Time elapsed: 0.056 s
04:26:35 testInnerAndOuterIfConditions3  Time elapsed: 0.058 s
04:26:35 testInnerAndOuterIfConditions4  Time elapsed: 0.058 s
04:26:35 testPullNegationUp  Time elapsed: 0.075 s
04:26:35 testConvertIfToSwitch1  Time elapsed: 0.059 s
04:26:35 testConvertIfToSwitch2  Time elapsed: 0.045 s
04:26:35 testConvertIfToSwitch3  Time elapsed: 0.069 s
04:26:35 testConvertIfToSwitch4  Time elapsed: 0.064 s
04:26:35 testConvertIfToSwitch5  Time elapsed: 0.062 s
04:26:35 testConvertIfToSwitch6  Time elapsed: 0.065 s
04:26:35 testConvertIfToSwitch7  Time elapsed: 0.06 s
04:26:35 testConvertIfToSwitch8  Time elapsed: 0.047 s
04:26:35 testConvertIfToSwitch9  Time elapsed: 0.066 s
04:26:35 testConvertSwitchToIfBug352422_2  Time elapsed: 0.053 s
04:26:35 testJoinOrIfStatements1  Time elapsed: 0.059 s
04:26:35 testPullNegationUpBug335778_1  Time elapsed: 0.053 s
04:26:35 testPullNegationUpBug335778_2  Time elapsed: 0.044 s
04:26:35 testInverseVariable1  Time elapsed: 0.054 s
04:26:35 testInverseVariable2  Time elapsed: 0.052 s
04:26:35 testInverseVariable3  Time elapsed: 0.055 s
04:26:35 testInverseVariable4  Time elapsed: 0.056 s
04:26:35 testReplaceReturnConditionWithIf1  Time elapsed: 0.058 s
04:26:35 testReplaceReturnConditionWithIf2  Time elapsed: 0.047 s
04:26:35 testReplaceReturnConditionWithIf3  Time elapsed: 0.054 s
04:26:35 testReplaceReturnConditionWithIf4  Time elapsed: 0.065 s
04:26:35 testAssignAndCast129336_2  Time elapsed: 0.056 s
04:26:35 testAddParenthesesForExpression1  Time elapsed: 0.053 s
04:26:35 testAddParenthesesForExpression2  Time elapsed: 0.054 s
04:26:35 testAddParenthesesForExpression3  Time elapsed: 0.054 s
04:26:35 testAddParenthesesForExpression4  Time elapsed: 0.056 s
04:26:35 testAddParenthesesForExpression5  Time elapsed: 0.055 s
04:26:35 testAddParenthesesForExpression6  Time elapsed: 0.062 s
04:26:35 testAddParenthesesForExpression7  Time elapsed: 0.044 s
04:26:35 testAddParenthesesForExpression8  Time elapsed: 0.045 s
04:26:35 testConvertSwitchToIfBug352422  Time elapsed: 0.054 s
04:26:35 testReplaceAssignIfWithCondition1  Time elapsed: 0.062 s
04:26:35 testReplaceAssignIfWithCondition2  Time elapsed: 0.071 s
04:26:35 testInverseVariable2b  Time elapsed: 0.066 s
04:26:35 testInverseVariableBug117960  Time elapsed: 0.064 s
04:26:35 testExchangeOperandsBug332019_1  Time elapsed: 0.068 s
04:26:35 testExchangeOperandsBug332019_2  Time elapsed: 0.056 s
04:26:35 testExchangeOperandsBug332019_3  Time elapsed: 0.056 s
04:26:35 testExchangeOperandsBug332019_4  Time elapsed: 0.057 s
04:26:35 testInverseIfIntoContinueInLoops1  Time elapsed: 0.064 s
04:26:35 testInverseIfContinueIntoIfThenInLoops1  Time elapsed: 0.065 s
04:26:35 testReplaceConditionalWithIf9  Time elapsed: 0.047 s
04:26:35 testExchangeOperands1  Time elapsed: 0.057 s
04:26:35 testExchangeOperands2  Time elapsed: 0.052 s
04:26:35 testExchangeOperands3  Time elapsed: 0.064 s
04:26:35 testExchangeOperands4  Time elapsed: 0.056 s
04:26:35 testExchangeOperands5  Time elapsed: 0.055 s
04:26:35 testExchangeOperands6  Time elapsed: 0.056 s
04:26:35 testExchangeOperands7  Time elapsed: 0.056 s
04:26:35 testReplaceConditionalWithIf10  Time elapsed: 0.055 s
04:26:35 testSurroundWithTemplate01  Time elapsed: 0.136 s
04:26:35 testSurroundWithTemplate02  Time elapsed: 0.114 s
04:26:35 testSurroundWithTemplate03  Time elapsed: 0.125 s
04:26:35 testSurroundWithTemplate04  Time elapsed: 0.108 s
04:26:35 testJoinAndIfStatementsBug335173  Time elapsed: 0.073 s
04:26:35 testCombineStringsProposals1  Time elapsed: 0.083 s
04:26:35 testCombineStringsProposals2  Time elapsed: 0.087 s
04:26:35 testCombineStringsProposals3  Time elapsed: 0.063 s
04:26:35 testCombineStringsProposals4  Time elapsed: 0.118 s
04:26:35 testCombineStringsProposals5  Time elapsed: 0.053 s
04:26:35 testIfReturnIntoIfElseAtEndOfVoidMethod1  Time elapsed: 0.054 s
04:26:35 testPushNegationDownBug335778_1  Time elapsed: 0.049 s
04:26:35 testPushNegationDownBug335778_2  Time elapsed: 0.046 s
04:26:35 testInverseIfCondition_bug117960  Time elapsed: 0.069 s
04:26:35 testInverseIfCondition_bug119251  Time elapsed: 0.063 s
04:26:35 testInverseIfCondition_bug388074  Time elapsed: 0.065 s
04:26:35 testJoinIfListInIfElseIf  Time elapsed: 0.062 s
04:26:35 testReplaceReturnIfWithCondition3  Time elapsed: 0.073 s
04:26:35 testReplaceReturnIfWithCondition4  Time elapsed: 0.092 s
04:26:35 testConvertIfToSwitch  Time elapsed: 0.092 s
04:26:35 testConvertSwitchToIf  Time elapsed: 0.064 s
04:26:35 testConvertIfToSwitch1  Time elapsed: 0.072 s
04:26:35 testConvertIfToSwitch2  Time elapsed: 0.048 s
04:26:35 testConvertIfToSwitch3  Time elapsed: 0.065 s
04:26:35 testConvertIfToSwitch4  Time elapsed: 0.072 s
04:26:35 testConvertIfToSwitch5  Time elapsed: 0.065 s
04:26:35 testReplaceReturnConditionWithIf4  Time elapsed: 0.067 s
04:26:35 testConvertToIfReturn1  Time elapsed: 0.106 s
04:26:35 testConvertToIfReturn2  Time elapsed: 0.06 s
04:26:35 testAllCleanUps  Time elapsed: 4.928 s
04:26:35 testRemoveRedundantSemicolons  Time elapsed: 0.079 s
04:26:35 testRemoveParentheses01  Time elapsed: 0.176 s
04:26:35 testAddNLSTag01  Time elapsed: 0.157 s
04:26:35 testPushDownNegationReplaceNegationAndEqualOperator  Time elapsed: 0.194 s
04:26:35 testCombinationBug234984_1  Time elapsed: 0.063 s
04:26:35 testCombinationBug234984_2  Time elapsed: 0.18 s
04:26:35 testUnusedCodeBug123766  Time elapsed: 0.136 s
04:26:35 testUnusedCodeBug150853  Time elapsed: 0.063 s
04:26:35 testUnusedCodeBug189394  Time elapsed: 0.183 s
04:26:35 testJava50Bug222257  Time elapsed: 0.064 s
04:26:35 testRemoveParenthesesBug405096_1  Time elapsed: 0.135 s
04:26:35 testRemoveParenthesesBug405096_2  Time elapsed: 0.053 s
04:26:35 testRemoveParenthesesBug405096_3  Time elapsed: 0.06 s
04:26:35 testRemoveParenthesesBug405096_4  Time elapsed: 0.058 s
04:26:35 testRemoveParenthesesBug405096_5  Time elapsed: 0.062 s
04:26:35 testRemoveParenthesesBug405096_6  Time elapsed: 0.061 s
04:26:35 testRemoveParenthesesBug405096_7  Time elapsed: 0.054 s
04:26:35 testCodeStyleQualifyMethodAccessesAlreadyImportedBug_552461  Time elapsed: 0.144 s
04:26:35 testCodeStyleBug_138318  Time elapsed: 0.062 s
04:26:35 testMergeConditionalBlocks  Time elapsed: 0.175 s
04:26:35 testCorrectIndetation01  Time elapsed: 0.132 s
04:26:35 testCodeStyleBug114544  Time elapsed: 0.063 s
04:26:35 testCodeStyleBug118204  Time elapsed: 0.123 s
04:26:35 testCodeStyleBug123468  Time elapsed: 0.067 s
04:26:35 testCodeStyleBug129115  Time elapsed: 0.122 s
04:26:35 testCodeStyleBug135219  Time elapsed: 0.061 s
04:26:35 testCodeStyleBug154787  Time elapsed: 0.064 s
04:26:35 testCodeStyleBug157480  Time elapsed: 0.084 s
04:26:35 testCodeStyleBug189398  Time elapsed: 0.063 s
04:26:35 testRemoveTrailingWhitespaceBug173081  Time elapsed: 0.065 s
04:26:35 testCodeStyleBug346230  Time elapsed: 0.111 s
04:26:35 testAddParentheses01  Time elapsed: 0.093 s
04:26:35 testAddParentheses02  Time elapsed: 0.093 s
04:26:35 testDoNotRefactorRegExWithPrecompilation  Time elapsed: 0.145 s
04:26:35 testSortMembers01  Time elapsed: 0.056 s
04:26:35 testSortMembers02  Time elapsed: 0.064 s
04:26:35 testRemoveQualifier01  Time elapsed: 0.051 s
04:26:35 testRemoveQualifier02  Time elapsed: 0.069 s
04:26:35 testRemoveQualifier03  Time elapsed: 0.052 s
04:26:35 testRemoveQualifier04  Time elapsed: 0.052 s
04:26:35 testRemoveBlock01  Time elapsed: 0.096 s
04:26:35 testRemoveBlock02  Time elapsed: 0.064 s
04:26:35 testRemoveBlock03  Time elapsed: 0.064 s
04:26:35 testRemoveBlock04  Time elapsed: 0.075 s
04:26:35 testRemoveBlock05  Time elapsed: 0.08 s
04:26:35 testPushDownNegationReplaceNegateNonBooleanPrimitiveExprs  Time elapsed: 0.057 s
04:26:35 testRemoveBlockReturnThrows01  Time elapsed: 0.067 s
04:26:35 testDoNotTouchCleanedModifiers  Time elapsed: 0.049 s
04:26:35 testCombinationBug120585  Time elapsed: 0.083 s
04:26:35 testCombinationBug125455  Time elapsed: 0.072 s
04:26:35 testCombinationBug157468  Time elapsed: 0.063 s
04:26:35 testRemoveNonStaticQualifier_Bug219204_1  Time elapsed: 0.074 s
04:26:35 testRemoveNonStaticQualifier_Bug219204_2  Time elapsed: 0.071 s
04:26:35 testCodeStyleBug138325_1  Time elapsed: 0.064 s
04:26:35 testCodeStyleBug138325_2  Time elapsed: 0.077 s
04:26:35 testRemoveParenthesesBug335173_1  Time elapsed: 0.074 s
04:26:35 testRemoveParenthesesBug335173_2  Time elapsed: 0.071 s
04:26:35 testRemoveParenthesesBug335173_3  Time elapsed: 0.05 s
04:26:35 testRemoveParenthesesBug335173_4  Time elapsed: 0.063 s
04:26:35 testRemoveParenthesesBug335173_5  Time elapsed: 0.052 s
04:26:35 testRemoveParenthesesBug335173_6  Time elapsed: 0.055 s
04:26:35 testRemoveParenthesesBug335173_7  Time elapsed: 0.059 s
04:26:35 testRemoveParenthesesBug335173_8  Time elapsed: 0.054 s
04:26:35 testRemoveParenthesesBug335173_9  Time elapsed: 0.066 s
04:26:35 testPushDownNegationReplaceNegateNonBooleanExprs  Time elapsed: 0.07 s
04:26:35 testChangeNonstaticAccessToStatic_Bug439733  Time elapsed: 0.084 s
04:26:35 testPushDownNegationReplaceNegationRemoveParentheses  Time elapsed: 0.064 s
04:26:35 testPushDownNegationReplaceNegationAndLessEqualOperator  Time elapsed: 0.066 s
04:26:35 testMapMethodRatherThanKeySetMethod  Time elapsed: 0.085 s
04:26:35 testRemoveRedundantModifiers  Time elapsed: 0.062 s
04:26:35 testCodeStyleQualifyMethodAccessesImportConflictBug_552461  Time elapsed: 0.074 s
04:26:35 testAddFinalBug157276_1  Time elapsed: 0.068 s
04:26:35 testAddFinalBug157276_2  Time elapsed: 0.06 s
04:26:35 testAddFinalBug157276_3  Time elapsed: 0.052 s
04:26:35 testAddFinalBug157276_4  Time elapsed: 0.05 s
04:26:35 testAddFinalBug157276_5  Time elapsed: 0.056 s
04:26:35 testAddFinalBug157276_6  Time elapsed: 0.056 s
04:26:35 testAddFinalBug157276_7  Time elapsed: 0.06 s
04:26:35 testAddFinalBug158041_1  Time elapsed: 0.062 s
04:26:35 testAddFinalBug158041_2  Time elapsed: 0.06 s
04:26:35 testAddFinalBug158041_3  Time elapsed: 0.07 s
04:26:35 testAddFinalBug158041_4  Time elapsed: 0.088 s
04:26:35 testAddFinalBug129807  Time elapsed: 0.072 s
04:26:35 testAddFinalBug145028  Time elapsed: 0.061 s
04:26:35 testAddFinalBug156842  Time elapsed: 0.065 s
04:26:35 testAddFinalBug163789  Time elapsed: 0.06 s
04:26:35 testAddFinalBug191862  Time elapsed: 0.082 s
04:26:35 testCleanUpWithCUProblemsGreaterThanMaxProblemsPerCUPreference  Time elapsed: 0.257 s
04:26:35 testAddFinalBug213995  Time elapsed: 0.069 s
04:26:35 testAddFinalBug272532  Time elapsed: 0.052 s
04:26:35 testAddFinalBug294768  Time elapsed: 0.057 s
04:26:35 testAddFinalBug297566  Time elapsed: 0.056 s
04:26:35 testMapMethodRatherThanValuesMethod  Time elapsed: 0.079 s
04:26:35 testRemoveParenthesesBug134741_1  Time elapsed: 0.055 s
04:26:35 testRemoveParenthesesBug134741_2  Time elapsed: 0.065 s
04:26:35 testRemoveParenthesesBug134741_3  Time elapsed: 0.05 s
04:26:35 testRemoveParenthesesBug134985_1  Time elapsed: 0.057 s
04:26:35 testRemoveParenthesesBug134985_2  Time elapsed: 0.075 s
04:26:35 testPushDownNegationReplaceNegationAndLessOperator  Time elapsed: 0.068 s
04:26:35 testCorrectIndetationBug202145_1  Time elapsed: 0.059 s
04:26:35 testCorrectIndetationBug202145_2  Time elapsed: 0.067 s
04:26:35 testAddBlockBug149110_1  Time elapsed: 0.054 s
04:26:35 testAddBlockBug149110_2  Time elapsed: 0.058 s
04:26:35 testCodeStyle_StaticAccessThroughInstance_Bug307407  Time elapsed: 0.051 s
04:26:35 testBug245254  Time elapsed: 0.051 s
04:26:35 testSortMembersMixedFields  Time elapsed: 0.055 s
04:26:35 testOrganizeImports01  Time elapsed: 0.56 s
04:26:35 testOrganizeImports02  Time elapsed: 0.053 s
04:26:35 testDoNotUseMapMethodInsideMapImplementation  Time elapsed: 0.171 s
04:26:35 testJava5001  Time elapsed: 0.075 s
04:26:35 testJava5002  Time elapsed: 0.076 s
04:26:35 testJava5003  Time elapsed: 0.074 s
04:26:35 testJava5004  Time elapsed: 0.095 s
04:26:35 testJava5005  Time elapsed: 0.111 s
04:26:35 testDoNotUseMapMethodInsideThisMapImplementation  Time elapsed: 0.064 s
04:26:35 testBug491087  Time elapsed: 0.084 s
04:26:35 testAddOverride15  Time elapsed: 0.074 s
04:26:35 testAddOverride16  Time elapsed: 0.102 s
04:26:35 testPushDownNegationReplaceNegationAndGreaterOperator  Time elapsed: 0.071 s
04:26:35 testCodeStyle_Bug140565  Time elapsed: 0.056 s
04:26:35 testRegExPrecompilationWithExistingImport  Time elapsed: 0.061 s
04:26:35 testPushDownNegationReplaceNegationAndGreaterEqualOperator  Time elapsed: 0.056 s
04:26:35 testPushDownNegationReplaceDoubleNegationWithParentheses  Time elapsed: 0.155 s
04:26:35 testPushDownNegationReplaceNegationWithInfixOrOperator  Time elapsed: 0.062 s
04:26:35 testPushDownNegationReplaceNegationWithNotEqualOperator  Time elapsed: 0.056 s
04:26:35 testRemoveParenthesesBug335173_10  Time elapsed: 0.051 s
04:26:35 testRemoveParenthesesBug335173_11  Time elapsed: 0.051 s
04:26:35 testRemoveParenthesesBug335173_12  Time elapsed: 0.124 s
04:26:35 testRemoveParenthesesBug335173_13  Time elapsed: 0.238 s
04:26:35 testRemoveParenthesesBug335173_14  Time elapsed: 0.214 s
04:26:35 testRemoveParenthesesBug335173_15  Time elapsed: 0.168 s
04:26:35 testRemoveParenthesesBug335173_16  Time elapsed: 0.21 s
04:26:35 testRemoveParenthesesBug335173_17  Time elapsed: 0.192 s
04:26:35 testRemoveParenthesesBug335173_18  Time elapsed: 0.217 s
04:26:35 testRemoveParenthesesBug335173_19  Time elapsed: 0.239 s
04:26:35 testRemoveParenthesesBug335173_20  Time elapsed: 0.28 s
04:26:35 testPushDownNegationReplaceNegationRevertInnerExpressions  Time elapsed: 0.088 s
04:26:35 testAddFinal01  Time elapsed: 0.076 s
04:26:35 testAddFinal02  Time elapsed: 0.075 s
04:26:35 testAddFinal03  Time elapsed: 0.074 s
04:26:35 testAddFinal04  Time elapsed: 0.073 s
04:26:35 testAddFinal05  Time elapsed: 0.065 s
04:26:35 testRemoveQualifierBug150481_1  Time elapsed: 0.072 s
04:26:35 testRemoveQualifierBug150481_2  Time elapsed: 0.059 s
04:26:35 testSortMembersVisibility  Time elapsed: 0.077 s
04:26:35 testUnusedCode01  Time elapsed: 0.067 s
04:26:35 testUnusedCode02  Time elapsed: 0.087 s
04:26:35 testUnusedCode03  Time elapsed: 0.06 s
04:26:35 testUnusedCode04  Time elapsed: 0.078 s
04:26:35 testUnusedCode05  Time elapsed: 0.067 s
04:26:35 testUnusedCode06  Time elapsed: 0.075 s
04:26:35 testUnusedCode07  Time elapsed: 0.068 s
04:26:35 testUnusedCode08  Time elapsed: 0.082 s
04:26:35 testUnusedCode09  Time elapsed: 0.073 s
04:26:35 testUnusedCode10  Time elapsed: 0.07 s
04:26:35 testUnusedCode11  Time elapsed: 0.077 s
04:26:35 testUnnecessaryCodeBug127704_1  Time elapsed: 0.066 s
04:26:35 testUnnecessaryCodeBug127704_2  Time elapsed: 0.078 s
04:26:35 testRemoveTrailingWhitespace01  Time elapsed: 0.065 s
04:26:35 testRemoveTrailingWhitespace02  Time elapsed: 0.058 s
04:26:35 testSortMembersBug218542  Time elapsed: 0.074 s
04:26:35 testSortMembersBug223997  Time elapsed: 0.061 s
04:26:35 testSortMembersBug263173  Time elapsed: 0.069 s
04:26:35 testCodeStyleBug119170_01  Time elapsed: 0.067 s
04:26:35 testCodeStyleBug119170_02  Time elapsed: 0.133 s
04:26:35 testPushDownNegationReplaceDoubleNegation  Time elapsed: 0.072 s
04:26:35 testSortMembersBug407759  Time elapsed: 0.07 s
04:26:35 testSortMembersBug434941  Time elapsed: 0.053 s
04:26:35 testAddFinalBug297566_2  Time elapsed: 0.07 s
04:26:35 testCodeStyleBug238828_1  Time elapsed: 0.068 s
04:26:35 testCodeStyleBug238828_2  Time elapsed: 0.068 s
04:26:35 testUnimplementedCode01  Time elapsed: 0.073 s
04:26:35 testUnimplementedCode02  Time elapsed: 0.067 s
04:26:35 testCodeStyle01  Time elapsed: 0.07 s
04:26:35 testCodeStyle02  Time elapsed: 0.394 s
04:26:35 testCodeStyle03  Time elapsed: 0.25 s
04:26:35 testCodeStyle04  Time elapsed: 0.092 s
04:26:35 testCodeStyle05  Time elapsed: 0.08 s
04:26:35 testCodeStyle06  Time elapsed: 0.056 s
04:26:35 testCodeStyle07  Time elapsed: 0.063 s
04:26:35 testCodeStyle08  Time elapsed: 0.06 s
04:26:35 testCodeStyle09  Time elapsed: 0.066 s
04:26:35 testCodeStyle10  Time elapsed: 0.067 s
04:26:35 testCodeStyle11  Time elapsed: 0.084 s
04:26:35 testCodeStyle12  Time elapsed: 0.082 s
04:26:35 testCodeStyle13  Time elapsed: 0.064 s
04:26:35 testCodeStyle14  Time elapsed: 0.073 s
04:26:35 testCodeStyle15  Time elapsed: 0.064 s
04:26:35 testCodeStyle16  Time elapsed: 0.09 s
04:26:35 testCodeStyle17  Time elapsed: 0.075 s
04:26:35 testCodeStyle18  Time elapsed: 0.077 s
04:26:35 testCodeStyle19  Time elapsed: 0.076 s
04:26:35 testCodeStyle20  Time elapsed: 0.075 s
04:26:35 testCodeStyle21  Time elapsed: 0.074 s
04:26:35 testCodeStyle22  Time elapsed: 0.144 s
04:26:35 testCodeStyle23  Time elapsed: 0.075 s
04:26:35 testCodeStyle24  Time elapsed: 0.065 s
04:26:35 testCodeStyle25  Time elapsed: 0.065 s
04:26:35 testCodeStyle26  Time elapsed: 0.076 s
04:26:35 testCodeStyle27  Time elapsed: 0.082 s
04:26:35 testCombination01  Time elapsed: 0.081 s
04:26:35 testCombination02  Time elapsed: 0.065 s
04:26:35 testCombination03  Time elapsed: 0.074 s
04:26:35 testRemoveQualifierBug134720  Time elapsed: 0.255 s
04:26:35 testRemoveQualifierBug219478  Time elapsed: 0.064 s
04:26:35 testRemoveQualifierBug219608  Time elapsed: 0.064 s
04:26:35 testRemoveBlockBug138628  Time elapsed: 0.067 s
04:26:35 testRemoveBlockBug149990  Time elapsed: 0.061 s
04:26:35 testRemoveQualifierBug330754  Time elapsed: 0.068 s
04:26:35 testPushDownNegationReplaceNegationWithInfixAndOperator  Time elapsed: 0.12 s
04:26:35 testRemoveNLSTag01  Time elapsed: 0.065 s
04:26:35 testSortMembersMixedFieldsInterface  Time elapsed: 0.063 s
04:26:35 testPushDownNegationReplaceInstanceofNegationWithInfixOrOperator  Time elapsed: 0.063 s
04:26:35 testPushDownNegationReplaceNegationLeaveParentheses  Time elapsed: 0.135 s
04:26:35 testUnusedCodeBug371078_1  Time elapsed: 0.073 s
04:26:35 testUnusedCodeBug371078_2  Time elapsed: 0.128 s
04:26:35 testOrganizeImportsBug202266  Time elapsed: 0.331 s
04:26:35 testOrganizeImportsBug229570  Time elapsed: 0.593 s
04:26:35 testPushDownNegationReplaceNegationWithEqualOperator  Time elapsed: 0.065 s
04:26:35 testAddOverride16_no_interface_methods  Time elapsed: 0.181 s
04:26:35 testPushDownNegationReplaceNegationAndNotEqualOperator  Time elapsed: 0.075 s
04:26:35 testSerialVersionBug139381  Time elapsed: 0.099 s
04:26:35 testRemoveParenthesesBug134739  Time elapsed: 0.066 s
04:26:35 testRemoveParenthesesBug188207  Time elapsed: 0.074 s
04:26:35 testRemoveParenthesesBug190188  Time elapsed: 0.062 s
04:26:35 testRemoveParenthesesBug208752  Time elapsed: 0.06 s
04:26:35 testRemoveParenthesesBug212856  Time elapsed: 0.066 s
04:26:35 testDoNotMergeConditionalBlocks  Time elapsed: 0.07 s
04:26:35 testSerialVersion01  Time elapsed: 0.066 s
04:26:35 testSerialVersion02  Time elapsed: 0.086 s
04:26:35 testSerialVersion03  Time elapsed: 0.088 s
04:26:35 testSerialVersion04  Time elapsed: 0.086 s
04:26:35 testSerialVersion05  Time elapsed: 0.202 s
04:26:35 testUseLazyLogicalOperator  Time elapsed: 0.144 s
04:26:35 testRemoveBlockBug156513_1  Time elapsed: 0.073 s
04:26:35 testRemoveBlockBug156513_2  Time elapsed: 0.087 s
04:26:35 testRegExPrecompilation  Time elapsed: 0.174 s
04:26:35 testPushDownNegationReplaceInstanceofNegationWithInfixAndOperator  Time elapsed: 0.117 s
04:26:35 testNumberSuffix  Time elapsed: 0.13 s
04:26:35 testUnusedCodeBug335173_1  Time elapsed: 0.06 s
04:26:35 testUnusedCodeBug335173_2  Time elapsed: 0.114 s
04:26:35 testUnusedCodeBug335173_3  Time elapsed: 0.067 s
04:26:35 testUnusedCodeBug173014_1  Time elapsed: 0.055 s
04:26:35 testUnusedCodeBug173014_2  Time elapsed: 0.058 s
04:26:35 testAddFinalBug134676_1  Time elapsed: 0.062 s
04:26:35 testAddFinalBug134676_2  Time elapsed: 0.062 s
04:26:35 testUnboxing2  Time elapsed: 0.074 s
04:26:35 testUnboxing3  Time elapsed: 0.081 s
04:26:35 testUnboxing4  Time elapsed: 0.077 s
04:26:35 testUnboxing5  Time elapsed: 0.078 s
04:26:35 testUnboxing6  Time elapsed: 0.073 s
04:26:35 testUnboxing7  Time elapsed: 0.069 s
04:26:35 testUnboxing8  Time elapsed: 0.145 s
04:26:35 testUnboxing9  Time elapsed: 0.139 s
04:26:35 testUnboxing10  Time elapsed: 0.151 s
04:26:35 testUnboxing11  Time elapsed: 0.071 s
04:26:35 testUseUnboxingOnPrimitiveDeclaration  Time elapsed: 0.153 s
04:26:35 testDoNotUseUnboxingOnNarrowingType  Time elapsed: 0.084 s
04:26:35 testAutoboxing  Time elapsed: 0.186 s
04:26:35 testUnboxingInArrayAccess  Time elapsed: 0.138 s
04:26:35 testJava50ForLoop01  Time elapsed: 0.077 s
04:26:35 testJava50ForLoop02  Time elapsed: 0.137 s
04:26:35 testJava50ForLoop03  Time elapsed: 0.073 s
04:26:35 testJava50ForLoop04  Time elapsed: 0.062 s
04:26:35 testJava50ForLoop05  Time elapsed: 0.116 s
04:26:35 testJava50ForLoop06  Time elapsed: 0.054 s
04:26:35 testJava50ForLoop07  Time elapsed: 0.063 s
04:26:35 testJava50ForLoop08  Time elapsed: 0.112 s
04:26:35 testJava50ForLoop09  Time elapsed: 0.069 s
04:26:35 testJava50ForLoop10  Time elapsed: 0.062 s
04:26:35 testJava50ForLoop11  Time elapsed: 0.142 s
04:26:35 testJava50ForLoop12  Time elapsed: 0.064 s
04:26:35 testJava50ForLoop13  Time elapsed: 0.055 s
04:26:35 testJava50ForLoop14  Time elapsed: 0.138 s
04:26:35 testJava50ForLoop15  Time elapsed: 0.066 s
04:26:35 testJava50ForLoop160283_1  Time elapsed: 0.092 s
04:26:35 testJava50ForLoop160283_2  Time elapsed: 0.135 s
04:26:35 testJava50ForLoop163122_1  Time elapsed: 0.073 s
04:26:35 testJava50ForLoop163122_2  Time elapsed: 0.168 s
04:26:35 testJava50ForLoop163122_3  Time elapsed: 0.069 s
04:26:35 testJava50ForLoop163122_4  Time elapsed: 0.131 s
04:26:35 testJava50ForLoop163122_5  Time elapsed: 0.095 s
04:26:35 testJava50ForLoop110599  Time elapsed: 0.062 s
04:26:35 testJava50ForLoop159449  Time elapsed: 0.153 s
04:26:35 testJava50ForLoop160218  Time elapsed: 0.091 s
04:26:35 testJava50ForLoop160270  Time elapsed: 0.064 s
04:26:35 testJava50ForLoop160312  Time elapsed: 0.095 s
04:26:35 testBug550726  Time elapsed: 0.079 s
04:26:35 testJava50ForLoop264421  Time elapsed: 0.085 s
04:26:35 testJava50ForLoop269595  Time elapsed: 0.068 s
04:26:35 testJava50ForLoop274199  Time elapsed: 0.172 s
04:26:35 testJava50ForLoop344674  Time elapsed: 0.078 s
04:26:35 testJava50ForLoop349782  Time elapsed: 0.057 s
04:26:35 testJava50ForLoop374264  Time elapsed: 0.066 s
04:26:35 testUnnecessaryArrayBug550129  Time elapsed: 0.089 s
04:26:35 testUnnecessaryArrayBug562091  Time elapsed: 0.066 s
04:26:35 testUnnecessaryArrayBug565374  Time elapsed: 0.073 s
04:26:35 testJava50ForLoopBug154939  Time elapsed: 0.065 s
04:26:35 testUnnecessaryArrayBug564983_1  Time elapsed: 0.054 s
04:26:35 testUnnecessaryArrayBug564983_2  Time elapsed: 0.057 s
04:26:35 testJava50ForLoopBug548002  Time elapsed: 0.06 s
04:26:35 testJava50ForLoopBug550334  Time elapsed: 0.057 s
04:26:35 testJava50ForLoopBug550672  Time elapsed: 0.074 s
04:26:35 testDoNotUseUnboxingWhenTypesDontMatch  Time elapsed: 0.057 s
04:26:35 testDoNotUseAutoboxingOnString  Time elapsed: 0.203 s
04:26:35 testAutoboxingSpecialCases  Time elapsed: 0.195 s
04:26:35 testJava50ForBug560431_1  Time elapsed: 0.06 s
04:26:35 testJava50ForBug560431_2  Time elapsed: 0.054 s
04:26:35 testDoNotRefactorObjectsEquals  Time elapsed: 0.083 s
04:26:35 testObjectsEqualsWithImportConflict  Time elapsed: 0.076 s
04:26:35 testRemoveRedundantTypeArguments1  Time elapsed: 0.093 s
04:26:35 testJava50ForLoop563267  Time elapsed: 0.074 s
04:26:35 testObjectsEquals  Time elapsed: 0.065 s
04:26:35 testConvertToAnonymousWithWildcards  Time elapsed: 0.594 s
04:26:35 testConvertToLambdaWithNonFunctionalTargetType  Time elapsed: 0.073 s
04:26:35 testConvertToLambdaAndQualifyNextField  Time elapsed: 0.064 s
04:26:35 testSimplifyLambdaExpression  Time elapsed: 0.082 s
04:26:35 testConvertToLambdaAmbiguous01  Time elapsed: 0.092 s
04:26:35 testConvertToLambdaAmbiguous02  Time elapsed: 0.083 s
04:26:35 testConvertToLambdaAmbiguous03  Time elapsed: 0.074 s
04:26:35 testConvertToAnonymousWithJoinedSAM  Time elapsed: 0.076 s
04:26:35 testConvertToLambdaNestedWithImports  Time elapsed: 0.078 s
04:26:35 testConvertToLambdaWithQualifiedField  Time elapsed: 0.06 s
04:26:35 testConvertToLambdaWithMethodAnnotations  Time elapsed: 0.058 s
04:26:35 testDoNotConvertLocalRecursiveClass  Time elapsed: 0.051 s
04:26:35 testConvertToLambdaWithRecursion  Time elapsed: 0.064 s
04:26:35 testConvertToLambdaConflictingNames  Time elapsed: 0.068 s
04:26:35 testConvertToLambda01  Time elapsed: 0.07 s
04:26:35 testConvertToLambda02  Time elapsed: 0.085 s
04:26:35 testConvertToLambda03  Time elapsed: 0.093 s
04:26:35 testConvertToAnonymousWithWildcards1  Time elapsed: 0.072 s
04:26:35 testDoNotRefactorWithExpressions  Time elapsed: 0.057 s
04:26:35 testConvertToLambdaInFieldInitializerWithFinalFieldReference2  Time elapsed: 0.057 s
04:26:35 testConvertToLambdaWithSynchronizedOrStrictfp  Time elapsed: 0.06 s
04:26:35 testConvertToLambdaInFieldInitializerWithFinalFieldReference  Time elapsed: 0.063 s
04:26:35 testDoNotUseVarOnUninitializedVariable  Time elapsed: 0.053 s
04:26:35 testUseLocalVariableTypeInferenceParameterizedTypeFromVariable  Time elapsed: 0.056 s
04:26:35 testUseLocalVariableTypeInferenceOnFloatWidening  Time elapsed: 0.06 s
04:26:35 testUseLocalVariableTypeInferenceOnLongWidening  Time elapsed: 0.056 s
04:26:35 testUseLocalVariableTypeInferenceOnHexaPrimitive  Time elapsed: 0.055 s
04:26:35 testUseLocalVariableTypeInferenceOnDoubleWidening  Time elapsed: 0.076 s
04:26:35 testUseLocalVariableTypeInferenceIntoStatement  Time elapsed: 0.063 s
04:26:35 testUseLocalVariableTypeInferenceOnParameterizedType  Time elapsed: 0.069 s
04:26:35 testDoNotUseVarOnDifferentTypeArguments  Time elapsed: 0.066 s
04:26:35 testUseLocalVariableTypeInferenceOnPrimitive  Time elapsed: 0.072 s
04:26:35 testDoNotUseVarOnDifferentTypes  Time elapsed: 0.101 s
04:26:35 testUseLocalVariableTypeInferenceParameterizedTypeFromMethod  Time elapsed: 0.065 s
04:26:35 testDoNotUseVarOnFromLambdaExpression  Time elapsed: 0.076 s
04:26:35 testDoNotUseVarOnParameterizedMethod  Time elapsed: 0.061 s
04:26:35 testDoNotUseVarOnArray  Time elapsed: 0.062 s
04:26:35 testDoNotUseVarOnNarrowingType  Time elapsed: 0.082 s
04:26:35 testDoNotUseVarOnMultiDeclarations  Time elapsed: 0.071 s
04:26:35 testUseLocalVariableTypeInferenceParameterizedTypeWithDiamond  Time elapsed: 0.081 s
04:26:35 testUseLocalVariableTypeInferenceParameterizedTypeFromCastExpression  Time elapsed: 0.08 s
04:26:35 testSortMembersTask  Time elapsed: 0.087 s
04:26:35 testSortMembersBookmarks  Time elapsed: 0.078 s
04:26:35 testSortMembersBreakpoints  Time elapsed: 0.074 s
04:26:35 testSortMembersProblemMarker  Time elapsed: 0.06 s
04:26:35 testFormatChangeBug488229_1  Time elapsed: 0.239 s
04:26:35 testFormatChangeBug488229_2  Time elapsed: 0.209 s
04:26:35 testFormatChangeBug488229_3  Time elapsed: 0.175 s
04:26:35 testFormatChangesBug207965_2  Time elapsed: 0.189 s
04:26:35 testBug213248_1  Time elapsed: 0.23 s
04:26:35 testBug213248_2  Time elapsed: 0.214 s
04:26:35 testBug213248_3  Time elapsed: 0.284 s
04:26:35 testBug213248_4  Time elapsed: 0.223 s
04:26:35 testBug228659  Time elapsed: 0.237 s
04:26:35 testFormatChanges01  Time elapsed: 0.195 s
04:26:35 testFormatChanges02  Time elapsed: 0.285 s
04:26:35 testFormatChangeBug560429  Time elapsed: 0.272 s
04:26:35 testFormatChangeBug561164  Time elapsed: 0.185 s
04:26:35 testFormatAll01  Time elapsed: 0.218 s
04:26:35 testBug232768_1  Time elapsed: 0.174 s
04:26:35 testBug232768_2  Time elapsed: 0.177 s
04:26:35 testBug232768_3  Time elapsed: 0.194 s
04:26:35 testFormatChangesBug205177  Time elapsed: 0.184 s
04:26:35 testFormatChangesBug205301  Time elapsed: 0.185 s
04:26:35 testFormatChangesBug205308  Time elapsed: 0.195 s
04:26:35 testFormatChangesBug207965  Time elapsed: 0.188 s
04:26:35 testFormatChangesBug208568  Time elapsed: 0.2 s
04:26:35 testSortMembersAction  Time elapsed: 0.077 s
04:26:35 testMoveTypeAnnotation  Time elapsed: 0.072 s
04:26:35 testBug528222  Time elapsed: 0.067 s
04:26:35 testContributedQuickFix1  Time elapsed: 0.067 s
04:26:35 testContributedQuickFix2  Time elapsed: 0.052 s
04:26:35 testSurroundWithRunnable10  Time elapsed: 0.067 s
04:26:35 testSurroundWithRunnable11  Time elapsed: 0.058 s
04:26:35 testSurroundWithRunnable12  Time elapsed: 0.129 s
04:26:35 testSurroundWithRunnable13  Time elapsed: 0.198 s
04:26:35 testSurroundWithRunnable14  Time elapsed: 0.162 s
04:26:35 testSurroundWithRunnable15  Time elapsed: 0.21 s
04:26:35 testSurroundWithRunnable16  Time elapsed: 0.217 s
04:26:35 testSurroundWithRunnable17  Time elapsed: 0.135 s
04:26:35 testSurroundWithRunnable18  Time elapsed: 0.221 s
04:26:35 testSurroundWithRunnable19  Time elapsed: 0.203 s
04:26:35 testSurroundWithRunnable20  Time elapsed: 0.233 s
04:26:35 testSurroundWithRunnable21  Time elapsed: 0.244 s
04:26:35 testSurroundWithRunnable22  Time elapsed: 0.127 s
04:26:35 testSurroundWithRunnable23  Time elapsed: 0.203 s
04:26:35 testSurroundWithRunnable24  Time elapsed: 0.192 s
04:26:35 testSurroundWithRunnable27  Time elapsed: 0.068 s
04:26:35 testSurroundWithRunnable28  Time elapsed: 0.075 s
04:26:35 testSurroundWithRunnable29  Time elapsed: 0.078 s
04:26:35 testSurroundWithRunnable30  Time elapsed: 0.067 s
04:26:35 testSurroundWithBug162549  Time elapsed: 0.072 s
04:26:35 testSurroundWithRunnableBug133560  Time elapsed: 0.066 s
04:26:35 testSurroundWithRunnableBug138323  Time elapsed: 0.072 s
04:26:35 testSurroundWithRunnableBug233278  Time elapsed: 0.061 s
04:26:35 testSurroundWithRunnable1  Time elapsed: 0.068 s
04:26:35 testSurroundWithRunnable2  Time elapsed: 0.075 s
04:26:35 testSurroundWithRunnable3  Time elapsed: 0.074 s
04:26:35 testSurroundWithRunnable4  Time elapsed: 0.059 s
04:26:35 testSurroundWithRunnable5  Time elapsed: 0.058 s
04:26:35 testSurroundWithRunnable6  Time elapsed: 0.058 s
04:26:35 testSurroundWithRunnable7  Time elapsed: 0.071 s
04:26:35 testSurroundWithRunnable8  Time elapsed: 0.079 s
04:26:35 testSurroundWithRunnable9  Time elapsed: 0.073 s
04:26:35 testRemoveTypeParameter2  Time elapsed: 0.075 s
04:26:35 testRemoveTypeParameter  Time elapsed: 0.092 s
04:26:35 testInferDiamondArguments  Time elapsed: 0.148 s
04:26:35 testCreateFieldInAccessor1  Time elapsed: 0.31 s
04:26:35 testCreateFieldInAccessor2  Time elapsed: 0.254 s
04:26:35 testCreateFieldInAccessor3  Time elapsed: 0.283 s
04:26:35 testCreateFieldInAccessor4  Time elapsed: 0.272 s
04:26:35 testCreateFieldInAccessor5  Time elapsed: 0.305 s
04:26:35 testCreateFieldInAccessor6  Time elapsed: 0.297 s
04:26:35 testRemoveProperty1  Time elapsed: 0.166 s
04:26:35 testRemoveProperty2  Time elapsed: 0.153 s
04:26:35 testRemoveProperty3  Time elapsed: 0.161 s
04:26:35 testRemoveProperty4  Time elapsed: 0.143 s
04:26:35 testNoProposals1  Time elapsed: 0.153 s
04:26:35 testNoProposals2  Time elapsed: 0.118 s
04:26:35 testNoProposals3  Time elapsed: 0.124 s
04:26:35 testChangeReturn2a  Time elapsed: 0.139 s
04:26:35 testChangeReturn2b  Time elapsed: 0.06 s
04:26:35 testRemoveRedundantAnnotation1  Time elapsed: 0.068 s
04:26:35 testRemoveRedundantAnnotation2  Time elapsed: 0.065 s
04:26:35 testRemoveRedundantAnnotation3  Time elapsed: 0.062 s
04:26:35 testRemoveRedundantAnnotation4  Time elapsed: 0.074 s
04:26:35 testRemoveRedundantAnnotation5  Time elapsed: 0.063 s
04:26:35 testRemoveRedundantAnnotation6  Time elapsed: 0.063 s
04:26:35 testRemoveRedundantAnnotation7  Time elapsed: 0.075 s
04:26:35 testRemoveRedundantAnnotation8  Time elapsed: 0.059 s
04:26:35 testAddNonNull  Time elapsed: 0.06 s
04:26:35 testChangeParameter2  Time elapsed: 0.07 s
04:26:35 testChangeParameter4  Time elapsed: 0.471 s
04:26:35 testChangeParameter5  Time elapsed: 0.063 s
04:26:35 testChangeParameter6  Time elapsed: 0.076 s
04:26:35 testChangeParameter7  Time elapsed: 0.261 s
04:26:35 testChangeParameter8  Time elapsed: 0.061 s
04:26:35 testChangeParameter9  Time elapsed: 0.47 s
04:26:35 testBug506108  Time elapsed: 0.51 s
04:26:35 testExtractPotentiallyNullField1  Time elapsed: 0.516 s
04:26:35 testExtractPotentiallyNullField2  Time elapsed: 0.065 s
04:26:35 testChangeParameter1a  Time elapsed: 0.471 s
04:26:35 testChangeParameter1b  Time elapsed: 0.528 s
04:26:35 testChangeParameter1c  Time elapsed: 0.505 s
04:26:35 testChangeParameter1d  Time elapsed: 0.519 s
04:26:35 testChangeParameter3a  Time elapsed: 0.511 s
04:26:35 testChangeParameter3b  Time elapsed: 0.057 s
04:26:35 testChangeParameter3c  Time elapsed: 0.07 s
04:26:35 testChangeParameter4a  Time elapsed: 0.428 s
04:26:35 testBug525428a  Time elapsed: 0.054 s
04:26:35 testBug525428b  Time elapsed: 0.179 s
04:26:35 testBug525428c  Time elapsed: 0.096 s
04:26:35 testBug525428d  Time elapsed: 0.122 s
04:26:35 testBug525428e  Time elapsed: 0.133 s
04:26:35 testExtractNullableField1  Time elapsed: 0.065 s
04:26:35 testExtractNullableField2  Time elapsed: 0.078 s
04:26:35 testExtractNullableField3  Time elapsed: 0.061 s
04:26:35 testExtractNullableField4  Time elapsed: 0.058 s
04:26:35 testExtractNullableField5  Time elapsed: 0.078 s
04:26:35 testExtractNullableField6  Time elapsed: 0.068 s
04:26:35 testExtractNullableField7  Time elapsed: 0.078 s
04:26:35 testExtractNullableField8  Time elapsed: 0.063 s
04:26:35 testExtractNullableField9  Time elapsed: 0.082 s
04:26:35 testChangeReturn1  Time elapsed: 0.421 s
04:26:35 testChangeReturn3  Time elapsed: 0.067 s
04:26:35 testChangeReturn4  Time elapsed: 0.506 s
04:26:35 testChangeReturn5  Time elapsed: 0.077 s
04:26:35 testChangeReturn6  Time elapsed: 0.381 s
04:26:35 test443146a  Time elapsed: 0.534 s
04:26:35 test443146b  Time elapsed: 0.533 s
04:26:35 test443146c  Time elapsed: 0.52 s
04:26:35 test443146d  Time elapsed: 0.523 s
04:26:35 test443146e  Time elapsed: 0.535 s
04:26:35 test443146f  Time elapsed: 0.525 s
04:26:35 testBug531511_none_decl  Time elapsed: 0.539 s
04:26:35 testBug531511_none_type  Time elapsed: 0.548 s
04:26:35 testBug531511_combined_multi_first_decl  Time elapsed: 0.109 s
04:26:35 testBug531511_combined_multi_first_type  Time elapsed: 0.171 s
04:26:35 testBug531511_return_multi_first_decl  Time elapsed: 0.26 s
04:26:35 testBug531511_return_multi_first_type  Time elapsed: 0.531 s
04:26:35 testBug531511_param_multi_first_decl  Time elapsed: 0.539 s
04:26:35 testBug531511_param_multi_first_type  Time elapsed: 0.558 s
04:26:35 testBug531511_boolean_default_decl  Time elapsed: 0.084 s
04:26:35 testBug531511_boolean_default_type  Time elapsed: 0.283 s
04:26:35 testBug531511_combined_multi_second_decl  Time elapsed: 0.073 s
04:26:35 testBug531511_combined_multi_second_type  Time elapsed: 0.085 s
04:26:35 testBug531511_param_multi_second_decl  Time elapsed: 0.571 s
04:26:35 testBug531511_param_multi_second_type  Time elapsed: 0.52 s
04:26:35 testBug513682  Time elapsed: 0.51 s
04:26:35 testBug525424  Time elapsed: 0.513 s
04:26:35 testBug531511_boolean_true_decl  Time elapsed: 0.074 s
04:26:35 testBug531511_boolean_true_type  Time elapsed: 0.074 s
04:26:35 testBug513209a  Time elapsed: 0.358 s
04:26:35 testBug513209b  Time elapsed: 0.507 s
04:26:35 testBug513209c  Time elapsed: 0.509 s
04:26:35 testBug513209d  Time elapsed: 0.054 s
04:26:35 testBug499716_a  Time elapsed: 0.489 s
04:26:35 testBug499716_b  Time elapsed: 0.511 s
04:26:35 testBug499716_c  Time elapsed: 0.51 s
04:26:35 testBug499716_d  Time elapsed: 0.509 s
04:26:35 testBug531511_unconfigurable_decl  Time elapsed: 0.142 s
04:26:35 testBug531511_unconfigurable_type  Time elapsed: 0.083 s
04:26:35 testBug531511_return_multi_second_decl  Time elapsed: 0.322 s
04:26:35 testBug531511_return_multi_second_type  Time elapsed: 0.526 s
04:26:35 testBug531511_boolean_false_decl  Time elapsed: 0.551 s
04:26:35 testBug531511_boolean_false_type  Time elapsed: 0.524 s
04:26:35 testBug473068_explicit_type  Time elapsed: 0.059 s
04:26:35 testBug473068_elided  Time elapsed: 0.058 s
04:26:35 testAnnotateReturn2  Time elapsed: 0.163 s
04:26:35 testAnnotateParameter_Varargs1  Time elapsed: 0.146 s
04:26:35 testAnnotateField1  Time elapsed: 0.154 s
04:26:35 testAnnotateField2  Time elapsed: 0.171 s
04:26:35 testAnnotateRemove  Time elapsed: 0.169 s
04:26:35 testAnnotateReturn  Time elapsed: 0.185 s
04:26:35 testBug466232  Time elapsed: 0.142 s
04:26:35 testAnnotateConstructorParameter  Time elapsed: 0.168 s
04:26:35 testAnnotateParameter_Array1  Time elapsed: 0.152 s
04:26:35 testAnnotateParameter_ArrayOfPrimitive  Time elapsed: 0.138 s
04:26:35 testAnnotateParameter_TypeArgument  Time elapsed: 0.149 s
04:26:35 testAnnotateParameter_Varargs1  Time elapsed: 0.146 s
04:26:35 testAnnotateParameter_Varargs2  Time elapsed: 0.141 s
04:26:35 testAnnotateParameter_Varargs3  Time elapsed: 0.158 s
04:26:35 testAnnotateField1  Time elapsed: 0.14 s
04:26:35 testAnnotateMethod_TypeParameter1  Time elapsed: 0.17 s
04:26:35 testAnnotateMethod_TypeParameter2  Time elapsed: 0.155 s
04:26:35 testAnnotateParameter_WildcardBound  Time elapsed: 0.159 s
04:26:35 testAnnotateMethod_Array1  Time elapsed: 0.145 s
04:26:35 testAnnotateMethod_Array2  Time elapsed: 0.145 s
04:26:35 testAnnotateParameter_Array2  Time elapsed: 0.14 s
04:26:35 testAnnotateParameter_Array3  Time elapsed: 0.142 s
04:26:35 testAnnotateParameter_Array4  Time elapsed: 0.14 s
04:26:35 testAnnotateParameter_Array5  Time elapsed: 0.197 s
04:26:35 testNormalAnnotationP4a  Time elapsed: 0.059 s
04:26:35 testMoveNormalAnnotationL1  Time elapsed: 0.056 s
04:26:35 testMoveAnnotationOnByteArraySuffixSyntax  Time elapsed: 0.057 s
04:26:35 testMoveAnnotationOnByteMultiDimArray  Time elapsed: 0.056 s
04:26:35 testMoveSingleValueAnnotationB2  Time elapsed: 0.057 s
04:26:35 testMoveSingleValueAnnotationF1  Time elapsed: 0.055 s
04:26:35 testMoveAnnotationOnByteArrayMixedSyntax  Time elapsed: 0.055 s
04:26:35 testMoveAnnotationOnByteArray  Time elapsed: 0.066 s
04:26:35 testNormalAnnotationP4  Time elapsed: 0.058 s
04:26:35 testMoveAnnotationB1  Time elapsed: 0.058 s
04:26:35 testMoveAnnotationB2  Time elapsed: 0.057 s
04:26:35 testMoveAnnotationB3  Time elapsed: 0.059 s
04:26:35 testMoveAnnotationC1  Time elapsed: 0.065 s
04:26:35 testMoveAnnotationF1  Time elapsed: 0.057 s
04:26:35 testMoveAnnotationL1  Time elapsed: 0.059 s
04:26:35 testMoveAnnotationM1  Time elapsed: 0.061 s
04:26:35 testMoveAnnotationM2  Time elapsed: 0.066 s
04:26:35 testMoveAnnotationM3  Time elapsed: 0.068 s
04:26:35 testMoveAnnotationM4  Time elapsed: 0.081 s
04:26:35 testMoveAnnotationM5  Time elapsed: 0.057 s
04:26:35 testMoveAnnotationM6  Time elapsed: 0.061 s
04:26:35 testMoveAnnotationM7  Time elapsed: 0.06 s
04:26:35 testMoveAnnotationM8  Time elapsed: 0.069 s
04:26:35 testMoveAnnotationM9  Time elapsed: 0.058 s
04:26:35 testMoveAnnotationP1  Time elapsed: 0.059 s
04:26:35 testMoveAnnotationP2  Time elapsed: 0.059 s
04:26:35 testMoveAnnotationP3  Time elapsed: 0.063 s
04:26:35 testMoveAnnotationP4  Time elapsed: 0.07 s
04:26:35 testMoveSingleValueAnnotationF1a  Time elapsed: 0.065 s
04:26:35 testMoveAnnotationM10  Time elapsed: 0.06 s
04:26:35 testMoveAnnotationM11  Time elapsed: 0.057 s
04:26:35 testMoveAnnotationM12  Time elapsed: 0.069 s
04:26:35 testMoveAnnotationM1a  Time elapsed: 0.063 s
04:26:35 testRemoveAnnotationOnByteNoArray  Time elapsed: 0.064 s
04:26:35 testBasicCreate  Time elapsed: 0.05 s
04:26:35 testBasicSet  Time elapsed: 0.02 s
04:26:35 testUserSet  Time elapsed: 0.001 s
04:26:35 testProjectChange  Time elapsed: 0.033 s
04:26:35 testUserCreate  Time elapsed: 0.046 s
04:26:35 testExistingOverwrite  Time elapsed: 0.115 s
04:26:35 testReadExisting  Time elapsed: 0.062 s
04:26:35 testCreateAnnotationWithBody  Time elapsed: 0.079 s
04:26:35 testCreateEnumWithBody  Time elapsed: 0.069 s
04:26:35 testCreateInterface  Time elapsed: 0.059 s
04:26:35 testAttemptCreateExistingClass  Time elapsed: 0.169 s
04:26:35 testCreateAnnotation  Time elapsed: 0.056 s
04:26:35 testCreateClassWithBody  Time elapsed: 0.058 s
04:26:35 testCreateEnum  Time elapsed: 0.059 s
04:26:35 testCreateInterfaceWithBody  Time elapsed: 0.068 s
04:26:35 testCreateInnerClass1  Time elapsed: 0.089 s
04:26:35 testCreateClassExtraImports1  Time elapsed: 0.072 s
04:26:35 testCreateClassExtraImports2  Time elapsed: 0.061 s
04:26:35 testCreateClassExtraImports3  Time elapsed: 0.066 s
04:26:35 testCreateClass1  Time elapsed: 0.302 s
04:26:35 testCreateClass2  Time elapsed: 0.059 s
04:26:35 testCreateClass3  Time elapsed: 0.059 s
04:26:35 testCreateClass4  Time elapsed: 0.179 s
04:26:35 testImportRawJavaProject  Time elapsed: 0.2 s
04:26:35 testDeleteBottomLevelFragment  Time elapsed: 0.201 s
04:26:35 testAddBottomLevelFragment  Time elapsed: 0.163 s
04:26:35 testGetChildrentMidLevelFragment  Time elapsed: 0.156 s
04:26:35 testChangedTopLevelPackageFragment  Time elapsed: 0.17 s
04:26:35 testBug65240  Time elapsed: 0.178 s
04:26:35 testGetParentTopLevelFragment  Time elapsed: 0.19 s
04:26:35 testGetParentMidLevelFragment  Time elapsed: 0.164 s
04:26:35 testChangeBottomLevelPackageFragment  Time elapsed: 0.248 s
04:26:35 testRemoveCUFromPackageFragment  Time elapsed: 0.181 s
04:26:35 testGetParentTopLevelFragmentInArchive  Time elapsed: 0.162 s
04:26:35 testGetParentMidLevelFragmentInArchive  Time elapsed: 0.182 s
04:26:35 testGetChildrenArchive  Time elapsed: 0.156 s
04:26:35 testGetChildrenProjectWithSourceFolders  Time elapsed: 0.181 s
04:26:35 testGetParentArchive  Time elapsed: 0.18 s
04:26:35 testGetChildrenSourceFolder  Time elapsed: 0.147 s
04:26:35 testRemoveCUsFromPackageFragment  Time elapsed: 0.163 s
04:26:35 testGetChildrenBottomLevelFragment  Time elapsed: 0.153 s
04:26:35 testGetChildrenBottomLevelFragmentInArchive  Time elapsed: 0.178 s
04:26:35 testGetChildrenMidLevelFragmentInArchive  Time elapsed: 0.182 s
04:26:35 testGetChildrenMidLevelFragmentInInternalArchive  Time elapsed: 0.063 s
04:26:35 testGetChildrentMidLevelFragment  Time elapsed: 0.079 s
04:26:35 testGetChildrenBottomLevelFragmentInInternalArchive  Time elapsed: 0.089 s
04:26:35 testGetParentTopLevelFragment  Time elapsed: 0.091 s
04:26:35 testGetChildrenBottomLevelFragmentWithCU  Time elapsed: 0.096 s
04:26:35 testGetParentMidLevelFragment  Time elapsed: 0.078 s
04:26:35 testGetChildrenBottomLevelFragment2  Time elapsed: 0.059 s
04:26:35 testGetParentTopLevelFragmentInArchive  Time elapsed: 0.056 s
04:26:35 testGetParentMidLevelFragmentInArchive  Time elapsed: 0.052 s
04:26:35 testGetParentArchive  Time elapsed: 0.054 s
04:26:35 testGetChildrenBottomLevelFragment  Time elapsed: 0.054 s
04:26:35 testGetChildrenProject  Time elapsed: 0.07 s
04:26:35 testGetChildrenBottomLevelFragmentFile  Time elapsed: 0.072 s
04:26:35 testGetChildrentMidLevelFragment  Time elapsed: 0.179 s
04:26:35 testAddBottomLevelFragmentFolding  Time elapsed: 0.184 s
04:26:35 testDeleteBottomLevelFragmentFolding  Time elapsed: 0.26 s
04:26:35 testGetParentFoldedBottomFragment  Time elapsed: 0.179 s
04:26:35 testGetParentTopLevelFragment  Time elapsed: 0.203 s
04:26:35 testGetChildrenBottomLevelFragmentWithCU  Time elapsed: 0.186 s
04:26:35 testGetParentMidLevelFragment  Time elapsed: 0.157 s
04:26:35 testChangedTopLevelPackageFragmentFolding  Time elapsed: 0.177 s
04:26:35 testRemoveCUFromPackageFragment  Time elapsed: 0.173 s
04:26:35 testChangeBottomLevelPackageFragmentFolding  Time elapsed: 0.185 s
04:26:35 testGetParentTopLevelFragmentInArchive  Time elapsed: 0.161 s
04:26:35 testGetChildrenSource  Time elapsed: 0.173 s
04:26:35 testGetChildrenArchive  Time elapsed: 0.166 s
04:26:35 testGetChildrenProjectWithSourceFolders  Time elapsed: 0.165 s
04:26:35 testGetParentArchive  Time elapsed: 0.159 s
04:26:35 testRemoveCUsFromPackageFragment  Time elapsed: 0.187 s
04:26:35 testGetChildrenBottomLevelFragment  Time elapsed: 0.311 s
04:26:35 testGetChildrenBottomLevelFragmentInArchive  Time elapsed: 0.318 s
04:26:35 testGetChildrenMidLevelFragmentInInternalArchive  Time elapsed: 0.061 s
04:26:35 testGetChildrentMidLevelFragment  Time elapsed: 0.053 s
04:26:35 testGetChildrenDefaultProject  Time elapsed: 0.054 s
04:26:35 testGetChildrenBottomLevelFragmentInInternalArchive  Time elapsed: 0.053 s
04:26:35 testGetParentTopLevelFragment  Time elapsed: 0.056 s
04:26:35 testGetChildrenBottomLevelFragmentWithCU  Time elapsed: 0.056 s
04:26:35 testGetParentMidLevelFragment  Time elapsed: 0.052 s
04:26:35 testGetParentMidLevelFragment2  Time elapsed: 0.054 s
04:26:35 testGetChildrenBottomLevelFragmenWithCU2  Time elapsed: 0.056 s
04:26:35 testGetParentTopLevelFragmentInArchive  Time elapsed: 0.066 s
04:26:35 testGetParentMidLevelFragmentInArchive  Time elapsed: 0.053 s
04:26:35 testGetParentArchive  Time elapsed: 0.069 s
04:26:35 testGetChildrenBottomLevelFragment  Time elapsed: 0.077 s
04:26:35 testGetChildrenProject  Time elapsed: 0.069 s
04:26:35 testNestedSource1  Time elapsed: 0.09 s
04:26:35 testInclExcl1  Time elapsed: 0.057 s
04:26:35 testProjectSource1  Time elapsed: 0.048 s
04:26:35 testChangeClassInProject  Time elapsed: 0.056 s
04:26:35 testAddFolderToClassFolder  Time elapsed: 0.046 s
04:26:35 testAddFileToClassFolder  Time elapsed: 0.045 s
04:26:35 testRemoveFolderFromClassFolder  Time elapsed: 0.046 s
04:26:35 testRemoveFileFromClassFolder  Time elapsed: 0.052 s
04:26:35 testModule1Flat  Time elapsed: 0.049 s
04:26:35 testModule2Flat  Time elapsed: 0.057 s
04:26:35 testModule1EmptyHierarchical  Time elapsed: 0.045 s
04:26:35 testModule2EmptyFlat  Time elapsed: 0.054 s
04:26:35 testModule2Hierarchical  Time elapsed: 0.047 s
04:26:35 testModule1EmptyFlat  Time elapsed: 0.054 s
04:26:35 testModule1Hierarchical  Time elapsed: 0.046 s
04:26:35 testModule2EmptyHierarchical  Time elapsed: 0.053 s
04:26:35 testCUAdaptedCU  Time elapsed: 0.106 s
04:26:35 testCU  Time elapsed: 0.209 s
04:26:35 testCUNotOnClasspath  Time elapsed: 0.303 s
04:26:35 testCUAdaptedResource  Time elapsed: 0.086 s
04:26:35 testMoveProject  Time elapsed: 0.07 s
04:26:35 testRearrange1  Time elapsed: 0.072 s
04:26:35 testRearrange2  Time elapsed: 0.075 s
04:26:35 testRearrange3  Time elapsed: 0.091 s
04:26:35 testMoveToOthersProject  Time elapsed: 0.095 s
04:26:35 testInvalidSource1  Time elapsed: 0.093 s
04:26:35 testInvalidSource2  Time elapsed: 0.066 s
04:26:35 testAddProject  Time elapsed: 0.1 s
04:26:35 testInvalidTarget2  Time elapsed: 0.086 s
04:26:35 testClassFolderFoldedHierarchical  Time elapsed: 0.315 s
04:26:35 testJARHierarchical  Time elapsed: 0.347 s
04:26:35 testClassFolderHierarchical  Time elapsed: 0.293 s
04:26:35 testJARFoldedHierarchical  Time elapsed: 0.276 s
04:26:35 testGetDirectChildren  Time elapsed: 0.052 s
04:26:35 testGetSingleChild  Time elapsed: 0.057 s
04:26:35 testSingleChildAgainstOldImplementation  Time elapsed: 0.043 s
04:26:35 testHasSingleChild  Time elapsed: 0.059 s
04:26:35 testHasSingleChildAgainstOldImplementation  Time elapsed: 0.043 s
04:26:35 testGetParentTopLevelLogicalPackage  Time elapsed: 0.204 s
04:26:35 testBug123424_1  Time elapsed: 0.197 s
04:26:35 testBug123424_2  Time elapsed: 0.174 s
04:26:35 testGetChildrenLogicalPackage  Time elapsed: 0.186 s
04:26:35 testGetParentWithRootFocusAfterProjectFocus  Time elapsed: 0.166 s
04:26:35 testGetChildrenLogicalPackage2  Time elapsed: 0.182 s
04:26:35 testGetParentTopLevelFragment  Time elapsed: 0.187 s
04:26:35 testGetParentPackageFragmentWithLogicalPackageParent  Time elapsed: 0.188 s
04:26:35 testGetParentPFwithProjectFocus  Time elapsed: 0.177 s
04:26:35 testGetParentMidLevelFragment  Time elapsed: 0.256 s
04:26:35 testGetChildrentMidLevelFragmentNotLogicalPackage  Time elapsed: 0.187 s
04:26:35 testGetParentOfLogicalPackagetWithLogicalPackageParent  Time elapsed: 0.188 s
04:26:35 testGetParentTopLevelFragmentInArchive  Time elapsed: 0.214 s
04:26:35 testGetParentMidLevelFragmentInArchive  Time elapsed: 0.17 s
04:26:35 testGetChildrenArchive  Time elapsed: 0.205 s
04:26:35 testGetChildrenProjectWithSourceFolders  Time elapsed: 0.212 s
04:26:35 testGetParentArchive  Time elapsed: 0.198 s
04:26:35 testGetChildrenSourceFolder  Time elapsed: 0.207 s
04:26:35 testGetChildrenBottomLevelFragment  Time elapsed: 0.213 s
04:26:35 testGetChildrenBottomLevelFragmentInArchive  Time elapsed: 0.188 s
04:26:35 testGetChildrenMidLevelFragmentInArchive  Time elapsed: 0.187 s
04:26:35 testRemovePackageNotLogicalPackage  Time elapsed: 0.212 s
04:26:35 testRemoveCUFromPackageNotLogicalPackage  Time elapsed: 0.215 s
04:26:35 testGetElementsPackageFragmentRoot  Time elapsed: 0.125 s
04:26:35 testRemovePackageFromLogicalPackage  Time elapsed: 0.253 s
04:26:35 testAddPackageNotLogicalPackage  Time elapsed: 0.295 s
04:26:35 testAddCUFromPackageNotLogicalPackage  Time elapsed: 0.186 s
04:26:35 testRemovePackageInTwoPackageLogicalPackage  Time elapsed: 0.185 s
04:26:35 testAddFragmentToLogicalPackage  Time elapsed: 0.186 s
04:26:35 testGetElementsProject  Time elapsed: 0.16 s
04:26:35 testAddPackageToCreateLogicalPackage  Time elapsed: 0.252 s
04:26:35 testAddBottomLevelFragmentNotLogicalPackage  Time elapsed: 0.123 s
04:26:35 testRemoveBottomLevelFragmentNotLogicalPackage  Time elapsed: 0.159 s
04:26:35 testAddTopLevelFragmentNotLogicalPackage  Time elapsed: 0.116 s
04:26:35 testRemoveFragmentInMultiFragmentLogicalPackage  Time elapsed: 0.108 s
04:26:35 testRemoveBottomLevelFragmentInMultiFragmentLogicalPackage  Time elapsed: 0.093 s
04:26:35 testRemoveCUFromFragmentNotLogicalPackage  Time elapsed: 0.104 s
04:26:35 testAddCUFromFragmentNotLogicalPackageNotVisible  Time elapsed: 0.113 s
04:26:35 testRemoveCUFromFragmentNotLogicalPackageWithParentNotVisible  Time elapsed: 0.107 s
04:26:35 testRemoveTopLevelFragmentNotLogicalPackage  Time elapsed: 0.116 s
04:26:35 testAddCUFromFragmentNotLogicalPackageVisible  Time elapsed: 0.126 s
04:26:35 testAddFragmentToLogicalPackage  Time elapsed: 0.122 s
04:26:35 testRemoveFragmentInTwoFragmentLogicalPackage  Time elapsed: 0.184 s
04:26:35 testOutgoingPackageDeletion269167  Time elapsed: 0.088 s
04:26:35 testOutgoingChangeInNonPackage261198  Time elapsed: 0.065 s
04:26:35 testOutgoingDeletion148118  Time elapsed: 0.077 s
04:26:35 testIncomingAddition159884Part2  Time elapsed: 0.051 s
04:26:35 testIncomingAddition159884  Time elapsed: 0.072 s
04:26:35 testGetChildrenOfCalleeRecursive  Time elapsed: 0.122 s
04:26:35 testGetChildrenOfCalleeMaxDepth  Time elapsed: 0.111 s
04:26:35 testGetChildrenOfCalleeRoot  Time elapsed: 0.112 s
04:26:35 testGetChildrenOfCallerRoot  Time elapsed: 0.368 s
04:26:35 testGetChildrenOfCallerRecursive  Time elapsed: 0.57 s
04:26:35 testGetChildrenOfCallerMaxDepth  Time elapsed: 0.538 s
04:26:35 testCompleteSelection  Time elapsed: 0.071 s
04:26:35 testCompleteSelectionOfSubPackage1  Time elapsed: 0.072 s
04:26:35 testCompleteSelectionOfSubPackage2  Time elapsed: 0.074 s
04:26:35 testPartialSelection1  Time elapsed: 0.087 s
04:26:35 testPartialSelection2  Time elapsed: 0.073 s
04:26:35 testPartialSelection3  Time elapsed: 0.106 s
04:26:35 testPartialSelection4  Time elapsed: 0.076 s
04:26:35 testRemoveResources1  Time elapsed: 0.051 s
04:26:35 testRemoveResources2  Time elapsed: 0.049 s
04:26:35 testRemoveResources3  Time elapsed: 0.042 s
04:26:35 testRemovePackages1  Time elapsed: 0.041 s
04:26:35 testRemovePackages2  Time elapsed: 0.042 s
04:26:35 testRemoveAll  Time elapsed: 0.042 s
04:26:35 testFindOverridden  Time elapsed: 0.277 s
04:26:35 testSimpleMethodRef  Time elapsed: 0.574 s
04:26:35 testSimpleAdd  Time elapsed: 0.168 s
04:26:35 testRemoveParentLast  Time elapsed: 0.133 s
04:26:35 testRemoveParentFirst  Time elapsed: 0.117 s
04:26:35 testRemove  Time elapsed: 0.119 s
04:26:35 testSimpleParticipant  Time elapsed: 0.585 s
04:26:35 testGetFile  Time elapsed: 0.654 s
04:26:35 testBug247012_1  Time elapsed: 0.574 s
04:26:35 testBug247012_2  Time elapsed: 0.543 s
04:26:35 testBug247012_3  Time elapsed: 0.545 s
04:26:35 testBug247012_4  Time elapsed: 0.533 s
04:26:35 test01  Time elapsed: 0.529 s
04:26:35 test02  Time elapsed: 0.528 s
04:26:35 test03  Time elapsed: 0.73 s
04:26:35 test04  Time elapsed: 0.556 s
04:26:35 test05  Time elapsed: 0.536 s
04:26:35 test06  Time elapsed: 0.539 s
04:26:35 testBug133810  Time elapsed: 0.553 s
04:26:35 testBug152604  Time elapsed: 0.538 s
04:26:35 testBug185178  Time elapsed: 0.541 s
04:26:35 testBug295040  Time elapsed: 0.531 s
04:26:35 testBug306168_1  Time elapsed: 0.537 s
04:26:35 testBug306168_2  Time elapsed: 0.531 s
04:26:35 testJUnitTabGroupSetDefaults  Time elapsed: 0.073 s
04:26:35 testAssertionsOnByDefault  Time elapsed: 0 s
04:26:35 testEnableAssertionsInWizard  Time elapsed: 0.062 s
04:26:35 testReorderCustomSuite  Time elapsed: 0.001 s
04:26:35 testReorderSimple  Time elapsed: 0 s
04:26:35 testReorderWithPropagation2  Time elapsed: 0 s
04:26:35 testReorderWithPropagation3  Time elapsed: 0 s
04:26:35 testReorderWithPropagation  Time elapsed: 0 s
04:26:35 testReorder  Time elapsed: 0 s
04:26:35 testReorderWithPropagationWithDecorator  Time elapsed: 0.001 s
04:26:35 testReorderWithPropagationBug  Time elapsed: 0 s
04:26:35 testReorderSimpleWithDecorator  Time elapsed: 0 s
04:26:35 testTwoPackageFragmentRootsSearchingInOneNoSupertype  Time elapsed: 0.448 s
04:26:35 testTwoPackageFragmentRootsSearchingInOne  Time elapsed: 0.526 s
04:26:35 testOnePackage  Time elapsed: 0.507 s
04:26:35 testProject  Time elapsed: 0.51 s
04:26:35 testTwoPackagesSearchingInOne  Time elapsed: 0.529 s
04:26:35 testPackageFragmentRoot  Time elapsed: 0.506 s
04:26:35 testJUnit4NoSrc  Time elapsed: 0.053 s
04:26:35 testSubPackage  Time elapsed: 0.458 s
04:26:35 testTwoPackages  Time elapsed: 0.51 s
04:26:35 testTwoPackageFragmentRoots  Time elapsed: 0.521 s
04:26:35 testSimpleTest  Time elapsed: 0.516 s
04:26:35 testTreeOnSessionStarted  Time elapsed: 0.298 s
04:26:35 testTreeOnSecondTestStarted2  Time elapsed: 0.298 s
04:26:35 testTreeUnrootedEnded  Time elapsed: 0.283 s
04:26:35 testTreeJUnit4TestAdapter  Time elapsed: 0.383 s
04:26:35 testFail  Time elapsed: 0.237 s
04:26:35 testOK  Time elapsed: 0.365 s
04:26:35 testTreeOnSecondTestStarted  Time elapsed: 0.329 s
04:26:35 testTreeOnSessionEnded  Time elapsed: 0.329 s
04:26:35 testSimpleTest  Time elapsed: 0.409 s
04:26:35 testTreeOnSessionStarted  Time elapsed: 0.416 s
04:26:35 testTreeOnSecondTestStarted2  Time elapsed: 0.497 s
04:26:35 testFail  Time elapsed: 0.455 s
04:26:35 testOK  Time elapsed: 0.45 s
04:26:35 testTreeOnSecondTestStarted  Time elapsed: 0.475 s
04:26:35 testParametrizedWithEvilChars  Time elapsed: 0.336 s
04:26:35 testTreeOnSessionEnded  Time elapsed: 0.378 s
04:26:35 testTreeOK  Time elapsed: 0.485 s
04:26:35 testTreeOnSessionStarted  Time elapsed: 0.857 s
04:26:35 testFail  Time elapsed: 1.253 s
04:26:35 testOK  Time elapsed: 0.843 s
04:26:35 testThatLauncherLibGetsAdded  Time elapsed: 1.294 s
04:26:35 testTreeOnSessionEnded  Time elapsed: 1.174 s
04:26:35 testFilterToNoTestsRemain  Time elapsed: 0.497 s
04:26:35 testFilterToTest2Fail  Time elapsed: 0.456 s
04:26:35 testFilterToTest1Succeed  Time elapsed: 0.363 s
04:26:35 testMatchSubtree1Leaf2ByName  Time elapsed: 0.387 s
04:26:35 testMatchAllFirstLeafs  Time elapsed: 0.365 s
04:26:35 testMatchSubtree1Leaf1ByNameAndClass  Time elapsed: 0.342 s
04:26:35 testMatchSubtree2ByName  Time elapsed: 0.374 s
04:26:35 testMatchRoot  Time elapsed: 0.346 s
04:26:35 testMatchSubtree1Leaf1ByName  Time elapsed: 0.411 s
04:26:35 testMatchSubtree1ByName  Time elapsed: 0.306 s
04:26:35 testFailingSuite  Time elapsed: 0.296 s
04:26:35 testAllTests  Time elapsed: 1.316 s
04:26:35 testATestSuite  Time elapsed: 1.287 s
04:26:35 testImportAntSuite  Time elapsed: 0.065 s
04:26:35 testATestCase_testSucceed  Time elapsed: 0.303 s
04:26:35 testATestCase  Time elapsed: 1.403 s
04:26:35 testFailures  Time elapsed: 0.24 s
04:26:35 testAllTests  Time elapsed: 1.36 s
04:26:35 testATestSuite  Time elapsed: 1.313 s
04:26:35 testImportAntSuite  Time elapsed: 0.055 s
04:26:35 testATestCase  Time elapsed: 1.276 s
04:26:35 testFailures  Time elapsed: 0.477 s
04:26:35 testTestInterface  Time elapsed: 0.099 s
04:26:35 testSuite  Time elapsed: 0.523 s
04:26:35 testTestCase  Time elapsed: 0.515 s
04:26:35 testTestAnnotation2  Time elapsed: 0.506 s
04:26:35 testSuiteFinder  Time elapsed: 0.557 s
04:26:35 testTestCase  Time elapsed: 3.549 s
04:26:35 testTestAnnotation  Time elapsed: 2.033 s
04:26:35 testRunWith  Time elapsed: 3.074 s
04:26:35 testTestAnnotation_bug204682  Time elapsed: 0.52 s
04:26:35 testSrcWithOthers  Time elapsed: 0.237 s
04:26:35 testPackageWithOthers  Time elapsed: 0.275 s
04:26:35 testDefaultZipWithOthers  Time elapsed: 0.315 s
04:26:35 testCUWithOthers  Time elapsed: 0.254 s
04:26:35 testDefaultPackWithOthers  Time elapsed: 0.288 s
04:26:35 testExcludedPackWithOthers  Time elapsed: 0.27 s
04:26:35 testNormalFolderWithOthers  Time elapsed: 0.243 s
04:26:35 testDefaultJARWithOthers  Time elapsed: 0.241 s
04:26:35 testProjectWithOthers  Time elapsed: 0.24 s
04:26:35 testExcludedFileWithOthers  Time elapsed: 0.236 s
04:26:35 testFileWithOthers  Time elapsed: 0.248 s
04:26:35 testAddExternalJar02AddMuiltiLibs  Time elapsed: 0.095 s
04:26:35 testAddExternalJar02AddMuiltiLibsTwice  Time elapsed: 0.034 s
04:26:35 testEditOutputFolderBug153068  Time elapsed: 0.049 s
04:26:35 testEditOutputFolderBug154044  Time elapsed: 0.226 s
04:26:35 testEditOutputFolderBug154196  Time elapsed: 0.276 s
04:26:35 testEditOutputFolderBug154044OldIsProject  Time elapsed: 0.052 s
04:26:35 testRemoveFromBuildpathBug153299Lib  Time elapsed: 0.063 s
04:26:35 testRemoveFromBuildpathBug153299Src  Time elapsed: 0.046 s
04:26:35 testEditOutputFolder05CannotOutputToSource  Time elapsed: 0.045 s
04:26:35 testAddExternalJar01AddMyLib  Time elapsed: 0.069 s
04:26:35 testRemoveFromBuildpath01  Time elapsed: 0.064 s
04:26:35 testEditOutputFolder01SetOutputFolderForSourceFolder  Time elapsed: 0.044 s
04:26:35 testRemoveFromBuildpath01RemoveProject  Time elapsed: 0.042 s
04:26:35 testEditOutputFolder03ExcludeOutputFolderOther  Time elapsed: 0.044 s
04:26:35 testAddExternalJarBug132827  Time elapsed: 0.052 s
04:26:35 testEditOutputFolder03ExcludeOutputFolderSelf  Time elapsed: 0.042 s
04:26:35 testRemoveFromBuildpath01RemoveLibs  Time elapsed: 0.042 s
04:26:35 testEditOutputFolder02RemoveProjectAsSourceFolder  Time elapsed: 0.044 s
04:26:35 testEditOutputFolder04RemoveProjectAndExcludeOutput  Time elapsed: 0.045 s
04:26:35 testEditOutputFolderBug154044DonotDeleteDefaultOutputFolder  Time elapsed: 0.043 s
04:26:35 testUserLibrarySorting  Time elapsed: 0.006 s
04:26:35 test4OutOverlap  Time elapsed: 0.052 s
04:26:35 test1Incomplete  Time elapsed: 0.062 s
04:26:35 test2Cyclic  Time elapsed: 0.129 s
04:26:35 test7Cyclic  Time elapsed: 0.133 s
04:26:35 test3RequiredBinaryLevel  Time elapsed: 0.001 s
04:26:35 exportCu  Time elapsed: 0.081 s
04:26:35 externalClassFolder  Time elapsed: 0.125 s
04:26:35 exportFile  Time elapsed: 0.072 s
04:26:35 exportExternalLib  Time elapsed: 5.429 s
04:26:35 externalClassFolder  Time elapsed: 2.555 s
04:26:35 variable  Time elapsed: 2.556 s
04:26:35 classFolder  Time elapsed: 2.484 s
04:26:35 signedLibs  Time elapsed: 2.672 s
04:26:35 exportSrcRootWithOutputFolder  Time elapsed: 2.474 s
04:26:35 exportInternalLib_UncompressedJar  Time elapsed: 2.567 s
04:26:35 exportOtherProject  Time elapsed: 2.473 s
04:26:35 exportSameSrcRoot  Time elapsed: 2.543 s
04:26:35 exportInternalLib  Time elapsed: 2.655 s
04:26:35 exportOtherSrcRoot  Time elapsed: 2.579 s
04:26:35 testGetDocFromPackageHtml_src  Time elapsed: 0.065 s
04:26:35 testGetDocFromPackageInfoJava_archive  Time elapsed: 0.063 s
04:26:35 testGetDocFromSourceAttachmentRootPath  Time elapsed: 0.072 s
04:26:35 testGetDocFromPackageHtml_archive  Time elapsed: 0.126 s
04:26:35 testGetPackageAttacheddoc  Time elapsed: 0.564 s
04:26:35 testGetDocFromPackageInfoJava_src  Time elapsed: 0.078 s
04:26:35 testFailToAccessAttachedJavadoc  Time elapsed: 2.1 s
04:26:35 testPackageInfoWithReferenceLinks  Time elapsed: 0.086 s
04:26:35 testPackageWithNoJavadoc  Time elapsed: 0.064 s
04:26:35 testValueTag  Time elapsed: 0.072 s
04:26:35 
04:26:35 Results:
04:26:35 
04:26:35 Tests run: 2999, Failures: 0, Errors: 0, Skipped: 2
04:26:35 
04:26:37 [INFO] All tests passed!
04:26:37 [INFO] 
04:26:37 [INFO] --- tycho-p2-extras-plugin:2.0.0:compare-version-with-baselines (compare-attached-artifacts-with-release) @ org.eclipse.jdt.ui.tests ---
04:26:37 [INFO] Fetching org.eclipse.jdt.ui.tests_3.13.1000.v20200526-0740.jar.pack.gz from https://download.eclipse.org/eclipse/updates/4.16/R-4.16-202006040540/plugins/ (8.27MB)
04:26:38 [INFO] 
04:26:38 [INFO] --- maven-antrun-plugin:3.0.0:run (check-skip-api-analysis) @ org.eclipse.jdt.ui.tests ---
04:26:38 [INFO] Executing tasks
04:26:38 [INFO] Executed tasks
04:26:38 [INFO] 
04:26:38 [INFO] --- tycho-dependency-tools-plugin:2.0.0:list-dependencies (list-dependencies) @ org.eclipse.jdt.ui.tests ---
04:26:38 [INFO] 
04:26:38 [INFO] --- tycho-eclipserun-plugin:2.0.0:eclipse-run (api-analysis) @ org.eclipse.jdt.ui.tests ---
04:26:38 [INFO] Toolchain in tycho-eclipserun-plugin: JDK[/opt/tools/java/openjdk/jdk-11/latest]
04:26:38 [INFO] Expected eclipse log file: /home/jenkins/agent/workspace/eclipse.jdt.ui-Gerrit/org.eclipse.jdt.ui.tests/target/eclipserun-work/data/.metadata/.log
04:26:38 [INFO] Command line:
04:26:38 	[/opt/tools/java/openjdk/jdk-11/latest/bin/java, -Xmx2048M, -jar, /home/jenkins/agent/workspace/eclipse.jdt.ui-Gerrit/.repository/p2/osgi/bundle/org.eclipse.equinox.launcher/1.5.800.v20200727-1323/org.eclipse.equinox.launcher-1.5.800.v20200727-1323.jar, -install, /home/jenkins/agent/workspace/eclipse.jdt.ui-Gerrit/org.eclipse.jdt.ui.tests/target/eclipserun-work, -configuration, /home/jenkins/agent/workspace/eclipse.jdt.ui-Gerrit/org.eclipse.jdt.ui.tests/target/eclipserun-work/configuration, -data, /home/jenkins/agent/workspace/eclipse.jdt.ui-Gerrit/org.eclipse.jdt.ui.tests/../target/org.eclipse.jdt.ui.tests-apiAnalyzer-workspace, -application, org.eclipse.pde.api.tools.apiAnalyzer, -project, /home/jenkins/agent/workspace/eclipse.jdt.ui-Gerrit/org.eclipse.jdt.ui.tests, -baseline, /home/jenkins/agent/workspace/eclipse.jdt.ui-Gerrit/org.eclipse.jdt.ui.tests/target/org.eclipse.jdt.ui.tests-apiBaseline.target, -dependencyList, /home/jenkins/agent/workspace/eclipse.jdt.ui-Gerrit/org.eclipse.jdt.ui.tests/target/dependencies-list.txt, -failOnError]
04:27:15 0 API ERRORS
04:27:15 0 API warnings
04:27:17 [INFO] 
04:27:17 [INFO] -------------< org.eclipse.jdt:org.eclipse.jdt.text.tests >-------------
04:27:17 [INFO] Building org.eclipse.jdt.text.tests 3.13.1000-SNAPSHOT           [12/15]
04:27:17 [INFO] ------------------------[ eclipse-test-plugin ]-------------------------
04:27:17 [INFO] 
04:27:17 [INFO] --- maven-clean-plugin:3.1.0:clean (default-clean) @ org.eclipse.jdt.text.tests ---
04:27:17 [INFO] 
04:27:17 [INFO] --- tycho-packaging-plugin:2.0.0:build-qualifier (default-build-qualifier) @ org.eclipse.jdt.text.tests ---
04:27:17 [INFO] The project's OSGi version is 3.13.1000.v20200812-0802
04:27:17 [INFO] 
04:27:17 [INFO] --- tycho-packaging-plugin:2.0.0:validate-id (default-validate-id) @ org.eclipse.jdt.text.tests ---
04:27:17 [INFO] 
04:27:17 [INFO] --- tycho-packaging-plugin:2.0.0:validate-version (default-validate-version) @ org.eclipse.jdt.text.tests ---
04:27:17 [INFO] 
04:27:17 [INFO] --- maven-resources-plugin:3.1.0:copy-resources (saveproperties) @ org.eclipse.jdt.text.tests ---
04:27:17 [INFO] Using 'UTF-8' encoding to copy filtered resources.
04:27:17 [INFO] skip non existing resourceDirectory /home/jenkins/agent/workspace/eclipse.jdt.ui-Gerrit/org.eclipse.jdt.text.tests/saveproperties
04:27:17 [INFO] 
04:27:17 [INFO] --- maven-enforcer-plugin:3.0.0-M3:enforce (enforce-maven) @ org.eclipse.jdt.text.tests ---
04:27:17 [INFO] 
04:27:17 [INFO] --- eclipse-cbi-plugin:1.1.8-SNAPSHOT:generate-api-build-xml (default) @ org.eclipse.jdt.text.tests ---
04:27:17 [INFO] 
04:27:17 [INFO] --- maven-resources-plugin:3.1.0:resources (default-resources) @ org.eclipse.jdt.text.tests ---
04:27:17 [INFO] Using 'UTF-8' encoding to copy filtered resources.
04:27:17 [INFO] skip non existing resourceDirectory /home/jenkins/agent/workspace/eclipse.jdt.ui-Gerrit/org.eclipse.jdt.text.tests/src/main/resources
04:27:17 [INFO] 
04:27:17 [INFO] --- maven-resources-plugin:3.1.0:resources (filter-resources) @ org.eclipse.jdt.text.tests ---
04:27:17 [INFO] Using 'UTF-8' encoding to copy filtered resources.
04:27:17 [INFO] skip non existing resourceDirectory /home/jenkins/agent/workspace/eclipse.jdt.ui-Gerrit/org.eclipse.jdt.text.tests/src/main/resources
04:27:17 [INFO] 
04:27:17 [INFO] --- tycho-compiler-plugin:2.0.0:compile (default-compile) @ org.eclipse.jdt.text.tests ---
04:27:17 [INFO] Compiling 170 source files to /home/jenkins/agent/workspace/eclipse.jdt.ui-Gerrit/org.eclipse.jdt.text.tests/target/classes
04:27:18 [INFO] ------------------------------------------------------------------------
04:27:18 [INFO] Reactor Summary:
04:27:18 [INFO] 
04:27:18 [INFO] eclipse.jdt.ui 4.17.0-SNAPSHOT ..................... SUCCESS [ 31.951 s]
04:27:18 [INFO] org.eclipse.ltk.core.refactoring 3.11.100-SNAPSHOT . SUCCESS [ 35.182 s]
04:27:18 [INFO] org.eclipse.ltk.ui.refactoring 3.11.100-SNAPSHOT ... SUCCESS [ 32.810 s]
04:27:18 [INFO] org.eclipse.jdt.core.manipulation 1.14.100-SNAPSHOT  SUCCESS [ 31.086 s]
04:27:18 [INFO] org.eclipse.jdt.ui 3.21.200-SNAPSHOT ............... SUCCESS [01:36 min]
04:27:18 [INFO] org.eclipse.jdt.junit.runtime 3.5.300-SNAPSHOT ..... SUCCESS [ 16.366 s]
04:27:18 [INFO] org.eclipse.jdt.junit.core 3.10.800-SNAPSHOT ....... SUCCESS [ 23.883 s]
04:27:18 [INFO] org.eclipse.jdt.junit 3.11.900-SNAPSHOT ............ SUCCESS [ 39.339 s]
04:27:18 [INFO] org.eclipse.jdt.junit4.runtime 1.1.1300-SNAPSHOT ... SUCCESS [ 14.329 s]
04:27:18 [INFO] org.eclipse.jdt.junit5.runtime 1.0.1000-SNAPSHOT ... SUCCESS [ 15.466 s]
04:27:18 [INFO] org.eclipse.jdt.ui.tests 3.13.1100-SNAPSHOT ........ SUCCESS [15:13 min]
04:27:18 [INFO] org.eclipse.jdt.text.tests 3.13.1000-SNAPSHOT ...... FAILURE [  1.063 s]
04:27:18 [INFO] org.eclipse.ltk.core.refactoring.tests 3.8.900-SNAPSHOT SKIPPED
04:27:18 [INFO] org.eclipse.ltk.ui.refactoring.tests 3.9.700-SNAPSHOT SKIPPED
04:27:18 [INFO] org.eclipse.jdt.ui.tests.refactoring 3.13.1100-SNAPSHOT SKIPPED
04:27:18 [INFO] ------------------------------------------------------------------------
04:27:18 [INFO] BUILD FAILURE
04:27:18 [INFO] ------------------------------------------------------------------------
04:27:18 [INFO] Total time:  23:50 min
04:27:18 [INFO] Finished at: 2020-08-12T08:27:18Z
04:27:18 [INFO] ------------------------------------------------------------------------
04:27:18 [ERROR] Failed to execute goal org.eclipse.tycho:tycho-compiler-plugin:2.0.0:compile (default-compile) on project org.eclipse.jdt.text.tests: Compilation failure: Compilation failure: 
04:27:18 [ERROR] /home/jenkins/agent/workspace/eclipse.jdt.ui-Gerrit/org.eclipse.jdt.text.tests/src/org/eclipse/jdt/text/tests/performance/InvocationCountPerformanceMeter.java:[25] 
04:27:18 [ERROR] 	import com.sun.jdi.ClassType;
04:27:18 [ERROR] 	       ^^^^^^^^^^^
04:27:18 [ERROR] The package com.sun.jdi is accessible from more than one module: <unnamed>, jdk.jdi
04:27:18 [ERROR] /home/jenkins/agent/workspace/eclipse.jdt.ui-Gerrit/org.eclipse.jdt.text.tests/src/org/eclipse/jdt/text/tests/performance/InvocationCountPerformanceMeter.java:[26] 
04:27:18 [ERROR] 	import com.sun.jdi.Method;
04:27:18 [ERROR] 	       ^^^^^^^^^^^
04:27:18 [ERROR] The package com.sun.jdi is accessible from more than one module: <unnamed>, jdk.jdi
04:27:18 [ERROR] /home/jenkins/agent/workspace/eclipse.jdt.ui-Gerrit/org.eclipse.jdt.text.tests/src/org/eclipse/jdt/text/tests/performance/InvocationCountPerformanceMeter.java:[27] 
04:27:18 [ERROR] 	import com.sun.jdi.ObjectReference;
04:27:18 [ERROR] 	       ^^^^^^^^^^^
04:27:18 [ERROR] The package com.sun.jdi is accessible from more than one module: <unnamed>, jdk.jdi
04:27:18 [ERROR] /home/jenkins/agent/workspace/eclipse.jdt.ui-Gerrit/org.eclipse.jdt.text.tests/src/org/eclipse/jdt/text/tests/performance/InvocationCountPerformanceMeter.java:[28] 
04:27:18 [ERROR] 	import com.sun.jdi.VMDisconnectedException;
04:27:18 [ERROR] 	       ^^^^^^^^^^^
04:27:18 [ERROR] The package com.sun.jdi is accessible from more than one module: <unnamed>, jdk.jdi
04:27:18 [ERROR] /home/jenkins/agent/workspace/eclipse.jdt.ui-Gerrit/org.eclipse.jdt.text.tests/src/org/eclipse/jdt/text/tests/performance/InvocationCountPerformanceMeter.java:[29] 
04:27:18 [ERROR] 	import com.sun.jdi.VirtualMachine;
04:27:18 [ERROR] 	       ^^^^^^^^^^^
04:27:18 [ERROR] The package com.sun.jdi is accessible from more than one module: <unnamed>, jdk.jdi
04:27:18 [ERROR] /home/jenkins/agent/workspace/eclipse.jdt.ui-Gerrit/org.eclipse.jdt.text.tests/src/org/eclipse/jdt/text/tests/performance/InvocationCountPerformanceMeter.java:[30] 
04:27:18 [ERROR] 	import com.sun.jdi.VirtualMachineManager;
04:27:18 [ERROR] 	       ^^^^^^^^^^^
04:27:18 [ERROR] The package com.sun.jdi is accessible from more than one module: <unnamed>, jdk.jdi
04:27:18 [ERROR] /home/jenkins/agent/workspace/eclipse.jdt.ui-Gerrit/org.eclipse.jdt.text.tests/src/org/eclipse/jdt/text/tests/performance/InvocationCountPerformanceMeter.java:[31] 
04:27:18 [ERROR] 	import com.sun.jdi.connect.AttachingConnector;
04:27:18 [ERROR] 	       ^^^^^^^^^^^^^^^^^^^
04:27:18 [ERROR] The package com.sun.jdi.connect is accessible from more than one module: <unnamed>, jdk.jdi
04:27:18 [ERROR] /home/jenkins/agent/workspace/eclipse.jdt.ui-Gerrit/org.eclipse.jdt.text.tests/src/org/eclipse/jdt/text/tests/performance/InvocationCountPerformanceMeter.java:[32] 
04:27:18 [ERROR] 	import com.sun.jdi.connect.Connector;
04:27:18 [ERROR] 	       ^^^^^^^^^^^^^^^^^^^
04:27:18 [ERROR] The package com.sun.jdi.connect is accessible from more than one module: <unnamed>, jdk.jdi
04:27:18 [ERROR] /home/jenkins/agent/workspace/eclipse.jdt.ui-Gerrit/org.eclipse.jdt.text.tests/src/org/eclipse/jdt/text/tests/performance/InvocationCountPerformanceMeter.java:[33] 
04:27:18 [ERROR] 	import com.sun.jdi.connect.IllegalConnectorArgumentsException;
04:27:18 [ERROR] 	       ^^^^^^^^^^^^^^^^^^^
04:27:18 [ERROR] The package com.sun.jdi.connect is accessible from more than one module: <unnamed>, jdk.jdi
04:27:18 [ERROR] /home/jenkins/agent/workspace/eclipse.jdt.ui-Gerrit/org.eclipse.jdt.text.tests/src/org/eclipse/jdt/text/tests/performance/InvocationCountPerformanceMeter.java:[34] 
04:27:18 [ERROR] 	import com.sun.jdi.event.BreakpointEvent;
04:27:18 [ERROR] 	       ^^^^^^^^^^^^^^^^^
04:27:18 [ERROR] The package com.sun.jdi.event is accessible from more than one module: <unnamed>, jdk.jdi
04:27:18 [ERROR] /home/jenkins/agent/workspace/eclipse.jdt.ui-Gerrit/org.eclipse.jdt.text.tests/src/org/eclipse/jdt/text/tests/performance/InvocationCountPerformanceMeter.java:[35] 
04:27:18 [ERROR] 	import com.sun.jdi.event.Event;
04:27:18 [ERROR] 	       ^^^^^^^^^^^^^^^^^
04:27:18 [ERROR] The package com.sun.jdi.event is accessible from more than one module: <unnamed>, jdk.jdi
04:27:18 [ERROR] /home/jenkins/agent/workspace/eclipse.jdt.ui-Gerrit/org.eclipse.jdt.text.tests/src/org/eclipse/jdt/text/tests/performance/InvocationCountPerformanceMeter.java:[36] 
04:27:18 [ERROR] 	import com.sun.jdi.event.EventIterator;
04:27:18 [ERROR] 	       ^^^^^^^^^^^^^^^^^
04:27:18 [ERROR] The package com.sun.jdi.event is accessible from more than one module: <unnamed>, jdk.jdi
04:27:18 [ERROR] /home/jenkins/agent/workspace/eclipse.jdt.ui-Gerrit/org.eclipse.jdt.text.tests/src/org/eclipse/jdt/text/tests/performance/InvocationCountPerformanceMeter.java:[37] 
04:27:18 [ERROR] 	import com.sun.jdi.event.EventQueue;
04:27:18 [ERROR] 	       ^^^^^^^^^^^^^^^^^
04:27:18 [ERROR] The package com.sun.jdi.event is accessible from more than one module: <unnamed>, jdk.jdi
04:27:18 [ERROR] /home/jenkins/agent/workspace/eclipse.jdt.ui-Gerrit/org.eclipse.jdt.text.tests/src/org/eclipse/jdt/text/tests/performance/InvocationCountPerformanceMeter.java:[38] 
04:27:18 [ERROR] 	import com.sun.jdi.event.EventSet;
04:27:18 [ERROR] 	       ^^^^^^^^^^^^^^^^^
04:27:18 [ERROR] The package com.sun.jdi.event is accessible from more than one module: <unnamed>, jdk.jdi
04:27:18 [ERROR] /home/jenkins/agent/workspace/eclipse.jdt.ui-Gerrit/org.eclipse.jdt.text.tests/src/org/eclipse/jdt/text/tests/performance/InvocationCountPerformanceMeter.java:[39] 
04:27:18 [ERROR] 	import com.sun.jdi.event.VMDeathEvent;
04:27:18 [ERROR] 	       ^^^^^^^^^^^^^^^^^
04:27:18 [ERROR] The package com.sun.jdi.event is accessible from more than one module: <unnamed>, jdk.jdi
04:27:18 [ERROR] /home/jenkins/agent/workspace/eclipse.jdt.ui-Gerrit/org.eclipse.jdt.text.tests/src/org/eclipse/jdt/text/tests/performance/InvocationCountPerformanceMeter.java:[40] 
04:27:18 [ERROR] 	import com.sun.jdi.request.BreakpointRequest;
04:27:18 [ERROR] 	       ^^^^^^^^^^^^^^^^^^^
04:27:18 [ERROR] The package com.sun.jdi.request is accessible from more than one module: <unnamed>, jdk.jdi
04:27:18 [ERROR] /home/jenkins/agent/workspace/eclipse.jdt.ui-Gerrit/org.eclipse.jdt.text.tests/src/org/eclipse/jdt/text/tests/performance/InvocationCountPerformanceMeter.java:[41] 
04:27:18 [ERROR] 	import com.sun.jdi.request.EventRequest;
04:27:18 [ERROR] 	       ^^^^^^^^^^^^^^^^^^^
04:27:18 [ERROR] The package com.sun.jdi.request is accessible from more than one module: <unnamed>, jdk.jdi
04:27:18 [ERROR] /home/jenkins/agent/workspace/eclipse.jdt.ui-Gerrit/org.eclipse.jdt.text.tests/src/org/eclipse/jdt/text/tests/performance/InvocationCountPerformanceMeter.java:[73] 
04:27:18 [ERROR] 	private EventQueue fEventQueue;
04:27:18 [ERROR] 	        ^^^^^^^^^^
04:27:18 [ERROR] EventQueue cannot be resolved to a type
04:27:18 [ERROR] /home/jenkins/agent/workspace/eclipse.jdt.ui-Gerrit/org.eclipse.jdt.text.tests/src/org/eclipse/jdt/text/tests/performance/InvocationCountPerformanceMeter.java:[87] 
04:27:18 [ERROR] 	public EventReader(EventQueue queue) {
04:27:18 [ERROR] 	                   ^^^^^^^^^^
04:27:18 [ERROR] EventQueue cannot be resolved to a type
04:27:18 [ERROR] /home/jenkins/agent/workspace/eclipse.jdt.ui-Gerrit/org.eclipse.jdt.text.tests/src/org/eclipse/jdt/text/tests/performance/InvocationCountPerformanceMeter.java:[88] 
04:27:18 [ERROR] 	fEventQueue= queue;
04:27:18 [ERROR] 	^^^^^^^^^^^
04:27:18 [ERROR] EventQueue cannot be resolved to a type
04:27:18 [ERROR] /home/jenkins/agent/workspace/eclipse.jdt.ui-Gerrit/org.eclipse.jdt.text.tests/src/org/eclipse/jdt/text/tests/performance/InvocationCountPerformanceMeter.java:[136] 
04:27:18 [ERROR] 	EventSet eventSet;
04:27:18 [ERROR] 	^^^^^^^^
04:27:18 [ERROR] EventSet cannot be resolved to a type
04:27:18 [ERROR] /home/jenkins/agent/workspace/eclipse.jdt.ui-Gerrit/org.eclipse.jdt.text.tests/src/org/eclipse/jdt/text/tests/performance/InvocationCountPerformanceMeter.java:[138] 
04:27:18 [ERROR] 	eventSet= fEventQueue.remove();
04:27:18 [ERROR] 	          ^^^^^^^^^^^
04:27:18 [ERROR] EventQueue cannot be resolved to a type
04:27:18 [ERROR] /home/jenkins/agent/workspace/eclipse.jdt.ui-Gerrit/org.eclipse.jdt.text.tests/src/org/eclipse/jdt/text/tests/performance/InvocationCountPerformanceMeter.java:[140] 
04:27:18 [ERROR] 	eventSet= fEventQueue.remove(fTimeout);
04:27:18 [ERROR] 	          ^^^^^^^^^^^
04:27:18 [ERROR] EventQueue cannot be resolved to a type
04:27:18 [ERROR] /home/jenkins/agent/workspace/eclipse.jdt.ui-Gerrit/org.eclipse.jdt.text.tests/src/org/eclipse/jdt/text/tests/performance/InvocationCountPerformanceMeter.java:[148] 
04:27:18 [ERROR] 	EventIterator iterator= eventSet.eventIterator();
04:27:18 [ERROR] 	^^^^^^^^^^^^^
04:27:18 [ERROR] EventIterator cannot be resolved to a type
04:27:18 [ERROR] /home/jenkins/agent/workspace/eclipse.jdt.ui-Gerrit/org.eclipse.jdt.text.tests/src/org/eclipse/jdt/text/tests/performance/InvocationCountPerformanceMeter.java:[150] 
04:27:18 [ERROR] 	Event event= iterator.nextEvent();
04:27:18 [ERROR] 	^^^^^
04:27:18 [ERROR] Event cannot be resolved to a type
04:27:18 [ERROR] /home/jenkins/agent/workspace/eclipse.jdt.ui-Gerrit/org.eclipse.jdt.text.tests/src/org/eclipse/jdt/text/tests/performance/InvocationCountPerformanceMeter.java:[151] 
04:27:18 [ERROR] 	if (event instanceof BreakpointEvent)
04:27:18 [ERROR] 	                     ^^^^^^^^^^^^^^^
04:27:18 [ERROR] BreakpointEvent cannot be resolved to a type
04:27:18 [ERROR] /home/jenkins/agent/workspace/eclipse.jdt.ui-Gerrit/org.eclipse.jdt.text.tests/src/org/eclipse/jdt/text/tests/performance/InvocationCountPerformanceMeter.java:[152] 
04:27:18 [ERROR] 	handleBreakpointEvent((BreakpointEvent) event);
04:27:18 [ERROR] 	^^^^^^^^^^^^^^^^^^^^^
04:27:18 [ERROR] The method handleBreakpointEvent(BreakpointEvent) from the type InvocationCountPerformanceMeter.EventReader refers to the missing type BreakpointEvent
04:27:18 [ERROR] /home/jenkins/agent/workspace/eclipse.jdt.ui-Gerrit/org.eclipse.jdt.text.tests/src/org/eclipse/jdt/text/tests/performance/InvocationCountPerformanceMeter.java:[152] 
04:27:18 [ERROR] 	handleBreakpointEvent((BreakpointEvent) event);
04:27:18 [ERROR] 	                       ^^^^^^^^^^^^^^^
04:27:18 [ERROR] BreakpointEvent cannot be resolved to a type
04:27:18 [ERROR] /home/jenkins/agent/workspace/eclipse.jdt.ui-Gerrit/org.eclipse.jdt.text.tests/src/org/eclipse/jdt/text/tests/performance/InvocationCountPerformanceMeter.java:[153] 
04:27:18 [ERROR] 	if (event instanceof VMDeathEvent) {
04:27:18 [ERROR] 	                     ^^^^^^^^^^^^
04:27:18 [ERROR] VMDeathEvent cannot be resolved to a type
04:27:18 [ERROR] /home/jenkins/agent/workspace/eclipse.jdt.ui-Gerrit/org.eclipse.jdt.text.tests/src/org/eclipse/jdt/text/tests/performance/InvocationCountPerformanceMeter.java:[166] 
04:27:18 [ERROR] 	} catch (VMDisconnectedException x) {
04:27:18 [ERROR] 	         ^^^^^^^^^^^^^^^^^^^^^^^
04:27:18 [ERROR] VMDisconnectedException cannot be resolved to a type
04:27:18 [ERROR] /home/jenkins/agent/workspace/eclipse.jdt.ui-Gerrit/org.eclipse.jdt.text.tests/src/org/eclipse/jdt/text/tests/performance/InvocationCountPerformanceMeter.java:[174] 
04:27:18 [ERROR] 	fVM.resume();
04:27:18 [ERROR] 	^^^
04:27:18 [ERROR] VirtualMachine cannot be resolved to a type
04:27:18 [ERROR] /home/jenkins/agent/workspace/eclipse.jdt.ui-Gerrit/org.eclipse.jdt.text.tests/src/org/eclipse/jdt/text/tests/performance/InvocationCountPerformanceMeter.java:[182] 
04:27:18 [ERROR] 	for (BreakpointRequest breakpointRequest : fBreakpointRequests) {
04:27:18 [ERROR] 	     ^^^^^^^^^^^^^^^^^
04:27:18 [ERROR] BreakpointRequest cannot be resolved to a type
04:27:18 [ERROR] /home/jenkins/agent/workspace/eclipse.jdt.ui-Gerrit/org.eclipse.jdt.text.tests/src/org/eclipse/jdt/text/tests/performance/InvocationCountPerformanceMeter.java:[182] 
04:27:18 [ERROR] 	for (BreakpointRequest breakpointRequest : fBreakpointRequests) {
04:27:18 [ERROR] 	                                           ^^^^^^^^^^^^^^^^^^^
04:27:18 [ERROR] BreakpointRequest cannot be resolved to a type
04:27:18 [ERROR] /home/jenkins/agent/workspace/eclipse.jdt.ui-Gerrit/org.eclipse.jdt.text.tests/src/org/eclipse/jdt/text/tests/performance/InvocationCountPerformanceMeter.java:[191] 
04:27:18 [ERROR] 	for (BreakpointRequest breakpointRequest : fBreakpointRequests) {
04:27:18 [ERROR] 	     ^^^^^^^^^^^^^^^^^
04:27:18 [ERROR] BreakpointRequest cannot be resolved to a type
04:27:18 [ERROR] /home/jenkins/agent/workspace/eclipse.jdt.ui-Gerrit/org.eclipse.jdt.text.tests/src/org/eclipse/jdt/text/tests/performance/InvocationCountPerformanceMeter.java:[191] 
04:27:18 [ERROR] 	for (BreakpointRequest breakpointRequest : fBreakpointRequests) {
04:27:18 [ERROR] 	                                           ^^^^^^^^^^^^^^^^^^^
04:27:18 [ERROR] BreakpointRequest cannot be resolved to a type
04:27:18 [ERROR] /home/jenkins/agent/workspace/eclipse.jdt.ui-Gerrit/org.eclipse.jdt.text.tests/src/org/eclipse/jdt/text/tests/performance/InvocationCountPerformanceMeter.java:[201] 
04:27:18 [ERROR] 	private void handleBreakpointEvent(BreakpointEvent event) {
04:27:18 [ERROR] 	                                   ^^^^^^^^^^^^^^^
04:27:18 [ERROR] BreakpointEvent cannot be resolved to a type
04:27:18 [ERROR] /home/jenkins/agent/workspace/eclipse.jdt.ui-Gerrit/org.eclipse.jdt.text.tests/src/org/eclipse/jdt/text/tests/performance/InvocationCountPerformanceMeter.java:[205] 
04:27:18 [ERROR] 	ObjectReference thisObject= event.thread().frame(0).thisObject();
04:27:18 [ERROR] 	^^^^^^^^^^^^^^^
04:27:18 [ERROR] ObjectReference cannot be resolved to a type
04:27:18 [ERROR] /home/jenkins/agent/workspace/eclipse.jdt.ui-Gerrit/org.eclipse.jdt.text.tests/src/org/eclipse/jdt/text/tests/performance/InvocationCountPerformanceMeter.java:[206] 
04:27:18 [ERROR] 	Method method= event.location().method();
04:27:18 [ERROR] 	^^^^^^
04:27:18 [ERROR] Method cannot be resolved to a type
04:27:18 [ERROR] /home/jenkins/agent/workspace/eclipse.jdt.ui-Gerrit/org.eclipse.jdt.text.tests/src/org/eclipse/jdt/text/tests/performance/InvocationCountPerformanceMeter.java:[305] 
04:27:18 [ERROR] 	private VirtualMachine fVM;
04:27:18 [ERROR] 	        ^^^^^^^^^^^^^^
04:27:18 [ERROR] VirtualMachine cannot be resolved to a type
04:27:18 [ERROR] /home/jenkins/agent/workspace/eclipse.jdt.ui-Gerrit/org.eclipse.jdt.text.tests/src/org/eclipse/jdt/text/tests/performance/InvocationCountPerformanceMeter.java:[323] 
04:27:18 [ERROR] 	private BreakpointRequest[] fBreakpointRequests;
04:27:18 [ERROR] 	        ^^^^^^^^^^^^^^^^^
04:27:18 [ERROR] BreakpointRequest cannot be resolved to a type
04:27:18 [ERROR] /home/jenkins/agent/workspace/eclipse.jdt.ui-Gerrit/org.eclipse.jdt.text.tests/src/org/eclipse/jdt/text/tests/performance/InvocationCountPerformanceMeter.java:[382] 
04:27:18 [ERROR] 	attach(localhost, PORT);
04:27:18 [ERROR] 	^^^^^^
04:27:18 [ERROR] The method attach(String, int) from the type InvocationCountPerformanceMeter refers to the missing type IllegalConnectorArgumentsException
04:27:18 [ERROR] /home/jenkins/agent/workspace/eclipse.jdt.ui-Gerrit/org.eclipse.jdt.text.tests/src/org/eclipse/jdt/text/tests/performance/InvocationCountPerformanceMeter.java:[384] 
04:27:18 [ERROR] 	List<BreakpointRequest> requests= new ArrayList<>();
04:27:18 [ERROR] 	     ^^^^^^^^^^^^^^^^^
04:27:18 [ERROR] BreakpointRequest cannot be resolved to a type
04:27:18 [ERROR] /home/jenkins/agent/workspace/eclipse.jdt.ui-Gerrit/org.eclipse.jdt.text.tests/src/org/eclipse/jdt/text/tests/performance/InvocationCountPerformanceMeter.java:[386] 
04:27:18 [ERROR] 	requests.add(createBreakpointRequest(method));
04:27:18 [ERROR] 	             ^^^^^^^^^^^^^^^^^^^^^^^
04:27:18 [ERROR] The method createBreakpointRequest(Method) from the type InvocationCountPerformanceMeter refers to the missing type BreakpointRequest
04:27:18 [ERROR] /home/jenkins/agent/workspace/eclipse.jdt.ui-Gerrit/org.eclipse.jdt.text.tests/src/org/eclipse/jdt/text/tests/performance/InvocationCountPerformanceMeter.java:[389] 
04:27:18 [ERROR] 	requests.add(createBreakpointRequest(constructor));
04:27:18 [ERROR] 	             ^^^^^^^^^^^^^^^^^^^^^^^
04:27:18 [ERROR] The method createBreakpointRequest(Constructor<?>) from the type InvocationCountPerformanceMeter refers to the missing type BreakpointRequest
04:27:18 [ERROR] /home/jenkins/agent/workspace/eclipse.jdt.ui-Gerrit/org.eclipse.jdt.text.tests/src/org/eclipse/jdt/text/tests/performance/InvocationCountPerformanceMeter.java:[391] 
04:27:18 [ERROR] 	fBreakpointRequests= requests.toArray(new BreakpointRequest[requests.size()]);
04:27:18 [ERROR] 	^^^^^^^^^^^^^^^^^^^
04:27:18 [ERROR] BreakpointRequest cannot be resolved to a type
04:27:18 [ERROR] /home/jenkins/agent/workspace/eclipse.jdt.ui-Gerrit/org.eclipse.jdt.text.tests/src/org/eclipse/jdt/text/tests/performance/InvocationCountPerformanceMeter.java:[391] 
04:27:18 [ERROR] 	fBreakpointRequests= requests.toArray(new BreakpointRequest[requests.size()]);
04:27:18 [ERROR] 	                                          ^^^^^^^^^^^^^^^^^
04:27:18 [ERROR] BreakpointRequest cannot be resolved to a type
04:27:18 [ERROR] /home/jenkins/agent/workspace/eclipse.jdt.ui-Gerrit/org.eclipse.jdt.text.tests/src/org/eclipse/jdt/text/tests/performance/InvocationCountPerformanceMeter.java:[393] 
04:27:18 [ERROR] 	fEventReader= new EventReader(fVM.eventQueue());
04:27:18 [ERROR] 	                              ^^^
04:27:18 [ERROR] VirtualMachine cannot be resolved to a type
04:27:18 [ERROR] /home/jenkins/agent/workspace/eclipse.jdt.ui-Gerrit/org.eclipse.jdt.text.tests/src/org/eclipse/jdt/text/tests/performance/InvocationCountPerformanceMeter.java:[395] 
04:27:18 [ERROR] 	} catch (IOException | IllegalConnectorArgumentsException x) {
04:27:18 [ERROR] 	         ^^^^^^^^^^^^^^^^^^^^^^^^^^^^^^^^^^^^^^^^^^^^^^^^
04:27:18 [ERROR] No exception of type Object can be thrown; an exception type must be a subclass of Throwable
04:27:18 [ERROR] /home/jenkins/agent/workspace/eclipse.jdt.ui-Gerrit/org.eclipse.jdt.text.tests/src/org/eclipse/jdt/text/tests/performance/InvocationCountPerformanceMeter.java:[395] 
04:27:18 [ERROR] 	} catch (IOException | IllegalConnectorArgumentsException x) {
04:27:18 [ERROR] 	                       ^^^^^^^^^^^^^^^^^^^^^^^^^^^^^^^^^^
04:27:18 [ERROR] IllegalConnectorArgumentsException cannot be resolved to a type
04:27:18 [ERROR] /home/jenkins/agent/workspace/eclipse.jdt.ui-Gerrit/org.eclipse.jdt.text.tests/src/org/eclipse/jdt/text/tests/performance/InvocationCountPerformanceMeter.java:[396] 
04:27:18 [ERROR] 	x.printStackTrace();
04:27:18 [ERROR] 	  ^^^^^^^^^^^^^^^
04:27:18 [ERROR] The method printStackTrace() is undefined for the type Object
04:27:18 [ERROR] /home/jenkins/agent/workspace/eclipse.jdt.ui-Gerrit/org.eclipse.jdt.text.tests/src/org/eclipse/jdt/text/tests/performance/InvocationCountPerformanceMeter.java:[412] 
04:27:18 [ERROR] 	if (fVM != null) {
04:27:18 [ERROR] 	    ^^^
04:27:18 [ERROR] VirtualMachine cannot be resolved to a type
04:27:18 [ERROR] /home/jenkins/agent/workspace/eclipse.jdt.ui-Gerrit/org.eclipse.jdt.text.tests/src/org/eclipse/jdt/text/tests/performance/InvocationCountPerformanceMeter.java:[439] 
04:27:18 [ERROR] 	if (fVM != null || fEventReader != null)
04:27:18 [ERROR] 	    ^^^
04:27:18 [ERROR] VirtualMachine cannot be resolved to a type
04:27:18 [ERROR] /home/jenkins/agent/workspace/eclipse.jdt.ui-Gerrit/org.eclipse.jdt.text.tests/src/org/eclipse/jdt/text/tests/performance/InvocationCountPerformanceMeter.java:[457] 
04:27:18 [ERROR] 	private void attach(String host, int port) throws IOException, IllegalConnectorArgumentsException {
04:27:18 [ERROR] 	                                                               ^^^^^^^^^^^^^^^^^^^^^^^^^^^^^^^^^^
04:27:18 [ERROR] IllegalConnectorArgumentsException cannot be resolved to a type
04:27:18 [ERROR] /home/jenkins/agent/workspace/eclipse.jdt.ui-Gerrit/org.eclipse.jdt.text.tests/src/org/eclipse/jdt/text/tests/performance/InvocationCountPerformanceMeter.java:[458] 
04:27:18 [ERROR] 	VirtualMachineManager manager= Bootstrap.virtualMachineManager();
04:27:18 [ERROR] 	^^^^^^^^^^^^^^^^^^^^^
04:27:18 [ERROR] VirtualMachineManager cannot be resolved to a type
04:27:18 [ERROR] /home/jenkins/agent/workspace/eclipse.jdt.ui-Gerrit/org.eclipse.jdt.text.tests/src/org/eclipse/jdt/text/tests/performance/InvocationCountPerformanceMeter.java:[459] 
04:27:18 [ERROR] 	List<AttachingConnector> connectors= manager.attachingConnectors();
04:27:18 [ERROR] 	     ^^^^^^^^^^^^^^^^^^
04:27:18 [ERROR] AttachingConnector cannot be resolved to a type
04:27:18 [ERROR] /home/jenkins/agent/workspace/eclipse.jdt.ui-Gerrit/org.eclipse.jdt.text.tests/src/org/eclipse/jdt/text/tests/performance/InvocationCountPerformanceMeter.java:[460] 
04:27:18 [ERROR] 	AttachingConnector connector= connectors.get(0);
04:27:18 [ERROR] 	^^^^^^^^^^^^^^^^^^
04:27:18 [ERROR] AttachingConnector cannot be resolved to a type
04:27:18 [ERROR] /home/jenkins/agent/workspace/eclipse.jdt.ui-Gerrit/org.eclipse.jdt.text.tests/src/org/eclipse/jdt/text/tests/performance/InvocationCountPerformanceMeter.java:[461] 
04:27:18 [ERROR] 	Map<String, Connector.Argument> args= connector.defaultArguments();
04:27:18 [ERROR] 	            ^^^^^^^^^
04:27:18 [ERROR] Connector cannot be resolved to a type
04:27:18 [ERROR] /home/jenkins/agent/workspace/eclipse.jdt.ui-Gerrit/org.eclipse.jdt.text.tests/src/org/eclipse/jdt/text/tests/performance/InvocationCountPerformanceMeter.java:[465] 
04:27:18 [ERROR] 	fVM= connector.attach(args);
04:27:18 [ERROR] 	^^^
04:27:18 [ERROR] VirtualMachine cannot be resolved to a type
04:27:18 [ERROR] /home/jenkins/agent/workspace/eclipse.jdt.ui-Gerrit/org.eclipse.jdt.text.tests/src/org/eclipse/jdt/text/tests/performance/InvocationCountPerformanceMeter.java:[472] 
04:27:18 [ERROR] 	fVM.dispose();
04:27:18 [ERROR] 	^^^
04:27:18 [ERROR] VirtualMachine cannot be resolved to a type
04:27:18 [ERROR] /home/jenkins/agent/workspace/eclipse.jdt.ui-Gerrit/org.eclipse.jdt.text.tests/src/org/eclipse/jdt/text/tests/performance/InvocationCountPerformanceMeter.java:[473] 
04:27:18 [ERROR] 	fVM= null;
04:27:18 [ERROR] 	^^^
04:27:18 [ERROR] VirtualMachine cannot be resolved to a type
04:27:18 [ERROR] /home/jenkins/agent/workspace/eclipse.jdt.ui-Gerrit/org.eclipse.jdt.text.tests/src/org/eclipse/jdt/text/tests/performance/InvocationCountPerformanceMeter.java:[482] 
04:27:18 [ERROR] 	private BreakpointRequest createBreakpointRequest(java.lang.reflect.Method method) {
04:27:18 [ERROR] 	        ^^^^^^^^^^^^^^^^^
04:27:18 [ERROR] BreakpointRequest cannot be resolved to a type
04:27:18 [ERROR] /home/jenkins/agent/workspace/eclipse.jdt.ui-Gerrit/org.eclipse.jdt.text.tests/src/org/eclipse/jdt/text/tests/performance/InvocationCountPerformanceMeter.java:[483] 
04:27:18 [ERROR] 	return createBreakpointRequest(getMethod(method.getDeclaringClass().getName(), method.getName(), getJNISignature(method)));
04:27:18 [ERROR] 	                               ^^^^^^^^^
04:27:18 [ERROR] The method getMethod(String, String, String) from the type InvocationCountPerformanceMeter refers to the missing type Method
04:27:18 [ERROR] /home/jenkins/agent/workspace/eclipse.jdt.ui-Gerrit/org.eclipse.jdt.text.tests/src/org/eclipse/jdt/text/tests/performance/InvocationCountPerformanceMeter.java:[492] 
04:27:18 [ERROR] 	private BreakpointRequest createBreakpointRequest(Constructor<?> constructor) {
04:27:18 [ERROR] 	        ^^^^^^^^^^^^^^^^^
04:27:18 [ERROR] BreakpointRequest cannot be resolved to a type
04:27:18 [ERROR] /home/jenkins/agent/workspace/eclipse.jdt.ui-Gerrit/org.eclipse.jdt.text.tests/src/org/eclipse/jdt/text/tests/performance/InvocationCountPerformanceMeter.java:[493] 
04:27:18 [ERROR] 	return createBreakpointRequest(getMethod(constructor.getDeclaringClass().getName(), "<init>", getJNISignature(constructor)));
04:27:18 [ERROR] 	                               ^^^^^^^^^
04:27:18 [ERROR] The method getMethod(String, String, String) from the type InvocationCountPerformanceMeter refers to the missing type Method
04:27:18 [ERROR] /home/jenkins/agent/workspace/eclipse.jdt.ui-Gerrit/org.eclipse.jdt.text.tests/src/org/eclipse/jdt/text/tests/performance/InvocationCountPerformanceMeter.java:[502] 
04:27:18 [ERROR] 	private BreakpointRequest createBreakpointRequest(Method method) {
04:27:18 [ERROR] 	        ^^^^^^^^^^^^^^^^^
04:27:18 [ERROR] BreakpointRequest cannot be resolved to a type
04:27:18 [ERROR] /home/jenkins/agent/workspace/eclipse.jdt.ui-Gerrit/org.eclipse.jdt.text.tests/src/org/eclipse/jdt/text/tests/performance/InvocationCountPerformanceMeter.java:[502] 
04:27:18 [ERROR] 	private BreakpointRequest createBreakpointRequest(Method method) {
04:27:18 [ERROR] 	                                                  ^^^^^^
04:27:18 [ERROR] Method cannot be resolved to a type
04:27:18 [ERROR] /home/jenkins/agent/workspace/eclipse.jdt.ui-Gerrit/org.eclipse.jdt.text.tests/src/org/eclipse/jdt/text/tests/performance/InvocationCountPerformanceMeter.java:[503] 
04:27:18 [ERROR] 	BreakpointRequest request= fVM.eventRequestManager().createBreakpointRequest(method.location());
04:27:18 [ERROR] 	^^^^^^^^^^^^^^^^^
04:27:18 [ERROR] BreakpointRequest cannot be resolved to a type
04:27:18 [ERROR] /home/jenkins/agent/workspace/eclipse.jdt.ui-Gerrit/org.eclipse.jdt.text.tests/src/org/eclipse/jdt/text/tests/performance/InvocationCountPerformanceMeter.java:[503] 
04:27:18 [ERROR] 	BreakpointRequest request= fVM.eventRequestManager().createBreakpointRequest(method.location());
04:27:18 [ERROR] 	                           ^^^
04:27:18 [ERROR] VirtualMachine cannot be resolved to a type
04:27:18 [ERROR] /home/jenkins/agent/workspace/eclipse.jdt.ui-Gerrit/org.eclipse.jdt.text.tests/src/org/eclipse/jdt/text/tests/performance/InvocationCountPerformanceMeter.java:[504] 
04:27:18 [ERROR] 	request.setSuspendPolicy(EventRequest.SUSPEND_EVENT_THREAD);
04:27:18 [ERROR] 	                         ^^^^^^^^^^^^
04:27:18 [ERROR] EventRequest cannot be resolved to a variable
04:27:18 [ERROR] /home/jenkins/agent/workspace/eclipse.jdt.ui-Gerrit/org.eclipse.jdt.text.tests/src/org/eclipse/jdt/text/tests/performance/InvocationCountPerformanceMeter.java:[516] 
04:27:18 [ERROR] 	private Method getMethod(String className, String name, String signature) {
04:27:18 [ERROR] 	        ^^^^^^
04:27:18 [ERROR] Method cannot be resolved to a type
04:27:18 [ERROR] /home/jenkins/agent/workspace/eclipse.jdt.ui-Gerrit/org.eclipse.jdt.text.tests/src/org/eclipse/jdt/text/tests/performance/InvocationCountPerformanceMeter.java:[517] 
04:27:18 [ERROR] 	ClassType type= (ClassType) fVM.classesByName(className).get(0);
04:27:18 [ERROR] 	^^^^^^^^^
04:27:18 [ERROR] ClassType cannot be resolved to a type
04:27:18 [ERROR] /home/jenkins/agent/workspace/eclipse.jdt.ui-Gerrit/org.eclipse.jdt.text.tests/src/org/eclipse/jdt/text/tests/performance/InvocationCountPerformanceMeter.java:[517] 
04:27:18 [ERROR] 	ClassType type= (ClassType) fVM.classesByName(className).get(0);
04:27:18 [ERROR] 	                 ^^^^^^^^^
04:27:18 [ERROR] ClassType cannot be resolved to a type
04:27:18 [ERROR] /home/jenkins/agent/workspace/eclipse.jdt.ui-Gerrit/org.eclipse.jdt.text.tests/src/org/eclipse/jdt/text/tests/performance/InvocationCountPerformanceMeter.java:[517] 
04:27:18 [ERROR] 	ClassType type= (ClassType) fVM.classesByName(className).get(0);
04:27:18 [ERROR] 	                            ^^^
04:27:18 [ERROR] VirtualMachine cannot be resolved to a type
04:27:18 [ERROR] /home/jenkins/agent/workspace/eclipse.jdt.ui-Gerrit/org.eclipse.jdt.text.tests/src/org/eclipse/jdt/text/tests/performance/InvocationCountPerformanceMeter.java:[526] 
04:27:18 [ERROR] 	fVM.eventRequestManager().deleteAllBreakpoints();
04:27:18 [ERROR] 	^^^
04:27:18 [ERROR] VirtualMachine cannot be resolved to a type
04:27:18 [ERROR] /home/jenkins/agent/workspace/eclipse.jdt.ui-Gerrit/org.eclipse.jdt.text.tests/src/org/eclipse/jdt/text/tests/performance/InvocationCountPerformanceMeter.java:[527] 
04:27:18 [ERROR] 	} catch (VMDisconnectedException x) {
04:27:18 [ERROR] 	         ^^^^^^^^^^^^^^^^^^^^^^^
04:27:18 [ERROR] VMDisconnectedException cannot be resolved to a type
04:27:18 [ERROR] 75 problems (75 errors)
04:27:18 [ERROR] -> [Help 1]
04:27:18 [ERROR] 
04:27:18 [ERROR] To see the full stack trace of the errors, re-run Maven with the -e switch.
04:27:18 [ERROR] Re-run Maven using the -X switch to enable full debug logging.
04:27:18 [ERROR] 
04:27:18 [ERROR] For more information about the errors and possible solutions, please read the following articles:
04:27:18 [ERROR] [Help 1] http://cwiki.apache.org/confluence/display/MAVEN/MojoFailureException
04:27:18 [ERROR] 
04:27:18 [ERROR] After correcting the problems, you can resume the build with the command
04:27:18 [ERROR]   mvn <args> -rf :org.eclipse.jdt.text.tests
04:27:19 Build step 'Invoke top-level Maven targets' marked build as failure
04:27:19 Terminating xvnc.
04:27:34 Archiving artifacts
04:27:35 Recording test results
04:27:36 Finished: FAILURE