FailedConsole Output

Skipping 1,154 KB.. Full Log
dataMojo.execute (P2MetadataMojo.java:135)
    at org.eclipse.tycho.plugins.p2.P2MetadataDefaultMojo.execute (P2MetadataDefaultMojo.java:33)
    at org.apache.maven.plugin.DefaultBuildPluginManager.executeMojo (DefaultBuildPluginManager.java:137)
    at org.apache.maven.lifecycle.internal.MojoExecutor.execute (MojoExecutor.java:210)
    at org.apache.maven.lifecycle.internal.MojoExecutor.execute (MojoExecutor.java:156)
    at org.apache.maven.lifecycle.internal.MojoExecutor.execute (MojoExecutor.java:148)
    at org.apache.maven.lifecycle.internal.LifecycleModuleBuilder.buildProject (LifecycleModuleBuilder.java:117)
    at org.apache.maven.lifecycle.internal.LifecycleModuleBuilder.buildProject (LifecycleModuleBuilder.java:81)
    at org.apache.maven.lifecycle.internal.builder.singlethreaded.SingleThreadedBuilder.build (SingleThreadedBuilder.java:56)
    at org.apache.maven.lifecycle.internal.LifecycleStarter.execute (LifecycleStarter.java:128)
    at org.apache.maven.DefaultMaven.doExecute (DefaultMaven.java:305)
    at org.apache.maven.DefaultMaven.doExecute (DefaultMaven.java:192)
    at org.apache.maven.DefaultMaven.execute (DefaultMaven.java:105)
    at org.apache.maven.cli.MavenCli.execute (MavenCli.java:956)
    at org.apache.maven.cli.MavenCli.doMain (MavenCli.java:288)
    at org.apache.maven.cli.MavenCli.main (MavenCli.java:192)
    at sun.reflect.NativeMethodAccessorImpl.invoke0 (Native Method)
    at sun.reflect.NativeMethodAccessorImpl.invoke (NativeMethodAccessorImpl.java:62)
    at sun.reflect.DelegatingMethodAccessorImpl.invoke (DelegatingMethodAccessorImpl.java:43)
    at java.lang.reflect.Method.invoke (Method.java:498)
    at org.codehaus.plexus.classworlds.launcher.Launcher.launchEnhanced (Launcher.java:289)
    at org.codehaus.plexus.classworlds.launcher.Launcher.launch (Launcher.java:229)
    at org.codehaus.plexus.classworlds.launcher.Launcher.mainWithExitCode (Launcher.java:415)
    at org.codehaus.plexus.classworlds.launcher.Launcher.main (Launcher.java:356)
[INFO] No baseline version MavenProject: org.eclipse.jdt:org.eclipse.jdt.launching.macosx:3.4.300-SNAPSHOT @ /jobs/genie.jdt/eclipse.jdt.debug-SonarQube/workspace/org.eclipse.jdt.launching.macosx/pom.xml
[INFO] 
[INFO] --- tycho-p2-extras-plugin:1.5.0-SNAPSHOT:compare-version-with-baselines (compare-attached-artifacts-with-release) @ org.eclipse.jdt.launching.macosx ---
[INFO] Skipped
[INFO] 
[INFO] --------< org.eclipse.jdt:org.eclipse.jdt.launching.ui.macosx >---------
[INFO] Building org.eclipse.jdt.launching.ui.macosx 1.2.300-SNAPSHOT      [5/7]
[INFO] ---------------------------[ eclipse-plugin ]---------------------------
[INFO] 
[INFO] --- maven-clean-plugin:3.1.0:clean (default-clean) @ org.eclipse.jdt.launching.ui.macosx ---
[INFO] 
[INFO] --- tycho-packaging-plugin:1.5.0-SNAPSHOT:build-qualifier (default-build-qualifier) @ org.eclipse.jdt.launching.ui.macosx ---
[INFO] The project's OSGi version is 1.2.300.v20190510-0639
[INFO] 
[INFO] --- tycho-packaging-plugin:1.5.0-SNAPSHOT:validate-id (default-validate-id) @ org.eclipse.jdt.launching.ui.macosx ---
[INFO] 
[INFO] --- tycho-packaging-plugin:1.5.0-SNAPSHOT:validate-version (default-validate-version) @ org.eclipse.jdt.launching.ui.macosx ---
[INFO] 
[INFO] --- maven-resources-plugin:3.1.0:copy-resources (saveproperties) @ org.eclipse.jdt.launching.ui.macosx ---
[INFO] Using 'UTF-8' encoding to copy filtered resources.
[INFO] skip non existing resourceDirectory /jobs/genie.jdt/eclipse.jdt.debug-SonarQube/workspace/org.eclipse.jdt.launching.ui.macosx/saveproperties
[INFO] 
[INFO] --- maven-enforcer-plugin:3.0.0-M2:enforce (enforce-maven) @ org.eclipse.jdt.launching.ui.macosx ---
[INFO] 
[INFO] --- jacoco-maven-plugin:0.8.4:prepare-agent (jacoco-agent) @ org.eclipse.jdt.launching.ui.macosx ---
[INFO] argLine set to -javaagent:/home/hudson/genie.jdt/.jenkins/jobs/eclipse.jdt.debug-SonarQube/workspace/.repository/org/jacoco/org.jacoco.agent/0.8.4/org.jacoco.agent-0.8.4-runtime.jar=destfile=/home/hudson/genie.jdt/.jenkins/jobs/eclipse.jdt.debug-SonarQube/workspace/jacoco.exec,append=true
[INFO] 
[INFO] --- eclipse-cbi-plugin:1.1.5:generate-api-build-xml (default) @ org.eclipse.jdt.launching.ui.macosx ---
Generating target/.apibuild.xml
[INFO] 
[INFO] --- maven-resources-plugin:3.1.0:resources (default-resources) @ org.eclipse.jdt.launching.ui.macosx ---
[INFO] Using 'UTF-8' encoding to copy filtered resources.
[INFO] skip non existing resourceDirectory /jobs/genie.jdt/eclipse.jdt.debug-SonarQube/workspace/org.eclipse.jdt.launching.ui.macosx/src/main/resources
[INFO] 
[INFO] --- maven-resources-plugin:3.1.0:resources (filter-resources) @ org.eclipse.jdt.launching.ui.macosx ---
[INFO] Using 'UTF-8' encoding to copy filtered resources.
[INFO] skip non existing resourceDirectory /jobs/genie.jdt/eclipse.jdt.debug-SonarQube/workspace/org.eclipse.jdt.launching.ui.macosx/src/main/resources
[INFO] 
[INFO] --- tycho-compiler-plugin:1.5.0-SNAPSHOT:compile (default-compile) @ org.eclipse.jdt.launching.ui.macosx ---
[INFO] Compiling 11 source files to /jobs/genie.jdt/eclipse.jdt.debug-SonarQube/workspace/org.eclipse.jdt.launching.ui.macosx/target/classes
[INFO] 
[INFO] --- tycho-eclipserun-plugin:1.5.0-SNAPSHOT:eclipse-run (default) @ org.eclipse.jdt.launching.ui.macosx ---
[INFO] Toolchain in tycho-eclipserun-plugin: JDK[/opt/public/common/jdk1.8.0_x64-latest/jre]
[INFO] Expected eclipse log file: /jobs/genie.jdt/eclipse.jdt.debug-SonarQube/workspace/org.eclipse.jdt.launching.ui.macosx/target/eclipserun-work/data/.metadata/.log
[INFO] Command line:
	[/opt/public/common/jdk1.8.0_x64-latest/jre/bin/java, -jar, /jobs/genie.jdt/eclipse.jdt.debug-SonarQube/workspace/.repository/p2/osgi/bundle/org.eclipse.equinox.launcher/1.5.500.v20190620-1700/org.eclipse.equinox.launcher-1.5.500.v20190620-1700.jar, -install, /jobs/genie.jdt/eclipse.jdt.debug-SonarQube/workspace/org.eclipse.jdt.launching.ui.macosx/target/eclipserun-work, -configuration, /jobs/genie.jdt/eclipse.jdt.debug-SonarQube/workspace/org.eclipse.jdt.launching.ui.macosx/target/eclipserun-work/configuration, -data, target/apibuild-workspace, -application, org.eclipse.ant.core.antRunner, -buildfile, target/.apibuild.xml]
Picked up JAVA_TOOL_OPTIONS: -Xmx2G -Djava.io.tmpdir=/tmp/genie.jdt
Buildfile: target/.apibuild.xml

apigen:
BUILD SUCCESSFUL

BUILD SUCCESSFUL
Total time: 0 seconds
[INFO] 
[INFO] --- maven-resources-plugin:3.1.0:testResources (default-testResources) @ org.eclipse.jdt.launching.ui.macosx ---
[INFO] Using 'UTF-8' encoding to copy filtered resources.
[INFO] skip non existing resourceDirectory /jobs/genie.jdt/eclipse.jdt.debug-SonarQube/workspace/org.eclipse.jdt.launching.ui.macosx/src/test/resources
[INFO] 
[INFO] --- tycho-source-plugin:1.5.0-SNAPSHOT:plugin-source (plugin-source) @ org.eclipse.jdt.launching.ui.macosx ---
[INFO] Building jar: /jobs/genie.jdt/eclipse.jdt.debug-SonarQube/workspace/org.eclipse.jdt.launching.ui.macosx/target/org.eclipse.jdt.launching.ui.macosx-1.2.300-SNAPSHOT-sources.jar
[INFO] 
[INFO] --- target-platform-configuration:1.5.0-SNAPSHOT:target-platform (default-target-platform) @ org.eclipse.jdt.launching.ui.macosx ---
[INFO] 
[INFO] --- tycho-packaging-plugin:1.5.0-SNAPSHOT:package-plugin (default-package-plugin) @ org.eclipse.jdt.launching.ui.macosx ---
[INFO] Building jar: /jobs/genie.jdt/eclipse.jdt.debug-SonarQube/workspace/org.eclipse.jdt.launching.ui.macosx/target/org.eclipse.jdt.launching.ui.macosx-1.2.300-SNAPSHOT.jar
[INFO] 
[INFO] --- tycho-p2-plugin:1.5.0-SNAPSHOT:p2-metadata-default (default-p2-metadata-default) @ org.eclipse.jdt.launching.ui.macosx ---
[WARNING] No repository found at file:/noThanks.
org.eclipse.equinox.p2.core.ProvisionException: No repository found at file:/noThanks.
    at org.eclipse.equinox.internal.p2.repository.helpers.AbstractRepositoryManager.fail (AbstractRepositoryManager.java:394)
    at org.eclipse.equinox.internal.p2.repository.helpers.AbstractRepositoryManager.loadRepository (AbstractRepositoryManager.java:645)
    at org.eclipse.equinox.internal.p2.metadata.repository.MetadataRepositoryManager.loadRepository (MetadataRepositoryManager.java:110)
    at org.eclipse.tycho.p2.remote.RemoteMetadataRepositoryManager.loadRepository (RemoteMetadataRepositoryManager.java:61)
    at org.eclipse.tycho.p2.remote.RemoteMetadataRepositoryManager.loadRepository (RemoteMetadataRepositoryManager.java:53)
    at org.eclipse.tycho.p2.tools.baseline.BaselineServiceImpl.getProjectBaseline (BaselineServiceImpl.java:95)
    at org.eclipse.tycho.plugins.p2.BaselineValidator.validateAndReplace (BaselineValidator.java:88)
    at org.eclipse.tycho.plugins.p2.P2MetadataMojo.attachP2Metadata (P2MetadataMojo.java:180)
    at org.eclipse.tycho.plugins.p2.P2MetadataMojo.execute (P2MetadataMojo.java:135)
    at org.eclipse.tycho.plugins.p2.P2MetadataDefaultMojo.execute (P2MetadataDefaultMojo.java:33)
    at org.apache.maven.plugin.DefaultBuildPluginManager.executeMojo (DefaultBuildPluginManager.java:137)
    at org.apache.maven.lifecycle.internal.MojoExecutor.execute (MojoExecutor.java:210)
    at org.apache.maven.lifecycle.internal.MojoExecutor.execute (MojoExecutor.java:156)
    at org.apache.maven.lifecycle.internal.MojoExecutor.execute (MojoExecutor.java:148)
    at org.apache.maven.lifecycle.internal.LifecycleModuleBuilder.buildProject (LifecycleModuleBuilder.java:117)
    at org.apache.maven.lifecycle.internal.LifecycleModuleBuilder.buildProject (LifecycleModuleBuilder.java:81)
    at org.apache.maven.lifecycle.internal.builder.singlethreaded.SingleThreadedBuilder.build (SingleThreadedBuilder.java:56)
    at org.apache.maven.lifecycle.internal.LifecycleStarter.execute (LifecycleStarter.java:128)
    at org.apache.maven.DefaultMaven.doExecute (DefaultMaven.java:305)
    at org.apache.maven.DefaultMaven.doExecute (DefaultMaven.java:192)
    at org.apache.maven.DefaultMaven.execute (DefaultMaven.java:105)
    at org.apache.maven.cli.MavenCli.execute (MavenCli.java:956)
    at org.apache.maven.cli.MavenCli.doMain (MavenCli.java:288)
    at org.apache.maven.cli.MavenCli.main (MavenCli.java:192)
    at sun.reflect.NativeMethodAccessorImpl.invoke0 (Native Method)
    at sun.reflect.NativeMethodAccessorImpl.invoke (NativeMethodAccessorImpl.java:62)
    at sun.reflect.DelegatingMethodAccessorImpl.invoke (DelegatingMethodAccessorImpl.java:43)
    at java.lang.reflect.Method.invoke (Method.java:498)
    at org.codehaus.plexus.classworlds.launcher.Launcher.launchEnhanced (Launcher.java:289)
    at org.codehaus.plexus.classworlds.launcher.Launcher.launch (Launcher.java:229)
    at org.codehaus.plexus.classworlds.launcher.Launcher.mainWithExitCode (Launcher.java:415)
    at org.codehaus.plexus.classworlds.launcher.Launcher.main (Launcher.java:356)
[INFO] No baseline version MavenProject: org.eclipse.jdt:org.eclipse.jdt.launching.ui.macosx:1.2.300-SNAPSHOT @ /jobs/genie.jdt/eclipse.jdt.debug-SonarQube/workspace/org.eclipse.jdt.launching.ui.macosx/pom.xml
[INFO] 
[INFO] --- tycho-p2-extras-plugin:1.5.0-SNAPSHOT:compare-version-with-baselines (compare-attached-artifacts-with-release) @ org.eclipse.jdt.launching.ui.macosx ---
[INFO] Skipped
[INFO] 
[INFO] --------------< org.eclipse.jdt:org.eclipse.jdt.debug.ui >--------------
[INFO] Building org.eclipse.jdt.debug.ui 3.10.300-SNAPSHOT                [6/7]
[INFO] ---------------------------[ eclipse-plugin ]---------------------------
[INFO] 
[INFO] --- maven-clean-plugin:3.1.0:clean (default-clean) @ org.eclipse.jdt.debug.ui ---
[INFO] 
[INFO] --- tycho-packaging-plugin:1.5.0-SNAPSHOT:build-qualifier (default-build-qualifier) @ org.eclipse.jdt.debug.ui ---
[INFO] The project's OSGi version is 3.10.300.v20190528-0604
[INFO] 
[INFO] --- tycho-packaging-plugin:1.5.0-SNAPSHOT:validate-id (default-validate-id) @ org.eclipse.jdt.debug.ui ---
[INFO] 
[INFO] --- tycho-packaging-plugin:1.5.0-SNAPSHOT:validate-version (default-validate-version) @ org.eclipse.jdt.debug.ui ---
[INFO] 
[INFO] --- maven-resources-plugin:3.1.0:copy-resources (saveproperties) @ org.eclipse.jdt.debug.ui ---
[INFO] Using 'UTF-8' encoding to copy filtered resources.
[INFO] skip non existing resourceDirectory /jobs/genie.jdt/eclipse.jdt.debug-SonarQube/workspace/org.eclipse.jdt.debug.ui/saveproperties
[INFO] 
[INFO] --- maven-enforcer-plugin:3.0.0-M2:enforce (enforce-maven) @ org.eclipse.jdt.debug.ui ---
[INFO] 
[INFO] --- jacoco-maven-plugin:0.8.4:prepare-agent (jacoco-agent) @ org.eclipse.jdt.debug.ui ---
[INFO] argLine set to -javaagent:/home/hudson/genie.jdt/.jenkins/jobs/eclipse.jdt.debug-SonarQube/workspace/.repository/org/jacoco/org.jacoco.agent/0.8.4/org.jacoco.agent-0.8.4-runtime.jar=destfile=/home/hudson/genie.jdt/.jenkins/jobs/eclipse.jdt.debug-SonarQube/workspace/jacoco.exec,append=true
[INFO] 
[INFO] --- eclipse-cbi-plugin:1.1.5:generate-api-build-xml (default) @ org.eclipse.jdt.debug.ui ---
Generating target/.apibuild.xml
[INFO] 
[INFO] --- maven-resources-plugin:3.1.0:resources (default-resources) @ org.eclipse.jdt.debug.ui ---
[INFO] Using 'UTF-8' encoding to copy filtered resources.
[INFO] skip non existing resourceDirectory /jobs/genie.jdt/eclipse.jdt.debug-SonarQube/workspace/org.eclipse.jdt.debug.ui/src/main/resources
[INFO] 
[INFO] --- maven-resources-plugin:3.1.0:resources (filter-resources) @ org.eclipse.jdt.debug.ui ---
[INFO] Using 'UTF-8' encoding to copy filtered resources.
[INFO] skip non existing resourceDirectory /jobs/genie.jdt/eclipse.jdt.debug-SonarQube/workspace/org.eclipse.jdt.debug.ui/src/main/resources
[INFO] 
[INFO] --- tycho-compiler-plugin:1.5.0-SNAPSHOT:compile (default-compile) @ org.eclipse.jdt.debug.ui ---
[INFO] Compiling 424 source files to /jobs/genie.jdt/eclipse.jdt.debug-SonarQube/workspace/org.eclipse.jdt.debug.ui/target/classes
[INFO] 
[INFO] --- tycho-eclipserun-plugin:1.5.0-SNAPSHOT:eclipse-run (default) @ org.eclipse.jdt.debug.ui ---
[INFO] Toolchain in tycho-eclipserun-plugin: JDK[/opt/public/common/jdk1.8.0_x64-latest/jre]
[INFO] Expected eclipse log file: /jobs/genie.jdt/eclipse.jdt.debug-SonarQube/workspace/org.eclipse.jdt.debug.ui/target/eclipserun-work/data/.metadata/.log
[INFO] Command line:
	[/opt/public/common/jdk1.8.0_x64-latest/jre/bin/java, -jar, /jobs/genie.jdt/eclipse.jdt.debug-SonarQube/workspace/.repository/p2/osgi/bundle/org.eclipse.equinox.launcher/1.5.500.v20190620-1700/org.eclipse.equinox.launcher-1.5.500.v20190620-1700.jar, -install, /jobs/genie.jdt/eclipse.jdt.debug-SonarQube/workspace/org.eclipse.jdt.debug.ui/target/eclipserun-work, -configuration, /jobs/genie.jdt/eclipse.jdt.debug-SonarQube/workspace/org.eclipse.jdt.debug.ui/target/eclipserun-work/configuration, -data, target/apibuild-workspace, -application, org.eclipse.ant.core.antRunner, -buildfile, target/.apibuild.xml]
Picked up JAVA_TOOL_OPTIONS: -Xmx2G -Djava.io.tmpdir=/tmp/genie.jdt
Buildfile: target/.apibuild.xml

apigen:
BUILD SUCCESSFUL

BUILD SUCCESSFUL
Total time: 1 second
[INFO] 
[INFO] --- maven-resources-plugin:3.1.0:testResources (default-testResources) @ org.eclipse.jdt.debug.ui ---
[INFO] Using 'UTF-8' encoding to copy filtered resources.
[INFO] skip non existing resourceDirectory /jobs/genie.jdt/eclipse.jdt.debug-SonarQube/workspace/org.eclipse.jdt.debug.ui/src/test/resources
[INFO] 
[INFO] --- tycho-source-plugin:1.5.0-SNAPSHOT:plugin-source (plugin-source) @ org.eclipse.jdt.debug.ui ---
[INFO] Building jar: /jobs/genie.jdt/eclipse.jdt.debug-SonarQube/workspace/org.eclipse.jdt.debug.ui/target/org.eclipse.jdt.debug.ui-3.10.300-SNAPSHOT-sources.jar
[INFO] 
[INFO] --- target-platform-configuration:1.5.0-SNAPSHOT:target-platform (default-target-platform) @ org.eclipse.jdt.debug.ui ---
[INFO] 
[INFO] --- tycho-packaging-plugin:1.5.0-SNAPSHOT:package-plugin (default-package-plugin) @ org.eclipse.jdt.debug.ui ---
[INFO] Building jar: /jobs/genie.jdt/eclipse.jdt.debug-SonarQube/workspace/org.eclipse.jdt.debug.ui/target/org.eclipse.jdt.debug.ui-3.10.300-SNAPSHOT.jar
[INFO] 
[INFO] --- tycho-p2-plugin:1.5.0-SNAPSHOT:p2-metadata-default (default-p2-metadata-default) @ org.eclipse.jdt.debug.ui ---
[WARNING] No repository found at file:/noThanks.
org.eclipse.equinox.p2.core.ProvisionException: No repository found at file:/noThanks.
    at org.eclipse.equinox.internal.p2.repository.helpers.AbstractRepositoryManager.fail (AbstractRepositoryManager.java:394)
    at org.eclipse.equinox.internal.p2.repository.helpers.AbstractRepositoryManager.loadRepository (AbstractRepositoryManager.java:645)
    at org.eclipse.equinox.internal.p2.metadata.repository.MetadataRepositoryManager.loadRepository (MetadataRepositoryManager.java:110)
    at org.eclipse.tycho.p2.remote.RemoteMetadataRepositoryManager.loadRepository (RemoteMetadataRepositoryManager.java:61)
    at org.eclipse.tycho.p2.remote.RemoteMetadataRepositoryManager.loadRepository (RemoteMetadataRepositoryManager.java:53)
    at org.eclipse.tycho.p2.tools.baseline.BaselineServiceImpl.getProjectBaseline (BaselineServiceImpl.java:95)
    at org.eclipse.tycho.plugins.p2.BaselineValidator.validateAndReplace (BaselineValidator.java:88)
    at org.eclipse.tycho.plugins.p2.P2MetadataMojo.attachP2Metadata (P2MetadataMojo.java:180)
    at org.eclipse.tycho.plugins.p2.P2MetadataMojo.execute (P2MetadataMojo.java:135)
    at org.eclipse.tycho.plugins.p2.P2MetadataDefaultMojo.execute (P2MetadataDefaultMojo.java:33)
    at org.apache.maven.plugin.DefaultBuildPluginManager.executeMojo (DefaultBuildPluginManager.java:137)
    at org.apache.maven.lifecycle.internal.MojoExecutor.execute (MojoExecutor.java:210)
    at org.apache.maven.lifecycle.internal.MojoExecutor.execute (MojoExecutor.java:156)
    at org.apache.maven.lifecycle.internal.MojoExecutor.execute (MojoExecutor.java:148)
    at org.apache.maven.lifecycle.internal.LifecycleModuleBuilder.buildProject (LifecycleModuleBuilder.java:117)
    at org.apache.maven.lifecycle.internal.LifecycleModuleBuilder.buildProject (LifecycleModuleBuilder.java:81)
    at org.apache.maven.lifecycle.internal.builder.singlethreaded.SingleThreadedBuilder.build (SingleThreadedBuilder.java:56)
    at org.apache.maven.lifecycle.internal.LifecycleStarter.execute (LifecycleStarter.java:128)
    at org.apache.maven.DefaultMaven.doExecute (DefaultMaven.java:305)
    at org.apache.maven.DefaultMaven.doExecute (DefaultMaven.java:192)
    at org.apache.maven.DefaultMaven.execute (DefaultMaven.java:105)
    at org.apache.maven.cli.MavenCli.execute (MavenCli.java:956)
    at org.apache.maven.cli.MavenCli.doMain (MavenCli.java:288)
    at org.apache.maven.cli.MavenCli.main (MavenCli.java:192)
    at sun.reflect.NativeMethodAccessorImpl.invoke0 (Native Method)
    at sun.reflect.NativeMethodAccessorImpl.invoke (NativeMethodAccessorImpl.java:62)
    at sun.reflect.DelegatingMethodAccessorImpl.invoke (DelegatingMethodAccessorImpl.java:43)
    at java.lang.reflect.Method.invoke (Method.java:498)
    at org.codehaus.plexus.classworlds.launcher.Launcher.launchEnhanced (Launcher.java:289)
    at org.codehaus.plexus.classworlds.launcher.Launcher.launch (Launcher.java:229)
    at org.codehaus.plexus.classworlds.launcher.Launcher.mainWithExitCode (Launcher.java:415)
    at org.codehaus.plexus.classworlds.launcher.Launcher.main (Launcher.java:356)
[INFO] No baseline version MavenProject: org.eclipse.jdt:org.eclipse.jdt.debug.ui:3.10.300-SNAPSHOT @ /jobs/genie.jdt/eclipse.jdt.debug-SonarQube/workspace/org.eclipse.jdt.debug.ui/pom.xml
[INFO] 
[INFO] --- tycho-p2-extras-plugin:1.5.0-SNAPSHOT:compare-version-with-baselines (compare-attached-artifacts-with-release) @ org.eclipse.jdt.debug.ui ---
[INFO] Skipped
[INFO] 
[INFO] ------------< org.eclipse.jdt:org.eclipse.jdt.debug.tests >-------------
[INFO] Building org.eclipse.jdt.debug.tests 3.11.500-SNAPSHOT             [7/7]
[INFO] ------------------------[ eclipse-test-plugin ]-------------------------
[INFO] 
[INFO] --- maven-clean-plugin:3.1.0:clean (default-clean) @ org.eclipse.jdt.debug.tests ---
[INFO] 
[INFO] --- tycho-packaging-plugin:1.5.0-SNAPSHOT:build-qualifier (default-build-qualifier) @ org.eclipse.jdt.debug.tests ---
[INFO] The project's OSGi version is 3.11.500.v20190517-0721
[INFO] 
[INFO] --- tycho-packaging-plugin:1.5.0-SNAPSHOT:validate-id (default-validate-id) @ org.eclipse.jdt.debug.tests ---
[INFO] 
[INFO] --- tycho-packaging-plugin:1.5.0-SNAPSHOT:validate-version (default-validate-version) @ org.eclipse.jdt.debug.tests ---
[INFO] 
[INFO] --- maven-resources-plugin:3.1.0:copy-resources (saveproperties) @ org.eclipse.jdt.debug.tests ---
[INFO] Using 'UTF-8' encoding to copy filtered resources.
[INFO] skip non existing resourceDirectory /jobs/genie.jdt/eclipse.jdt.debug-SonarQube/workspace/org.eclipse.jdt.debug.tests/saveproperties
[INFO] 
[INFO] --- maven-enforcer-plugin:3.0.0-M2:enforce (enforce-maven) @ org.eclipse.jdt.debug.tests ---
[INFO] 
[INFO] --- jacoco-maven-plugin:0.8.4:prepare-agent (jacoco-agent) @ org.eclipse.jdt.debug.tests ---
[INFO] tycho.testArgLine set to -javaagent:/home/hudson/genie.jdt/.jenkins/jobs/eclipse.jdt.debug-SonarQube/workspace/.repository/org/jacoco/org.jacoco.agent/0.8.4/org.jacoco.agent-0.8.4-runtime.jar=destfile=/home/hudson/genie.jdt/.jenkins/jobs/eclipse.jdt.debug-SonarQube/workspace/jacoco.exec,append=true
[INFO] 
[INFO] --- eclipse-cbi-plugin:1.1.5:generate-api-build-xml (default) @ org.eclipse.jdt.debug.tests ---
[INFO] 
[INFO] --- maven-resources-plugin:3.1.0:resources (default-resources) @ org.eclipse.jdt.debug.tests ---
[INFO] Using 'UTF-8' encoding to copy filtered resources.
[INFO] skip non existing resourceDirectory /jobs/genie.jdt/eclipse.jdt.debug-SonarQube/workspace/org.eclipse.jdt.debug.tests/src/main/resources
[INFO] 
[INFO] --- maven-resources-plugin:3.1.0:resources (filter-resources) @ org.eclipse.jdt.debug.tests ---
[INFO] Using 'UTF-8' encoding to copy filtered resources.
[INFO] skip non existing resourceDirectory /jobs/genie.jdt/eclipse.jdt.debug-SonarQube/workspace/org.eclipse.jdt.debug.tests/src/main/resources
[INFO] 
[INFO] --- tycho-compiler-plugin:1.5.0-SNAPSHOT:compile (default-compile) @ org.eclipse.jdt.debug.tests ---
[INFO] Compiling 322 source files to /jobs/genie.jdt/eclipse.jdt.debug-SonarQube/workspace/org.eclipse.jdt.debug.tests/target/classes
[INFO] 
[INFO] --- tycho-eclipserun-plugin:1.5.0-SNAPSHOT:eclipse-run (default) @ org.eclipse.jdt.debug.tests ---
[INFO] 
[INFO] --- maven-resources-plugin:3.1.0:testResources (default-testResources) @ org.eclipse.jdt.debug.tests ---
[INFO] Using 'UTF-8' encoding to copy filtered resources.
[INFO] skip non existing resourceDirectory /jobs/genie.jdt/eclipse.jdt.debug-SonarQube/workspace/org.eclipse.jdt.debug.tests/src/test/resources
[INFO] 
[INFO] --- tycho-source-plugin:1.5.0-SNAPSHOT:plugin-source (plugin-source) @ org.eclipse.jdt.debug.tests ---
[INFO] Building jar: /jobs/genie.jdt/eclipse.jdt.debug-SonarQube/workspace/org.eclipse.jdt.debug.tests/target/org.eclipse.jdt.debug.tests-3.11.500-SNAPSHOT-sources.jar
[INFO] 
[INFO] --- target-platform-configuration:1.5.0-SNAPSHOT:target-platform (default-target-platform) @ org.eclipse.jdt.debug.tests ---
[INFO] 
[INFO] --- tycho-packaging-plugin:1.5.0-SNAPSHOT:package-plugin (default-package-plugin) @ org.eclipse.jdt.debug.tests ---
[INFO] Building jar: /jobs/genie.jdt/eclipse.jdt.debug-SonarQube/workspace/org.eclipse.jdt.debug.tests/javadebugtests.jar
[INFO] Building jar: /jobs/genie.jdt/eclipse.jdt.debug-SonarQube/workspace/org.eclipse.jdt.debug.tests/target/org.eclipse.jdt.debug.tests-3.11.500-SNAPSHOT.jar
[INFO] 
[INFO] --- tycho-p2-plugin:1.5.0-SNAPSHOT:p2-metadata-default (default-p2-metadata-default) @ org.eclipse.jdt.debug.tests ---
[WARNING] No repository found at file:/noThanks.
org.eclipse.equinox.p2.core.ProvisionException: No repository found at file:/noThanks.
    at org.eclipse.equinox.internal.p2.repository.helpers.AbstractRepositoryManager.fail (AbstractRepositoryManager.java:394)
    at org.eclipse.equinox.internal.p2.repository.helpers.AbstractRepositoryManager.loadRepository (AbstractRepositoryManager.java:645)
    at org.eclipse.equinox.internal.p2.metadata.repository.MetadataRepositoryManager.loadRepository (MetadataRepositoryManager.java:110)
    at org.eclipse.tycho.p2.remote.RemoteMetadataRepositoryManager.loadRepository (RemoteMetadataRepositoryManager.java:61)
    at org.eclipse.tycho.p2.remote.RemoteMetadataRepositoryManager.loadRepository (RemoteMetadataRepositoryManager.java:53)
    at org.eclipse.tycho.p2.tools.baseline.BaselineServiceImpl.getProjectBaseline (BaselineServiceImpl.java:95)
    at org.eclipse.tycho.plugins.p2.BaselineValidator.validateAndReplace (BaselineValidator.java:88)
    at org.eclipse.tycho.plugins.p2.P2MetadataMojo.attachP2Metadata (P2MetadataMojo.java:180)
    at org.eclipse.tycho.plugins.p2.P2MetadataMojo.execute (P2MetadataMojo.java:135)
    at org.eclipse.tycho.plugins.p2.P2MetadataDefaultMojo.execute (P2MetadataDefaultMojo.java:33)
    at org.apache.maven.plugin.DefaultBuildPluginManager.executeMojo (DefaultBuildPluginManager.java:137)
    at org.apache.maven.lifecycle.internal.MojoExecutor.execute (MojoExecutor.java:210)
    at org.apache.maven.lifecycle.internal.MojoExecutor.execute (MojoExecutor.java:156)
    at org.apache.maven.lifecycle.internal.MojoExecutor.execute (MojoExecutor.java:148)
    at org.apache.maven.lifecycle.internal.LifecycleModuleBuilder.buildProject (LifecycleModuleBuilder.java:117)
    at org.apache.maven.lifecycle.internal.LifecycleModuleBuilder.buildProject (LifecycleModuleBuilder.java:81)
    at org.apache.maven.lifecycle.internal.builder.singlethreaded.SingleThreadedBuilder.build (SingleThreadedBuilder.java:56)
    at org.apache.maven.lifecycle.internal.LifecycleStarter.execute (LifecycleStarter.java:128)
    at org.apache.maven.DefaultMaven.doExecute (DefaultMaven.java:305)
    at org.apache.maven.DefaultMaven.doExecute (DefaultMaven.java:192)
    at org.apache.maven.DefaultMaven.execute (DefaultMaven.java:105)
    at org.apache.maven.cli.MavenCli.execute (MavenCli.java:956)
    at org.apache.maven.cli.MavenCli.doMain (MavenCli.java:288)
    at org.apache.maven.cli.MavenCli.main (MavenCli.java:192)
    at sun.reflect.NativeMethodAccessorImpl.invoke0 (Native Method)
    at sun.reflect.NativeMethodAccessorImpl.invoke (NativeMethodAccessorImpl.java:62)
    at sun.reflect.DelegatingMethodAccessorImpl.invoke (DelegatingMethodAccessorImpl.java:43)
    at java.lang.reflect.Method.invoke (Method.java:498)
    at org.codehaus.plexus.classworlds.launcher.Launcher.launchEnhanced (Launcher.java:289)
    at org.codehaus.plexus.classworlds.launcher.Launcher.launch (Launcher.java:229)
    at org.codehaus.plexus.classworlds.launcher.Launcher.mainWithExitCode (Launcher.java:415)
    at org.codehaus.plexus.classworlds.launcher.Launcher.main (Launcher.java:356)
[INFO] No baseline version MavenProject: org.eclipse.jdt:org.eclipse.jdt.debug.tests:3.11.500-SNAPSHOT @ /jobs/genie.jdt/eclipse.jdt.debug-SonarQube/workspace/org.eclipse.jdt.debug.tests/pom.xml
[INFO] 
[INFO] --- tycho-surefire-plugin:1.5.0-SNAPSHOT:test (default-test) @ org.eclipse.jdt.debug.tests ---
[INFO] Expected eclipse log file: /jobs/genie.jdt/eclipse.jdt.debug-SonarQube/workspace/org.eclipse.jdt.debug.tests/target/work/data/.metadata/.log
[INFO] Command line:
	[/opt/public/common/java/oracle/jdk1.8.0_192_x64/jre/bin/java, -Dosgi.noShutdown=false, -Dosgi.os=linux, -Dosgi.ws=gtk, -Dosgi.arch=x86_64, -javaagent:/home/hudson/genie.jdt/.jenkins/jobs/eclipse.jdt.debug-SonarQube/workspace/.repository/org/jacoco/org.jacoco.agent/0.8.4/org.jacoco.agent-0.8.4-runtime.jar=destfile=/home/hudson/genie.jdt/.jenkins/jobs/eclipse.jdt.debug-SonarQube/workspace/jacoco.exec,append=true, -Dosgi.clean=true, -jar, /jobs/genie.jdt/eclipse.jdt.debug-SonarQube/workspace/.repository/p2/osgi/bundle/org.eclipse.equinox.launcher/1.5.500.v20190620-1700/org.eclipse.equinox.launcher-1.5.500.v20190620-1700.jar, -data, /jobs/genie.jdt/eclipse.jdt.debug-SonarQube/workspace/org.eclipse.jdt.debug.tests/target/work/data, -install, /jobs/genie.jdt/eclipse.jdt.debug-SonarQube/workspace/org.eclipse.jdt.debug.tests/target/work, -configuration, /jobs/genie.jdt/eclipse.jdt.debug-SonarQube/workspace/org.eclipse.jdt.debug.tests/target/work/configuration, -application, org.eclipse.tycho.surefire.osgibooter.uitest, -testproperties, /jobs/genie.jdt/eclipse.jdt.debug-SonarQube/workspace/org.eclipse.jdt.debug.tests/target/surefire.properties]
Picked up JAVA_TOOL_OPTIONS: -Xmx2G -Djava.io.tmpdir=/tmp/genie.jdt
Running org.eclipse.jdt.debug.tests.AutomatedSuite
Java Model Exception: Java Model Status [testVeryLongClasspathWithClasspathOnlyJar does not exist]
	at org.eclipse.jdt.internal.core.JavaElement.newJavaModelException(JavaElement.java:583)
	at org.eclipse.jdt.internal.core.Openable.generateInfos(Openable.java:256)
	at org.eclipse.jdt.internal.core.JavaElement.openWhenClosed(JavaElement.java:596)
	at org.eclipse.jdt.internal.core.JavaElement.getElementInfo(JavaElement.java:326)
	at org.eclipse.jdt.internal.core.JavaElement.getElementInfo(JavaElement.java:312)
	at org.eclipse.jdt.internal.core.JavaProject.getModuleDescription(JavaProject.java:3716)
	at org.eclipse.jdt.internal.core.CompilationUnit.getModuleName(CompilationUnit.java:1438)
	at org.eclipse.jdt.internal.compiler.env.ICompilationUnit.module(ICompilationUnit.java:64)
	at org.eclipse.jdt.internal.compiler.ast.CompilationUnitDeclaration.module(CompilationUnitDeclaration.java:833)
	at org.eclipse.jdt.internal.compiler.lookup.LookupEnvironment.buildTypeBindings(LookupEnvironment.java:470)
	at org.eclipse.jdt.internal.compiler.Compiler.internalBeginToCompile(Compiler.java:845)
	at org.eclipse.jdt.internal.compiler.Compiler.beginToCompile(Compiler.java:394)
	at org.eclipse.jdt.internal.compiler.Compiler.resolve(Compiler.java:1024)
	at org.eclipse.jdt.internal.compiler.Compiler.resolve(Compiler.java:1100)
	at org.eclipse.jdt.internal.core.CompilationUnitProblemFinder.process(CompilationUnitProblemFinder.java:280)
	at org.eclipse.jdt.internal.core.CompilationUnitProblemFinder.process(CompilationUnitProblemFinder.java:346)
	at org.eclipse.jdt.internal.core.ReconcileWorkingCopyOperation.makeConsistent(ReconcileWorkingCopyOperation.java:193)
	at org.eclipse.jdt.internal.core.ReconcileWorkingCopyOperation.executeOperation(ReconcileWorkingCopyOperation.java:94)
	at org.eclipse.jdt.internal.core.JavaModelOperation.run(JavaModelOperation.java:736)
	at org.eclipse.jdt.internal.core.JavaModelOperation.runOperation(JavaModelOperation.java:802)
	at org.eclipse.jdt.internal.core.CompilationUnit.reconcile(CompilationUnit.java:1317)
	at org.eclipse.jdt.internal.ui.text.java.JavaReconcilingStrategy.reconcile(JavaReconcilingStrategy.java:131)
	at org.eclipse.jdt.internal.ui.text.java.JavaReconcilingStrategy.access$0(JavaReconcilingStrategy.java:113)
	at org.eclipse.jdt.internal.ui.text.java.JavaReconcilingStrategy$1.run(JavaReconcilingStrategy.java:93)
	at org.eclipse.core.runtime.SafeRunner.run(SafeRunner.java:45)
	at org.eclipse.jdt.internal.ui.text.java.JavaReconcilingStrategy.reconcile(JavaReconcilingStrategy.java:90)
	at org.eclipse.jdt.internal.ui.text.java.JavaReconcilingStrategy.initialReconcile(JavaReconcilingStrategy.java:188)
	at org.eclipse.jdt.internal.ui.text.CompositeReconcilingStrategy.initialReconcile(CompositeReconcilingStrategy.java:122)
	at org.eclipse.jdt.internal.ui.text.JavaCompositeReconcilingStrategy.initialReconcile(JavaCompositeReconcilingStrategy.java:139)
	at org.eclipse.jface.text.reconciler.MonoReconciler.initialProcess(MonoReconciler.java:98)
	at org.eclipse.jdt.internal.ui.text.JavaReconciler.initialProcess(JavaReconciler.java:423)
	at org.eclipse.jface.text.reconciler.AbstractReconciler$BackgroundThread.run(AbstractReconciler.java:177)

Waiting for evaluation to start..
Tests run: 956, Failures: 0, Errors: 1, Skipped: 0, Time elapsed: 1,038.234 s <<< FAILURE! - in org.eclipse.jdt.debug.tests.AutomatedSuite
testOutputFolderNotEmpty(org.eclipse.jdt.debug.tests.ProjectCreationDecorator)  Time elapsed: 4.024 s
testPerspectiveSwtich(org.eclipse.jdt.debug.tests.ProjectCreationDecorator)  Time elapsed: 1.401 s
testForUnexpectedErrorsInProject(org.eclipse.jdt.debug.tests.ProjectCreationDecorator)  Time elapsed: 0.12 s
testClassFilesGenerated(org.eclipse.jdt.debug.tests.ProjectCreationDecorator)  Time elapsed: 0.117 s
testResetDebugLaunchPerspective2(org.eclipse.jdt.debug.tests.launching.LaunchModeTests)  Time elapsed: 0.02 s
testModeSpecificTabGroups(org.eclipse.jdt.debug.tests.launching.LaunchModeTests)  Time elapsed: 0.081 s
testDefaultDebugLaunchPerspective2(org.eclipse.jdt.debug.tests.launching.LaunchModeTests)  Time elapsed: 0.016 s
testResetRunLaunchPerspective2(org.eclipse.jdt.debug.tests.launching.LaunchModeTests)  Time elapsed: 0.016 s
testContributedLaunchPerspective(org.eclipse.jdt.debug.tests.launching.LaunchModeTests)  Time elapsed: 0.016 s
testContributedLaunchMode(org.eclipse.jdt.debug.tests.launching.LaunchModeTests)  Time elapsed: 0.565 s
testResetDebugLaunchPerspective(org.eclipse.jdt.debug.tests.launching.LaunchModeTests)  Time elapsed: 0.016 s
testLaunchModes(org.eclipse.jdt.debug.tests.launching.LaunchModeTests)  Time elapsed: 0.015 s
testResetDebugPerspectiveJavaLaunchDelegate(org.eclipse.jdt.debug.tests.launching.LaunchModeTests)  Time elapsed: 0.015 s
testSupportsMode(org.eclipse.jdt.debug.tests.launching.LaunchModeTests)  Time elapsed: 0.016 s
testDefaultRunPerspectiveJavaLaunchDelegate(org.eclipse.jdt.debug.tests.launching.LaunchModeTests)  Time elapsed: 0.015 s
testDefaultRunLaunchPerspective(org.eclipse.jdt.debug.tests.launching.LaunchModeTests)  Time elapsed: 0.015 s
testResetRunPerspectiveJavaLaunchDelegate(org.eclipse.jdt.debug.tests.launching.LaunchModeTests)  Time elapsed: 0.015 s
testDefaultDebugPerspectiveJavaLaunchDelegate(org.eclipse.jdt.debug.tests.launching.LaunchModeTests)  Time elapsed: 0.016 s
testDefaultDebugLaunchPerspective(org.eclipse.jdt.debug.tests.launching.LaunchModeTests)  Time elapsed: 0.016 s
testResetRunLaunchPerspective(org.eclipse.jdt.debug.tests.launching.LaunchModeTests)  Time elapsed: 0.167 s
testDefaultRunLaunchPerspective2(org.eclipse.jdt.debug.tests.launching.LaunchModeTests)  Time elapsed: 0.016 s
testPartialModeCombination(org.eclipse.jdt.debug.tests.launching.LaunchDelegateTests)  Time elapsed: 0.016 s
testMixedModeDelegate(org.eclipse.jdt.debug.tests.launching.LaunchDelegateTests)  Time elapsed: 0.024 s
testSingleModeMultipleDelegates(org.eclipse.jdt.debug.tests.launching.LaunchDelegateTests)  Time elapsed: 0.016 s
testMultipleModeSingleDelegate(org.eclipse.jdt.debug.tests.launching.LaunchDelegateTests)  Time elapsed: 0.016 s
testSourceLocatorExtension(org.eclipse.jdt.debug.tests.launching.LaunchDelegateTests)  Time elapsed: 0.016 s
testProvideLaunch(org.eclipse.jdt.debug.tests.launching.LaunchDelegateTests)  Time elapsed: 0.406 s
testSourcePathComputerExtension(org.eclipse.jdt.debug.tests.launching.LaunchDelegateTests)  Time elapsed: 0.016 s
testSingleAlternateModeDelegate(org.eclipse.jdt.debug.tests.launching.LaunchDelegateTests)  Time elapsed: 0.016 s
testSingleDebugModeDelegate(org.eclipse.jdt.debug.tests.launching.LaunchDelegateTests)  Time elapsed: 0.017 s
testAssociatedConfigurationTypeSupported(org.eclipse.jdt.debug.tests.launching.LaunchShortcutTests)  Time elapsed: 0.016 s
testGetApplicableLaunchShortcuts(org.eclipse.jdt.debug.tests.launching.LaunchShortcutTests)  Time elapsed: 0.017 s
testAssociatedConfigurationTypeNotSupported(org.eclipse.jdt.debug.tests.launching.LaunchShortcutTests)  Time elapsed: 0.016 s
testGetRunShortcutDescription(org.eclipse.jdt.debug.tests.launching.LaunchShortcutTests)  Time elapsed: 0.016 s
testAssociatedPespectiveSupported(org.eclipse.jdt.debug.tests.launching.LaunchShortcutTests)  Time elapsed: 0.015 s
testGetGeneralShortcutDescription(org.eclipse.jdt.debug.tests.launching.LaunchShortcutTests)  Time elapsed: 0.016 s
testGetLaunchShortcutPerspectiveCategory(org.eclipse.jdt.debug.tests.launching.LaunchShortcutTests)  Time elapsed: 0.02 s
testAssociatedPerspectiveNotSupported(org.eclipse.jdt.debug.tests.launching.LaunchShortcutTests)  Time elapsed: 0.016 s
testGetLaunchShortcutCategory(org.eclipse.jdt.debug.tests.launching.LaunchShortcutTests)  Time elapsed: 0.015 s
testUnregisteredLaunch(org.eclipse.jdt.debug.tests.launching.LaunchTests)  Time elapsed: 1.127 s
testLaunchNotification(org.eclipse.jdt.debug.tests.launching.LaunchTests)  Time elapsed: 0.312 s
testDebugMode(org.eclipse.jdt.debug.tests.launching.LaunchesTests)  Time elapsed: 0.267 s
testRunMode(org.eclipse.jdt.debug.tests.launching.LaunchesTests)  Time elapsed: 0.966 s
testContributedTab(org.eclipse.jdt.debug.tests.launching.ContributedTabTests)  Time elapsed: 0.018 s
testContributedTabRelativePlacement(org.eclipse.jdt.debug.tests.launching.ContributedTabTests)  Time elapsed: 0.016 s
testContributedTabPlacementTabNotFound(org.eclipse.jdt.debug.tests.launching.ContributedTabTests)  Time elapsed: 0.017 s
testContributedTabsPlacement(org.eclipse.jdt.debug.tests.launching.ContributedTabTests)  Time elapsed: 0.016 s
testAllTabsCreated(org.eclipse.jdt.debug.tests.launching.TabGroupWrapperTests)  Time elapsed: 0.016 s
testDisposeAllTabs(org.eclipse.jdt.debug.tests.launching.TabGroupWrapperTests)  Time elapsed: 0.016 s
testStandardMigration(org.eclipse.jdt.debug.tests.launching.MigrationDelegateTests)  Time elapsed: 0.037 s
testMigrationAlreadyPerformed(org.eclipse.jdt.debug.tests.launching.MigrationDelegateTests)  Time elapsed: 0.028 s
testRemovingMappedResources1(org.eclipse.jdt.debug.tests.launching.ConfigurationResourceMappingTests)  Time elapsed: 0.026 s
testRemovingMappedResources2(org.eclipse.jdt.debug.tests.launching.ConfigurationResourceMappingTests)  Time elapsed: 0.025 s
testSetMappedResources(org.eclipse.jdt.debug.tests.launching.ConfigurationResourceMappingTests)  Time elapsed: 0.025 s
testSetMappedResource(org.eclipse.jdt.debug.tests.launching.ConfigurationResourceMappingTests)  Time elapsed: 0.028 s
testGetSpecificWorkbenchEncoding(org.eclipse.jdt.debug.tests.launching.ConfigurationEncodingTests)  Time elapsed: 0.016 s
testGetSpecificResourceEncoding(org.eclipse.jdt.debug.tests.launching.ConfigurationEncodingTests)  Time elapsed: 0.035 s
testGetSpecificResourcesEncoding(org.eclipse.jdt.debug.tests.launching.ConfigurationEncodingTests)  Time elapsed: 0.053 s
testGetSpecificConfigurationEncoding(org.eclipse.jdt.debug.tests.launching.ConfigurationEncodingTests)  Time elapsed: 0.03 s
testGetSystemDefaultEncoding(org.eclipse.jdt.debug.tests.launching.ConfigurationEncodingTests)  Time elapsed: 0.016 s
testGetDefaultLaunchGroupForDebugMode(org.eclipse.jdt.debug.tests.launching.LaunchConfigurationManagerTests)  Time elapsed: 0.016 s
testGetAllLaunchGroups(org.eclipse.jdt.debug.tests.launching.LaunchConfigurationManagerTests)  Time elapsed: 0.016 s
testGetLaunchGroupForConfigurationAndMode(org.eclipse.jdt.debug.tests.launching.LaunchConfigurationManagerTests)  Time elapsed: 0.016 s
testGetLaunchShortcutsForSpecificResource(org.eclipse.jdt.debug.tests.launching.LaunchConfigurationManagerTests)  Time elapsed: 0.133 s
testSingleton(org.eclipse.jdt.debug.tests.launching.LaunchConfigurationManagerTests)  Time elapsed: 0.016 s
testGetApplicableLaunchConfigurationsForResource(org.eclipse.jdt.debug.tests.launching.LaunchConfigurationManagerTests)  Time elapsed: 0.029 s
testGetLaunchShortcutsForCategory(org.eclipse.jdt.debug.tests.launching.LaunchConfigurationManagerTests)  Time elapsed: 0.016 s
testGetDefaultLaunchGroupForRunMode(org.eclipse.jdt.debug.tests.launching.LaunchConfigurationManagerTests)  Time elapsed: 0.016 s
testGetLaunchShortcuts(org.eclipse.jdt.debug.tests.launching.LaunchConfigurationManagerTests)  Time elapsed: 0.016 s
testGetLaunchGroupForConfigurationAndUnsupportedMode(org.eclipse.jdt.debug.tests.launching.LaunchConfigurationManagerTests)  Time elapsed: 0.016 s
testGetAppletLaunchShortcutsForSpecificResource(org.eclipse.jdt.debug.tests.launching.LaunchConfigurationManagerTests)  Time elapsed: 0.031 s
testGetJavaLaunchShortcutsForSpecificResource(org.eclipse.jdt.debug.tests.launching.LaunchConfigurationManagerTests)  Time elapsed: 0.026 s
testGetApplicableLaunchConfigurationTypes(org.eclipse.jdt.debug.tests.launching.LaunchConfigurationManagerTests)  Time elapsed: 0.032 s
testGetLaunchGroupForId(org.eclipse.jdt.debug.tests.launching.LaunchConfigurationManagerTests)  Time elapsed: 0.522 s
testGetSimpleName(org.eclipse.jdt.debug.tests.launching.LaunchConfigurationTests)  Time elapsed: 0.016 s
testGetFileName(org.eclipse.jdt.debug.tests.launching.LaunchConfigurationTests)  Time elapsed: 0.016 s
testSetName(org.eclipse.jdt.debug.tests.launching.LaunchConfigurationTests)  Time elapsed: 0.016 s
testSelectedProject(org.eclipse.jdt.debug.tests.launching.ProjectClasspathVariableTests)  Time elapsed: 0.475 s
testProjectClasspath(org.eclipse.jdt.debug.tests.launching.ProjectClasspathVariableTests)  Time elapsed: 0.017 s
testProjectDoesNotExist(org.eclipse.jdt.debug.tests.launching.ProjectClasspathVariableTests)  Time elapsed: 0.016 s
testMissingProjectName(org.eclipse.jdt.debug.tests.launching.ProjectClasspathVariableTests)  Time elapsed: 0.028 s
testDefLocalType(org.eclipse.jdt.debug.tests.sourcelookup.SourceLookupTests)  Time elapsed: 1.036 s
testStackFrameReuse(org.eclipse.jdt.debug.tests.sourcelookup.SourceLookupTests)  Time elapsed: 1.377 s
testDefInnerType(org.eclipse.jdt.debug.tests.sourcelookup.SourceLookupTests)  Time elapsed: 0.019 s
testInnerNestedType(org.eclipse.jdt.debug.tests.sourcelookup.SourceLookupTests)  Time elapsed: 0.016 s
testInner$Type(org.eclipse.jdt.debug.tests.sourcelookup.SourceLookupTests)  Time elapsed: 0.016 s
testInnerType(org.eclipse.jdt.debug.tests.sourcelookup.SourceLookupTests)  Time elapsed: 0.016 s
testDefAnonInnerType(org.eclipse.jdt.debug.tests.sourcelookup.SourceLookupTests)  Time elapsed: 0.872 s
testTopLevelType(org.eclipse.jdt.debug.tests.sourcelookup.SourceLookupTests)  Time elapsed: 0.017 s
testDefTopLevelType(org.eclipse.jdt.debug.tests.sourcelookup.SourceLookupTests)  Time elapsed: 0.016 s
testPackageFragmentRoots(org.eclipse.jdt.debug.tests.sourcelookup.SourceLookupTests)  Time elapsed: 0.016 s
testInnerNested$Type(org.eclipse.jdt.debug.tests.sourcelookup.SourceLookupTests)  Time elapsed: 0.016 s
testTopLevel$Type(org.eclipse.jdt.debug.tests.sourcelookup.SourceLookupTests)  Time elapsed: 0.016 s
testSimpleSourceLookupPositive(org.eclipse.jdt.debug.tests.sourcelookup.FolderSourceContainerTests)  Time elapsed: 0.016 s
testSimpleSourceLookupNegative(org.eclipse.jdt.debug.tests.sourcelookup.FolderSourceContainerTests)  Time elapsed: 0.016 s
testQualifiedSourceLookupPositive(org.eclipse.jdt.debug.tests.sourcelookup.FolderSourceContainerTests)  Time elapsed: 0.016 s
testQualifiedSourceLookupNegative(org.eclipse.jdt.debug.tests.sourcelookup.FolderSourceContainerTests)  Time elapsed: 0.016 s
testPartiallyQualifiedNestedSourceLookupPositive(org.eclipse.jdt.debug.tests.sourcelookup.FolderSourceContainerTests)  Time elapsed: 0.016 s
testCaseSensitiveQualifiedSourceLookup(org.eclipse.jdt.debug.tests.sourcelookup.FolderSourceContainerTests)  Time elapsed: 0.016 s
testSimpleNestedSourceLookupPositive(org.eclipse.jdt.debug.tests.sourcelookup.FolderSourceContainerTests)  Time elapsed: 0.017 s
testSimpleNestedSourceLookupNegative(org.eclipse.jdt.debug.tests.sourcelookup.FolderSourceContainerTests)  Time elapsed: 0.017 s
testRelativePathName(org.eclipse.jdt.debug.tests.sourcelookup.FolderSourceContainerTests)  Time elapsed: 0.016 s
testFolderSourceContainerMemento(org.eclipse.jdt.debug.tests.sourcelookup.FolderSourceContainerTests)  Time elapsed: 0.022 s
testSimpleSourceLookupPositive(org.eclipse.jdt.debug.tests.sourcelookup.DirectorySourceContainerTests)  Time elapsed: 0.018 s
testSimpleSourceLookupNegative(org.eclipse.jdt.debug.tests.sourcelookup.DirectorySourceContainerTests)  Time elapsed: 0.015 s
testQualifiedSourceLookupPositive(org.eclipse.jdt.debug.tests.sourcelookup.DirectorySourceContainerTests)  Time elapsed: 0.015 s
testDirectorySourceContainerMemento(org.eclipse.jdt.debug.tests.sourcelookup.DirectorySourceContainerTests)  Time elapsed: 0.019 s
testQualifiedSourceLookupNegative(org.eclipse.jdt.debug.tests.sourcelookup.DirectorySourceContainerTests)  Time elapsed: 0.016 s
testPartiallyQualifiedNestedSourceLookupPositive(org.eclipse.jdt.debug.tests.sourcelookup.DirectorySourceContainerTests)  Time elapsed: 0.017 s
testCaseSensitiveQualifiedSourceLookup(org.eclipse.jdt.debug.tests.sourcelookup.DirectorySourceContainerTests)  Time elapsed: 0.016 s
testSimpleNestedSourceLookupPositive(org.eclipse.jdt.debug.tests.sourcelookup.DirectorySourceContainerTests)  Time elapsed: 0.017 s
testSimpleNestedSourceLookupNegative(org.eclipse.jdt.debug.tests.sourcelookup.DirectorySourceContainerTests)  Time elapsed: 0.018 s
testSimpleSourceLookupPositive(org.eclipse.jdt.debug.tests.sourcelookup.ProjectSourceContainerTests)  Time elapsed: 0.017 s
testSimpleSourceLookupNegative(org.eclipse.jdt.debug.tests.sourcelookup.ProjectSourceContainerTests)  Time elapsed: 0.019 s
testQualifiedSourceLookupPositive(org.eclipse.jdt.debug.tests.sourcelookup.ProjectSourceContainerTests)  Time elapsed: 0.018 s
testQualifiedSourceLookupNegative(org.eclipse.jdt.debug.tests.sourcelookup.ProjectSourceContainerTests)  Time elapsed: 0.018 s
testCaseSensitiveQualifiedSourceLookup(org.eclipse.jdt.debug.tests.sourcelookup.ProjectSourceContainerTests)  Time elapsed: 0.019 s
testSimpleRootSourceLookupPositive(org.eclipse.jdt.debug.tests.sourcelookup.ProjectSourceContainerTests)  Time elapsed: 0.016 s
testProjectSourceContainerMemento(org.eclipse.jdt.debug.tests.sourcelookup.ProjectSourceContainerTests)  Time elapsed: 0.018 s
testSimpleSourceLookupPositive(org.eclipse.jdt.debug.tests.core.WorkspaceSourceContainerTests)  Time elapsed: 0.018 s
testSimpleSourceLookupNegative(org.eclipse.jdt.debug.tests.core.WorkspaceSourceContainerTests)  Time elapsed: 0.018 s
testWorkspaceSourceContainerMemento(org.eclipse.jdt.debug.tests.core.WorkspaceSourceContainerTests)  Time elapsed: 0.018 s
testQualifiedSourceLookupPositive(org.eclipse.jdt.debug.tests.core.WorkspaceSourceContainerTests)  Time elapsed: 0.018 s
testQualifiedSourceLookupNegative(org.eclipse.jdt.debug.tests.core.WorkspaceSourceContainerTests)  Time elapsed: 0.018 s
testCaseSensitiveQualifiedSourceLookup(org.eclipse.jdt.debug.tests.core.WorkspaceSourceContainerTests)  Time elapsed: 0.018 s
testDefaultSourceContainerMemento(org.eclipse.jdt.debug.tests.sourcelookup.DefaultSourceContainerTests)  Time elapsed: 0.02 s
testNestedType(org.eclipse.jdt.debug.tests.sourcelookup.DirectorySourceLookupTests)  Time elapsed: 0.018 s
testDefInnerType(org.eclipse.jdt.debug.tests.sourcelookup.DirectorySourceLookupTests)  Time elapsed: 0.016 s
testInner$Type(org.eclipse.jdt.debug.tests.sourcelookup.DirectorySourceLookupTests)  Time elapsed: 0.016 s
testInnerType(org.eclipse.jdt.debug.tests.sourcelookup.DirectorySourceLookupTests)  Time elapsed: 0.016 s
testTopLevelType(org.eclipse.jdt.debug.tests.sourcelookup.DirectorySourceLookupTests)  Time elapsed: 0.016 s
testDefTopLevelType(org.eclipse.jdt.debug.tests.sourcelookup.DirectorySourceLookupTests)  Time elapsed: 0.016 s
testInnerNested$Type(org.eclipse.jdt.debug.tests.sourcelookup.DirectorySourceLookupTests)  Time elapsed: 0.016 s
testTopLevel$Type(org.eclipse.jdt.debug.tests.sourcelookup.DirectorySourceLookupTests)  Time elapsed: 0.016 s
testArchiveSourceContainerMemento(org.eclipse.jdt.debug.tests.sourcelookup.ExternalArchiveSourceContainerTests)  Time elapsed: 0.019 s
testAutoDetectMultipleRoots(org.eclipse.jdt.debug.tests.sourcelookup.ExternalArchiveSourceContainerTests)  Time elapsed: 0.017 s
testAutoDetectRootSourceLookupPositive(org.eclipse.jdt.debug.tests.sourcelookup.ExternalArchiveSourceContainerTests)  Time elapsed: 0.036 s
testAutoDetectRootSourceLookupNegative(org.eclipse.jdt.debug.tests.sourcelookup.ExternalArchiveSourceContainerTests)  Time elapsed: 0.032 s
testPartiallyQualifiedSourceLookupPositive(org.eclipse.jdt.debug.tests.sourcelookup.ExternalArchiveSourceContainerTests)  Time elapsed: 0.019 s
testAutoDetectUnqualifiedSourceLookupPositive(org.eclipse.jdt.debug.tests.sourcelookup.ExternalArchiveSourceContainerTests)  Time elapsed: 0.035 s
testSourceLookupPositive(org.eclipse.jdt.debug.tests.sourcelookup.ExternalArchiveSourceContainerTests)  Time elapsed: 0.016 s
testSourceLookupNegative(org.eclipse.jdt.debug.tests.sourcelookup.ExternalArchiveSourceContainerTests)  Time elapsed: 0.026 s
testDisposed(org.eclipse.jdt.debug.tests.sourcelookup.ExternalArchiveSourceContainerTests)  Time elapsed: 6.093 s
testNestedType(org.eclipse.jdt.debug.tests.sourcelookup.ArchiveSourceLookupTests)  Time elapsed: 0.018 s
testDefInnerType(org.eclipse.jdt.debug.tests.sourcelookup.ArchiveSourceLookupTests)  Time elapsed: 0.016 s
testInner$Type(org.eclipse.jdt.debug.tests.sourcelookup.ArchiveSourceLookupTests)  Time elapsed: 0.016 s
testInnerType(org.eclipse.jdt.debug.tests.sourcelookup.ArchiveSourceLookupTests)  Time elapsed: 0.016 s
testTopLevelType(org.eclipse.jdt.debug.tests.sourcelookup.ArchiveSourceLookupTests)  Time elapsed: 0.016 s
testDefTopLevelType(org.eclipse.jdt.debug.tests.sourcelookup.ArchiveSourceLookupTests)  Time elapsed: 0.016 s
testInnerNested$Type(org.eclipse.jdt.debug.tests.sourcelookup.ArchiveSourceLookupTests)  Time elapsed: 0.016 s
testTopLevel$Type(org.eclipse.jdt.debug.tests.sourcelookup.ArchiveSourceLookupTests)  Time elapsed: 0.016 s
testSourceContainerMemento(org.eclipse.jdt.debug.tests.sourcelookup.JavaProjectSourceContainerTests)  Time elapsed: 0.02 s
testQualifiedLookup(org.eclipse.jdt.debug.tests.sourcelookup.JavaProjectSourceContainerTests)  Time elapsed: 0.017 s
testDefaultPackageLookup(org.eclipse.jdt.debug.tests.sourcelookup.JavaProjectSourceContainerTests)  Time elapsed: 0.016 s
testNonJavaLookup(org.eclipse.jdt.debug.tests.sourcelookup.JavaProjectSourceContainerTests)  Time elapsed: 0.017 s
testNegativeSourceFolderSourceLocation(org.eclipse.jdt.debug.tests.sourcelookup.SourceLocationTests)  Time elapsed: 0.016 s
testJavaSourceLocatorMemento(org.eclipse.jdt.debug.tests.sourcelookup.SourceLocationTests)  Time elapsed: 0.026 s
testPositiveSystemLibrarySourceLocation(org.eclipse.jdt.debug.tests.sourcelookup.SourceLocationTests)  Time elapsed: 0.023 s
testPositiveSourceFolderSourceLocation(org.eclipse.jdt.debug.tests.sourcelookup.SourceLocationTests)  Time elapsed: 0.016 s
testProjectLocationMemento(org.eclipse.jdt.debug.tests.sourcelookup.SourceLocationTests)  Time elapsed: 0.017 s
testPackageFragmentRootLocationMemento(org.eclipse.jdt.debug.tests.sourcelookup.SourceLocationTests)  Time elapsed: 0.017 s
testDirectoryLocationMemento(org.eclipse.jdt.debug.tests.sourcelookup.SourceLocationTests)  Time elapsed: 0.016 s
testEmptyPackageFragmentRootLocationMemento(org.eclipse.jdt.debug.tests.sourcelookup.SourceLocationTests)  Time elapsed: 0.017 s
testJavaUISourceLocatorMemento(org.eclipse.jdt.debug.tests.sourcelookup.SourceLocationTests)  Time elapsed: 0.128 s
testNegativeSystemLibrarySourceLocation(org.eclipse.jdt.debug.tests.sourcelookup.SourceLocationTests)  Time elapsed: 0.017 s
testArchiveLocationMemento(org.eclipse.jdt.debug.tests.sourcelookup.SourceLocationTests)  Time elapsed: 0.018 s
testAnonTypeB(org.eclipse.jdt.debug.tests.sourcelookup.TypeResolutionTests)  Time elapsed: 1.418 s
testTypeB(org.eclipse.jdt.debug.tests.sourcelookup.TypeResolutionTests)  Time elapsed: 0.855 s
testTopLevelType(org.eclipse.jdt.debug.tests.sourcelookup.TypeResolutionTests)  Time elapsed: 0.828 s
testTypeAA(org.eclipse.jdt.debug.tests.sourcelookup.TypeResolutionTests)  Time elapsed: 0.857 s
testTypeAB(org.eclipse.jdt.debug.tests.sourcelookup.TypeResolutionTests)  Time elapsed: 0.845 s
testTypeAC(org.eclipse.jdt.debug.tests.sourcelookup.TypeResolutionTests)  Time elapsed: 0.938 s
testTypeAE(org.eclipse.jdt.debug.tests.sourcelookup.TypeResolutionTests)  Time elapsed: 0.926 s
testTypeBB(org.eclipse.jdt.debug.tests.sourcelookup.TypeResolutionTests)  Time elapsed: 0.855 s
testTypeBC(org.eclipse.jdt.debug.tests.sourcelookup.TypeResolutionTests)  Time elapsed: 0.9 s
testTypeCB(org.eclipse.jdt.debug.tests.sourcelookup.TypeResolutionTests)  Time elapsed: 0.894 s
testTypeCC(org.eclipse.jdt.debug.tests.sourcelookup.TypeResolutionTests)  Time elapsed: 1.013 s
testTypeEB(org.eclipse.jdt.debug.tests.sourcelookup.TypeResolutionTests)  Time elapsed: 0.921 s
testTypeEC(org.eclipse.jdt.debug.tests.sourcelookup.TypeResolutionTests)  Time elapsed: 0.931 s
testAnonType11(org.eclipse.jdt.debug.tests.sourcelookup.TypeResolutionTests)  Time elapsed: 0.933 s
testAnonType21(org.eclipse.jdt.debug.tests.sourcelookup.TypeResolutionTests)  Time elapsed: 0.911 s
testAnonTypeA1(org.eclipse.jdt.debug.tests.sourcelookup.TypeResolutionTests)  Time elapsed: 0.895 s
testAnonTypeA2(org.eclipse.jdt.debug.tests.sourcelookup.TypeResolutionTests)  Time elapsed: 0.914 s
testAnonTypeC1(org.eclipse.jdt.debug.tests.sourcelookup.TypeResolutionTests)  Time elapsed: 0.872 s
testAnonTypeDB(org.eclipse.jdt.debug.tests.sourcelookup.TypeResolutionTests)  Time elapsed: 0.891 s
testAnonTypeDC(org.eclipse.jdt.debug.tests.sourcelookup.TypeResolutionTests)  Time elapsed: 0.879 s
testAnonTypeE1(org.eclipse.jdt.debug.tests.sourcelookup.TypeResolutionTests)  Time elapsed: 0.922 s
testAnonTypeFB(org.eclipse.jdt.debug.tests.sourcelookup.TypeResolutionTests)  Time elapsed: 1.043 s
testAnonTypeFC(org.eclipse.jdt.debug.tests.sourcelookup.TypeResolutionTests)  Time elapsed: 0.922 s
testTranslateContainers(org.eclipse.jdt.debug.tests.sourcelookup.JarSourceLookupTests)  Time elapsed: 8.145 s
testInspectClassFileFromJar(org.eclipse.jdt.debug.tests.sourcelookup.JarSourceLookupTests)  Time elapsed: 12.434 s
testShowClassFileFromJar(org.eclipse.jdt.debug.tests.sourcelookup.JarSourceLookupTests)  Time elapsed: 4.395 s
testGetField(org.eclipse.jdt.debug.tests.core.InstanceVariableTests)  Time elapsed: 0.904 s
testEvaluationAssignments(org.eclipse.jdt.debug.tests.core.InstanceVariableTests)  Time elapsed: 2.012 s
testValueHasChanged(org.eclipse.jdt.debug.tests.core.InstanceVariableTests)  Time elapsed: 1.494 s
testGetDeclaredFieldNamesInSubclass(org.eclipse.jdt.debug.tests.core.InstanceVariableTests)  Time elapsed: 0.89 s
testGetAllFieldNamesInSubclass(org.eclipse.jdt.debug.tests.core.InstanceVariableTests)  Time elapsed: 0.889 s
testGetDeclaredFieldNames(org.eclipse.jdt.debug.tests.core.InstanceVariableTests)  Time elapsed: 0.855 s
testNestedInnerTypeDetails(org.eclipse.jdt.debug.tests.core.LocalVariableTests)  Time elapsed: 0.974 s
testStringArrayDetailsDefPkg(org.eclipse.jdt.debug.tests.core.LocalVariableTests)  Time elapsed: 0.945 s
testFindConflicting1(org.eclipse.jdt.debug.tests.core.LocalVariableTests)  Time elapsed: 0.861 s
testFindConflicting2(org.eclipse.jdt.debug.tests.core.LocalVariableTests)  Time elapsed: 0.897 s
testInnerTypeDetailsDefPkg(org.eclipse.jdt.debug.tests.core.LocalVariableTests)  Time elapsed: 0.932 s
testEvaluationAssignments(org.eclipse.jdt.debug.tests.core.LocalVariableTests)  Time elapsed: 1.335 s
testStringArrayDetails(org.eclipse.jdt.debug.tests.core.LocalVariableTests)  Time elapsed: 0.92 s
testTopLevelTypeArrayDetailsDefPkg(org.eclipse.jdt.debug.tests.core.LocalVariableTests)  Time elapsed: 0.954 s
testNestedInnerTypeDetailsDefPkg(org.eclipse.jdt.debug.tests.core.LocalVariableTests)  Time elapsed: 0.927 s
testInterfaceTypeDetails(org.eclipse.jdt.debug.tests.core.LocalVariableTests)  Time elapsed: 0.942 s
testIntArrayDetails(org.eclipse.jdt.debug.tests.core.LocalVariableTests)  Time elapsed: 0.876 s
testInterfaceTypeDetailsDefPkg(org.eclipse.jdt.debug.tests.core.LocalVariableTests)  Time elapsed: 1.017 s
testTopLevelTypeArrayDetails(org.eclipse.jdt.debug.tests.core.LocalVariableTests)  Time elapsed: 0.998 s
testIntArrayDetailsDefPkg(org.eclipse.jdt.debug.tests.core.LocalVariableTests)  Time elapsed: 0.854 s
testSimpleVisibility(org.eclipse.jdt.debug.tests.core.LocalVariableTests)  Time elapsed: 1.471 s
testInnerTypeDetails(org.eclipse.jdt.debug.tests.core.LocalVariableTests)  Time elapsed: 1.039 s
testSetValue(org.eclipse.jdt.debug.tests.core.StaticVariableTests)  Time elapsed: 0.858 s
testSetBadLowerLengthArray(org.eclipse.jdt.debug.tests.core.ArrayTests)  Time elapsed: 0.87 s
testSetExactSrcIndexArray(org.eclipse.jdt.debug.tests.core.ArrayTests)  Time elapsed: 0.861 s
testSetBadUpperIndexArray(org.eclipse.jdt.debug.tests.core.ArrayTests)  Time elapsed: 0.862 s
testCreateArray(org.eclipse.jdt.debug.tests.core.ArrayTests)  Time elapsed: 0.898 s
testGetVariableRange(org.eclipse.jdt.debug.tests.core.ArrayTests)  Time elapsed: 0.871 s
testSetExactUpperIndexArray(org.eclipse.jdt.debug.tests.core.ArrayTests)  Time elapsed: 1.175 s
testGetSize(org.eclipse.jdt.debug.tests.core.ArrayTests)  Time elapsed: 1.583 s
testSetMinus1LengthArray(org.eclipse.jdt.debug.tests.core.ArrayTests)  Time elapsed: 0.859 s
testSetBadLowerSrcIndexArray(org.eclipse.jdt.debug.tests.core.ArrayTests)  Time elapsed: 0.85 s
testSetZeroLengthArray(org.eclipse.jdt.debug.tests.core.ArrayTests)  Time elapsed: 0.954 s
testSetBadUpperSrcIndexArray(org.eclipse.jdt.debug.tests.core.ArrayTests)  Time elapsed: 0.866 s
testSetValueRange(org.eclipse.jdt.debug.tests.core.ArrayTests)  Time elapsed: 0.869 s
testGetVariable(org.eclipse.jdt.debug.tests.core.ArrayTests)  Time elapsed: 0.87 s
testSetBadLowerIndexArray(org.eclipse.jdt.debug.tests.core.ArrayTests)  Time elapsed: 0.892 s
testSetLongerSrcArray(org.eclipse.jdt.debug.tests.core.ArrayTests)  Time elapsed: 0.857 s
testSetBadLengthPlusSrcIndexArray(org.eclipse.jdt.debug.tests.core.ArrayTests)  Time elapsed: 0.851 s
testSetBadLengthPlusIndexArray(org.eclipse.jdt.debug.tests.core.ArrayTests)  Time elapsed: 0.879 s
testMapLogicalStructure(org.eclipse.jdt.debug.tests.variables.TestLogicalStructures)  Time elapsed: 0.926 s
testEntryLogicalStructure(org.eclipse.jdt.debug.tests.variables.TestLogicalStructures)  Time elapsed: 0.883 s
testListLogicalStructure(org.eclipse.jdt.debug.tests.variables.TestLogicalStructures)  Time elapsed: 0.893 s
testGetInstances(org.eclipse.jdt.debug.tests.variables.TestInstanceRetrieval)  Time elapsed: 1.383 s
testInspectInAnonField(org.eclipse.jdt.debug.tests.variables.TestAnonymousInspect)  Time elapsed: 1.013 s
testInspectInAnonInitializer(org.eclipse.jdt.debug.tests.variables.TestAnonymousInspect)  Time elapsed: 0.973 s
testInspectInAnonMethod(org.eclipse.jdt.debug.tests.variables.TestAnonymousInspect)  Time elapsed: 1.083 s
testUnderscoreLongVarAssignment(org.eclipse.jdt.debug.tests.core.LiteralTests17)  Time elapsed: 5.174 s
testUnderscoreByteVarAssignment(org.eclipse.jdt.debug.tests.core.LiteralTests17)  Time elapsed: 1.085 s
testUnderscoreOctEval(org.eclipse.jdt.debug.tests.core.LiteralTests17)  Time elapsed: 1.142 s
testUnderscoreLongEval(org.eclipse.jdt.debug.tests.core.LiteralTests17)  Time elapsed: 1.181 s
testUnderscoreByteEval(org.eclipse.jdt.debug.tests.core.LiteralTests17)  Time elapsed: 1.207 s
testUnderscoreFloatVarAssignment(org.eclipse.jdt.debug.tests.core.LiteralTests17)  Time elapsed: 1.188 s
testUnderscoreIntVarAssignment(org.eclipse.jdt.debug.tests.core.LiteralTests17)  Time elapsed: 1.2 s
testUnderscoreDoubleEval(org.eclipse.jdt.debug.tests.core.LiteralTests17)  Time elapsed: 2.553 s
testUnderscoreDoubleVarAssignment(org.eclipse.jdt.debug.tests.core.LiteralTests17)  Time elapsed: 1.069 s
testUnderscoreHexEval(org.eclipse.jdt.debug.tests.core.LiteralTests17)  Time elapsed: 0.948 s
testUnderscoreFloatEval(org.eclipse.jdt.debug.tests.core.LiteralTests17)  Time elapsed: 1.052 s
testUnderscoreShortEval(org.eclipse.jdt.debug.tests.core.LiteralTests17)  Time elapsed: 0.949 s
testUnderscoreOctVarAssignment(org.eclipse.jdt.debug.tests.core.LiteralTests17)  Time elapsed: 1.421 s
testUnderscoreHexVarAssignment(org.eclipse.jdt.debug.tests.core.LiteralTests17)  Time elapsed: 1.054 s
testUnderscoreBinaryVarAssignment(org.eclipse.jdt.debug.tests.core.LiteralTests17)  Time elapsed: 1.227 s
testUnderscoreShortVarAssignment(org.eclipse.jdt.debug.tests.core.LiteralTests17)  Time elapsed: 1.272 s
testUnderscoreIntEval(org.eclipse.jdt.debug.tests.core.LiteralTests17)  Time elapsed: 0.953 s
testUnderscoreBinaryEval(org.eclipse.jdt.debug.tests.core.LiteralTests17)  Time elapsed: 0.969 s
testGetterFilters(org.eclipse.jdt.debug.test.stepping.StepFilterTests)  Time elapsed: 0.876 s
testInactiveStepFilter(org.eclipse.jdt.debug.test.stepping.StepFilterTests)  Time elapsed: 0.832 s
testContributedFilter1(org.eclipse.jdt.debug.test.stepping.StepFilterTests)  Time elapsed: 0.827 s
testSetterFilters(org.eclipse.jdt.debug.test.stepping.StepFilterTests)  Time elapsed: 0.855 s
testDontStepThruStepFilters(org.eclipse.jdt.debug.test.stepping.StepFilterTests)  Time elapsed: 1.535 s
testStepOverFilter(org.eclipse.jdt.debug.test.stepping.StepFilterTests)  Time elapsed: 0.82 s
testDeepStepFilter(org.eclipse.jdt.debug.test.stepping.StepFilterTests)  Time elapsed: 0.818 s
testStepReturnFilter(org.eclipse.jdt.debug.test.stepping.StepFilterTests)  Time elapsed: 0.824 s
testSimpleStepFilter(org.eclipse.jdt.debug.test.stepping.StepFilterTests)  Time elapsed: 1.334 s
testStepIntoSourceMethod(org.eclipse.jdt.debug.test.stepping.StepIntoSelectionTests)  Time elapsed: 1.737 s
testStepIntoSourceConstructor(org.eclipse.jdt.debug.test.stepping.StepIntoSelectionTests)  Time elapsed: 1.287 s
testStepIntoSourceMethodWithParameters(org.eclipse.jdt.debug.test.stepping.StepIntoSelectionTests)  Time elapsed: 2.684 s
testStepIntoBinaryConstructor(org.eclipse.jdt.debug.test.stepping.StepIntoSelectionTests)  Time elapsed: 1.344 s
testStepIntoBinaryMethod(org.eclipse.jdt.debug.test.stepping.StepIntoSelectionTests)  Time elapsed: 1.295 s
testLineBreakpoint(org.eclipse.jdt.debug.tests.core.InstanceFilterTests)  Time elapsed: 1.338 s
testExceptionBreakpoint(org.eclipse.jdt.debug.tests.core.InstanceFilterTests)  Time elapsed: 1.318 s
testMethodEntryBreakpoint(org.eclipse.jdt.debug.tests.core.InstanceFilterTests)  Time elapsed: 1.354 s
testModificationWatchpoint(org.eclipse.jdt.debug.tests.core.InstanceFilterTests)  Time elapsed: 1.357 s
testAccessWatchpoint(org.eclipse.jdt.debug.tests.core.InstanceFilterTests)  Time elapsed: 1.35 s
testMethodExitBreakpoint(org.eclipse.jdt.debug.tests.core.InstanceFilterTests)  Time elapsed: 1.445 s
testForceObjectReturn(org.eclipse.jdt.debug.test.stepping.ForceReturnTests)  Time elapsed: 0.825 s
testIncompatibleReturnTypeTopFrame(org.eclipse.jdt.debug.test.stepping.ForceReturnTests)  Time elapsed: 0.822 s
testForceStringReturn(org.eclipse.jdt.debug.test.stepping.ForceReturnTests)  Time elapsed: 0.832 s
testForceIntReturn(org.eclipse.jdt.debug.test.stepping.ForceReturnTests)  Time elapsed: 0.838 s
testForceStringReturnTopFrame(org.eclipse.jdt.debug.test.stepping.ForceReturnTests)  Time elapsed: 0.841 s
testForceIntReturnTopFrame(org.eclipse.jdt.debug.test.stepping.ForceReturnTests)  Time elapsed: 0.825 s
testIncompatibleReturnType(org.eclipse.jdt.debug.test.stepping.ForceReturnTests)  Time elapsed: 0.838 s
testForceObjectReturnTopFrame(org.eclipse.jdt.debug.test.stepping.ForceReturnTests)  Time elapsed: 0.833 s
testStringVariablePath(org.eclipse.jdt.debug.tests.core.JavaLibraryPathTests)  Time elapsed: 0.129 s
testRequiredProjectExplicitPath(org.eclipse.jdt.debug.tests.core.JavaLibraryPathTests)  Time elapsed: 0.103 s
testMultiVMArgsForRequiredProjectExplicitPath(org.eclipse.jdt.debug.tests.core.JavaLibraryPathTests)  Time elapsed: 0.083 s
testNoRequiredProjectExplicitPath(org.eclipse.jdt.debug.tests.core.JavaLibraryPathTests)  Time elapsed: 0.132 s
testVMArgsForRequiredProjectExplicitPath(org.eclipse.jdt.debug.tests.core.JavaLibraryPathTests)  Time elapsed: 0.103 s
testVariableExtensionWithNullSourceAttachmentWithExtension(org.eclipse.jdt.debug.tests.core.ClasspathVariableTests)  Time elapsed: 0.021 s
testJRELibResolution(org.eclipse.jdt.debug.tests.core.ClasspathVariableTests)  Time elapsed: 0.016 s
testVariableExtensionWithNullSourceAttachment(org.eclipse.jdt.debug.tests.core.ClasspathVariableTests)  Time elapsed: 0.016 s
testNullVariableResolution(org.eclipse.jdt.debug.tests.core.ClasspathVariableTests)  Time elapsed: 0.016 s
testProjectResolutionWithVariableArchiveAndSourceAttachmentWithExtension(org.eclipse.jdt.debug.tests.core.ClasspathVariableTests)  Time elapsed: 0.039 s
testVariableArchiveAndSourceAttachmentWithExtension(org.eclipse.jdt.debug.tests.core.ClasspathVariableTests)  Time elapsed: 0.016 s
testLibraryCaseSensitivity(org.eclipse.jdt.debug.tests.core.ClasspathContainerTests)  Time elapsed: 0.017 s
testCanUpdate(org.eclipse.jdt.debug.tests.core.ClasspathContainerTests)  Time elapsed: 0.027 s
testJREContainerIndex(org.eclipse.jdt.debug.tests.core.ClasspathContainerTests)  Time elapsed: 0.021 s
testJREContainerIndex2(org.eclipse.jdt.debug.tests.core.ClasspathContainerTests)  Time elapsed: 0.018 s
testJRELIBVariableEntry(org.eclipse.jdt.debug.tests.core.RuntimeClasspathEntryTests)  Time elapsed: 0.018 s
testExampleContainerEqualityPositive(org.eclipse.jdt.debug.tests.core.RuntimeClasspathEntryTests)  Time elapsed: 0.02 s
testExampleContainerEqualityNegative(org.eclipse.jdt.debug.tests.core.RuntimeClasspathEntryTests)  Time elapsed: 1.584 s
testJREContainerEquality(org.eclipse.jdt.debug.tests.core.RuntimeClasspathEntryTests)  Time elapsed: 0.233 s
testProjectEntry(org.eclipse.jdt.debug.tests.core.RuntimeClasspathEntryTests)  Time elapsed: 0.135 s
testStandardClassesJarResolution(org.eclipse.jdt.debug.tests.core.ClasspathProviderTests)  Time elapsed: 0.016 s
testEmptyProvider(org.eclipse.jdt.debug.tests.core.ClasspathProviderTests)  Time elapsed: 0.018 s
testUserClassesVariableResolution(org.eclipse.jdt.debug.tests.core.ClasspathProviderTests)  Time elapsed: 0.017 s
testUserClassesVariableExtensionResolution(org.eclipse.jdt.debug.tests.core.ClasspathProviderTests)  Time elapsed: 0.017 s
testStandardClassesContainerResolution(org.eclipse.jdt.debug.tests.core.ClasspathProviderTests)  Time elapsed: 0.016 s
testMultiOutputDefaultClasspath(org.eclipse.jdt.debug.tests.core.ClasspathProviderTests)  Time elapsed: 0.017 s
testUserClassesJarResolution(org.eclipse.jdt.debug.tests.core.ClasspathProviderTests)  Time elapsed: 0.016 s
testStandardClassesProjectResolution(org.eclipse.jdt.debug.tests.core.ClasspathProviderTests)  Time elapsed: 0.016 s
testStandardClassesVariableResolution(org.eclipse.jdt.debug.tests.core.ClasspathProviderTests)  Time elapsed: 0.016 s
testVariableArchiveResolution(org.eclipse.jdt.debug.tests.core.ClasspathProviderTests)  Time elapsed: 0.017 s
testBootpathProjectResolution(org.eclipse.jdt.debug.tests.core.ClasspathProviderTests)  Time elapsed: 0.016 s
testSingleOutputDefaultClasspath(org.eclipse.jdt.debug.tests.core.ClasspathProviderTests)  Time elapsed: 0.017 s
testBootpathJarResolution(org.eclipse.jdt.debug.tests.core.ClasspathProviderTests)  Time elapsed: 0.016 s
testBootpathVariableExtensionResolution(org.eclipse.jdt.debug.tests.core.ClasspathProviderTests)  Time elapsed: 0.016 s
testStandardClassesVariableExtensionResolution(org.eclipse.jdt.debug.tests.core.ClasspathProviderTests)  Time elapsed: 0.017 s
testUserClassesProjectNonDefaultOutputLocationsResolution(org.eclipse.jdt.debug.tests.core.ClasspathProviderTests)  Time elapsed: 0.016 s
testStandardClassesFolderResolution(org.eclipse.jdt.debug.tests.core.ClasspathProviderTests)  Time elapsed: 0.016 s
testBootpathFolderResolution(org.eclipse.jdt.debug.tests.core.ClasspathProviderTests)  Time elapsed: 0.016 s
testBootpathContainerResolution(org.eclipse.jdt.debug.tests.core.ClasspathProviderTests)  Time elapsed: 0.017 s
testRelativeClasspathEntry(org.eclipse.jdt.debug.tests.core.ClasspathProviderTests)  Time elapsed: 0.09 s
testVariableWithRelativePath(org.eclipse.jdt.debug.tests.core.ClasspathProviderTests)  Time elapsed: 0.089 s
testVariableExtensionResolution(org.eclipse.jdt.debug.tests.core.ClasspathProviderTests)  Time elapsed: 0.017 s
testUserClassesFolderResolution(org.eclipse.jdt.debug.tests.core.ClasspathProviderTests)  Time elapsed: 0.017 s
testUserClassesContainerResolution(org.eclipse.jdt.debug.tests.core.ClasspathProviderTests)  Time elapsed: 0.016 s
testStandardClassesProjectNonDefaultOutputLocationsResolution(org.eclipse.jdt.debug.tests.core.ClasspathProviderTests)  Time elapsed: 0.016 s
testUserClassesProjectResolution(org.eclipse.jdt.debug.tests.core.ClasspathProviderTests)  Time elapsed: 0.016 s
testBootpathVariableResolution(org.eclipse.jdt.debug.tests.core.ClasspathProviderTests)  Time elapsed: 0.017 s
testBootpathProjectNonDefaultOutputLocationsResolution(org.eclipse.jdt.debug.tests.core.ClasspathProviderTests)  Time elapsed: 0.016 s
testDefaultBootpath(org.eclipse.jdt.debug.tests.core.BootpathTests)  Time elapsed: 0.018 s
testEmptyBootpath(org.eclipse.jdt.debug.tests.core.BootpathTests)  Time elapsed: 0.017 s
testPrependBootpath(org.eclipse.jdt.debug.tests.core.BootpathTests)  Time elapsed: 0.022 s
testParseProperties(org.eclipse.jdt.debug.tests.core.EEDefinitionTests)  Time elapsed: 0.02 s
testEmptyProperty(org.eclipse.jdt.debug.tests.core.EEDefinitionTests)  Time elapsed: 0.016 s
testValidateInstallLocation(org.eclipse.jdt.debug.tests.core.EEDefinitionTests)  Time elapsed: 0.016 s
testSourceAttachments(org.eclipse.jdt.debug.tests.core.EEDefinitionTests)  Time elapsed: 0.02 s
testCompatibleEEs(org.eclipse.jdt.debug.tests.core.EEDefinitionTests)  Time elapsed: 0.023 s
testVMArguments(org.eclipse.jdt.debug.tests.core.EEDefinitionTests)  Time elapsed: 0.016 s
testIndexLocation(org.eclipse.jdt.debug.tests.core.EEDefinitionTests)  Time elapsed: 6.249 s
testLibraries(org.eclipse.jdt.debug.tests.core.EEDefinitionTests)  Time elapsed: 0.017 s
testDefaultLibraries(org.eclipse.jdt.debug.tests.core.EEDefinitionTests)  Time elapsed: 0.016 s
testValidateDefinitionFile(org.eclipse.jdt.debug.tests.core.EEDefinitionTests)  Time elapsed: 0.016 s
testVMName(org.eclipse.jdt.debug.tests.core.EEDefinitionTests)  Time elapsed: 0.016 s
testJavadocLocation(org.eclipse.jdt.debug.tests.core.EEDefinitionTests)  Time elapsed: 0.036 s
testSystemPropertiesCaching(org.eclipse.jdt.debug.tests.core.VMInstallTests)  Time elapsed: 0.122 s
testSystemProperties(org.eclipse.jdt.debug.tests.core.VMInstallTests)  Time elapsed: 0.016 s
testLibraryResolver1(org.eclipse.jdt.debug.tests.core.VMInstallTests)  Time elapsed: 0.638 s
testLibraryResolver2(org.eclipse.jdt.debug.tests.core.VMInstallTests)  Time elapsed: 0.018 s
testLibraryResolver3(org.eclipse.jdt.debug.tests.core.VMInstallTests)  Time elapsed: 0.747 s
testLibraryResolver4(org.eclipse.jdt.debug.tests.core.VMInstallTests)  Time elapsed: 0.019 s
testJavaVersion(org.eclipse.jdt.debug.tests.core.VMInstallTests)  Time elapsed: 0.016 s
testResourcePathSelectFile(org.eclipse.jdt.debug.tests.core.StringSubstitutionTests)  Time elapsed: 4.262 s
testAddNotificaiton(org.eclipse.jdt.debug.tests.core.StringSubstitutionTests)  Time elapsed: 0.02 s
testWorkspaceLocArg(org.eclipse.jdt.debug.tests.core.StringSubstitutionTests)  Time elapsed: 0.018 s
testWorkspaceLoc(org.eclipse.jdt.debug.tests.core.StringSubstitutionTests)  Time elapsed: 0.016 s
testChangeNotificaiton(org.eclipse.jdt.debug.tests.core.StringSubstitutionTests)  Time elapsed: 0.021 s
testValueVariableSetMethods(org.eclipse.jdt.debug.tests.core.StringSubstitutionTests)  Time elapsed: 0.019 s
testNestedReferences(org.eclipse.jdt.debug.tests.core.StringSubstitutionTests)  Time elapsed: 0.017 s
testSelectedResourcePathFile(org.eclipse.jdt.debug.tests.core.StringSubstitutionTests)  Time elapsed: 0.02 s
testOpenEndedBrace(org.eclipse.jdt.debug.tests.core.StringSubstitutionTests)  Time elapsed: 0.016 s
testCreatedValueVariables(org.eclipse.jdt.debug.tests.core.StringSubstitutionTests)  Time elapsed: 0.016 s
testContextVarReferenceNoArgs(org.eclipse.jdt.debug.tests.core.StringSubstitutionTests)  Time elapsed: 0.016 s
testContextWithoutArg(org.eclipse.jdt.debug.tests.core.StringSubstitutionTests)  Time elapsed: 0.016 s
testValueInitializer(org.eclipse.jdt.debug.tests.core.StringSubstitutionTests)  Time elapsed: 0.016 s
testMultipleReferences(org.eclipse.jdt.debug.tests.core.StringSubstitutionTests)  Time elapsed: 0.015 s
testSelectedResourceNameFile(org.eclipse.jdt.debug.tests.core.StringSubstitutionTests)  Time elapsed: 0.019 s
testValueSuppliedReadOnly(org.eclipse.jdt.debug.tests.core.StringSubstitutionTests)  Time elapsed: 0.017 s
testResourceNameSelectFile(org.eclipse.jdt.debug.tests.core.StringSubstitutionTests)  Time elapsed: 0.018 s
testContainerPathSelectFolder(org.eclipse.jdt.debug.tests.core.StringSubstitutionTests)  Time elapsed: 0.024 s
testContextVarReferenceWithArg(org.eclipse.jdt.debug.tests.core.StringSubstitutionTests)  Time elapsed: 0.016 s
testValueSupplied(org.eclipse.jdt.debug.tests.core.StringSubstitutionTests)  Time elapsed: 0.016 s
testProjectLocArgFolderPath(org.eclipse.jdt.debug.tests.core.StringSubstitutionTests)  Time elapsed: 0.017 s
testNoReferences(org.eclipse.jdt.debug.tests.core.StringSubstitutionTests)  Time elapsed: 0.016 s
testContextWithArg(org.eclipse.jdt.debug.tests.core.StringSubstitutionTests)  Time elapsed: 0.016 s
testValueInitializerReadOnly(org.eclipse.jdt.debug.tests.core.StringSubstitutionTests)  Time elapsed: 0.017 s
testSimpleReferenceCycle(org.eclipse.jdt.debug.tests.core.StringSubstitutionTests)  Time elapsed: 0.021 s
testProjectPathArgProjectName(org.eclipse.jdt.debug.tests.core.StringSubstitutionTests)  Time elapsed: 0.016 s
testProjectPathSelectFile(org.eclipse.jdt.debug.tests.core.StringSubstitutionTests)  Time elapsed: 0.043 s
testResourcePathArgFolderName(org.eclipse.jdt.debug.tests.core.StringSubstitutionTests)  Time elapsed: 0.016 s
testResourceLocArgFolderName(org.eclipse.jdt.debug.tests.core.StringSubstitutionTests)  Time elapsed: 0.016 s
testContainerLocArgFolderName(org.eclipse.jdt.debug.tests.core.StringSubstitutionTests)  Time elapsed: 0.016 s
testProjectPathArgFolderPath(org.eclipse.jdt.debug.tests.core.StringSubstitutionTests)  Time elapsed: 0.016 s
testContainerNameSelectFolder(org.eclipse.jdt.debug.tests.core.StringSubstitutionTests)  Time elapsed: 0.024 s
testProjectLocArgProjectName(org.eclipse.jdt.debug.tests.core.StringSubstitutionTests)  Time elapsed: 0.016 s
testContainerPathArgFolderName(org.eclipse.jdt.debug.tests.core.StringSubstitutionTests)  Time elapsed: 0.016 s
testReferenceCycleWithUniqueExpression(org.eclipse.jdt.debug.tests.core.StringSubstitutionTests)  Time elapsed: 0.02 s
testResourceLocSelectFolder(org.eclipse.jdt.debug.tests.core.StringSubstitutionTests)  Time elapsed: 0.019 s
testContainerLocSelectFolder(org.eclipse.jdt.debug.tests.core.StringSubstitutionTests)  Time elapsed: 0.02 s
testProjectNameArgProjectName(org.eclipse.jdt.debug.tests.core.StringSubstitutionTests)  Time elapsed: 0.016 s
testSelectedResourceLocFolder(org.eclipse.jdt.debug.tests.core.StringSubstitutionTests)  Time elapsed: 0.02 s
testProjectLocSelectFolder(org.eclipse.jdt.debug.tests.core.StringSubstitutionTests)  Time elapsed: 0.019 s
testResourceNameArgFolderName(org.eclipse.jdt.debug.tests.core.StringSubstitutionTests)  Time elapsed: 0.016 s
testDividedRecursiveReferenceCycles(org.eclipse.jdt.debug.tests.core.StringSubstitutionTests)  Time elapsed: 0.021 s
testRemoveNotificaiton(org.eclipse.jdt.debug.tests.core.StringSubstitutionTests)  Time elapsed: 0.019 s
testProjectNameArgFolderPath(org.eclipse.jdt.debug.tests.core.StringSubstitutionTests)  Time elapsed: 0.016 s
testContainerNameArgFolderName(org.eclipse.jdt.debug.tests.core.StringSubstitutionTests)  Time elapsed: 0.015 s
testValueVarReference(org.eclipse.jdt.debug.tests.core.StringSubstitutionTests)  Time elapsed: 0.016 s
testRecursiveReferences(org.eclipse.jdt.debug.tests.core.StringSubstitutionTests)  Time elapsed: 0.019 s
testEmptySelectedResource(org.eclipse.jdt.debug.tests.core.StringSubstitutionTests)  Time elapsed: 0.022 s
testLocalJavaApplicationParameters(org.eclipse.jdt.debug.tests.core.StringSubstitutionTests)  Time elapsed: 0.023 s
testProjectNameSelectProject(org.eclipse.jdt.debug.tests.core.StringSubstitutionTests)  Time elapsed: 0.024 s
testWinOSCaseInsensitiveVariable(org.eclipse.jdt.debug.tests.core.EnvironmentTests)  Time elapsed: 0.016 s
testWinOSCaseInsensitiveOverride(org.eclipse.jdt.debug.tests.core.EnvironmentTests)  Time elapsed: 0.016 s
testAnalyze(org.eclipse.jdt.debug.tests.core.ExecutionEnvironmentTests)  Time elapsed: 0.015 s
testGetEnvironments(org.eclipse.jdt.debug.tests.core.ExecutionEnvironmentTests)  Time elapsed: 0.015 s
testDefaultSystemPackageAccessRules(org.eclipse.jdt.debug.tests.core.ExecutionEnvironmentTests)  Time elapsed: 0.017 s
testAccessRulesNotPresentOnJREProject(org.eclipse.jdt.debug.tests.core.ExecutionEnvironmentTests)  Time elapsed: 0.36 s
testAccessRulesPresentOnEEProject(org.eclipse.jdt.debug.tests.core.ExecutionEnvironmentTests)  Time elapsed: 2.436 s
testEEHomeVariableInvalidArgument(org.eclipse.jdt.debug.tests.core.ExecutionEnvironmentTests)  Time elapsed: 0.375 s
testNoAccessRuleParticipants(org.eclipse.jdt.debug.tests.core.ExecutionEnvironmentTests)  Time elapsed: 0.412 s
testEEHomeVariable(org.eclipse.jdt.debug.tests.core.ExecutionEnvironmentTests)  Time elapsed: 0.036 s
testAccessRuleParticipantsWithShortCircut(org.eclipse.jdt.debug.tests.core.ExecutionEnvironmentTests)  Time elapsed: 0.017 s
testAccessRuleParticipants(org.eclipse.jdt.debug.tests.core.ExecutionEnvironmentTests)  Time elapsed: 0.017 s
testEEHomeVariableMissingArgument(org.eclipse.jdt.debug.tests.core.ExecutionEnvironmentTests)  Time elapsed: 0.015 s
testVMArgSimpleQuotes(org.eclipse.jdt.debug.tests.core.ArgumentTests)  Time elapsed: 0.185 s
testVMArgSingle(org.eclipse.jdt.debug.tests.core.ArgumentTests)  Time elapsed: 0.18 s
testProgramArgStandardQuotes(org.eclipse.jdt.debug.tests.core.ArgumentTests)  Time elapsed: 0.495 s
testProgramArgSimpleQuotes(org.eclipse.jdt.debug.tests.core.ArgumentTests)  Time elapsed: 0.213 s
testProgramArgEmptyStringWithOthers(org.eclipse.jdt.debug.tests.core.ArgumentTests)  Time elapsed: 0.177 s
testVMArgStandardQuotes(org.eclipse.jdt.debug.tests.core.ArgumentTests)  Time elapsed: 0.224 s
testVMArgStandardEmbeddedQuotes(org.eclipse.jdt.debug.tests.core.ArgumentTests)  Time elapsed: 0.227 s
testProgramArgEmptyString(org.eclipse.jdt.debug.tests.core.ArgumentTests)  Time elapsed: 0.385 s
testProgramArgSingle(org.eclipse.jdt.debug.tests.core.ArgumentTests)  Time elapsed: 0.168 s
testProgramArgCreativeQuotes(org.eclipse.jdt.debug.tests.core.ArgumentTests)  Time elapsed: 0.215 s
testProgramArgMultiple(org.eclipse.jdt.debug.tests.core.ArgumentTests)  Time elapsed: 0.217 s
testProgramArgEmbeddedQuotes(org.eclipse.jdt.debug.tests.core.ArgumentTests)  Time elapsed: 0.226 s
testVMArgCreativeQuotes(org.eclipse.jdt.debug.tests.core.ArgumentTests)  Time elapsed: 0.18 s
testProgramArgCreativeEmbeddedQuotes(org.eclipse.jdt.debug.tests.core.ArgumentTests)  Time elapsed: 0.215 s
testVMArgEmbeddedQuotes(org.eclipse.jdt.debug.tests.core.ArgumentTests)  Time elapsed: 0.179 s
testVMArgEmbeddedCreativeQuotes(org.eclipse.jdt.debug.tests.core.ArgumentTests)  Time elapsed: 0.179 s
testVMArgWorkaroundQuotes(org.eclipse.jdt.debug.tests.core.ArgumentTests)  Time elapsed: 0.214 s
testProgramArgOneQuote(org.eclipse.jdt.debug.tests.core.ArgumentTests)  Time elapsed: 0.18 s
testRemoveProcess(org.eclipse.jdt.debug.tests.core.ConsoleTests)  Time elapsed: 0.361 s
testManualLifecycle(org.eclipse.jdt.debug.tests.core.ConsoleTests)  Time elapsed: 0.02 s
testAutoLifecycle(org.eclipse.jdt.debug.tests.core.ConsoleTests)  Time elapsed: 0.037 s
testEOF(org.eclipse.jdt.debug.tests.core.ConsoleInputTests)  Time elapsed: 0.276 s
testMultiLineInput(org.eclipse.jdt.debug.tests.core.ConsoleInputTests)  Time elapsed: 0.281 s
testDeleteAllEnteredText(org.eclipse.jdt.debug.tests.core.ConsoleInputTests)  Time elapsed: 0.755 s
testSimpleLineCounter(org.eclipse.jdt.debug.tests.core.LineTrackerTests)  Time elapsed: 1.081 s
testFlood(org.eclipse.jdt.debug.tests.core.LineTrackerTests)  Time elapsed: 0.73 s
testJavaExceptionHyperLink(org.eclipse.jdt.debug.tests.core.LineTrackerTests)  Time elapsed: 0.78 s
testStringConcatenation(org.eclipse.jdt.debug.tests.core.LineTrackerTests)  Time elapsed: 0.926 s
testNoPrintln(org.eclipse.jdt.debug.tests.core.LineTrackerTests)  Time elapsed: 0.84 s
testIntConcatenation(org.eclipse.jdt.debug.tests.core.LineTrackerTests)  Time elapsed: 0.893 s
testHyperLink(org.eclipse.jdt.debug.tests.core.LineTrackerTests)  Time elapsed: 2.387 s
testStackTraces(org.eclipse.jdt.debug.tests.core.LineTrackerTests)  Time elapsed: 0.571 s
testHyperlinkMatchSignatureSimple(org.eclipse.jdt.debug.tests.console.JavaStackTraceConsoleTest)  Time elapsed: 0.375 s
testLoadAndSaveDocument(org.eclipse.jdt.debug.tests.console.JavaStackTraceConsoleTest)  Time elapsed: 0.139 s
testClearInitialContent(org.eclipse.jdt.debug.tests.console.JavaStackTraceConsoleTest)  Time elapsed: 1.04 s
testHyperlinkMatchInvalidLine(org.eclipse.jdt.debug.tests.console.JavaStackTraceConsoleTest)  Time elapsed: 0.149 s
testHyperlinkMatchMultiple(org.eclipse.jdt.debug.tests.console.JavaStackTraceConsoleTest)  Time elapsed: 0.149 s
testHyperlinkNoMatch(org.eclipse.jdt.debug.tests.console.JavaStackTraceConsoleTest)  Time elapsed: 0.148 s
testHyperlinkMatchSignatureExtended(org.eclipse.jdt.debug.tests.console.JavaStackTraceConsoleTest)  Time elapsed: 0.15 s
testPatternMatchListener(org.eclipse.jdt.debug.tests.console.IOConsoleTests)  Time elapsed: 1.545 s
testTerminateAll_01(org.eclipse.jdt.debug.tests.console.ConsoleTerminateAllActionTests)  Time elapsed: 2.408 s
testLocalHostConnection(org.eclipse.jdt.debug.tests.console.ConsoleTerminateAllActionTests)  Time elapsed: 0.016 s
testModelSpecificEvent(org.eclipse.jdt.debug.tests.core.DebugEventTests)  Time elapsed: 0.016 s
testDoubleBreakpoint(org.eclipse.jdt.debug.tests.core.EventSetTests)  Time elapsed: 0.846 s
testExitValueNormal(org.eclipse.jdt.debug.tests.core.ProcessTests)  Time elapsed: 0.879 s
testAlreadyTerminatedProcess(org.eclipse.jdt.debug.tests.core.ProcessTests)  Time elapsed: 0.52 s
testClassLoader(org.eclipse.jdt.debug.tests.core.TypeTests)  Time elapsed: 1.324 s
testDeclaringTypes(org.eclipse.jdt.debug.tests.core.TypeTests)  Time elapsed: 1.374 s
testDeferredExpression(org.eclipse.jdt.debug.tests.core.WatchExpressionTests)  Time elapsed: 1.419 s
testDefaultStratum(org.eclipse.jdt.debug.tests.core.StratumTests)  Time elapsed: 0.867 s
testSetGetDefaultStratum(org.eclipse.jdt.debug.tests.core.StratumTests)  Time elapsed: 0.859 s
testAvailableStrata(org.eclipse.jdt.debug.tests.core.StratumTests)  Time elapsed: 0.87 s
testGetSourceNameInStratum(org.eclipse.jdt.debug.tests.core.StratumTests)  Time elapsed: 0.865 s
testGetLineInStratum(org.eclipse.jdt.debug.tests.core.StratumTests)  Time elapsed: 0.862 s
testIsAvailable(org.eclipse.jdt.debug.tests.core.JavaDebugTargetTests)  Time elapsed: 0.968 s
testGetVersion(org.eclipse.jdt.debug.tests.core.JavaDebugTargetTests)  Time elapsed: 0.818 s
testSupportsResource(org.eclipse.jdt.debug.tests.core.JavaDebugTargetTests)  Time elapsed: 3.934 s
testGetVMName(org.eclipse.jdt.debug.tests.core.JavaDebugTargetTests)  Time elapsed: 0.817 s
testDefaultWorkingDirectory(org.eclipse.jdt.debug.tests.core.WorkingDirectoryTests)  Time elapsed: 0.844 s
testAbsoluteWorkingDirectory(org.eclipse.jdt.debug.tests.core.WorkingDirectoryTests)  Time elapsed: 0.842 s
testWorkspaceRelativeWorkingDirectory(org.eclipse.jdt.debug.tests.core.WorkingDirectoryTests)  Time elapsed: 0.844 s
test285130_bulkThreadCreation(org.eclipse.jdt.debug.tests.core.EventDispatcherTest)  Time elapsed: 2.241 s
testConditionalExpressionEventDispatching(org.eclipse.jdt.debug.tests.core.EventDispatcherTest)  Time elapsed: 1.07 s
testWatchPointBreakPoint(org.eclipse.jdt.debug.tests.refactoring.MoveCompilationUnitTests)  Time elapsed: 2.307 s
testClassLoadBreakPoint(org.eclipse.jdt.debug.tests.refactoring.MoveCompilationUnitTests)  Time elapsed: 2.411 s
testLineBreakPoint(org.eclipse.jdt.debug.tests.refactoring.MoveCompilationUnitTests)  Time elapsed: 4.067 s
testMethodBreakPoint(org.eclipse.jdt.debug.tests.refactoring.MoveCompilationUnitTests)  Time elapsed: 3.478 s
testNonPublicWatchpoint(org.eclipse.jdt.debug.tests.refactoring.RenameFieldUnitTests)  Time elapsed: 2.261 s
testPublicWatchpoint(org.eclipse.jdt.debug.tests.refactoring.RenameFieldUnitTests)  Time elapsed: 1.614 s
testInnerAnonymousTypeWatchpoint(org.eclipse.jdt.debug.tests.refactoring.RenameFieldUnitTests)  Time elapsed: 2.372 s
testInnerWatchpoint(org.eclipse.jdt.debug.tests.refactoring.RenameFieldUnitTests)  Time elapsed: 2.289 s
testPublicAnonymousTypeWatchpoint(org.eclipse.jdt.debug.tests.refactoring.RenameFieldUnitTests)  Time elapsed: 1.726 s
testNonPublicAnonymousTypeWatchpoint(org.eclipse.jdt.debug.tests.refactoring.RenameFieldUnitTests)  Time elapsed: 2.246 s
testPublicClassLoadpoint(org.eclipse.jdt.debug.tests.refactoring.RenamePackageUnitTests)  Time elapsed: 1.723 s
testNonPublicMethodBreakpoint(org.eclipse.jdt.debug.tests.refactoring.RenamePackageUnitTests)  Time elapsed: 2.594 s
testNonPublicClassLoadpoint(org.eclipse.jdt.debug.tests.refactoring.RenamePackageUnitTests)  Time elapsed: 1.601 s
testPublicMethodBreakpoint(org.eclipse.jdt.debug.tests.refactoring.RenamePackageUnitTests)  Time elapsed: 2.573 s
testNonPublicWatchpoint(org.eclipse.jdt.debug.tests.refactoring.RenamePackageUnitTests)  Time elapsed: 1.673 s
testPublicWatchpoint(org.eclipse.jdt.debug.tests.refactoring.RenamePackageUnitTests)  Time elapsed: 2.369 s
testInnerLineBreakpoint(org.eclipse.jdt.debug.tests.refactoring.RenamePackageUnitTests)  Time elapsed: 2.268 s
testInnerAnonymousTypeMethodBreakpoint(org.eclipse.jdt.debug.tests.refactoring.RenamePackageUnitTests)  Time elapsed: 1.695 s
testInnerAnonymousTypeWatchpoint(org.eclipse.jdt.debug.tests.refactoring.RenamePackageUnitTests)  Time elapsed: 2.383 s
testInnerAnonymousTypeLineBreakpoint(org.eclipse.jdt.debug.tests.refactoring.RenamePackageUnitTests)  Time elapsed: 2.369 s
testInnerAnonmyousTypeClassLoadpoint(org.eclipse.jdt.debug.tests.refactoring.RenamePackageUnitTests)  Time elapsed: 4.26 s
testPublicAnonymousTypeMethodBreakpoint(org.eclipse.jdt.debug.tests.refactoring.RenamePackageUnitTests)  Time elapsed: 2.468 s
testPublicAnonymousTypeLineBreakpoint(org.eclipse.jdt.debug.tests.refactoring.RenamePackageUnitTests)  Time elapsed: 2.257 s
testNonPublicAnonymousTypeLineBreakpoint(org.eclipse.jdt.debug.tests.refactoring.RenamePackageUnitTests)  Time elapsed: 1.647 s
testInnerWatchpoint(org.eclipse.jdt.debug.tests.refactoring.RenamePackageUnitTests)  Time elapsed: 2.366 s
testInnerClassLoadpoint(org.eclipse.jdt.debug.tests.refactoring.RenamePackageUnitTests)  Time elapsed: 2.255 s
testPublicAnonymousTypeWatchpoint(org.eclipse.jdt.debug.tests.refactoring.RenamePackageUnitTests)  Time elapsed: 5.787 s
testPublicLineBreakpoint(org.eclipse.jdt.debug.tests.refactoring.RenamePackageUnitTests)  Time elapsed: 2.245 s
testNonPublicLineBreakpoint(org.eclipse.jdt.debug.tests.refactoring.RenamePackageUnitTests)  Time elapsed: 2.262 s
testNonPublicAnonymousTypeMethodBreakpoint(org.eclipse.jdt.debug.tests.refactoring.RenamePackageUnitTests)  Time elapsed: 2.85 s
testNonPublicAnonymousTypeWatchpoint(org.eclipse.jdt.debug.tests.refactoring.RenamePackageUnitTests)  Time elapsed: 2.27 s
testInnerMethodBreakpoint(org.eclipse.jdt.debug.tests.refactoring.RenamePackageUnitTests)  Time elapsed: 2.263 s
testPublicAnonymousTypeClassLoadpoint(org.eclipse.jdt.debug.tests.refactoring.RenamePackageUnitTests)  Time elapsed: 1.646 s
testNonPublicAnonymousTypeClassLoadpoint(org.eclipse.jdt.debug.tests.refactoring.RenamePackageUnitTests)  Time elapsed: 2.357 s
testPublicClassLoadpoint(org.eclipse.jdt.debug.tests.refactoring.RenamePublicTypeUnitTests)  Time elapsed: 1.971 s
testPublicMethodBreakpoint(org.eclipse.jdt.debug.tests.refactoring.RenamePublicTypeUnitTests)  Time elapsed: 2.136 s
testPublicWatchpoint(org.eclipse.jdt.debug.tests.refactoring.RenamePublicTypeUnitTests)  Time elapsed: 2.158 s
testPublicExceptionBreakpoint(org.eclipse.jdt.debug.tests.refactoring.RenamePublicTypeUnitTests)  Time elapsed: 2.133 s
testPublicLineBreakpoint(org.eclipse.jdt.debug.tests.refactoring.RenamePublicTypeUnitTests)  Time elapsed: 2.13 s
testInnerLineBreakpoint(org.eclipse.jdt.debug.tests.refactoring.RenameInnerTypeUnitTests)  Time elapsed: 2.113 s
testPublicExceptionBreakpoint(org.eclipse.jdt.debug.tests.refactoring.RenameInnerTypeUnitTests)  Time elapsed: 2.106 s
testInnerWatchpoint(org.eclipse.jdt.debug.tests.refactoring.RenameInnerTypeUnitTests)  Time elapsed: 2.124 s
testInnerClassLoadpoint(org.eclipse.jdt.debug.tests.refactoring.RenameInnerTypeUnitTests)  Time elapsed: 2.116 s
testInnerMethodBreakpoint(org.eclipse.jdt.debug.tests.refactoring.RenameInnerTypeUnitTests)  Time elapsed: 2.107 s
testNonPublicMethodBreakpoint(org.eclipse.jdt.debug.tests.refactoring.RenameNonPublicTypeUnitTests)  Time elapsed: 2.109 s
testNonPublicClassLoadpoint(org.eclipse.jdt.debug.tests.refactoring.RenameNonPublicTypeUnitTests)  Time elapsed: 2.107 s
testNonPublicWatchpoint(org.eclipse.jdt.debug.tests.refactoring.RenameNonPublicTypeUnitTests)  Time elapsed: 2.111 s
testPublicExceptionBreakpoint(org.eclipse.jdt.debug.tests.refactoring.RenameNonPublicTypeUnitTests)  Time elapsed: 2.121 s
testNonPublicLineBreakpoint(org.eclipse.jdt.debug.tests.refactoring.RenameNonPublicTypeUnitTests)  Time elapsed: 2.123 s
testPublicClassLoadpoint(org.eclipse.jdt.debug.tests.refactoring.RenameCompilationUnitUnitTests)  Time elapsed: 2.115 s
testNonPublicMethodBreakpoint(org.eclipse.jdt.debug.tests.refactoring.RenameCompilationUnitUnitTests)  Time elapsed: 2.114 s
testNonPublicClassLoadpoint(org.eclipse.jdt.debug.tests.refactoring.RenameCompilationUnitUnitTests)  Time elapsed: 2.136 s
testPublicMethodBreakpoint(org.eclipse.jdt.debug.tests.refactoring.RenameCompilationUnitUnitTests)  Time elapsed: 2.117 s
testNonPublicWatchpoint(org.eclipse.jdt.debug.tests.refactoring.RenameCompilationUnitUnitTests)  Time elapsed: 2.11 s
testPublicWatchpoint(org.eclipse.jdt.debug.tests.refactoring.RenameCompilationUnitUnitTests)  Time elapsed: 2.109 s
testInnerLineBreakpoint(org.eclipse.jdt.debug.tests.refactoring.RenameCompilationUnitUnitTests)  Time elapsed: 2.121 s
testInnerAnonymousTypeMethodBreakpoint(org.eclipse.jdt.debug.tests.refactoring.RenameCompilationUnitUnitTests)  Time elapsed: 2.11 s
testInnerAnonymousTypeWatchpoint(org.eclipse.jdt.debug.tests.refactoring.RenameCompilationUnitUnitTests)  Time elapsed: 2.123 s
testInnerAnonymousTypeLineBreakpoint(org.eclipse.jdt.debug.tests.refactoring.RenameCompilationUnitUnitTests)  Time elapsed: 2.157 s
testInnerAnonmyousTypeClassLoadpoint(org.eclipse.jdt.debug.tests.refactoring.RenameCompilationUnitUnitTests)  Time elapsed: 1.611 s
testPublicAnonymousTypeMethodBreakpoint(org.eclipse.jdt.debug.tests.refactoring.RenameCompilationUnitUnitTests)  Time elapsed: 2.116 s
testPublicAnonymousTypeLineBreakpoint(org.eclipse.jdt.debug.tests.refactoring.RenameCompilationUnitUnitTests)  Time elapsed: 2.126 s
testNonPublicAnonymousTypeLineBreakpoint(org.eclipse.jdt.debug.tests.refactoring.RenameCompilationUnitUnitTests)  Time elapsed: 2.119 s
testInnerWatchpoint(org.eclipse.jdt.debug.tests.refactoring.RenameCompilationUnitUnitTests)  Time elapsed: 2.111 s
testInnerClassLoadpoint(org.eclipse.jdt.debug.tests.refactoring.RenameCompilationUnitUnitTests)  Time elapsed: 2.114 s
testPublicAnonymousTypeWatchpoint(org.eclipse.jdt.debug.tests.refactoring.RenameCompilationUnitUnitTests)  Time elapsed: 2.128 s
testPublicLineBreakpoint(org.eclipse.jdt.debug.tests.refactoring.RenameCompilationUnitUnitTests)  Time elapsed: 2.112 s
testNonPublicLineBreakpoint(org.eclipse.jdt.debug.tests.refactoring.RenameCompilationUnitUnitTests)  Time elapsed: 2.146 s
testNonPublicAnonymousTypeMethodBreakpoint(org.eclipse.jdt.debug.tests.refactoring.RenameCompilationUnitUnitTests)  Time elapsed: 2.111 s
testNonPublicAnonymousTypeWatchpoint(org.eclipse.jdt.debug.tests.refactoring.RenameCompilationUnitUnitTests)  Time elapsed: 2.116 s
testInnerMethodBreakpoint(org.eclipse.jdt.debug.tests.refactoring.RenameCompilationUnitUnitTests)  Time elapsed: 2.11 s
testPublicAnonymousTypeClassLoadpoint(org.eclipse.jdt.debug.tests.refactoring.RenameCompilationUnitUnitTests)  Time elapsed: 2.114 s
testNonPublicAnonymousTypeClassLoadpoint(org.eclipse.jdt.debug.tests.refactoring.RenameCompilationUnitUnitTests)  Time elapsed: 2.118 s
testNonPublicMethodBreakpoint(org.eclipse.jdt.debug.tests.refactoring.RenameMethodUnitTests)  Time elapsed: 1.665 s
testPublicMethodBreakpoint(org.eclipse.jdt.debug.tests.refactoring.RenameMethodUnitTests)  Time elapsed: 2.524 s
testInnerAnonymousTypeMethodBreakpoint(org.eclipse.jdt.debug.tests.refactoring.RenameMethodUnitTests)  Time elapsed: 1.662 s
testPublicAnonymousTypeMethodBreakpoint(org.eclipse.jdt.debug.tests.refactoring.RenameMethodUnitTests)  Time elapsed: 2.354 s
testNonPublicAnonymousTypeMethodBreakpoint(org.eclipse.jdt.debug.tests.refactoring.RenameMethodUnitTests)  Time elapsed: 2.237 s
testInnerMethodBreakpoint(org.eclipse.jdt.debug.tests.refactoring.RenameMethodUnitTests)  Time elapsed: 1.719 s
testCapabilities(org.eclipse.jdt.debug.tests.core.JDWPTests)  Time elapsed: 0.866 s
testClassesBySingature(org.eclipse.jdt.debug.tests.core.JDWPTests)  Time elapsed: 0.862 s
testDefaultSettings(org.eclipse.jdt.debug.tests.connectors.MultipleConnectionsTest)  Time elapsed: 0.019 s
testSingleConnectionBehaviour(org.eclipse.jdt.debug.tests.connectors.MultipleConnectionsTest)  Time elapsed: 2.235 s
testTwoConnectionsBehaviour(org.eclipse.jdt.debug.tests.connectors.MultipleConnectionsTest)  Time elapsed: 2.218 s
testDefaultBehaviour(org.eclipse.jdt.debug.tests.connectors.MultipleConnectionsTest)  Time elapsed: 2.219 s
testUnlimitedConnectionsBehaviour(org.eclipse.jdt.debug.tests.connectors.MultipleConnectionsTest)  Time elapsed: 10.23 s
testAllThreadsSuspended(org.eclipse.jdt.debug.tests.state.RefreshStateTests)  Time elapsed: 1.462 s
testAllThreadsResumed(org.eclipse.jdt.debug.tests.state.RefreshStateTests)  Time elapsed: 1.411 s
testTargetHasResumed(org.eclipse.jdt.debug.tests.state.RefreshStateTests)  Time elapsed: 1.297 s
testTargetHasSuspended(org.eclipse.jdt.debug.tests.state.RefreshStateTests)  Time elapsed: 2.333 s
testThreadHasResumed(org.eclipse.jdt.debug.tests.state.RefreshStateTests)  Time elapsed: 1.284 s
testThreadHasSuspended(org.eclipse.jdt.debug.tests.state.RefreshStateTests)  Time elapsed: 1.3 s
testHCRConstructor2(org.eclipse.jdt.debug.tests.core.HcrTests)  Time elapsed: 1.898 s
testSimpleHcr(org.eclipse.jdt.debug.tests.core.HcrTests)  Time elapsed: 2.947 s
testHCRInnerLocal(org.eclipse.jdt.debug.tests.core.HcrTests)  Time elapsed: 2.783 s
testHCRInnerType2(org.eclipse.jdt.debug.tests.core.HcrTests)  Time elapsed: 1.877 s
testHCRInnerType3(org.eclipse.jdt.debug.tests.core.HcrTests)  Time elapsed: 1.895 s
testHCRInnerType4(org.eclipse.jdt.debug.tests.core.HcrTests)  Time elapsed: 2.014 s
testHCRInnerType5(org.eclipse.jdt.debug.tests.core.HcrTests)  Time elapsed: 1.884 s
testHCRAnonymousType(org.eclipse.jdt.debug.tests.core.HcrTests)  Time elapsed: 2.987 s
testHCRLocalType(org.eclipse.jdt.debug.tests.core.HcrTests)  Time elapsed: 1.882 s
testGeneralHcrListener(org.eclipse.jdt.debug.tests.core.HcrTests)  Time elapsed: 2.199 s
testHCRAnonymousType2(org.eclipse.jdt.debug.tests.core.HcrTests)  Time elapsed: 3.084 s
testHCRAnonymousType3(org.eclipse.jdt.debug.tests.core.HcrTests)  Time elapsed: 2.306 s
testHCRLocalInner(org.eclipse.jdt.debug.tests.core.HcrTests)  Time elapsed: 6.042 s
testHCRLocalType2(org.eclipse.jdt.debug.tests.core.HcrTests)  Time elapsed: 1.978 s
testHCRLocalType3(org.eclipse.jdt.debug.tests.core.HcrTests)  Time elapsed: 1.363 s
testNoHcrOnUnrelatedType(org.eclipse.jdt.debug.tests.core.HcrTests)  Time elapsed: 32.149 s
testHCRInnerType(org.eclipse.jdt.debug.tests.core.HcrTests)  Time elapsed: 2.697 s
testHCRLocalAnonymous(org.eclipse.jdt.debug.tests.core.HcrTests)  Time elapsed: 3.093 s
testHCRAnnonymousLocal(org.eclipse.jdt.debug.tests.core.HcrTests)  Time elapsed: 1.882 s
testHCRConstructor(org.eclipse.jdt.debug.tests.core.HcrTests)  Time elapsed: 1.854 s
testSpecificHcrListener(org.eclipse.jdt.debug.tests.core.HcrTests)  Time elapsed: 2.387 s
testAutoCloseDebugPerspective(org.eclipse.jdt.debug.tests.ui.ViewManagementTests)  Time elapsed: 0.04 s
testAutoOpenJavaPerspective(org.eclipse.jdt.debug.tests.ui.ViewManagementTests)  Time elapsed: 0.041 s
testAutoOpenDebugPerspective(org.eclipse.jdt.debug.tests.ui.ViewManagementTests)  Time elapsed: 0.037 s
testAutoCloseJavaPerspective(org.eclipse.jdt.debug.tests.ui.ViewManagementTests)  Time elapsed: 0.037 s
testWrongSelectionBug534319lateStart(org.eclipse.jdt.debug.tests.ui.DebugViewTests)  Time elapsed: 21.611 s
testWrongSelectionBug538303(org.eclipse.jdt.debug.tests.ui.DebugViewTests)  Time elapsed: 7.405 s
testWrongSelectionBug540243(org.eclipse.jdt.debug.tests.ui.DebugViewTests)  Time elapsed: 4.811 s
testWrongSelectionBug534319earlyStart(org.eclipse.jdt.debug.tests.ui.DebugViewTests)  Time elapsed: 21.495 s
testLastStackElementShown(org.eclipse.jdt.debug.tests.ui.DebugViewTests)  Time elapsed: 3.991 s
testWrongSelectionBug534319startBetwen(org.eclipse.jdt.debug.tests.ui.DebugViewTests)  Time elapsed: 21.648 s
testWrongSelectionBug534319singleThread(org.eclipse.jdt.debug.tests.ui.DebugViewTests)  Time elapsed: 17.461 s
testResolveInLambda(org.eclipse.jdt.debug.tests.ui.DebugHoverTests)  Time elapsed: 6.521 s
testInstructionPointerLeaks(org.eclipse.jdt.debug.tests.core.InstructionPointerTests)  Time elapsed: 0.015 s
testGetUserPreferredDetailPane(org.eclipse.jdt.debug.tests.ui.DetailPaneManagerTests)  Time elapsed: 0.015 s
testSetPreferredDetailPane(org.eclipse.jdt.debug.tests.ui.DetailPaneManagerTests)  Time elapsed: 0.018 s
testGetPreferredPaneFromSelection(org.eclipse.jdt.debug.tests.ui.DetailPaneManagerTests)  Time elapsed: 0.028 s
testGetAvailablePaneIDs(org.eclipse.jdt.debug.tests.ui.DetailPaneManagerTests)  Time elapsed: 0.016 s
testGetDetailPaneFromID(org.eclipse.jdt.debug.tests.ui.DetailPaneManagerTests)  Time elapsed: 0.017 s
testGetNameFromID(org.eclipse.jdt.debug.tests.ui.DetailPaneManagerTests)  Time elapsed: 0.015 s
testGetDescriptionFromID(org.eclipse.jdt.debug.tests.ui.DetailPaneManagerTests)  Time elapsed: 0.016 s
testSimpleStringValueText(org.eclipse.jdt.debug.tests.ui.presentation.ModelPresentationTests)  Time elapsed: 0.017 s
testAllNullValueText(org.eclipse.jdt.debug.tests.ui.presentation.ModelPresentationTests)  Time elapsed: 0.015 s
testSimpleArrayValueText(org.eclipse.jdt.debug.tests.ui.presentation.ModelPresentationTests)  Time elapsed: 0.017 s
testResolvedStringValueText(org.eclipse.jdt.debug.tests.ui.presentation.ModelPresentationTests)  Time elapsed: 0.016 s
testUnknownValueText(org.eclipse.jdt.debug.tests.ui.presentation.ModelPresentationTests)  Time elapsed: 0.015 s
testClassFileLine_1(org.eclipse.jdt.debug.tests.ui.OpenFromClipboardTests)  Time elapsed: 0.563 s
testClassFileLine_2(org.eclipse.jdt.debug.tests.ui.OpenFromClipboardTests)  Time elapsed: 0.533 s
testClassFileLine_3(org.eclipse.jdt.debug.tests.ui.OpenFromClipboardTests)  Time elapsed: 0.56 s
testInvalidPattern_1(org.eclipse.jdt.debug.tests.ui.OpenFromClipboardTests)  Time elapsed: 0.024 s
testInvalidPattern_2(org.eclipse.jdt.debug.tests.ui.OpenFromClipboardTests)  Time elapsed: 0.024 s
testInvalidPattern_3(org.eclipse.jdt.debug.tests.ui.OpenFromClipboardTests)  Time elapsed: 0.023 s
testClassFile_1(org.eclipse.jdt.debug.tests.ui.OpenFromClipboardTests)  Time elapsed: 0.459 s
testDBCS(org.eclipse.jdt.debug.tests.ui.OpenFromClipboardTests)  Time elapsed: 0.56 s
testQualifiedName_1(org.eclipse.jdt.debug.tests.ui.OpenFromClipboardTests)  Time elapsed: 0.626 s
testQualifiedName_2(org.eclipse.jdt.debug.tests.ui.OpenFromClipboardTests)  Time elapsed: 0.588 s
testQualifiedName_3(org.eclipse.jdt.debug.tests.ui.OpenFromClipboardTests)  Time elapsed: 0.566 s
testQualifiedName_4(org.eclipse.jdt.debug.tests.ui.OpenFromClipboardTests)  Time elapsed: 0.568 s
testQualifiedName_5(org.eclipse.jdt.debug.tests.ui.OpenFromClipboardTests)  Time elapsed: 0.62 s
testQualifiedName_6(org.eclipse.jdt.debug.tests.ui.OpenFromClipboardTests)  Time elapsed: 0.62 s
testMethod_10(org.eclipse.jdt.debug.tests.ui.OpenFromClipboardTests)  Time elapsed: 0.589 s
testMethod_11(org.eclipse.jdt.debug.tests.ui.OpenFromClipboardTests)  Time elapsed: 0.566 s
testMember_1(org.eclipse.jdt.debug.tests.ui.OpenFromClipboardTests)  Time elapsed: 0.571 s
testMember_2(org.eclipse.jdt.debug.tests.ui.OpenFromClipboardTests)  Time elapsed: 0.569 s
testMember_3(org.eclipse.jdt.debug.tests.ui.OpenFromClipboardTests)  Time elapsed: 0.569 s
testMethod_1(org.eclipse.jdt.debug.tests.ui.OpenFromClipboardTests)  Time elapsed: 0.62 s
testMethod_2(org.eclipse.jdt.debug.tests.ui.OpenFromClipboardTests)  Time elapsed: 0.629 s
testMethod_3(org.eclipse.jdt.debug.tests.ui.OpenFromClipboardTests)  Time elapsed: 0.778 s
testMethod_4(org.eclipse.jdt.debug.tests.ui.OpenFromClipboardTests)  Time elapsed: 0.563 s
testMethod_5(org.eclipse.jdt.debug.tests.ui.OpenFromClipboardTests)  Time elapsed: 0.565 s
testMethod_6(org.eclipse.jdt.debug.tests.ui.OpenFromClipboardTests)  Time elapsed: 0.578 s
testMethod_7(org.eclipse.jdt.debug.tests.ui.OpenFromClipboardTests)  Time elapsed: 0.564 s
testMethod_8(org.eclipse.jdt.debug.tests.ui.OpenFromClipboardTests)  Time elapsed: 0.022 s
testMethod_9(org.eclipse.jdt.debug.tests.ui.OpenFromClipboardTests)  Time elapsed: 0.023 s
testStackTraceLine_1(org.eclipse.jdt.debug.tests.ui.OpenFromClipboardTests)  Time elapsed: 0.507 s
testStackTraceLine_2(org.eclipse.jdt.debug.tests.ui.OpenFromClipboardTests)  Time elapsed: 0.559 s
testStackTraceLine_3(org.eclipse.jdt.debug.tests.ui.OpenFromClipboardTests)  Time elapsed: 0.524 s
testStackTraceLine_4(org.eclipse.jdt.debug.tests.ui.OpenFromClipboardTests)  Time elapsed: 0.556 s
testStackTraceLine_5(org.eclipse.jdt.debug.tests.ui.OpenFromClipboardTests)  Time elapsed: 0.556 s
testStackTraceLine_6(org.eclipse.jdt.debug.tests.ui.OpenFromClipboardTests)  Time elapsed: 0.556 s
testStackTraceLine_7(org.eclipse.jdt.debug.tests.ui.OpenFromClipboardTests)  Time elapsed: 0.555 s
testStackElement_1(org.eclipse.jdt.debug.tests.ui.OpenFromClipboardTests)  Time elapsed: 0.567 s
testStackElement_2(org.eclipse.jdt.debug.tests.ui.OpenFromClipboardTests)  Time elapsed: 0.564 s
testUmlaut(org.eclipse.jdt.debug.tests.ui.OpenFromClipboardTests)  Time elapsed: 0.555 s
testTypeLine_1(org.eclipse.jdt.debug.tests.ui.OpenFromClipboardTests)  Time elapsed: 0.563 s
testTypeLine_2(org.eclipse.jdt.debug.tests.ui.OpenFromClipboardTests)  Time elapsed: 0.557 s
testMultipleInfixEval10(org.eclipse.jdt.debug.tests.eval.GeneralEvalTests)  Time elapsed: 1.144 s
testMultipleInfixEval11(org.eclipse.jdt.debug.tests.eval.GeneralEvalTests)  Time elapsed: 0.949 s
testMultipleInfixEval12(org.eclipse.jdt.debug.tests.eval.GeneralEvalTests)  Time elapsed: 0.961 s
testMultipleInfixEval13(org.eclipse.jdt.debug.tests.eval.GeneralEvalTests)  Time elapsed: 0.952 s
testMultipleInfixEval14(org.eclipse.jdt.debug.tests.eval.GeneralEvalTests)  Time elapsed: 0.954 s
testMultipleInfixEval15(org.eclipse.jdt.debug.tests.eval.GeneralEvalTests)  Time elapsed: 0.987 s
testMultipleInfixEval16(org.eclipse.jdt.debug.tests.eval.GeneralEvalTests)  Time elapsed: 0.95 s
testInnerType1(org.eclipse.jdt.debug.tests.eval.GeneralEvalTests)  Time elapsed: 0.957 s
testInnerType2(org.eclipse.jdt.debug.tests.eval.GeneralEvalTests)  Time elapsed: 0.959 s
testInnerType3(org.eclipse.jdt.debug.tests.eval.GeneralEvalTests)  Time elapsed: 0.953 s
testMultiByteCharacters(org.eclipse.jdt.debug.tests.eval.GeneralEvalTests)  Time elapsed: 1.379 s
testCompoundCondition(org.eclipse.jdt.debug.tests.eval.GeneralEvalTests)  Time elapsed: 0.952 s
testInnerAnonymousType(org.eclipse.jdt.debug.tests.eval.GeneralEvalTests)  Time elapsed: 0.956 s
testMultipleInfixEval1(org.eclipse.jdt.debug.tests.eval.GeneralEvalTests)  Time elapsed: 0.959 s
testMultipleInfixEval2(org.eclipse.jdt.debug.tests.eval.GeneralEvalTests)  Time elapsed: 0.949 s
testMultipleInfixEval3(org.eclipse.jdt.debug.tests.eval.GeneralEvalTests)  Time elapsed: 0.953 s
testMultipleInfixEval4(org.eclipse.jdt.debug.tests.eval.GeneralEvalTests)  Time elapsed: 0.975 s
testMultipleInfixEval5(org.eclipse.jdt.debug.tests.eval.GeneralEvalTests)  Time elapsed: 0.963 s
testMultipleInfixEval6(org.eclipse.jdt.debug.tests.eval.GeneralEvalTests)  Time elapsed: 0.954 s
testMultipleInfixEval7(org.eclipse.jdt.debug.tests.eval.GeneralEvalTests)  Time elapsed: 0.951 s
testMultipleInfixEval8(org.eclipse.jdt.debug.tests.eval.GeneralEvalTests)  Time elapsed: 0.954 s
testMultipleInfixEval9(org.eclipse.jdt.debug.tests.eval.GeneralEvalTests)  Time elapsed: 0.95 s
testClasspathInEnvironmentReplacedOnWindows(org.eclipse.jdt.debug.tests.launching.ClasspathShortenerTests)  Time elapsed: 0.025 s
testShortenClasspathWhenClasspathArgumentIsTooLong(org.eclipse.jdt.debug.tests.launching.ClasspathShortenerTests)  Time elapsed: 0.018 s
testClasspathOnlyJarUsedForLongClasspathOnJava8(org.eclipse.jdt.debug.tests.launching.ClasspathShortenerTests)  Time elapsed: 0.024 s
testClasspathEnvVariableUsedForLongClasspathOnJava8OnWindows(org.eclipse.jdt.debug.tests.launching.ClasspathShortenerTests)  Time elapsed: 0.015 s
testShortenClasspathWhenCommandLineIsTooLong(org.eclipse.jdt.debug.tests.launching.ClasspathShortenerTests)  Time elapsed: 0.016 s
testClasspathUsedOnWindowsWhenEnvp(org.eclipse.jdt.debug.tests.launching.ClasspathShortenerTests)  Time elapsed: 0.015 s
testNoNeedToShortenShortClasspath(org.eclipse.jdt.debug.tests.launching.ClasspathShortenerTests)  Time elapsed: 0.016 s
testLongClasspathAndLongModulePath(org.eclipse.jdt.debug.tests.launching.ClasspathShortenerTests)  Time elapsed: 0.017 s
testForceClasspathOnlyJar(org.eclipse.jdt.debug.tests.launching.ClasspathShortenerTests)  Time elapsed: 0.018 s
testArgFileUsedForLongModulePath(org.eclipse.jdt.debug.tests.launching.ClasspathShortenerTests)  Time elapsed: 0.016 s
testArgFileUsedForLongClasspathOnJava9(org.eclipse.jdt.debug.tests.launching.ClasspathShortenerTests)  Time elapsed: 0.016 s
testVeryLongClasspathWithClasspathOnlyJar(org.eclipse.jdt.debug.tests.launching.LongClassPathTests)  Time elapsed: 10.224 s
testCreateWatchpointBPNullTypeName(org.eclipse.jdt.debug.tests.breakpoints.TypeNameBreakpointTests)  Time elapsed: 0.018 s
testJDIModelTypeNameNull1(org.eclipse.jdt.debug.tests.breakpoints.TypeNameBreakpointTests)  Time elapsed: 0.016 s
testCreateExceptionBPNullTypeName(org.eclipse.jdt.debug.tests.breakpoints.TypeNameBreakpointTests)  Time elapsed: 0.017 s
testLaunchNullTypeWatchpoint(org.eclipse.jdt.debug.tests.breakpoints.TypeNameBreakpointTests)  Time elapsed: 7.159 s
testCreateMethodBPNullTypeName(org.eclipse.jdt.debug.tests.breakpoints.TypeNameBreakpointTests)  Time elapsed: 0.017 s
testLaunchNullTypeExceptionBreakpoint(org.eclipse.jdt.debug.tests.breakpoints.TypeNameBreakpointTests)  Time elapsed: 7.164 s
testCreateLineBPNullTypeName(org.eclipse.jdt.debug.tests.breakpoints.TypeNameBreakpointTests)  Time elapsed: 0.017 s
testGetPresentationTypeNameNull2(org.eclipse.jdt.debug.tests.breakpoints.TypeNameBreakpointTests)  Time elapsed: 0.016 s
testGetPresentationTypeNameNull3(org.eclipse.jdt.debug.tests.breakpoints.TypeNameBreakpointTests)  Time elapsed: 0.017 s
testGetPresentationTypeNameNull4(org.eclipse.jdt.debug.tests.breakpoints.TypeNameBreakpointTests)  Time elapsed: 0.017 s
testGetPresentationTypeNameNull5(org.eclipse.jdt.debug.tests.breakpoints.TypeNameBreakpointTests)  Time elapsed: 0.016 s
testGetPresentationTypeNameNull6(org.eclipse.jdt.debug.tests.breakpoints.TypeNameBreakpointTests)  Time elapsed: 0.017 s
testGetPresentationTypeNameNull7(org.eclipse.jdt.debug.tests.breakpoints.TypeNameBreakpointTests)  Time elapsed: 0.019 s
testLaunchNullTypeLineBreakpoint(org.eclipse.jdt.debug.tests.breakpoints.TypeNameBreakpointTests)  Time elapsed: 7.176 s
testJDIDebugModelTypeName2(org.eclipse.jdt.debug.tests.breakpoints.TypeNameBreakpointTests)  Time elapsed: 0.018 s
testCreateClassPrepareBPNullTypeName(org.eclipse.jdt.debug.tests.breakpoints.TypeNameBreakpointTests)  Time elapsed: 0.017 s
testGetPresentationNullTypeName(org.eclipse.jdt.debug.tests.breakpoints.TypeNameBreakpointTests)  Time elapsed: 0.016 s
testCreateStratumBPNullTypeName(org.eclipse.jdt.debug.tests.breakpoints.TypeNameBreakpointTests)  Time elapsed: 0.017 s
testCreateMethodEntryBPNullTypeName(org.eclipse.jdt.debug.tests.breakpoints.TypeNameBreakpointTests)  Time elapsed: 0.018 s
testTypeNamesEqual(org.eclipse.jdt.debug.tests.breakpoints.TypeNameBreakpointTests)  Time elapsed: 0.016 s
testEnableDisableBreakpoint(org.eclipse.jdt.debug.tests.breakpoints.DeferredBreakpointTests)  Time elapsed: 2.358 s
testDisabledBreakpoint(org.eclipse.jdt.debug.tests.breakpoints.DeferredBreakpointTests)  Time elapsed: 0.343 s
testSkipLineBreakpoint(org.eclipse.jdt.debug.tests.breakpoints.DeferredBreakpointTests)  Time elapsed: 0.813 s
testDeferredBreakpoints(org.eclipse.jdt.debug.tests.breakpoints.DeferredBreakpointTests)  Time elapsed: 1.576 s
testExpiredHitCountBreakpoint(org.eclipse.jdt.debug.tests.breakpoints.HitCountBreakpointsTests)  Time elapsed: 2.649 s
testResetHitCountBreakpoint(org.eclipse.jdt.debug.tests.breakpoints.HitCountBreakpointsTests)  Time elapsed: 2.425 s
testExceptionThreadFilterBreakpoint(org.eclipse.jdt.debug.tests.breakpoints.ThreadFilterBreakpointsTests)  Time elapsed: 1.925 s
testAccessWatchpointThreadFilterBreakpoint(org.eclipse.jdt.debug.tests.breakpoints.ThreadFilterBreakpointsTests)  Time elapsed: 1.586 s
testModificationWatchpointThreadFilterBreakpoint(org.eclipse.jdt.debug.tests.breakpoints.ThreadFilterBreakpointsTests)  Time elapsed: 1.285 s
testSimpleThreadFilterBreakpoint(org.eclipse.jdt.debug.tests.breakpoints.ThreadFilterBreakpointsTests)  Time elapsed: 2.783 s
testMultiThreadFilterBreakpoint(org.eclipse.jdt.debug.tests.breakpoints.ThreadFilterBreakpointsTests)  Time elapsed: 1.702 s
testSuspendVmModificationWatchpointBreakpoint(org.eclipse.jdt.debug.tests.breakpoints.SuspendVMBreakpointsTests)  Time elapsed: 0.863 s
testSuspendVmLineBreakpoint(org.eclipse.jdt.debug.tests.breakpoints.SuspendVMBreakpointsTests)  Time elapsed: 0.888 s
testSuspendVmMethodEntryBreakpoint(org.eclipse.jdt.debug.tests.breakpoints.SuspendVMBreakpointsTests)  Time elapsed: 0.968 s
testSuspendVmAccessWatchpointBreakpoint(org.eclipse.jdt.debug.tests.breakpoints.SuspendVMBreakpointsTests)  Time elapsed: 0.866 s
testSuspendVmExceptionBreakpoint(org.eclipse.jdt.debug.tests.breakpoints.SuspendVMBreakpointsTests)  Time elapsed: 0.99 s
testSuspendVmMethodExitBreakpoint(org.eclipse.jdt.debug.tests.breakpoints.SuspendVMBreakpointsTests)  Time elapsed: 0.879 s
testRunModeLaunchWithBreakpoints(org.eclipse.jdt.debug.tests.breakpoints.PreLaunchBreakpointTest)  Time elapsed: 1.586 s
testBreakpointImportMissingResources(org.eclipse.jdt.debug.tests.breakpoints.ImportBreakpointsTest)  Time elapsed: 0.027 s
testBreakpointImportWithWorkingsets(org.eclipse.jdt.debug.tests.breakpoints.ImportBreakpointsTest)  Time elapsed: 0.247 s
testBreakpointImportOverwrite(org.eclipse.jdt.debug.tests.breakpoints.ImportBreakpointsTest)  Time elapsed: 0.382 s
testImportWithWorkingsets(org.eclipse.jdt.debug.tests.breakpoints.ImportBreakpointsTest)  Time elapsed: 0.193 s
testBreakpointImportFile(org.eclipse.jdt.debug.tests.breakpoints.ImportBreakpointsTest)  Time elapsed: 0.072 s
testBreakpointImportBuffer(org.eclipse.jdt.debug.tests.breakpoints.ImportBreakpointsTest)  Time elapsed: 0.086 s
testBreakpointImportBadFilename(org.eclipse.jdt.debug.tests.breakpoints.ImportBreakpointsTest)  Time elapsed: 0.017 s
testInsertIntoDefaultSet(org.eclipse.jdt.debug.tests.breakpoints.BreakpointWorkingSetTests)  Time elapsed: 0.345 s
testAddToDefaultWorkingSet(org.eclipse.jdt.debug.tests.breakpoints.BreakpointWorkingSetTests)  Time elapsed: 0.077 s
testNoDefaultWorkingSet(org.eclipse.jdt.debug.tests.breakpoints.BreakpointWorkingSetTests)  Time elapsed: 0.063 s
testThreadFilterInclusive(org.eclipse.jdt.debug.tests.breakpoints.MethodBreakpointTests)  Time elapsed: 1.096 s
testInnerClassNotHit(org.eclipse.jdt.debug.tests.breakpoints.MethodBreakpointTests)  Time elapsed: 1.025 s
testDisabledEntryAndExitBreakpoints(org.eclipse.jdt.debug.tests.breakpoints.MethodBreakpointTests)  Time elapsed: 0.945 s
testLabelWithoutSigOrMethodName(org.eclipse.jdt.debug.tests.breakpoints.MethodBreakpointTests)  Time elapsed: 0.078 s
testLabelWithoutSignature(org.eclipse.jdt.debug.tests.breakpoints.MethodBreakpointTests)  Time elapsed: 0.038 s
testInnerClassesHit(org.eclipse.jdt.debug.tests.breakpoints.MethodBreakpointTests)  Time elapsed: 1.035 s
testEntryAndExitBreakpoints(org.eclipse.jdt.debug.tests.breakpoints.MethodBreakpointTests)  Time elapsed: 5.671 s
testThreadFilterExclusive(org.eclipse.jdt.debug.tests.breakpoints.MethodBreakpointTests)  Time elapsed: 0.522 s
testLabelWithoutMethodName(org.eclipse.jdt.debug.tests.breakpoints.MethodBreakpointTests)  Time elapsed: 0.069 s
testSkipMethodBreakpoint(org.eclipse.jdt.debug.tests.breakpoints.MethodBreakpointTests)  Time elapsed: 2.339 s
testHitCountExitBreakpoint(org.eclipse.jdt.debug.tests.breakpoints.MethodBreakpointTests)  Time elapsed: 0.995 s
testEntryDefaultPackageReturnType(org.eclipse.jdt.debug.tests.breakpoints.MethodBreakpointTests)  Time elapsed: 0.886 s
testHitCountEntryBreakpoint(org.eclipse.jdt.debug.tests.breakpoints.MethodBreakpointTests)  Time elapsed: 0.895 s
testStopInMain(org.eclipse.jdt.debug.tests.breakpoints.MethodBreakpointTests)  Time elapsed: 0.85 s
testMultiInclusiveExclusiveScopedExceptionMissed(org.eclipse.jdt.debug.tests.breakpoints.ExceptionBreakpointTests)  Time elapsed: 0.432 s
testUncaughtException(org.eclipse.jdt.debug.tests.breakpoints.ExceptionBreakpointTests)  Time elapsed: 2.074 s
testExclusiveScopedException(org.eclipse.jdt.debug.tests.breakpoints.ExceptionBreakpointTests)  Time elapsed: 2.139 s
testInclusiveScopedException(org.eclipse.jdt.debug.tests.breakpoints.ExceptionBreakpointTests)  Time elapsed: 0.908 s
testMultiInclusiveExclusiveScopedExceptionHit(org.eclipse.jdt.debug.tests.breakpoints.ExceptionBreakpointTests)  Time elapsed: 0.849 s
testHitCountException(org.eclipse.jdt.debug.tests.breakpoints.ExceptionBreakpointTests)  Time elapsed: 0.87 s
testMultiExclusiveScopedExceptionMissed(org.eclipse.jdt.debug.tests.breakpoints.ExceptionBreakpointTests)  Time elapsed: 0.382 s
testDisabledUncaughtNPE(org.eclipse.jdt.debug.tests.breakpoints.ExceptionBreakpointTests)  Time elapsed: 1.594 s
testMultiInclusiveScopedExceptionHit(org.eclipse.jdt.debug.tests.breakpoints.ExceptionBreakpointTests)  Time elapsed: 0.884 s
testDisabledCaughtException(org.eclipse.jdt.debug.tests.breakpoints.ExceptionBreakpointTests)  Time elapsed: 0.342 s
testCaughtException(org.eclipse.jdt.debug.tests.breakpoints.ExceptionBreakpointTests)  Time elapsed: 0.858 s
testSkipExceptionBreakpoint(org.eclipse.jdt.debug.tests.breakpoints.ExceptionBreakpointTests)  Time elapsed: 0.994 s
testMultiInclusiveScopedExceptionMissed(org.eclipse.jdt.debug.tests.breakpoints.ExceptionBreakpointTests)  Time elapsed: 0.418 s
testMultiExclusiveScopedExceptionHit(org.eclipse.jdt.debug.tests.breakpoints.ExceptionBreakpointTests)  Time elapsed: 0.879 s
testSkipWatchpoint(org.eclipse.jdt.debug.tests.breakpoints.WatchpointTests)  Time elapsed: 0.926 s
testDisabledModification(org.eclipse.jdt.debug.tests.breakpoints.WatchpointTests)  Time elapsed: 0.446 s
testDisabledAccess(org.eclipse.jdt.debug.tests.breakpoints.WatchpointTests)  Time elapsed: 0.855 s
testAccessAndModification(org.eclipse.jdt.debug.tests.breakpoints.WatchpointTests)  Time elapsed: 1.039 s
testFinalWatchpoint(org.eclipse.jdt.debug.tests.breakpoints.WatchpointTests)  Time elapsed: 0.946 s
testModification(org.eclipse.jdt.debug.tests.breakpoints.WatchpointTests)  Time elapsed: 0.996 s
testAccess(org.eclipse.jdt.debug.tests.breakpoints.WatchpointTests)  Time elapsed: 1.332 s
testHitCountAccess(org.eclipse.jdt.debug.tests.breakpoints.WatchpointTests)  Time elapsed: 1.133 s
testTogglePatternBreakpoint(org.eclipse.jdt.debug.tests.breakpoints.PatternBreakpointTests)  Time elapsed: 1.231 s
testPatternBreakpoints(org.eclipse.jdt.debug.tests.breakpoints.PatternBreakpointTests)  Time elapsed: 1.076 s
testSkipPatternBreakpoint(org.eclipse.jdt.debug.tests.breakpoints.PatternBreakpointTests)  Time elapsed: 1.296 s
testToggleStratumBreakpoint(org.eclipse.jdt.debug.tests.breakpoints.PatternBreakpointTests)  Time elapsed: 1.151 s
testTargetPatternBreakpoints(org.eclipse.jdt.debug.tests.breakpoints.TargetPatternBreakpointTests)  Time elapsed: 1.043 s
testMultiListenerProjectCloseOpen(org.eclipse.jdt.debug.tests.breakpoints.BreakpointListenerTests)  Time elapsed: 3.893 s
testSingleListenerMoveCompilationUnit(org.eclipse.jdt.debug.tests.breakpoints.BreakpointListenerTests)  Time elapsed: 4.929 s
testMultiListenerMoveCompilationUnit(org.eclipse.jdt.debug.tests.breakpoints.BreakpointListenerTests)  Time elapsed: 16.347 s
testSingleListener(org.eclipse.jdt.debug.tests.breakpoints.BreakpointListenerTests)  Time elapsed: 2.128 s
testMultiListener(org.eclipse.jdt.debug.tests.breakpoints.BreakpointListenerTests)  Time elapsed: 1.989 s
testStepOverHitsNestedEvaluationHandlerSuspend(org.eclipse.jdt.debug.tests.breakpoints.JavaBreakpointListenerTests)  Time elapsed: 1.396 s
testDontSuspendVote(org.eclipse.jdt.debug.tests.breakpoints.JavaBreakpointListenerTests)  Time elapsed: 1.094 s
testInstallDontCareVote(org.eclipse.jdt.debug.tests.breakpoints.JavaBreakpointListenerTests)  Time elapsed: 1.05 s
testStepOverHitsNestedEvaluationHandlerResume(org.eclipse.jdt.debug.tests.breakpoints.JavaBreakpointListenerTests)  Time elapsed: 1.401 s
testLineBreakpoint(org.eclipse.jdt.debug.tests.breakpoints.JavaBreakpointListenerTests)  Time elapsed: 0.95 s
testExceptionBreakpoint(org.eclipse.jdt.debug.tests.breakpoints.JavaBreakpointListenerTests)  Time elapsed: 1.13 s
testAddRemoveListeners(org.eclipse.jdt.debug.tests.breakpoints.JavaBreakpointListenerTests)  Time elapsed: 0.074 s
testMethodBreakpoint(org.eclipse.jdt.debug.tests.breakpoints.JavaBreakpointListenerTests)  Time elapsed: 1.019 s
testRemovedNotification(org.eclipse.jdt.debug.tests.breakpoints.JavaBreakpointListenerTests)  Time elapsed: 1.073 s
testUnanimousSuspendVote(org.eclipse.jdt.debug.tests.breakpoints.JavaBreakpointListenerTests)  Time elapsed: 0.914 s
testInstallDontVote(org.eclipse.jdt.debug.tests.breakpoints.JavaBreakpointListenerTests)  Time elapsed: 0.988 s
testMethodBreakpointDontSuspendVote(org.eclipse.jdt.debug.tests.breakpoints.JavaBreakpointListenerTests)  Time elapsed: 0.985 s
testDontInstallVote(org.eclipse.jdt.debug.tests.breakpoints.JavaBreakpointListenerTests)  Time elapsed: 1.011 s
testListenersOnConditionalBreakpoint(org.eclipse.jdt.debug.tests.breakpoints.JavaBreakpointListenerTests)  Time elapsed: 2.223 s
testListenersOnConditionalBreakpointStepping(org.eclipse.jdt.debug.tests.breakpoints.JavaBreakpointListenerTests)  Time elapsed: 1.65 s
testSuspendDontVote(org.eclipse.jdt.debug.tests.breakpoints.JavaBreakpointListenerTests)  Time elapsed: 0.885 s
testGlobalListener(org.eclipse.jdt.debug.tests.breakpoints.JavaBreakpointListenerTests)  Time elapsed: 0.984 s
testDontCareSuspendVote(org.eclipse.jdt.debug.tests.breakpoints.JavaBreakpointListenerTests)  Time elapsed: 0.891 s
testListenersOnRuntimeError(org.eclipse.jdt.debug.tests.breakpoints.JavaBreakpointListenerTests)  Time elapsed: 0.904 s
testEvalListenerExtension(org.eclipse.jdt.debug.tests.breakpoints.JavaBreakpointListenerTests)  Time elapsed: 1.92 s
testUnanimousInstallVote(org.eclipse.jdt.debug.tests.breakpoints.JavaBreakpointListenerTests)  Time elapsed: 0.889 s
testAddDuplicateListeners(org.eclipse.jdt.debug.tests.breakpoints.JavaBreakpointListenerTests)  Time elapsed: 0.089 s
testSuspendDontCareVote(org.eclipse.jdt.debug.tests.breakpoints.JavaBreakpointListenerTests)  Time elapsed: 0.934 s
testListenersOnCompilationError(org.eclipse.jdt.debug.tests.breakpoints.JavaBreakpointListenerTests)  Time elapsed: 24.829 s  <<< ERROR!
org.eclipse.core.runtime.CoreException: Cannot connect to VM
	at org.eclipse.jdt.debug.tests.breakpoints.JavaBreakpointListenerTests.testListenersOnCompilationError(JavaBreakpointListenerTests.java:1086)
Caused by: com.sun.jdi.connect.TransportTimeoutException

testSuspendEvaluation(org.eclipse.jdt.debug.tests.breakpoints.JavaBreakpointListenerTests)  Time elapsed: 1.016 s
testStepEndResumeVote(org.eclipse.jdt.debug.tests.breakpoints.JavaBreakpointListenerTests)  Time elapsed: 1.399 s
testDontCareInstallVote(org.eclipse.jdt.debug.tests.breakpoints.JavaBreakpointListenerTests)  Time elapsed: 0.951 s
testGetListenersAfterDelete(org.eclipse.jdt.debug.tests.breakpoints.JavaBreakpointListenerTests)  Time elapsed: 0.09 s
testSuspendOnCompilationErrors(org.eclipse.jdt.debug.tests.breakpoints.MiscBreakpointsTests)  Time elapsed: 2.993 s
testDontSuspendOnUncaughtExceptions(org.eclipse.jdt.debug.tests.breakpoints.MiscBreakpointsTests)  Time elapsed: 0.477 s
testDontSuspendOnCompilationErrors(org.eclipse.jdt.debug.tests.breakpoints.MiscBreakpointsTests)  Time elapsed: 1.622 s
testSuspendOnUncaughtExceptions(org.eclipse.jdt.debug.tests.breakpoints.MiscBreakpointsTests)  Time elapsed: 0.849 s
testListenToThreadNameChange(org.eclipse.jdt.debug.tests.breakpoints.ThreadNameChangeTests)  Time elapsed: 4.655 s
testListenToThreadNameChangeDisabled(org.eclipse.jdt.debug.tests.breakpoints.ThreadNameChangeTests)  Time elapsed: 4.72 s
testMethodNotOnMethod(org.eclipse.jdt.debug.tests.breakpoints.BreakpointLocationVerificationTests)  Time elapsed: 0.04 s
testLineExpressionReplacedByConstant1(org.eclipse.jdt.debug.tests.breakpoints.BreakpointLocationVerificationTests)  Time elapsed: 0.024 s
testLineExpressionReplacedByConstant2(org.eclipse.jdt.debug.tests.breakpoints.BreakpointLocationVerificationTests)  Time elapsed: 0.023 s
testNestedEmptyLabels(org.eclipse.jdt.debug.tests.breakpoints.BreakpointLocationVerificationTests)  Time elapsed: 0.021 s
testEmptyLabel(org.eclipse.jdt.debug.tests.breakpoints.BreakpointLocationVerificationTests)  Time elapsed: 0.022 s
testMethodOnMethodSignatureNotAvailable(org.eclipse.jdt.debug.tests.breakpoints.BreakpointLocationVerificationTests)  Time elapsed: 0.025 s
testFinalFieldWithTypeDecl3a(org.eclipse.jdt.debug.tests.breakpoints.BreakpointLocationVerificationTests)  Time elapsed: 0.021 s
testFinalFieldWithTypeDecl4a(org.eclipse.jdt.debug.tests.breakpoints.BreakpointLocationVerificationTests)  Time elapsed: 0.021 s
testFinalFieldWithTypeDecl5a(org.eclipse.jdt.debug.tests.breakpoints.BreakpointLocationVerificationTests)  Time elapsed: 0.02 s
testLineInAnnonymousType(org.eclipse.jdt.debug.tests.breakpoints.BreakpointLocationVerificationTests)  Time elapsed: 0.024 s
testLineMethodSignature(org.eclipse.jdt.debug.tests.breakpoints.BreakpointLocationVerificationTests)  Time elapsed: 0.024 s
testLabelWithCode(org.eclipse.jdt.debug.tests.breakpoints.BreakpointLocationVerificationTests)  Time elapsed: 0.019 s
testFieldLocationOnFinalFielda(org.eclipse.jdt.debug.tests.breakpoints.BreakpointLocationVerificationTests)  Time elapsed: 0.02 s
testFieldLocationNotOnField(org.eclipse.jdt.debug.tests.breakpoints.BreakpointLocationVerificationTests)  Time elapsed: 0.023 s
testLineInInnerType(org.eclipse.jdt.debug.tests.breakpoints.BreakpointLocationVerificationTests)  Time elapsed: 0.024 s
testLineAfterAllCode(org.eclipse.jdt.debug.tests.breakpoints.BreakpointLocationVerificationTests)  Time elapsed: 0.022 s
testLineLitteral1(org.eclipse.jdt.debug.tests.breakpoints.BreakpointLocationVerificationTests)  Time elapsed: 0.025 s
testLineLitteral2(org.eclipse.jdt.debug.tests.breakpoints.BreakpointLocationVerificationTests)  Time elapsed: 0.024 s
testInnerStaticClass(org.eclipse.jdt.debug.tests.breakpoints.BreakpointLocationVerificationTests)  Time elapsed: 0.026 s
testFinalFieldWithTypeDecl(org.eclipse.jdt.debug.tests.breakpoints.BreakpointLocationVerificationTests)  Time elapsed: 0.02 s
testLineBeforeTypeDeclaration(org.eclipse.jdt.debug.tests.breakpoints.BreakpointLocationVerificationTests)  Time elapsed: 0.02 s
testFinalFieldWithTypeDecl3(org.eclipse.jdt.debug.tests.breakpoints.BreakpointLocationVerificationTests)  Time elapsed: 0.021 s
testFinalFieldWithTypeDecl4(org.eclipse.jdt.debug.tests.breakpoints.BreakpointLocationVerificationTests)  Time elapsed: 0.018 s
testFinalFieldWithTypeDecl5(org.eclipse.jdt.debug.tests.breakpoints.BreakpointLocationVerificationTests)  Time elapsed: 0.022 s
testFinalFieldWithTypeDecla(org.eclipse.jdt.debug.tests.breakpoints.BreakpointLocationVerificationTests)  Time elapsed: 0.021 s
testFieldLocationOnFinalField(org.eclipse.jdt.debug.tests.breakpoints.BreakpointLocationVerificationTests)  Time elapsed: 0.02 s
testLineExpressionNotReplacedByConstant1(org.eclipse.jdt.debug.tests.breakpoints.BreakpointLocationVerificationTests)  Time elapsed: 0.021 s
testLineExpressionNotReplacedByConstant2(org.eclipse.jdt.debug.tests.breakpoints.BreakpointLocationVerificationTests)  Time elapsed: 0.023 s
testLineVariableDeclarationWithAssigment(org.eclipse.jdt.debug.tests.breakpoints.BreakpointLocationVerificationTests)  Time elapsed: 0.021 s
testMethodOnSignature(org.eclipse.jdt.debug.tests.breakpoints.BreakpointLocationVerificationTests)  Time elapsed: 0.022 s
testFieldLocationOnField(org.eclipse.jdt.debug.tests.breakpoints.BreakpointLocationVerificationTests)  Time elapsed: 0.023 s
testLineFieldDeclarationWithAssigment(org.eclipse.jdt.debug.tests.breakpoints.BreakpointLocationVerificationTests)  Time elapsed: 0.026 s
testMethodOnCode(org.eclipse.jdt.debug.tests.breakpoints.BreakpointLocationVerificationTests)  Time elapsed: 0.025 s
testRunToLineHitBreakpoint(org.eclipse.jdt.debug.tests.breakpoints.RunToLineTests)  Time elapsed: 1.74 s
testRunToLineSkipBreakpoint(org.eclipse.jdt.debug.tests.breakpoints.RunToLineTests)  Time elapsed: 1.673 s
testRunToLine(org.eclipse.jdt.debug.tests.breakpoints.RunToLineTests)  Time elapsed: 1.677 s
testExternalWatchpoint(org.eclipse.jdt.debug.tests.breakpoints.TestToggleBreakpointsTarget)  Time elapsed: 0.667 s
testExternalMethodBreakpoint(org.eclipse.jdt.debug.tests.breakpoints.TestToggleBreakpointsTarget)  Time elapsed: 0.206 s
testExternalLineBreakpoint(org.eclipse.jdt.debug.tests.breakpoints.TestToggleBreakpointsTarget)  Time elapsed: 0.182 s
testTriggerPointBreakpoint(org.eclipse.jdt.debug.tests.breakpoints.TriggerPointBreakpointsTests)  Time elapsed: 0.908 s
testComputeFrameIndexOnSecondFrameAndMonitorsOn(org.eclipse.jdt.debug.tests.breakpoints.JavaThreadEventHandlerTests)  Time elapsed: 1.354 s
testComputeFrameIndexDuringEvaluation(org.eclipse.jdt.debug.tests.breakpoints.JavaThreadEventHandlerTests)  Time elapsed: 2.389 s
testComputeFrameIndexOnSecondFrameAndMonitorsOff(org.eclipse.jdt.debug.tests.breakpoints.JavaThreadEventHandlerTests)  Time elapsed: 0.877 s
testInterfaceUnimplementedMethodBreakpoint(org.eclipse.jdt.debug.tests.breakpoints.TestToggleBreakpointsTarget8)  Time elapsed: 30.251 s
testInterfaceStaticMethodBreakpoint(org.eclipse.jdt.debug.tests.breakpoints.TestToggleBreakpointsTarget8)  Time elapsed: 0.12 s
testInterfaceLineBreakpoint(org.eclipse.jdt.debug.tests.breakpoints.TestToggleBreakpointsTarget8)  Time elapsed: 0.161 s
testInterfaceDefaultMethodBreakpoint(org.eclipse.jdt.debug.tests.breakpoints.TestToggleBreakpointsTarget8)  Time elapsed: 0.157 s
testClosureVariableText(org.eclipse.jdt.debug.tests.ui.presentation.ModelPresentationTests18)  Time elapsed: 1.069 s
testBug404097BreakpointInLambda(org.eclipse.jdt.debug.tests.breakpoints.ConditionalBreakpointsInJava8Tests)  Time elapsed: 1.524 s
testBug404097BreakpointUsingInnerClass(org.eclipse.jdt.debug.tests.breakpoints.ConditionalBreakpointsInJava8Tests)  Time elapsed: 2.057 s
testBug404097BreakpointInLocalClass(org.eclipse.jdt.debug.tests.breakpoints.ConditionalBreakpointsInJava8Tests)  Time elapsed: 1.582 s
testBug541110(org.eclipse.jdt.debug.tests.breakpoints.ConditionalBreakpointsInJava8Tests)  Time elapsed: 1.543 s
testBug404097BreakpointInAnonymousLocalClass(org.eclipse.jdt.debug.tests.breakpoints.ConditionalBreakpointsInJava8Tests)  Time elapsed: 1.596 s
testBug541110_conditional(org.eclipse.jdt.debug.tests.breakpoints.LambdaBreakpointsInJava8Tests)  Time elapsed: 1.554 s
testBug541110_unconditional(org.eclipse.jdt.debug.tests.breakpoints.LambdaBreakpointsInJava8Tests)  Time elapsed: 1.904 s
testTypeParameter(org.eclipse.jdt.debug.tests.breakpoints.MethodBreakpointTests15)  Time elapsed: 1.331 s
testGenericArrayEntryBreakpoints(org.eclipse.jdt.debug.tests.breakpoints.MethodBreakpointTests15)  Time elapsed: 1.388 s
testStaticTypeParameter(org.eclipse.jdt.debug.tests.breakpoints.MethodBreakpointTests15)  Time elapsed: 0.898 s
testMethodTypeParameter(org.eclipse.jdt.debug.tests.breakpoints.MethodBreakpointTests15)  Time elapsed: 0.886 s
testRowColumnAccess(org.eclipse.jdt.debug.tests.variables.TestIntegerAccessUnboxing15)  Time elapsed: 0.966 s
testColumnAccess(org.eclipse.jdt.debug.tests.variables.TestIntegerAccessUnboxing15)  Time elapsed: 0.894 s
testRowAccess(org.eclipse.jdt.debug.tests.variables.TestIntegerAccessUnboxing15)  Time elapsed: 0.995 s
testStepIntoSelection1(org.eclipse.jdt.debug.test.stepping.StepIntoSelectionWithGenerics)  Time elapsed: 1.328 s
testStepIntoSelection2(org.eclipse.jdt.debug.test.stepping.StepIntoSelectionWithGenerics)  Time elapsed: 1.47 s
testStepIntoSelection3(org.eclipse.jdt.debug.test.stepping.StepIntoSelectionWithGenerics)  Time elapsed: 1.387 s
testDuplicateGenericTypes(org.eclipse.jdt.debug.tests.breakpoints.ConditionalBreakpointsWithGenerics)  Time elapsed: 0.974 s
testBreakpointWithGenericCondition2(org.eclipse.jdt.debug.tests.breakpoints.ConditionalBreakpointsWithGenerics)  Time elapsed: 1.137 s
testBreakpointWithGenericCondition3(org.eclipse.jdt.debug.tests.breakpoints.ConditionalBreakpointsWithGenerics)  Time elapsed: 0.905 s
testBreakpointWithGenericCondition4(org.eclipse.jdt.debug.tests.breakpoints.ConditionalBreakpointsWithGenerics)  Time elapsed: 0.898 s
testMultipleGenericTypes1(org.eclipse.jdt.debug.tests.breakpoints.ConditionalBreakpointsWithGenerics)  Time elapsed: 1.033 s
testMultipleGenericTypes2(org.eclipse.jdt.debug.tests.breakpoints.ConditionalBreakpointsWithGenerics)  Time elapsed: 1.044 s
testBreakpointWithGenericsCondition1(org.eclipse.jdt.debug.tests.breakpoints.ConditionalBreakpointsWithGenerics)  Time elapsed: 0.979 s
testNestedTypes1(org.eclipse.jdt.debug.tests.breakpoints.ConditionalBreakpointsWithGenerics)  Time elapsed: 1.022 s
testNestedTypes2(org.eclipse.jdt.debug.tests.breakpoints.ConditionalBreakpointsWithGenerics)  Time elapsed: 0.975 s
testNestedTypes3(org.eclipse.jdt.debug.tests.breakpoints.ConditionalBreakpointsWithGenerics)  Time elapsed: 0.888 s
testEvalGeneric10(org.eclipse.jdt.debug.tests.eval.GenericsEvalTests)  Time elapsed: 0.985 s
testEvalGeneric11(org.eclipse.jdt.debug.tests.eval.GenericsEvalTests)  Time elapsed: 1.31 s
testEvalGeneric12(org.eclipse.jdt.debug.tests.eval.GenericsEvalTests)  Time elapsed: 1.007 s
testEvalGeneric13(org.eclipse.jdt.debug.tests.eval.GenericsEvalTests)  Time elapsed: 1.012 s
testEvalGenerics1(org.eclipse.jdt.debug.tests.eval.GenericsEvalTests)  Time elapsed: 0.983 s
testEvalGenerics2(org.eclipse.jdt.debug.tests.eval.GenericsEvalTests)  Time elapsed: 1.081 s
testEvalGenerics3(org.eclipse.jdt.debug.tests.eval.GenericsEvalTests)  Time elapsed: 0.958 s
testEvalGenerics4(org.eclipse.jdt.debug.tests.eval.GenericsEvalTests)  Time elapsed: 0.983 s
testEvalGenerics5(org.eclipse.jdt.debug.tests.eval.GenericsEvalTests)  Time elapsed: 1.015 s
testEvalGenerics6(org.eclipse.jdt.debug.tests.eval.GenericsEvalTests)  Time elapsed: 1.013 s
testEvalGenerics7(org.eclipse.jdt.debug.tests.eval.GenericsEvalTests)  Time elapsed: 0.994 s
testEvalGenerics8(org.eclipse.jdt.debug.tests.eval.GenericsEvalTests)  Time elapsed: 0.995 s
testEvalGenerics9(org.eclipse.jdt.debug.tests.eval.GenericsEvalTests)  Time elapsed: 1.657 s
testLineCommentEvalGenerics1(org.eclipse.jdt.debug.tests.eval.GenericsEvalTests)  Time elapsed: 0.987 s
testLineCommentEvalGenerics2(org.eclipse.jdt.debug.tests.eval.GenericsEvalTests)  Time elapsed: 0.997 s
testLineCommentEvalGenerics3(org.eclipse.jdt.debug.tests.eval.GenericsEvalTests)  Time elapsed: 1.032 s
testLineCommentEvalGenerics4(org.eclipse.jdt.debug.tests.eval.GenericsEvalTests)  Time elapsed: 1.027 s
testInnerEnumType1(org.eclipse.jdt.debug.tests.eval.GenericsEvalTests)  Time elapsed: 1.044 s
testInnerEnumType2(org.eclipse.jdt.debug.tests.eval.GenericsEvalTests)  Time elapsed: 0.891 s
testInnerEnumType3(org.eclipse.jdt.debug.tests.eval.GenericsEvalTests)  Time elapsed: 1.058 s
testInnerEnumType4(org.eclipse.jdt.debug.tests.eval.GenericsEvalTests)  Time elapsed: 1.06 s
testInnerEnumType5(org.eclipse.jdt.debug.tests.eval.GenericsEvalTests)  Time elapsed: 1.004 s
testInfixDetails1(org.eclipse.jdt.debug.tests.variables.DetailFormatterTests)  Time elapsed: 1.012 s
testInfixDetails2(org.eclipse.jdt.debug.tests.variables.DetailFormatterTests)  Time elapsed: 0.966 s
testInfixDetails3(org.eclipse.jdt.debug.tests.variables.DetailFormatterTests)  Time elapsed: 1.044 s
testCompoundDetails1(org.eclipse.jdt.debug.tests.variables.DetailFormatterTests)  Time elapsed: 1.003 s
testCompoundDetails2(org.eclipse.jdt.debug.tests.variables.DetailFormatterTests)  Time elapsed: 0.955 s
testHoverWithNoTypeArguments(org.eclipse.jdt.debug.tests.variables.DetailFormatterTests)  Time elapsed: 1.2 s
testSimpleDetails1(org.eclipse.jdt.debug.tests.variables.DetailFormatterTests)  Time elapsed: 0.964 s
testSimpleDetails2(org.eclipse.jdt.debug.tests.variables.DetailFormatterTests)  Time elapsed: 1.006 s
testDefaultStratum(org.eclipse.jdt.debug.tests.core.AlternateStratumTests)  Time elapsed: 1.955 s
testResolveJavaElement(org.eclipse.jdt.debug.tests.core.AlternateStratumTests)  Time elapsed: 1.946 s
testAvailableStrata(org.eclipse.jdt.debug.tests.core.AlternateStratumTests)  Time elapsed: 1.901 s
testResolveJavaProject(org.eclipse.jdt.debug.tests.core.AlternateStratumTests)  Time elapsed: 10.21 s
testResolveType(org.eclipse.jdt.debug.tests.core.AlternateStratumTests)  Time elapsed: 2.018 s
testGetSourceNameInStratum2(org.eclipse.jdt.debug.tests.core.AlternateStratumTests)  Time elapsed: 1.888 s
testConditionBreakpointReturnBooleanObjectTrue(org.eclipse.jdt.debug.tests.breakpoints.ConditionalBreakpointsTests)  Time elapsed: 0.985 s
testSimpleConditionalBreakpoint(org.eclipse.jdt.debug.tests.breakpoints.ConditionalBreakpointsTests)  Time elapsed: 1.221 s
testSystracelBreakpoint(org.eclipse.jdt.debug.tests.breakpoints.ConditionalBreakpointsTests)  Time elapsed: 0.925 s
testConditionalStepReturn(org.eclipse.jdt.debug.tests.breakpoints.ConditionalBreakpointsTests)  Time elapsed: 1.44 s
testSuspendLongRunningCondition(org.eclipse.jdt.debug.tests.breakpoints.ConditionalBreakpointsTests)  Time elapsed: 1.775 s
testEvalConditionOnStep(org.eclipse.jdt.debug.tests.breakpoints.ConditionalBreakpointsTests)  Time elapsed: 1.436 s
testSimpleConditionalBreakpointSuspendOnChange(org.eclipse.jdt.debug.tests.breakpoints.ConditionalBreakpointsTests)  Time elapsed: 1.845 s
testConditionalMultiInfix1(org.eclipse.jdt.debug.tests.breakpoints.ConditionalBreakpointsTests)  Time elapsed: 0.894 s
testConditionalMultiInfix2(org.eclipse.jdt.debug.tests.breakpoints.ConditionalBreakpointsTests)  Time elapsed: 1.004 s
testConditionalMultiInfix3(org.eclipse.jdt.debug.tests.breakpoints.ConditionalBreakpointsTests)  Time elapsed: 0.927 s
testConditionalMultiInfix4(org.eclipse.jdt.debug.tests.breakpoints.ConditionalBreakpointsTests)  Time elapsed: 0.892 s
testConditionalMultiInfix5(org.eclipse.jdt.debug.tests.breakpoints.ConditionalBreakpointsTests)  Time elapsed: 0.867 s
testConditionalMultiInfix6(org.eclipse.jdt.debug.tests.breakpoints.ConditionalBreakpointsTests)  Time elapsed: 0.902 s
testConditionalMultiInfix7(org.eclipse.jdt.debug.tests.breakpoints.ConditionalBreakpointsTests)  Time elapsed: 0.955 s
testConditionalMultiInfix8(org.eclipse.jdt.debug.tests.breakpoints.ConditionalBreakpointsTests)  Time elapsed: 0.985 s
testConditionalMultiInfix9(org.eclipse.jdt.debug.tests.breakpoints.ConditionalBreakpointsTests)  Time elapsed: 9.038 s
testConditionBreakpointReturnBooleanObjectFalse(org.eclipse.jdt.debug.tests.breakpoints.ConditionalBreakpointsTests)  Time elapsed: 1.217 s
testConditionalMultiInfix10(org.eclipse.jdt.debug.tests.breakpoints.ConditionalBreakpointsTests)  Time elapsed: 3.565 s
testConditionalMultiInfix11(org.eclipse.jdt.debug.tests.breakpoints.ConditionalBreakpointsTests)  Time elapsed: 1.024 s
testConditionalMultiInfix12(org.eclipse.jdt.debug.tests.breakpoints.ConditionalBreakpointsTests)  Time elapsed: 0.887 s
testConditionalMultiInfix13(org.eclipse.jdt.debug.tests.breakpoints.ConditionalBreakpointsTests)  Time elapsed: 1.17 s
testStaticMethodCallConditionalBreakpoint(org.eclipse.jdt.debug.tests.breakpoints.ConditionalBreakpointsTests)  Time elapsed: 1.479 s
testConditionBreakpointReturnNonBooleanObject(org.eclipse.jdt.debug.tests.breakpoints.ConditionalBreakpointsTests)  Time elapsed: 1.031 s
testConditionalExpressionIgnoresBreakpoint(org.eclipse.jdt.debug.tests.breakpoints.ConditionalBreakpointsTests)  Time elapsed: 0.915 s

Results:

Errors: 
  JavaBreakpointListenerTests>AbstractDebugTest.runBare:2612->testListenersOnCompilationError:1086->AbstractDebugTest.launchToLineBreakpoint:1349->AbstractDebugTest.launchToLineBreakpoint:1365->AbstractDebugTest.launchToLineBreakpoint:1382->AbstractDebugTest.launchAndWait:1104->AbstractDebugTest.launchAndWait:1120 » Core

Tests run: 956, Failures: 0, Errors: 1, Skipped: 0

[INFO] ------------------------------------------------------------------------
[INFO] Reactor Summary:
[INFO] 
[INFO] eclipse.jdt.debug 4.13.0-SNAPSHOT .................. SUCCESS [ 55.607 s]
[INFO] org.eclipse.jdt.debug 3.13.100-SNAPSHOT ............ SUCCESS [ 28.127 s]
[INFO] org.eclipse.jdt.launching 3.14.100-SNAPSHOT ........ SUCCESS [ 11.110 s]
[INFO] org.eclipse.jdt.launching.macosx 3.4.300-SNAPSHOT .. SUCCESS [  5.737 s]
[INFO] org.eclipse.jdt.launching.ui.macosx 1.2.300-SNAPSHOT SUCCESS [  6.495 s]
[INFO] org.eclipse.jdt.debug.ui 3.10.300-SNAPSHOT ......... SUCCESS [ 11.039 s]
[INFO] org.eclipse.jdt.debug.tests 3.11.500-SNAPSHOT ...... FAILURE [17:46 min]
[INFO] ------------------------------------------------------------------------
[INFO] BUILD FAILURE
[INFO] ------------------------------------------------------------------------
[INFO] Total time:  21:38 min
[INFO] Finished at: 2019-07-03T03:25:32-04:00
[INFO] ------------------------------------------------------------------------
[ERROR] Failed to execute goal org.eclipse.tycho:tycho-surefire-plugin:1.5.0-SNAPSHOT:test (default-test) on project org.eclipse.jdt.debug.tests: There are test failures.
[ERROR] 
[ERROR] Please refer to /jobs/genie.jdt/eclipse.jdt.debug-SonarQube/workspace/org.eclipse.jdt.debug.tests/target/surefire-reports for the individual test results.
[ERROR] -> [Help 1]
[ERROR] 
[ERROR] To see the full stack trace of the errors, re-run Maven with the -e switch.
[ERROR] Re-run Maven using the -X switch to enable full debug logging.
[ERROR] 
[ERROR] For more information about the errors and possible solutions, please read the following articles:
[ERROR] [Help 1] http://cwiki.apache.org/confluence/display/MAVEN/MojoFailureException
[ERROR] 
[ERROR] After correcting the problems, you can resume the build with the command
[ERROR]   mvn <goals> -rf :org.eclipse.jdt.debug.tests
Build step 'Invoke top-level Maven targets' marked build as failure
Terminating xvnc.
Skipping sonar analysis due to bad build status FAILURE
Recording test results
Archiving artifacts
Started calculate disk usage of build
Finished Calculation of disk usage of build in 0 seconds
Started calculate disk usage of workspace
Finished Calculation of disk usage of workspace in 0 seconds
Finished: FAILURE