FailedConsole Output

Skipping 8,198 KB.. Full Log
a\X.java (at line 11)\n
11:09:12 	* {@link X.Y#foo(no_test.a.X.Y.Z[])} KO for javadoc tool\n
11:09:12 	                 ^^^^^^^^^^^^^^^\n
11:09:12 Javadoc: no_test[] cannot be resolved to a type\n
11:09:12 ----------\n
11:09:12 3. ERROR in test\a\X.java (at line 12)\n
11:09:12 	* {@link X.Y#foo(Y.Z[])} KO for javadoc tool\n
11:09:12 	                 ^^^\n
11:09:12 Javadoc: Invalid member type qualification\n
11:09:12 ----------\n
11:09:12 4. ERROR in test\a\X.java (at line 13)\n
11:09:12 	* {@link test.a.X.Y#foo(Y.Z[])} KO for javadoc tool\n
11:09:12 	                        ^^^\n
11:09:12 Javadoc: Invalid member type qualification\n
11:09:12 ----------\n
11:09:12 
11:09:12 --------- Difference is ----------
11:09:12  expected:<[]> but was:<[----------\n
11:09:12 1. ERROR in test\a\X.java (at line 10)\n
11:09:12 	* {@link X.Y#foo(test.a.X.Y.Z)} KO for javadoc tool\n
11:09:12 	             ^^^\n
11:09:12 Javadoc: The method foo(X.Y.Z[]) in the type X.Y is not applicable for the arguments (X.Y.Z)\n
11:09:12 ----------\n
11:09:12 2. ERROR in test\a\X.java (at line 11)\n
11:09:12 	* {@link X.Y#foo(no_test.a.X.Y.Z[])} KO for javadoc tool\n
11:09:12 	                 ^^^^^^^^^^^^^^^\n
11:09:12 Javadoc: no_test[] cannot be resolved to a type\n
11:09:12 ----------\n
11:09:12 3. ERROR in test\a\X.java (at line 12)\n
11:09:12 	* {@link X.Y#foo(Y.Z[])} KO for javadoc tool\n
11:09:12 	                 ^^^\n
11:09:12 Javadoc: Invalid member type qualification\n
11:09:12 ----------\n
11:09:12 4. ERROR in test\a\X.java (at line 13)\n
11:09:12 	* {@link test.a.X.Y#foo(Y.Z[])} KO for javadoc tool\n
11:09:12 	                        ^^^\n
11:09:12 Javadoc: Invalid member type qualification\n
11:09:12 ----------\n
11:09:12 ]>
11:09:12   JavadocBugsTest>TestCase.runTest:964->testBug233187b:7882->AbstractRegressionTest.runNegativeTest:2474->AbstractRegressionTest.runNegativeTest:2485->AbstractRegressionTest.runTest:2920->AbstractRegressionTest.runTest:3195->AbstractRegressionTest.runJavac:2350->AbstractRegressionTest.handleMismatch:2403->TestCase.assertEquals:242->TestCase.assertStringEquals:266 testBug233187b - Eclipse found error(s) but Javac did not find any.
11:09:12 ----------- Expected ------------
11:09:12 
11:09:12 ------------ but was ------------
11:09:12 ----------\n
11:09:12 1. ERROR in test\b\X.java (at line 10)\n
11:09:12 	* {@link X.Y#foo(test.b.X.Y.Z[])} KO for javadoc tool\n
11:09:12 	             ^^^\n
11:09:12 Javadoc: The method foo(X.Y.Z) in the type X.Y is not applicable for the arguments (X.Y.Z[])\n
11:09:12 ----------\n
11:09:12 2. ERROR in test\b\X.java (at line 11)\n
11:09:12 	* {@link X.Y#foo(no_test.b.X.Y.Z)} KO for javadoc tool\n
11:09:12 	                 ^^^^^^^^^^^^^^^\n
11:09:12 Javadoc: no_test cannot be resolved to a type\n
11:09:12 ----------\n
11:09:12 3. ERROR in test\b\X.java (at line 12)\n
11:09:12 	* {@link X.Y#foo(Y.Z)} KO for javadoc tool\n
11:09:12 	                 ^^^\n
11:09:12 Javadoc: Invalid member type qualification\n
11:09:12 ----------\n
11:09:12 4. ERROR in test\b\X.java (at line 13)\n
11:09:12 	* {@link test.b.X.Y#foo(Y.Z)} KO for javadoc tool\n
11:09:12 	                        ^^^\n
11:09:12 Javadoc: Invalid member type qualification\n
11:09:12 ----------\n
11:09:12 
11:09:12 --------- Difference is ----------
11:09:12  expected:<[]> but was:<[----------\n
11:09:12 1. ERROR in test\b\X.java (at line 10)\n
11:09:12 	* {@link X.Y#foo(test.b.X.Y.Z[])} KO for javadoc tool\n
11:09:12 	             ^^^\n
11:09:12 Javadoc: The method foo(X.Y.Z) in the type X.Y is not applicable for the arguments (X.Y.Z[])\n
11:09:12 ----------\n
11:09:12 2. ERROR in test\b\X.java (at line 11)\n
11:09:12 	* {@link X.Y#foo(no_test.b.X.Y.Z)} KO for javadoc tool\n
11:09:12 	                 ^^^^^^^^^^^^^^^\n
11:09:12 Javadoc: no_test cannot be resolved to a type\n
11:09:12 ----------\n
11:09:12 3. ERROR in test\b\X.java (at line 12)\n
11:09:12 	* {@link X.Y#foo(Y.Z)} KO for javadoc tool\n
11:09:12 	                 ^^^\n
11:09:12 Javadoc: Invalid member type qualification\n
11:09:12 ----------\n
11:09:12 4. ERROR in test\b\X.java (at line 13)\n
11:09:12 	* {@link test.b.X.Y#foo(Y.Z)} KO for javadoc tool\n
11:09:12 	                        ^^^\n
11:09:12 Javadoc: Invalid member type qualification\n
11:09:12 ----------\n
11:09:12 ]>
11:09:12   JavadocBugsTest>TestCase.runTest:964->testBug254825:8110->AbstractRegressionTest.runNegativeTest:2474->AbstractRegressionTest.runNegativeTest:2485->AbstractRegressionTest.runTest:2920->AbstractRegressionTest.runTest:3195->AbstractRegressionTest.runJavac:2350->AbstractRegressionTest.handleMismatch:2403->TestCase.assertEquals:242->TestCase.assertStringEquals:266 testBug254825 - Eclipse found error(s) but Javac did not find any.
11:09:12 ----------- Expected ------------
11:09:12 
11:09:12 ------------ but was ------------
11:09:12 ----------\n
11:09:12 1. ERROR in X.java (at line 4)\n
11:09:12 	/** @see #o */\n
11:09:12 	          ^\n
11:09:12 Javadoc: o cannot be resolved or is not a field\n
11:09:12 ----------\n
11:09:12 
11:09:12 --------- Difference is ----------
11:09:12  expected:<[]> but was:<[----------\n
11:09:12 1. ERROR in X.java (at line 4)\n
11:09:12 	/** @see #o */\n
11:09:12 	          ^\n
11:09:12 Javadoc: o cannot be resolved or is not a field\n
11:09:12 ----------\n
11:09:12 ]>
11:09:12   JavadocBugsTest>TestCase.runTest:964->testBug254825b:8131->AbstractRegressionTest.runNegativeTest:2474->AbstractRegressionTest.runNegativeTest:2485->AbstractRegressionTest.runTest:2920->AbstractRegressionTest.runTest:3195->AbstractRegressionTest.runJavac:2350->AbstractRegressionTest.handleMismatch:2403->TestCase.assertEquals:242->TestCase.assertStringEquals:266 testBug254825b - Eclipse found error(s) but Javac did not find any.
11:09:12 ----------- Expected ------------
11:09:12 
11:09:12 ------------ but was ------------
11:09:12 ----------\n
11:09:12 1. ERROR in X.java (at line 2)\n
11:09:12 	/** @see #o */\n
11:09:12 	          ^\n
11:09:12 Javadoc: o cannot be resolved or is not a field\n
11:09:12 ----------\n
11:09:12 
11:09:12 --------- Difference is ----------
11:09:12  expected:<[]> but was:<[----------\n
11:09:12 1. ERROR in X.java (at line 2)\n
11:09:12 	/** @see #o */\n
11:09:12 	          ^\n
11:09:12 Javadoc: o cannot be resolved or is not a field\n
11:09:12 ----------\n
11:09:12 ]>
11:09:12   JavadocBugsTest>TestCase.runTest:964->testBug258798_1:8165->AbstractRegressionTest.runNegativeTest:2474->AbstractRegressionTest.runNegativeTest:2485->AbstractRegressionTest.runTest:2920->AbstractRegressionTest.runTest:3195->AbstractRegressionTest.runJavac:2350->AbstractRegressionTest.handleMismatch:2419->TestCase.assertEquals:242->TestCase.assertStringEquals:266 testBug258798_1 - Eclipse found warning(s) but Javac did not find any.
11:09:12 ----------- Expected ------------
11:09:12 
11:09:12 ------------ but was ------------
11:09:12 ----------\n
11:09:12 1. WARNING in X.java (at line 5)\n
11:09:12 	X(int i) {\n
11:09:12 	      ^\n
11:09:12 Javadoc: Missing tag for parameter i\n
11:09:12 ----------\n
11:09:12 
11:09:12 --------- Difference is ----------
11:09:12  expected:<[]> but was:<[----------\n
11:09:12 1. WARNING in X.java (at line 5)\n
11:09:12 	X(int i) {\n
11:09:12 	      ^\n
11:09:12 Javadoc: Missing tag for parameter i\n
11:09:12 ----------\n
11:09:12 ]>
11:09:12   JavadocBugsTest>TestCase.runTest:964->testBug258798_2a:8186->AbstractRegressionTest.runNegativeTest:2474->AbstractRegressionTest.runNegativeTest:2485->AbstractRegressionTest.runTest:2920->AbstractRegressionTest.runTest:3195->AbstractRegressionTest.runJavac:2350->AbstractRegressionTest.handleMismatch:2419->TestCase.assertEquals:242->TestCase.assertStringEquals:266 testBug258798_2a - Eclipse found warning(s) but Javac did not find any.
11:09:12 ----------- Expected ------------
11:09:12 
11:09:12 ------------ but was ------------
11:09:12 ----------\n
11:09:12 1. WARNING in X.java (at line 6)\n
11:09:12 	Y(double d) { super(0); }\n
11:09:12 	         ^\n
11:09:12 Javadoc: Missing tag for parameter d\n
11:09:12 ----------\n
11:09:12 
11:09:12 --------- Difference is ----------
11:09:12  expected:<[]> but was:<[----------\n
11:09:12 1. WARNING in X.java (at line 6)\n
11:09:12 	Y(double d) { super(0); }\n
11:09:12 	         ^\n
11:09:12 Javadoc: Missing tag for parameter d\n
11:09:12 ----------\n
11:09:12 ]>
11:09:12   JavadocBugsTest>TestCase.runTest:964->testBug258798_2b:8208->AbstractRegressionTest.runNegativeTest:2474->AbstractRegressionTest.runNegativeTest:2485->AbstractRegressionTest.runTest:2920->AbstractRegressionTest.runTest:3195->AbstractRegressionTest.runJavac:2350->AbstractRegressionTest.handleMismatch:2419->TestCase.assertEquals:242->TestCase.assertStringEquals:266 testBug258798_2b - Eclipse found warning(s) but Javac did not find any.
11:09:12 ----------- Expected ------------
11:09:12 
11:09:12 ------------ but was ------------
11:09:12 ----------\n
11:09:12 1. WARNING in X.java (at line 7)\n
11:09:12 	Y(List<U> lu) { super(null); }\n
11:09:12 	          ^^\n
11:09:12 Javadoc: Missing tag for parameter lu\n
11:09:12 ----------\n
11:09:12 
11:09:12 --------- Difference is ----------
11:09:12  expected:<[]> but was:<[----------\n
11:09:12 1. WARNING in X.java (at line 7)\n
11:09:12 	Y(List<U> lu) { super(null); }\n
11:09:12 	          ^^\n
11:09:12 Javadoc: Missing tag for parameter lu\n
11:09:12 ----------\n
11:09:12 ]>
11:09:12   JavadocBugsTest>TestCase.runTest:964->testBug258798_2c:8232->AbstractRegressionTest.runNegativeTest:2474->AbstractRegressionTest.runNegativeTest:2485->AbstractRegressionTest.runTest:2920->AbstractRegressionTest.runTest:3195->AbstractRegressionTest.runJavac:2350->AbstractRegressionTest.handleMismatch:2419->TestCase.assertEquals:242->TestCase.assertStringEquals:266 testBug258798_2c - Eclipse found warning(s) but Javac did not find any.
11:09:12 ----------- Expected ------------
11:09:12 
11:09:12 ------------ but was ------------
11:09:12 ----------\n
11:09:12 1. WARNING in X.java (at line 7)\n
11:09:12 	Y(List<U> lu) { super(lu); }\n
11:09:12 	          ^^\n
11:09:12 Javadoc: Missing tag for parameter lu\n
11:09:12 ----------\n
11:09:12 
11:09:12 --------- Difference is ----------
11:09:12  expected:<[]> but was:<[----------\n
11:09:12 1. WARNING in X.java (at line 7)\n
11:09:12 	Y(List<U> lu) { super(lu); }\n
11:09:12 	          ^^\n
11:09:12 Javadoc: Missing tag for parameter lu\n
11:09:12 ----------\n
11:09:12 ]>
11:09:12   JavadocBugsTest>TestCase.runTest:964->testBug267833_3:8498->AbstractRegressionTest.runNegativeTest:2474->AbstractRegressionTest.runNegativeTest:2485->AbstractRegressionTest.runTest:2920->AbstractRegressionTest.runTest:3195->AbstractRegressionTest.runJavac:2350->AbstractRegressionTest.handleMismatch:2403->TestCase.assertEquals:242->TestCase.assertStringEquals:266 testBug267833_3 - Eclipse found error(s) but Javac did not find any.
11:09:12 ----------- Expected ------------
11:09:12 
11:09:12 ------------ but was ------------
11:09:12 ----------\n
11:09:12 1. ERROR in X.java (at line 3)\n
11:09:12 	* Description {@see String} , {@return int}, {@since 1.0}, {@param i}, {@throws NullPointerException}\n
11:09:12 	                ^^^\n
11:09:12 Javadoc: Unexpected tag\n
11:09:12 ----------\n
11:09:12 2. ERROR in X.java (at line 3)\n
11:09:12 	* Description {@see String} , {@return int}, {@since 1.0}, {@param i}, {@throws NullPointerException}\n
11:09:12 	                                ^^^^^^\n
11:09:12 Javadoc: Unexpected tag\n
11:09:12 ----------\n
11:09:12 3. ERROR in X.java (at line 3)\n
11:09:12 	* Description {@see String} , {@return int}, {@since 1.0}, {@param i}, {@throws NullPointerException}\n
11:09:12 	                                               ^^^^^\n
11:09:12 Javadoc: Unexpected tag\n
11:09:12 ----------\n
11:09:12 4. ERROR in X.java (at line 3)\n
11:09:12 	* Description {@see String} , {@return int}, {@since 1.0}, {@param i}, {@throws NullPointerException}\n
11:09:12 	                                                             ^^^^^\n
11:09:12 Javadoc: Unexpected tag\n
11:09:12 ----------\n
11:09:12 5. ERROR in X.java (at line 3)\n
11:09:12 	* Description {@see String} , {@return int}, {@since 1.0}, {@param i}, {@throws NullPointerException}\n
11:09:12 	                                                                         ^^^^^^\n
11:09:12 Javadoc: Unexpected tag\n
11:09:12 ----------\n
11:09:12 6. ERROR in X.java (at line 4)\n
11:09:12 	* and more {@author jay}, {@category cat}, {@deprecated}, {@exception NullPointerException}, {@version 1.1}\n
11:09:12 	             ^^^^^^\n
11:09:12 Javadoc: Unexpected tag\n
11:09:12 ----------\n
11:09:12 7. ERROR in X.java (at line 4)\n
11:09:12 	* and more {@author jay}, {@category cat}, {@deprecated}, {@exception NullPointerException}, {@version 1.1}\n
11:09:12 	                            ^^^^^^^^\n
11:09:12 Javadoc: Unexpected tag\n
11:09:12 ----------\n
11:09:12 8. ERROR in X.java (at line 4)\n
11:09:12 	* and more {@author jay}, {@category cat}, {@deprecated}, {@exception NullPointerException}, {@version 1.1}\n
11:09:12 	                                             ^^^^^^^^^^\n
11:09:12 Javadoc: Unexpected tag\n
11:09:12 ----------\n
11:09:12 9. ERROR in X.java (at line 4)\n
11:09:12 	* and more {@author jay}, {@category cat}, {@deprecated}, {@exception NullPointerException}, {@version 1.1}\n
11:09:12 	                                                            ^^^^^^^^^\n
11:09:12 Javadoc: Unexpected tag\n
11:09:12 ----------\n
11:09:12 10. ERROR in X.java (at line 4)\n
11:09:12 	* and more {@author jay}, {@category cat}, {@deprecated}, {@exception NullPointerException}, {@version 1.1}\n
11:09:12 	                                                                                               ^^^^^^^\n
11:09:12 Javadoc: Unexpected tag\n
11:09:12 ----------\n
11:09:12 11. ERROR in X.java (at line 5)\n
11:09:12 	* and more {@since 1.0}, {@serial 0L}, {@serialData data}, {@serialField field}\n
11:09:12 	             ^^^^^\n
11:09:12 Javadoc: Unexpected tag\n
11:09:12 ----------\n
11:09:12 12. ERROR in X.java (at line 5)\n
11:09:12 	* and more {@since 1.0}, {@serial 0L}, {@serialData data}, {@serialField field}\n
11:09:12 	                           ^^^^^^\n
11:09:12 Javadoc: Unexpected tag\n
11:09:12 ----------\n
11:09:12 13. ERROR in X.java (at line 5)\n
11:09:12 	* and more {@since 1.0}, {@serial 0L}, {@serialData data}, {@serialField field}\n
11:09:12 	                                         ^^^^^^^^^^\n
11:09:12 Javadoc: Unexpected tag\n
11:09:12 ----------\n
11:09:12 14. ERROR in X.java (at line 5)\n
11:09:12 	* and more {@since 1.0}, {@serial 0L}, {@serialData data}, {@serialField field}\n
11:09:12 	                                                             ^^^^^^^^^^^\n
11:09:12 Javadoc: Unexpected tag\n
11:09:12 ----------\n
11:09:12 
11:09:12 --------- Difference is ----------
11:09:12  expected:<[]> but was:<[----------\n
11:09:12 1. ERROR in X.java (at line 3)\n
11:09:12 	* Description {@see String} , {@return int}, {@since 1.0}, {@param i}, {@throws NullPointerException}\n
11:09:12 	                ^^^\n
11:09:12 Javadoc: Unexpected tag\n
11:09:12 ----------\n
11:09:12 2. ERROR in X.java (at line 3)\n
11:09:12 	* Description {@see String} , {@return int}, {@since 1.0}, {@param i}, {@throws NullPointerException}\n
11:09:12 	                                ^^^^^^\n
11:09:12 Javadoc: Unexpected tag\n
11:09:12 ----------\n
11:09:12 3. ERROR in X.java (at line 3)\n
11:09:12 	* Description {@see String} , {@return int}, {@since 1.0}, {@param i}, {@throws NullPointerException}\n
11:09:12 	                                               ^^^^^\n
11:09:12 Javadoc: Unexpected tag\n
11:09:12 ----------\n
11:09:12 4. ERROR in X.java (at line 3)\n
11:09:12 	* Description {@see String} , {@return int}, {@since 1.0}, {@param i}, {@throws NullPointerException}\n
11:09:12 	                                                             ^^^^^\n
11:09:12 Javadoc: Unexpected tag\n
11:09:12 ----------\n
11:09:12 5. ERROR in X.java (at line 3)\n
11:09:12 	* Description {@see String} , {@return int}, {@since 1.0}, {@param i}, {@throws NullPointerException}\n
11:09:12 	                                                                         ^^^^^^\n
11:09:12 Javadoc: Unexpected tag\n
11:09:12 ----------\n
11:09:12 6. ERROR in X.java (at line 4)\n
11:09:12 	* and more {@author jay}, {@category cat}, {@deprecated}, {@exception NullPointerException}, {@version 1.1}\n
11:09:12 	             ^^^^^^\n
11:09:12 Javadoc: Unexpected tag\n
11:09:12 ----------\n
11:09:12 7. ERROR in X.java (at line 4)\n
11:09:12 	* and more {@author jay}, {@category cat}, {@deprecated}, {@exception NullPointerException}, {@version 1.1}\n
11:09:12 	                            ^^^^^^^^\n
11:09:12 Javadoc: Unexpected tag\n
11:09:12 ----------\n
11:09:12 8. ERROR in X.java (at line 4)\n
11:09:12 	* and more {@author jay}, {@category cat}, {@deprecated}, {@exception NullPointerException}, {@version 1.1}\n
11:09:12 	                                             ^^^^^^^^^^\n
11:09:12 Javadoc: Unexpected tag\n
11:09:12 ----------\n
11:09:12 9. ERROR in X.java (at line 4)\n
11:09:12 	* and more {@author jay}, {@category cat}, {@deprecated}, {@exception NullPointerException}, {@version 1.1}\n
11:09:12 	                                                            ^^^^^^^^^\n
11:09:12 Javadoc: Unexpected tag\n
11:09:12 ----------\n
11:09:12 10. ERROR in X.java (at line 4)\n
11:09:12 	* and more {@author jay}, {@category cat}, {@deprecated}, {@exception NullPointerException}, {@version 1.1}\n
11:09:12 	                                                                                               ^^^^^^^\n
11:09:12 Javadoc: Unexpected tag\n
11:09:12 ----------\n
11:09:12 11. ERROR in X.java (at line 5)\n
11:09:12 	* and more {@since 1.0}, {@serial 0L}, {@serialData data}, {@serialField field}\n
11:09:12 	             ^^^^^\n
11:09:12 Javadoc: Unexpected tag\n
11:09:12 ----------\n
11:09:12 12. ERROR in X.java (at line 5)\n
11:09:12 	* and more {@since 1.0}, {@serial 0L}, {@serialData data}, {@serialField field}\n
11:09:12 	                           ^^^^^^\n
11:09:12 Javadoc: Unexpected tag\n
11:09:12 ----------\n
11:09:12 13. ERROR in X.java (at line 5)\n
11:09:12 	* and more {@since 1.0}, {@serial 0L}, {@serialData data}, {@serialField field}\n
11:09:12 	                                         ^^^^^^^^^^\n
11:09:12 Javadoc: Unexpected tag\n
11:09:12 ----------\n
11:09:12 14. ERROR in X.java (at line 5)\n
11:09:12 	* and more {@since 1.0}, {@serial 0L}, {@serialData data}, {@serialField field}\n
11:09:12 	                                                             ^^^^^^^^^^^\n
11:09:12 Javadoc: Unexpected tag\n
11:09:12 ----------\n
11:09:12 ]>
11:09:12   JavadocBugsTest>TestCase.runTest:964->testBug281609a:8592->AbstractRegressionTest.runNegativeTest:2474->AbstractRegressionTest.runNegativeTest:2485->AbstractRegressionTest.runTest:2920->AbstractRegressionTest.runTest:3195->AbstractRegressionTest.runJavac:2350->AbstractRegressionTest.handleMismatch:2403->TestCase.assertEquals:242->TestCase.assertStringEquals:266 testBug281609a - Eclipse found error(s) but Javac did not find any.
11:09:12 ----------- Expected ------------
11:09:12 
11:09:12 ------------ but was ------------
11:09:12 ----------\n
11:09:12 1. ERROR in pkg\X.java (at line 7)\n
11:09:12 	* @see PKG\n
11:09:12 	       ^^^\n
11:09:12 Javadoc: PKG cannot be resolved to a type\n
11:09:12 ----------\n
11:09:12 
11:09:12 --------- Difference is ----------
11:09:12  expected:<[]> but was:<[----------\n
11:09:12 1. ERROR in pkg\X.java (at line 7)\n
11:09:12 	* @see PKG\n
11:09:12 	       ^^^\n
11:09:12 Javadoc: PKG cannot be resolved to a type\n
11:09:12 ----------\n
11:09:12 ]>
11:09:12   JavadocBugsTest>TestCase.runTest:964->testBug73352a:3106->AbstractRegressionTest.runConformTest:3339->AbstractRegressionTest.runTest:2920->AbstractRegressionTest.runTest:3195->AbstractRegressionTest.runJavac:2350->AbstractRegressionTest.handleMismatch:2454 testBug73352a: unused excuse org.eclipse.jdt.core.tests.compiler.regression.AbstractRegressionTest$JavacTestOptions$Excuse@1f5a1ad4 for compiler org.eclipse.jdt.core.tests.compiler.regression.AbstractRegressionTest$JavacCompiler@7866ffa
11:09:12   JavadocBugsTest>TestCase.runTest:964->testBug73352c:3238->AbstractRegressionTest.runConformTest:3339->AbstractRegressionTest.runTest:2920->AbstractRegressionTest.runTest:3195->AbstractRegressionTest.runJavac:2350->AbstractRegressionTest.handleMismatch:2454 testBug73352c: unused excuse org.eclipse.jdt.core.tests.compiler.regression.AbstractRegressionTest$JavacTestOptions$Excuse@1f5a1ad4 for compiler org.eclipse.jdt.core.tests.compiler.regression.AbstractRegressionTest$JavacCompiler@7866ffa
11:09:12   JavadocTestForClass>TestCase.runTest:964->test055:1066->AbstractRegressionTest.runNegativeTest:2474->AbstractRegressionTest.runNegativeTest:2485->AbstractRegressionTest.runTest:2920->AbstractRegressionTest.runTest:3195->AbstractRegressionTest.runJavac:2350->AbstractRegressionTest.handleMismatch:2407->TestCase.assertEquals:242->TestCase.assertStringEquals:266 test055 - Eclipse found error(s) but Javac only found warning(s).
11:09:12 ----------- Expected ------------
11:09:12 ----------\n
11:09:12 1. ERROR in X.java (at line 5)\n
11:09:12 	* <li> {@link Entry} </li>\n
11:09:12 	              ^^^^^\n
11:09:12 Javadoc: Invalid member type qualification\n
11:09:12 ----------\n
11:09:12 
11:09:12 ------------ but was ------------
11:09:12 X.java:8: warning: [rawtypes] found raw type: Map\n
11:09:12 public interface X extends Map {\n
11:09:12                            ^\n
11:09:12   missing type arguments for generic class Map<K,V>\n
11:09:12   where K,V are type-variables:\n
11:09:12     K extends Object declared in interface Map\n
11:09:12     V extends Object declared in interface Map\n
11:09:12 X.java:9: warning: [rawtypes] found raw type: Entry\n
11:09:12 	Entry e = null;\n
11:09:12 	^\n
11:09:12   missing type arguments for generic class Entry<K,V>\n
11:09:12   where K,V are type-variables:\n
11:09:12     K extends Object declared in interface Entry\n
11:09:12     V extends Object declared in interface Entry\n
11:09:12 2 warnings\n
11:09:12 
11:09:12 --------- Difference is ----------
11:09:12  expected:<[----------\n
11:09:12 1. ERROR in X.java (at line 5)\n
11:09:12 	* <li> {@link Entry} </li>\n
11:09:12 	              ^^^^^\n
11:09:12 Javadoc: Invalid member type qualification\n
11:09:12 ----------]\n
11:09:12 > but was:<[X.java:8: warning: [rawtypes] found raw type: Map\n
11:09:12 public interface X extends Map {\n
11:09:12                            ^\n
11:09:12   missing type arguments for generic class Map<K,V>\n
11:09:12   where K,V are type-variables:\n
11:09:12     K extends Object declared in interface Map\n
11:09:12     V extends Object declared in interface Map\n
11:09:12 X.java:9: warning: [rawtypes] found raw type: Entry\n
11:09:12 	Entry e = null;\n
11:09:12 	^\n
11:09:12   missing type arguments for generic class Entry<K,V>\n
11:09:12   where K,V are type-variables:\n
11:09:12     K extends Object declared in interface Entry\n
11:09:12     V extends Object declared in interface Entry\n
11:09:12 2 warnings]\n
11:09:12 >
11:09:12   JavadocTest_1_5>TestCase.runTest:964->testBug247037a:3885->AbstractRegressionTest.runNegativeTest:2474->AbstractRegressionTest.runNegativeTest:2485->AbstractRegressionTest.runTest:2920->AbstractRegressionTest.runTest:3195->AbstractRegressionTest.runJavac:2350->AbstractRegressionTest.handleMismatch:2403->TestCase.assertEquals:242->TestCase.assertStringEquals:266 testBug247037a - Eclipse found error(s) but Javac did not find any.
11:09:12 ----------- Expected ------------
11:09:12 
11:09:12 ------------ but was ------------
11:09:12 ----------\n
11:09:12 1. ERROR in pack\package-info.java (at line 2)\n
11:09:12 	* {@inheritDoc}\n
11:09:12 	    ^^^^^^^^^^\n
11:09:12 Javadoc: Unexpected tag\n
11:09:12 ----------\n
11:09:12 2. ERROR in pack\package-info.java (at line 3)\n
11:09:12 	* @since {@inheritDoc}\n
11:09:12 	           ^^^^^^^^^^\n
11:09:12 Javadoc: Unexpected tag\n
11:09:12 ----------\n
11:09:12 3. ERROR in pack\package-info.java (at line 4)\n
11:09:12 	* @blah {@inheritDoc}\n
11:09:12 	          ^^^^^^^^^^\n
11:09:12 Javadoc: Unexpected tag\n
11:09:12 ----------\n
11:09:12 
11:09:12 --------- Difference is ----------
11:09:12  expected:<[]> but was:<[----------\n
11:09:12 1. ERROR in pack\package-info.java (at line 2)\n
11:09:12 	* {@inheritDoc}\n
11:09:12 	    ^^^^^^^^^^\n
11:09:12 Javadoc: Unexpected tag\n
11:09:12 ----------\n
11:09:12 2. ERROR in pack\package-info.java (at line 3)\n
11:09:12 	* @since {@inheritDoc}\n
11:09:12 	           ^^^^^^^^^^\n
11:09:12 Javadoc: Unexpected tag\n
11:09:12 ----------\n
11:09:12 3. ERROR in pack\package-info.java (at line 4)\n
11:09:12 	* @blah {@inheritDoc}\n
11:09:12 	          ^^^^^^^^^^\n
11:09:12 Javadoc: Unexpected tag\n
11:09:12 ----------\n
11:09:12 ]>
11:09:12   JavadocTest_1_5>TestCase.runTest:964->testBug247037b:3917->AbstractRegressionTest.runNegativeTest:2474->AbstractRegressionTest.runNegativeTest:2485->AbstractRegressionTest.runTest:2920->AbstractRegressionTest.runTest:3195->AbstractRegressionTest.runJavac:2350->AbstractRegressionTest.handleMismatch:2403->TestCase.assertEquals:242->TestCase.assertStringEquals:266 testBug247037b - Eclipse found error(s) but Javac did not find any.
11:09:12 ----------- Expected ------------
11:09:12 
11:09:12 ------------ but was ------------
11:09:12 ----------\n
11:09:12 1. ERROR in pack\package-info.java (at line 2)\n
11:09:12 	* @return {@inheritDoc}\n
11:09:12 	   ^^^^^^\n
11:09:12 Javadoc: Unexpected tag\n
11:09:12 ----------\n
11:09:12 2. ERROR in pack\package-info.java (at line 2)\n
11:09:12 	* @return {@inheritDoc}\n
11:09:12 	            ^^^^^^^^^^\n
11:09:12 Javadoc: Unexpected tag\n
11:09:12 ----------\n
11:09:12 3. ERROR in pack\package-info.java (at line 3)\n
11:09:12 	* @param blah {@inheritDoc}\n
11:09:12 	   ^^^^^\n
11:09:12 Javadoc: Unexpected tag\n
11:09:12 ----------\n
11:09:12 4. ERROR in pack\package-info.java (at line 3)\n
11:09:12 	* @param blah {@inheritDoc}\n
11:09:12 	                ^^^^^^^^^^\n
11:09:12 Javadoc: Unexpected tag\n
11:09:12 ----------\n
11:09:12 
11:09:12 --------- Difference is ----------
11:09:12  expected:<[]> but was:<[----------\n
11:09:12 1. ERROR in pack\package-info.java (at line 2)\n
11:09:12 	* @return {@inheritDoc}\n
11:09:12 	   ^^^^^^\n
11:09:12 Javadoc: Unexpected tag\n
11:09:12 ----------\n
11:09:12 2. ERROR in pack\package-info.java (at line 2)\n
11:09:12 	* @return {@inheritDoc}\n
11:09:12 	            ^^^^^^^^^^\n
11:09:12 Javadoc: Unexpected tag\n
11:09:12 ----------\n
11:09:12 3. ERROR in pack\package-info.java (at line 3)\n
11:09:12 	* @param blah {@inheritDoc}\n
11:09:12 	   ^^^^^\n
11:09:12 Javadoc: Unexpected tag\n
11:09:12 ----------\n
11:09:12 4. ERROR in pack\package-info.java (at line 3)\n
11:09:12 	* @param blah {@inheritDoc}\n
11:09:12 	                ^^^^^^^^^^\n
11:09:12 Javadoc: Unexpected tag\n
11:09:12 ----------\n
11:09:12 ]>
11:09:12   JavadocTest_1_5>TestCase.runTest:964->testBug284333:3958->AbstractRegressionTest.runNegativeTest:2474->AbstractRegressionTest.runNegativeTest:2485->AbstractRegressionTest.runTest:2920->AbstractRegressionTest.runTest:3195->AbstractRegressionTest.runJavac:2350->AbstractRegressionTest.handleMismatch:2403->TestCase.assertEquals:242->TestCase.assertStringEquals:266 testBug284333 - Eclipse found error(s) but Javac did not find any.
11:09:12 ----------- Expected ------------
11:09:12 
11:09:12 ------------ but was ------------
11:09:12 ----------\n
11:09:12 1. ERROR in foo\bar\package-info.java (at line 2)\n
11:09:12 	* @see ClassInSamePackage#SOME_FIELD\n
11:09:12 	       ^^^^^^^^^^^^^^^^^^\n
11:09:12 Javadoc: Invalid reference\n
11:09:12 ----------\n
11:09:12 2. ERROR in foo\bar\package-info.java (at line 4)\n
11:09:12 	* @see ClassInSamePackage#SOME_FIELD\n
11:09:12 	       ^^^^^^^^^^^^^^^^^^\n
11:09:12 Javadoc: Invalid reference\n
11:09:12 ----------\n
11:09:12 3. ERROR in foo\bar\package-info.java (at line 5)\n
11:09:12 	* @see ClassInSubPackage#foo\n
11:09:12 	       ^^^^^^^^^^^^^^^^^\n
11:09:12 Javadoc: ClassInSubPackage cannot be resolved to a type\n
11:09:12 ----------\n
11:09:12 4. ERROR in foo\bar\package-info.java (at line 7)\n
11:09:12 	* @see ClassInSubPackage#foo\n
11:09:12 	       ^^^^^^^^^^^^^^^^^\n
11:09:12 Javadoc: ClassInSubPackage cannot be resolved to a type\n
11:09:12 ----------\n
11:09:12 5. ERROR in foo\bar\package-info.java (at line 8)\n
11:09:12 	* @see ClassInEnclosingPackage\n
11:09:12 	       ^^^^^^^^^^^^^^^^^^^^^^^\n
11:09:12 Javadoc: ClassInEnclosingPackage cannot be resolved to a type\n
11:09:12 ----------\n
11:09:12 6. ERROR in foo\bar\package-info.java (at line 10)\n
11:09:12 	* @see ClassInEnclosingPackage\n
11:09:12 	       ^^^^^^^^^^^^^^^^^^^^^^^\n
11:09:12 Javadoc: ClassInEnclosingPackage cannot be resolved to a type\n
11:09:12 ----------\n
11:09:12 
11:09:12 --------- Difference is ----------
11:09:12  expected:<[]> but was:<[----------\n
11:09:12 1. ERROR in foo\bar\package-info.java (at line 2)\n
11:09:12 	* @see ClassInSamePackage#SOME_FIELD\n
11:09:12 	       ^^^^^^^^^^^^^^^^^^\n
11:09:12 Javadoc: Invalid reference\n
11:09:12 ----------\n
11:09:12 2. ERROR in foo\bar\package-info.java (at line 4)\n
11:09:12 	* @see ClassInSamePackage#SOME_FIELD\n
11:09:12 	       ^^^^^^^^^^^^^^^^^^\n
11:09:12 Javadoc: Invalid reference\n
11:09:12 ----------\n
11:09:12 3. ERROR in foo\bar\package-info.java (at line 5)\n
11:09:12 	* @see ClassInSubPackage#foo\n
11:09:12 	       ^^^^^^^^^^^^^^^^^\n
11:09:12 Javadoc: ClassInSubPackage cannot be resolved to a type\n
11:09:12 ----------\n
11:09:12 4. ERROR in foo\bar\package-info.java (at line 7)\n
11:09:12 	* @see ClassInSubPackage#foo\n
11:09:12 	       ^^^^^^^^^^^^^^^^^\n
11:09:12 Javadoc: ClassInSubPackage cannot be resolved to a type\n
11:09:12 ----------\n
11:09:12 5. ERROR in foo\bar\package-info.java (at line 8)\n
11:09:12 	* @see ClassInEnclosingPackage\n
11:09:12 	       ^^^^^^^^^^^^^^^^^^^^^^^\n
11:09:12 Javadoc: ClassInEnclosingPackage cannot be resolved to a type\n
11:09:12 ----------\n
11:09:12 6. ERROR in foo\bar\package-info.java (at line 10)\n
11:09:12 	* @see ClassInEnclosingPackage\n
11:09:12 	       ^^^^^^^^^^^^^^^^^^^^^^^\n
11:09:12 Javadoc: ClassInEnclosingPackage cannot be resolved to a type\n
11:09:12 ----------\n
11:09:12 ]>
11:09:12   JavadocTest_1_5>TestCase.runTest:964->testBug284333a:4037->AbstractRegressionTest.runNegativeTest:2474->AbstractRegressionTest.runNegativeTest:2485->AbstractRegressionTest.runTest:2920->AbstractRegressionTest.runTest:3195->AbstractRegressionTest.runJavac:2350->AbstractRegressionTest.handleMismatch:2403->TestCase.assertEquals:242->TestCase.assertStringEquals:266 testBug284333a - Eclipse found error(s) but Javac did not find any.
11:09:12 ----------- Expected ------------
11:09:12 
11:09:12 ------------ but was ------------
11:09:12 ----------\n
11:09:12 1. ERROR in foo\bar\NotAPackageInfo.java (at line 9)\n
11:09:12 	* @see ClassInSubPackage#foo\n
11:09:12 	       ^^^^^^^^^^^^^^^^^\n
11:09:12 Javadoc: ClassInSubPackage cannot be resolved to a type\n
11:09:12 ----------\n
11:09:12 2. ERROR in foo\bar\NotAPackageInfo.java (at line 11)\n
11:09:12 	* @see ClassInSubPackage#foo\n
11:09:12 	       ^^^^^^^^^^^^^^^^^\n
11:09:12 Javadoc: ClassInSubPackage cannot be resolved to a type\n
11:09:12 ----------\n
11:09:12 3. ERROR in foo\bar\NotAPackageInfo.java (at line 15)\n
11:09:12 	* @see ClassInEnclosingPackage\n
11:09:12 	       ^^^^^^^^^^^^^^^^^^^^^^^\n
11:09:12 Javadoc: ClassInEnclosingPackage cannot be resolved to a type\n
11:09:12 ----------\n
11:09:12 4. ERROR in foo\bar\NotAPackageInfo.java (at line 17)\n
11:09:12 	* @see ClassInEnclosingPackage\n
11:09:12 	       ^^^^^^^^^^^^^^^^^^^^^^^\n
11:09:12 Javadoc: ClassInEnclosingPackage cannot be resolved to a type\n
11:09:12 ----------\n
11:09:12 
11:09:12 --------- Difference is ----------
11:09:12  expected:<[]> but was:<[----------\n
11:09:12 1. ERROR in foo\bar\NotAPackageInfo.java (at line 9)\n
11:09:12 	* @see ClassInSubPackage#foo\n
11:09:12 	       ^^^^^^^^^^^^^^^^^\n
11:09:12 Javadoc: ClassInSubPackage cannot be resolved to a type\n
11:09:12 ----------\n
11:09:12 2. ERROR in foo\bar\NotAPackageInfo.java (at line 11)\n
11:09:12 	* @see ClassInSubPackage#foo\n
11:09:12 	       ^^^^^^^^^^^^^^^^^\n
11:09:12 Javadoc: ClassInSubPackage cannot be resolved to a type\n
11:09:12 ----------\n
11:09:12 3. ERROR in foo\bar\NotAPackageInfo.java (at line 15)\n
11:09:12 	* @see ClassInEnclosingPackage\n
11:09:12 	       ^^^^^^^^^^^^^^^^^^^^^^^\n
11:09:12 Javadoc: ClassInEnclosingPackage cannot be resolved to a type\n
11:09:12 ----------\n
11:09:12 4. ERROR in foo\bar\NotAPackageInfo.java (at line 17)\n
11:09:12 	* @see ClassInEnclosingPackage\n
11:09:12 	       ^^^^^^^^^^^^^^^^^^^^^^^\n
11:09:12 Javadoc: ClassInEnclosingPackage cannot be resolved to a type\n
11:09:12 ----------\n
11:09:12 ]>
11:09:12   LookupTest>TestCase.runTest:964->test103:3413->AbstractRegressionTest.runNegativeTest:2474->AbstractRegressionTest.runNegativeTest:2485->AbstractRegressionTest.runTest:2920->AbstractRegressionTest.runTest:3195->AbstractRegressionTest.runJavac:2350->AbstractRegressionTest.handleMismatch:2419->TestCase.assertEquals:242->TestCase.assertStringEquals:266 test103 - Eclipse found warning(s) but Javac did not find any.
11:09:12 ----------- Expected ------------
11:09:12 
11:09:12 ------------ but was ------------
11:09:12 ----------\n
11:09:12 1. WARNING in A.java (at line 2)\n
11:09:12 	private int x;\n
11:09:12 	            ^\n
11:09:12 The value of the field A.x is not used\n
11:09:12 ----------\n
11:09:12 2. WARNING in A.java (at line 4)\n
11:09:12 	private int x;\n
11:09:12 	            ^\n
11:09:12 The value of the field A.B.x is not used\n
11:09:12 ----------\n
11:09:12 3. WARNING in A.java (at line 5)\n
11:09:12 	private C c = new C() {\n
11:09:12 	          ^\n
11:09:12 The value of the field A.B.c is not used\n
11:09:12 ----------\n
11:09:12 4. WARNING in A.java (at line 6)\n
11:09:12 	void foo() {\n
11:09:12 	     ^^^^^\n
11:09:12 The method foo() from the type new A.C(){} is never used locally\n
11:09:12 ----------\n
11:09:12 5. WARNING in A.java (at line 7)\n
11:09:12 	x = 3;\n
11:09:12 	^\n
11:09:12 Write access to enclosing field A.B.x is emulated by a synthetic accessor method\n
11:09:12 ----------\n
11:09:12 6. WARNING in A.java (at line 12)\n
11:09:12 	private int x;\n
11:09:12 	            ^\n
11:09:12 The value of the field A.C.x is not used\n
11:09:12 ----------\n
11:09:12 
11:09:12 --------- Difference is ----------
11:09:12  expected:<[]> but was:<[----------\n
11:09:12 1. WARNING in A.java (at line 2)\n
11:09:12 	private int x;\n
11:09:12 	            ^\n
11:09:12 The value of the field A.x is not used\n
11:09:12 ----------\n
11:09:12 2. WARNING in A.java (at line 4)\n
11:09:12 	private int x;\n
11:09:12 	            ^\n
11:09:12 The value of the field A.B.x is not used\n
11:09:12 ----------\n
11:09:12 3. WARNING in A.java (at line 5)\n
11:09:12 	private C c = new C() {\n
11:09:12 	          ^\n
11:09:12 The value of the field A.B.c is not used\n
11:09:12 ----------\n
11:09:12 4. WARNING in A.java (at line 6)\n
11:09:12 	void foo() {\n
11:09:12 	     ^^^^^\n
11:09:12 The method foo() from the type new A.C(){} is never used locally\n
11:09:12 ----------\n
11:09:12 5. WARNING in A.java (at line 7)\n
11:09:12 	x = 3;\n
11:09:12 	^\n
11:09:12 Write access to enclosing field A.B.x is emulated by a synthetic accessor method\n
11:09:12 ----------\n
11:09:12 6. WARNING in A.java (at line 12)\n
11:09:12 	private int x;\n
11:09:12 	            ^\n
11:09:12 The value of the field A.C.x is not used\n
11:09:12 ----------\n
11:09:12 ]>
11:09:12   LookupTest>TestCase.runTest:964->test105:3537->AbstractRegressionTest.runNegativeTest:2474->AbstractRegressionTest.runNegativeTest:2485->AbstractRegressionTest.runTest:2920->AbstractRegressionTest.runTest:3195->AbstractRegressionTest.runJavac:2350->AbstractRegressionTest.handleMismatch:2419->TestCase.assertEquals:242->TestCase.assertStringEquals:266 test105 - Eclipse found warning(s) but Javac did not find any.
11:09:12 ----------- Expected ------------
11:09:12 
11:09:12 ------------ but was ------------
11:09:12 ----------\n
11:09:12 1. WARNING in A.java (at line 2)\n
11:09:12 	private int x;\n
11:09:12 	            ^\n
11:09:12 The value of the field A.x is not used\n
11:09:12 ----------\n
11:09:12 2. WARNING in A.java (at line 3)\n
11:09:12 	private C c = new C() {\n
11:09:12 	          ^\n
11:09:12 The value of the field A.c is not used\n
11:09:12 ----------\n
11:09:12 3. WARNING in A.java (at line 4)\n
11:09:12 	void foo() {\n
11:09:12 	     ^^^^^\n
11:09:12 The method foo() from the type new A.C(){} is never used locally\n
11:09:12 ----------\n
11:09:12 4. WARNING in A.java (at line 5)\n
11:09:12 	x = 3;\n
11:09:12 	^\n
11:09:12 Write access to enclosing field A.x is emulated by a synthetic accessor method\n
11:09:12 ----------\n
11:09:12 5. WARNING in A.java (at line 9)\n
11:09:12 	private int x;\n
11:09:12 	            ^\n
11:09:12 The value of the field A.C.x is not used\n
11:09:12 ----------\n
11:09:12 
11:09:12 --------- Difference is ----------
11:09:12  expected:<[]> but was:<[----------\n
11:09:12 1. WARNING in A.java (at line 2)\n
11:09:12 	private int x;\n
11:09:12 	            ^\n
11:09:12 The value of the field A.x is not used\n
11:09:12 ----------\n
11:09:12 2. WARNING in A.java (at line 3)\n
11:09:12 	private C c = new C() {\n
11:09:12 	          ^\n
11:09:12 The value of the field A.c is not used\n
11:09:12 ----------\n
11:09:12 3. WARNING in A.java (at line 4)\n
11:09:12 	void foo() {\n
11:09:12 	     ^^^^^\n
11:09:12 The method foo() from the type new A.C(){} is never used locally\n
11:09:12 ----------\n
11:09:12 4. WARNING in A.java (at line 5)\n
11:09:12 	x = 3;\n
11:09:12 	^\n
11:09:12 Write access to enclosing field A.x is emulated by a synthetic accessor method\n
11:09:12 ----------\n
11:09:12 5. WARNING in A.java (at line 9)\n
11:09:12 	private int x;\n
11:09:12 	            ^\n
11:09:12 The value of the field A.C.x is not used\n
11:09:12 ----------\n
11:09:12 ]>
11:09:12   MethodHandleTest>TestCase.runTest:964->test009:279->AbstractRegressionTest.runNegativeTest:3507->AbstractRegressionTest.runTest:2920->AbstractRegressionTest.runTest:3195->AbstractRegressionTest.runJavac:2350->AbstractRegressionTest.handleMismatch:2454 test009: unused excuse org.eclipse.jdt.core.tests.compiler.regression.AbstractRegressionTest$JavacTestOptions$Excuse@58fcb07b for compiler org.eclipse.jdt.core.tests.compiler.regression.AbstractRegressionTest$JavacCompiler@7866ffa
11:09:12   MethodHandleTest>TestCase.runTest:964->test010:315->AbstractRegressionTest.runNegativeTest:3507->AbstractRegressionTest.runTest:2920->AbstractRegressionTest.runTest:3195->AbstractRegressionTest.runJavac:2350->AbstractRegressionTest.handleMismatch:2454 test010: unused excuse org.eclipse.jdt.core.tests.compiler.regression.AbstractRegressionTest$JavacTestOptions$Excuse@58fcb07b for compiler org.eclipse.jdt.core.tests.compiler.regression.AbstractRegressionTest$JavacCompiler@7866ffa
11:09:12   MethodVerifyTest>TestCase.runTest:964->test025e:1713->AbstractRegressionTest.runConformTest:3339->AbstractRegressionTest.runTest:2920->AbstractRegressionTest.runTest:3195->AbstractRegressionTest.runJavac:2350->AbstractRegressionTest.handleMismatch:2454 test025e: unused excuse org.eclipse.jdt.core.tests.compiler.regression.AbstractRegressionTest$JavacTestOptions$Excuse@1f5a1ad4 for compiler org.eclipse.jdt.core.tests.compiler.regression.AbstractRegressionTest$JavacCompiler@7866ffa
11:09:12   MethodVerifyTest>TestCase.runTest:964->test025f:1747->AbstractRegressionTest.runConformTest:3339->AbstractRegressionTest.runTest:2920->AbstractRegressionTest.runTest:3195->AbstractRegressionTest.runJavac:2350->AbstractRegressionTest.handleMismatch:2454 test025f: unused excuse org.eclipse.jdt.core.tests.compiler.regression.AbstractRegressionTest$JavacTestOptions$Excuse@1f5a1ad4 for compiler org.eclipse.jdt.core.tests.compiler.regression.AbstractRegressionTest$JavacCompiler@7866ffa
11:09:12   MethodVerifyTest>TestCase.runTest:964->test041:2861->AbstractRegressionTest.runConformTest:3339->AbstractRegressionTest.runTest:2920->AbstractRegressionTest.runTest:3195->AbstractRegressionTest.runJavac:2350->AbstractRegressionTest.handleMismatch:2454 test041: unused excuse org.eclipse.jdt.core.tests.compiler.regression.AbstractRegressionTest$JavacTestOptions$EclipseJustification$1@68db67d for compiler org.eclipse.jdt.core.tests.compiler.regression.AbstractRegressionTest$JavacCompiler@7866ffa
11:09:12   MethodVerifyTest>TestCase.runTest:964->test041a:2883->AbstractRegressionTest.runConformTest:3339->AbstractRegressionTest.runTest:2920->AbstractRegressionTest.runTest:3195->AbstractRegressionTest.runJavac:2350->AbstractRegressionTest.handleMismatch:2454 test041a: unused excuse org.eclipse.jdt.core.tests.compiler.regression.AbstractRegressionTest$JavacTestOptions$EclipseJustification$1@68db67d for compiler org.eclipse.jdt.core.tests.compiler.regression.AbstractRegressionTest$JavacCompiler@7866ffa
11:09:12   MethodVerifyTest>TestCase.runTest:964->test043:2994->AbstractRegressionTest.runNegativeTest:3448->AbstractRegressionTest.runTest:2920->AbstractRegressionTest.runTest:3195->AbstractRegressionTest.runJavac:2350->AbstractRegressionTest.handleMismatch:2454 test043: unused excuse org.eclipse.jdt.core.tests.compiler.regression.AbstractRegressionTest$JavacTestOptions$EclipseJustification@7cf0c700 for compiler org.eclipse.jdt.core.tests.compiler.regression.AbstractRegressionTest$JavacCompiler@7866ffa
11:09:12   MethodVerifyTest>TestCase.runTest:964->test145:9263->AbstractRegressionTest.runConformTest:1689->AbstractRegressionTest.runConformTest:1692->AbstractRegressionTest.runTest:2920->AbstractRegressionTest.runTest:3195->AbstractRegressionTest.runJavac:2350->AbstractRegressionTest.handleMismatch:2411->TestCase.assertEquals:242->TestCase.assertStringEquals:266 test145 - Javac found error(s) but Eclipse did not find any.
11:09:12 ----------- Expected ------------
11:09:12 
11:09:12 ------------ but was ------------
11:09:12 BaseImpl.java:3: error: name clash: setValue(String) in BaseImpl overrides a method whose erasure is the same as another method, yet neither overrides the other\n
11:09:12 class BaseImpl extends Base<String> { public void setValue(String object) {} }\n
11:09:12                                                   ^\n
11:09:12   first method:  setValue(Object) in Base\n
11:09:12   second method: setValue(Tvalue) in BaseInterface\n
11:09:12   where Tvalue is a type-variable:\n
11:09:12     Tvalue extends Object declared in interface BaseInterface\n
11:09:12 1 error\n
11:09:12 
11:09:12 --------- Difference is ----------
11:09:12  expected:<[]> but was:<[BaseImpl.java:3: error: name clash: setValue(String) in BaseImpl overrides a method whose erasure is the same as another method, yet neither overrides the other\n
11:09:12 class BaseImpl extends Base<String> { public void setValue(String object) {} }\n
11:09:12                                                   ^\n
11:09:12   first method:  setValue(Object) in Base\n
11:09:12   second method: setValue(Tvalue) in BaseInterface\n
11:09:12   where Tvalue is a type-variable:\n
11:09:12     Tvalue extends Object declared in interface BaseInterface\n
11:09:12 1 error\n
11:09:12 ]>
11:09:12   MethodVerifyTest>TestCase.runTest:964->test169:10107->AbstractRegressionTest.runNegativeTest:3507->AbstractRegressionTest.runTest:2920->AbstractRegressionTest.runTest:3195->AbstractRegressionTest.runJavac:2350->AbstractRegressionTest.handleMismatch:2454 test169: unused excuse org.eclipse.jdt.core.tests.compiler.regression.AbstractRegressionTest$JavacTestOptions$Excuse@1f5a1ad4 for compiler org.eclipse.jdt.core.tests.compiler.regression.AbstractRegressionTest$JavacCompiler@7866ffa
11:09:12   MethodVerifyTest>TestCase.runTest:964->test169a:10139->AbstractRegressionTest.runNegativeTest:3507->AbstractRegressionTest.runTest:2920->AbstractRegressionTest.runTest:3195->AbstractRegressionTest.runJavac:2350->AbstractRegressionTest.handleMismatch:2454 test169a: unused excuse org.eclipse.jdt.core.tests.compiler.regression.AbstractRegressionTest$JavacTestOptions$Excuse@1f5a1ad4 for compiler org.eclipse.jdt.core.tests.compiler.regression.AbstractRegressionTest$JavacCompiler@7866ffa
11:09:12   MethodVerifyTest>TestCase.runTest:964->test175:10288->AbstractRegressionTest.runNegativeTest:3507->AbstractRegressionTest.runTest:2920->AbstractRegressionTest.runTest:3195->AbstractRegressionTest.runJavac:2350->AbstractRegressionTest.handleMismatch:2454 test175: unused excuse org.eclipse.jdt.core.tests.compiler.regression.AbstractRegressionTest$JavacTestOptions$Excuse@1f5a1ad4 for compiler org.eclipse.jdt.core.tests.compiler.regression.AbstractRegressionTest$JavacCompiler@7866ffa
11:09:12   MethodVerifyTest>TestCase.runTest:964->test188:10971->AbstractRegressionTest.runNegativeTest:3507->AbstractRegressionTest.runTest:2920->AbstractRegressionTest.runTest:3195->AbstractRegressionTest.runJavac:2350->AbstractRegressionTest.handleMismatch:2454 test188: unused excuse org.eclipse.jdt.core.tests.compiler.regression.AbstractRegressionTest$JavacTestOptions$Excuse@1f5a1ad4 for compiler org.eclipse.jdt.core.tests.compiler.regression.AbstractRegressionTest$JavacCompiler@7866ffa
11:09:12   MethodVerifyTest>TestCase.runTest:964->test201:11429->AbstractRegressionTest.runConformTest:1689->AbstractRegressionTest.runConformTest:1692->AbstractRegressionTest.runTest:2920->AbstractRegressionTest.runTest:3195->AbstractRegressionTest.runJavac:2350->AbstractRegressionTest.handleMismatch:2411->TestCase.assertEquals:242->TestCase.assertStringEquals:266 test201 - Javac found error(s) but Eclipse did not find any.
11:09:12 ----------- Expected ------------
11:09:12 
11:09:12 ------------ but was ------------
11:09:12 A.java:4: error: types J<CAP#1> and K<T3> are incompatible; both define get(), but with unrelated return types\n
11:09:12 interface A<T3 extends K<T3> & J<? extends I>> extends J<I> {}\n
11:09:12             ^\n
11:09:12   where T3 is a type-variable:\n
11:09:12     T3 extends K<T3>,J<? extends I> declared in interface A\n
11:09:12   where CAP#1 is a fresh type-variable:\n
11:09:12     CAP#1 extends I from capture of ? extends I\n
11:09:12 A.java:5: error: types K<T4> and J<CAP#1> are incompatible; both define get(), but with unrelated return types\n
11:09:12 interface B<T4 extends J<? extends I> & K<T4>> extends J<I> {}\n
11:09:12             ^\n
11:09:12   where T4 is a type-variable:\n
11:09:12     T4 extends J<? extends I>,K<T4> declared in interface B\n
11:09:12   where CAP#1 is a fresh type-variable:\n
11:09:12     CAP#1 extends I from capture of ? extends I\n
11:09:12 2 errors\n
11:09:12 
11:09:12 --------- Difference is ----------
11:09:12  expected:<[]> but was:<[A.java:4: error: types J<CAP#1> and K<T3> are incompatible; both define get(), but with unrelated return types\n
11:09:12 interface A<T3 extends K<T3> & J<? extends I>> extends J<I> {}\n
11:09:12             ^\n
11:09:12   where T3 is a type-variable:\n
11:09:12     T3 extends K<T3>,J<? extends I> declared in interface A\n
11:09:12   where CAP#1 is a fresh type-variable:\n
11:09:12     CAP#1 extends I from capture of ? extends I\n
11:09:12 A.java:5: error: types K<T4> and J<CAP#1> are incompatible; both define get(), but with unrelated return types\n
11:09:12 interface B<T4 extends J<? extends I> & K<T4>> extends J<I> {}\n
11:09:12             ^\n
11:09:12   where T4 is a type-variable:\n
11:09:12     T4 extends J<? extends I>,K<T4> declared in interface B\n
11:09:12   where CAP#1 is a fresh type-variable:\n
11:09:12     CAP#1 extends I from capture of ? extends I\n
11:09:12 2 errors\n
11:09:12 ]>
11:09:12   MethodVerifyTest>TestCase.runTest:964->test204:11483->AbstractRegressionTest.runConformTest:1689->AbstractRegressionTest.runConformTest:1692->AbstractRegressionTest.runTest:2920->AbstractRegressionTest.runTest:3195->AbstractRegressionTest.runJavac:2350->AbstractRegressionTest.handleMismatch:2411->TestCase.assertEquals:242->TestCase.assertStringEquals:266 test204 - Javac found error(s) but Eclipse did not find any.
11:09:12 ----------- Expected ------------
11:09:12 
11:09:12 ------------ but was ------------
11:09:12 OverrideBug.java:6: error: name clash: put(K#1,List<V#1>) in OverrideBug overrides a method whose erasure is the same as another method, yet neither overrides the other\n
11:09:12 public List<V> put(final K arg0, final List<V> arg1) {\n
11:09:12                ^\n
11:09:12   first method:  put(K#1,V#1) in OverrideBug\n
11:09:12   second method: put(K#2,V#2) in Map\n
11:09:12   where K#1,V#1,K#2,V#2 are type-variables:\n
11:09:12     K#1 extends Object declared in class OverrideBug\n
11:09:12     V#1 extends Object declared in class OverrideBug\n
11:09:12     K#2 extends Object declared in interface Map\n
11:09:12     V#2 extends Object declared in interface Map\n
11:09:12 OverrideBug.java:9: error: name clash: put(K#1,V#1) in OverrideBug and put(K#2,V#2) in Map have the same erasure, yet neither overrides the other\n
11:09:12 public List<V> put(final K arg0, final V arg1) {\n
11:09:12                ^\n
11:09:12   where K#1,V#1,K#2,V#2 are type-variables:\n
11:09:12     K#1 extends Object declared in class OverrideBug\n
11:09:12     V#1 extends Object declared in class OverrideBug\n
11:09:12     K#2 extends Object declared in interface Map\n
11:09:12     V#2 extends Object declared in interface Map\n
11:09:12 2 errors\n
11:09:12 
11:09:12 --------- Difference is ----------
11:09:12  expected:<[]> but was:<[OverrideBug.java:6: error: name clash: put(K#1,List<V#1>) in OverrideBug overrides a method whose erasure is the same as another method, yet neither overrides the other\n
11:09:12 public List<V> put(final K arg0, final List<V> arg1) {\n
11:09:12                ^\n
11:09:12   first method:  put(K#1,V#1) in OverrideBug\n
11:09:12   second method: put(K#2,V#2) in Map\n
11:09:12   where K#1,V#1,K#2,V#2 are type-variables:\n
11:09:12     K#1 extends Object declared in class OverrideBug\n
11:09:12     V#1 extends Object declared in class OverrideBug\n
11:09:12     K#2 extends Object declared in interface Map\n
11:09:12     V#2 extends Object declared in interface Map\n
11:09:12 OverrideBug.java:9: error: name clash: put(K#1,V#1) in OverrideBug and put(K#2,V#2) in Map have the same erasure, yet neither overrides the other\n
11:09:12 public List<V> put(final K arg0, final V arg1) {\n
11:09:12                ^\n
11:09:12   where K#1,V#1,K#2,V#2 are type-variables:\n
11:09:12     K#1 extends Object declared in class OverrideBug\n
11:09:12     V#1 extends Object declared in class OverrideBug\n
11:09:12     K#2 extends Object declared in interface Map\n
11:09:12     V#2 extends Object declared in interface Map\n
11:09:12 2 errors\n
11:09:12 ]>
11:09:12   MethodVerifyTest>TestCase.runTest:964->test329584:12125->AbstractRegressionTest.runConformTest:1822->AbstractRegressionTest.runTest:2920->AbstractRegressionTest.runTest:3195->AbstractRegressionTest.runJavac:2350->AbstractRegressionTest.handleMismatch:2411->TestCase.assertEquals:242->TestCase.assertStringEquals:266 test329584 - Javac found error(s) but Eclipse did not find any.
11:09:12 ----------- Expected ------------
11:09:12 
11:09:12 ------------ but was ------------
11:09:12 ./I.java:2: error: type Dictionary does not take parameters\n
11:09:12 	void foo(Object o[], Dictionary<Object, Object> dict);\n
11:09:12 	                               ^\n
11:09:12 1 error\n
11:09:12 
11:09:12 --------- Difference is ----------
11:09:12  expected:<[]> but was:<[./I.java:2: error: type Dictionary does not take parameters\n
11:09:12 	void foo(Object o[], Dictionary<Object, Object> dict);\n
11:09:12 	                               ^\n
11:09:12 1 error\n
11:09:12 ]>
11:09:12   MethodVerifyTest>TestCase.runTest:964->test330435:12264->AbstractRegressionTest.runNegativeTest:2592->AbstractRegressionTest.runNegativeTest:2601->AbstractRegressionTest.runTest:2920->AbstractRegressionTest.runTest:3195->AbstractRegressionTest.runJavac:2350->AbstractRegressionTest.handleMismatch:2407->TestCase.assertEquals:242->TestCase.assertStringEquals:266 test330435 - Eclipse found error(s) but Javac only found warning(s).
11:09:12 ----------- Expected ------------
11:09:12 ----------\n
11:09:12 1. ERROR in X.java (at line 3)\n
11:09:12 	String[] a = A.asList(args).toArray(new String[0]);\n
11:09:12 	             ^^^^^^^^^^^^^^^^^^^^^^^^^^^^^^^^^^^^^\n
11:09:12 Type mismatch: cannot convert from Object[] to String[]\n
11:09:12 ----------\n
11:09:12 
11:09:12 ------------ but was ------------
11:09:12 ./A.java:2: warning: [unchecked] Possible heap pollution from parameterized vararg type T\n
11:09:12 	public static <T> B<T> asList(T... tab) {\n
11:09:12 	                                   ^\n
11:09:12   where T is a type-variable:\n
11:09:12     T extends Object declared in method <T>asList(T...)\n
11:09:12 1 warning\n
11:09:12 
11:09:12 --------- Difference is ----------
11:09:12  expected:<[----------\n
11:09:12 1. ERROR in X.java (at line 3)\n
11:09:12 	String[] a = A.asList(args).toArray(new String[0]);\n
11:09:12 	             ^^^^^^^^^^^^^^^^^^^^^^^^^^^^^^^^^^^^^\n
11:09:12 Type mismatch: cannot convert from Object[] to String[]\n
11:09:12 ----------]\n
11:09:12 > but was:<[./A.java:2: warning: [unchecked] Possible heap pollution from parameterized vararg type T\n
11:09:12 	public static <T> B<T> asList(T... tab) {\n
11:09:12 	                                   ^\n
11:09:12   where T is a type-variable:\n
11:09:12     T extends Object declared in method <T>asList(T...)\n
11:09:12 1 warning]\n
11:09:12 >
11:09:12   MethodVerifyTest>TestCase.runTest:964->test330445:12216->AbstractRegressionTest.runConformTest:1822->AbstractRegressionTest.runTest:2920->AbstractRegressionTest.runTest:3195->AbstractRegressionTest.runJavac:2350->AbstractRegressionTest.handleMismatch:2411->TestCase.assertEquals:242->TestCase.assertStringEquals:266 test330445 - Javac found error(s) but Eclipse did not find any.
11:09:12 ----------- Expected ------------
11:09:12 
11:09:12 ------------ but was ------------
11:09:12 X.java:4: error: incompatible types: Properties cannot be converted to Map<String,String>\n
11:09:12         Y.foo(new Properties());\n
11:09:12               ^\n
11:09:12 Note: Some messages have been simplified; recompile with -Xdiags:verbose to get full output\n
11:09:12 1 error\n
11:09:12 
11:09:12 --------- Difference is ----------
11:09:12  expected:<[]> but was:<[X.java:4: error: incompatible types: Properties cannot be converted to Map<String,String>\n
11:09:12         Y.foo(new Properties());\n
11:09:12               ^\n
11:09:12 Note: Some messages have been simplified; recompile with -Xdiags:verbose to get full output\n
11:09:12 1 error\n
11:09:12 ]>
11:09:12   MethodVerifyTest>TestCase.runTest:964->test331446:12374->AbstractRegressionTest.runConformTest:1822->AbstractRegressionTest.runTest:2920->AbstractRegressionTest.runTest:3195->AbstractRegressionTest.runJavac:2350->AbstractRegressionTest.handleMismatch:2411->TestCase.assertEquals:242->TestCase.assertStringEquals:266 test331446 - Javac found error(s) but Eclipse did not find any.
11:09:12 ----------- Expected ------------
11:09:12 
11:09:12 ------------ but was ------------
11:09:12 X.java:6: warning: [rawtypes] found raw type: Comparator\n
11:09:12 		Comparator comparator = new Comparator() {\n
11:09:12 		^\n
11:09:12   missing type arguments for generic class Comparator<T>\n
11:09:12   where T is a type-variable:\n
11:09:12     T extends Object declared in interface Comparator\n
11:09:12 X.java:6: warning: [rawtypes] found raw type: Comparator\n
11:09:12 		Comparator comparator = new Comparator() {\n
11:09:12 		                            ^\n
11:09:12   missing type arguments for generic class Comparator<T>\n
11:09:12   where T is a type-variable:\n
11:09:12     T extends Object declared in interface Comparator\n
11:09:12 X.java:12: warning: [rawtypes] found raw type: ArrayList\n
11:09:12 		Test.assertEquals("Test", comparator, new ArrayList(), new ArrayList());\n
11:09:12 		                                          ^\n
11:09:12   missing type arguments for generic class ArrayList<E>\n
11:09:12   where E is a type-variable:\n
11:09:12     E extends Object declared in class ArrayList\n
11:09:12 X.java:12: warning: [rawtypes] found raw type: ArrayList\n
11:09:12 		Test.assertEquals("Test", comparator, new ArrayList(), new ArrayList());\n
11:09:12 		                                                           ^\n
11:09:12   missing type arguments for generic class ArrayList<E>\n
11:09:12   where E is a type-variable:\n
11:09:12     E extends Object declared in class ArrayList\n
11:09:12 X.java:12: error: reference to assertEquals is ambiguous\n
11:09:12 		Test.assertEquals("Test", comparator, new ArrayList(), new ArrayList());\n
11:09:12 		    ^\n
11:09:12   both method <T#1>assertEquals(String,Comparator<T#1>,List<T#1>,List<T#1>) in Test and method <T#2>assertEquals(String,Comparator<T#2>,T#2,T#2) in Test match\n
11:09:12   where T#1,T#2 are type-variables:\n
11:09:12     T#1 extends Object declared in method <T#1>assertEquals(String,Comparator<T#1>,List<T#1>,List<T#1>)\n
11:09:12     T#2 extends Object declared in method <T#2>assertEquals(String,Comparator<T#2>,T#2,T#2)\n
11:09:12 X.java:12: warning: [unchecked] unchecked method invocation: method assertEquals in class Test is applied to given types\n
11:09:12 		Test.assertEquals("Test", comparator, new ArrayList(), new ArrayList());\n
11:09:12 		                 ^\n
11:09:12   required: String,Comparator<T>,List<T>,List<T>\n
11:09:12   found: String,Comparator,ArrayList,ArrayList\n
11:09:12   where T is a type-variable:\n
11:09:12     T extends Object declared in method <T>assertEquals(String,Comparator<T>,List<T>,List<T>)\n
11:09:12 X.java:12: warning: [unchecked] unchecked conversion\n
11:09:12 		Test.assertEquals("Test", comparator, new ArrayList(), new ArrayList());\n
11:09:12 		                          ^\n
11:09:12   required: Comparator<T>\n
11:09:12   found:    Comparator\n
11:09:12   where T is a type-variable:\n
11:09:12     T extends Object declared in method <T>assertEquals(String,Comparator<T>,List<T>,List<T>)\n
11:09:12 X.java:12: warning: [unchecked] unchecked conversion\n
11:09:12 		Test.assertEquals("Test", comparator, new ArrayList(), new ArrayList());\n
11:09:12 		                                      ^\n
11:09:12   required: List<T>\n
11:09:12   found:    ArrayList\n
11:09:12   where T is a type-variable:\n
11:09:12     T extends Object declared in method <T>assertEquals(String,Comparator<T>,List<T>,List<T>)\n
11:09:12 X.java:12: warning: [unchecked] unchecked conversion\n
11:09:12 		Test.assertEquals("Test", comparator, new ArrayList(), new ArrayList());\n
11:09:12 		                                                       ^\n
11:09:12   required: List<T>\n
11:09:12   found:    ArrayList\n
11:09:12   where T is a type-variable:\n
11:09:12     T extends Object declared in method <T>assertEquals(String,Comparator<T>,List<T>,List<T>)\n
11:09:12 1 error\n
11:09:12 8 warnings\n
11:09:12 
11:09:12 --------- Difference is ----------
11:09:12  expected:<[]> but was:<[X.java:6: warning: [rawtypes] found raw type: Comparator\n
11:09:12 		Comparator comparator = new Comparator() {\n
11:09:12 		^\n
11:09:12   missing type arguments for generic class Comparator<T>\n
11:09:12   where T is a type-variable:\n
11:09:12     T extends Object declared in interface Comparator\n
11:09:12 X.java:6: warning: [rawtypes] found raw type: Comparator\n
11:09:12 		Comparator comparator = new Comparator() {\n
11:09:12 		                            ^\n
11:09:12   missing type arguments for generic class Comparator<T>\n
11:09:12   where T is a type-variable:\n
11:09:12     T extends Object declared in interface Comparator\n
11:09:12 X.java:12: warning: [rawtypes] found raw type: ArrayList\n
11:09:12 		Test.assertEquals("Test", comparator, new ArrayList(), new ArrayList());\n
11:09:12 		                                          ^\n
11:09:12   missing type arguments for generic class ArrayList<E>\n
11:09:12   where E is a type-variable:\n
11:09:12     E extends Object declared in class ArrayList\n
11:09:12 X.java:12: warning: [rawtypes] found raw type: ArrayList\n
11:09:12 		Test.assertEquals("Test", comparator, new ArrayList(), new ArrayList());\n
11:09:12 		                                                           ^\n
11:09:12   missing type arguments for generic class ArrayList<E>\n
11:09:12   where E is a type-variable:\n
11:09:12     E extends Object declared in class ArrayList\n
11:09:12 X.java:12: error: reference to assertEquals is ambiguous\n
11:09:12 		Test.assertEquals("Test", comparator, new ArrayList(), new ArrayList());\n
11:09:12 		    ^\n
11:09:12   both method <T#1>assertEquals(String,Comparator<T#1>,List<T#1>,List<T#1>) in Test and method <T#2>assertEquals(String,Comparator<T#2>,T#2,T#2) in Test match\n
11:09:12   where T#1,T#2 are type-variables:\n
11:09:12     T#1 extends Object declared in method <T#1>assertEquals(String,Comparator<T#1>,List<T#1>,List<T#1>)\n
11:09:12     T#2 extends Object declared in method <T#2>assertEquals(String,Comparator<T#2>,T#2,T#2)\n
11:09:12 X.java:12: warning: [unchecked] unchecked method invocation: method assertEquals in class Test is applied to given types\n
11:09:12 		Test.assertEquals("Test", comparator, new ArrayList(), new ArrayList());\n
11:09:12 		                 ^\n
11:09:12   required: String,Comparator<T>,List<T>,List<T>\n
11:09:12   found: String,Comparator,ArrayList,ArrayList\n
11:09:12   where T is a type-variable:\n
11:09:12     T extends Object declared in method <T>assertEquals(String,Comparator<T>,List<T>,List<T>)\n
11:09:12 X.java:12: warning: [unchecked] unchecked conversion\n
11:09:12 		Test.assertEquals("Test", comparator, new ArrayList(), new ArrayList());\n
11:09:12 		                          ^\n
11:09:12   required: Comparator<T>\n
11:09:12   found:    Comparator\n
11:09:12   where T is a type-variable:\n
11:09:12     T extends Object declared in method <T>assertEquals(String,Comparator<T>,List<T>,List<T>)\n
11:09:12 X.java:12: warning: [unchecked] unchecked conversion\n
11:09:12 		Test.assertEquals("Test", comparator, new ArrayList(), new ArrayList());\n
11:09:12 		                                      ^\n
11:09:12   required: List<T>\n
11:09:12   found:    ArrayList\n
11:09:12   where T is a type-variable:\n
11:09:12     T extends Object declared in method <T>assertEquals(String,Comparator<T>,List<T>,List<T>)\n
11:09:12 X.java:12: warning: [unchecked] unchecked conversion\n
11:09:12 		Test.assertEquals("Test", comparator, new ArrayList(), new ArrayList());\n
11:09:12 		                                                       ^\n
11:09:12   required: List<T>\n
11:09:12   found:    ArrayList\n
11:09:12   where T is a type-variable:\n
11:09:12     T extends Object declared in method <T>assertEquals(String,Comparator<T>,List<T>,List<T>)\n
11:09:12 1 error\n
11:09:12 8 warnings\n
11:09:12 ]>
11:09:12   MethodVerifyTest>TestCase.runTest:964->testBug536978_comment2:14394->AbstractRegressionTest.runNegativeTest:2474->AbstractRegressionTest.runNegativeTest:2485->AbstractRegressionTest.runTest:2920->AbstractRegressionTest.runTest:3195->AbstractRegressionTest.runJavac:2350->AbstractRegressionTest.handleMismatch:2407->TestCase.assertEquals:242->TestCase.assertStringEquals:266 testBug536978_comment2 - Eclipse found error(s) but Javac only found warning(s).
11:09:12 ----------- Expected ------------
11:09:12 ----------\n
11:09:12 1. ERROR in SimpleDemo.java (at line 22)\n
11:09:12 	protected SimpleResult test(AbstractResult request) {\n
11:09:12 	          ^^^^^^^^^^^^\n
11:09:12 The return type is incompatible with AbstractDemo<Request,Response>.test(Request)\n
11:09:12 ----------\n
11:09:12 
11:09:12 ------------ but was ------------
11:09:12 SimpleDemo.java:22: warning: [unchecked] test(AbstractResult) in SimpleDemo overrides test(Request) in AbstractDemo\n
11:09:12     protected SimpleResult test(AbstractResult request) {\n
11:09:12                            ^\n
11:09:12   return type requires unchecked conversion from SimpleResult to Response#2\n
11:09:12   where Request,Response#1,Response#2 are type-variables:\n
11:09:12     Request extends AbstractResult declared in class AbstractDemo\n
11:09:12     Response#1 extends AbstractResult declared in class AbstractDemo\n
11:09:12     Response#2 extends AbstractResult declared in class SimpleDemo\n
11:09:12 1 warning\n
11:09:12 
11:09:12 --------- Difference is ----------
11:09:12  expected:<[----------\n
11:09:12 1. ERROR in SimpleDemo.java (at line 22)\n
11:09:12 	protected SimpleResult test(AbstractResult request) {\n
11:09:12 	          ^^^^^^^^^^^^\n
11:09:12 The return type is incompatible with AbstractDemo<Request,Response>.test(Request)\n
11:09:12 ----------]\n
11:09:12 > but was:<[SimpleDemo.java:22: warning: [unchecked] test(AbstractResult) in SimpleDemo overrides test(Request) in AbstractDemo\n
11:09:12     protected SimpleResult test(AbstractResult request) {\n
11:09:12                            ^\n
11:09:12   return type requires unchecked conversion from SimpleResult to Response#2\n
11:09:12   where Request,Response#1,Response#2 are type-variables:\n
11:09:12     Request extends AbstractResult declared in class AbstractDemo\n
11:09:12     Response#1 extends AbstractResult declared in class AbstractDemo\n
11:09:12     Response#2 extends AbstractResult declared in class SimpleDemo\n
11:09:12 1 warning]\n
11:09:12 >
11:09:12   NegativeTypeAnnotationTest>TestCase.runTest:964->test420038:4167->AbstractRegressionTest.runNegativeTest:2474->AbstractRegressionTest.runNegativeTest:2485->AbstractRegressionTest.runTest:2920->AbstractRegressionTest.runTest:3195->AbstractRegressionTest.runJavac:2350->AbstractRegressionTest.handleMismatch:2403->TestCase.assertEquals:242->TestCase.assertStringEquals:266 test420038 - Eclipse found error(s) but Javac did not find any.
11:09:12 ----------- Expected ------------
11:09:12 
11:09:12 ------------ but was ------------
11:09:12 ----------\n
11:09:12 1. ERROR in X.java (at line 8)\n
11:09:12 	Class<?> c = int @T [].class; \n
11:09:12 	                 ^^\n
11:09:12 Syntax error, type annotations are illegal here\n
11:09:12 ----------\n
11:09:12 
11:09:12 --------- Difference is ----------
11:09:12  expected:<[]> but was:<[----------\n
11:09:12 1. ERROR in X.java (at line 8)\n
11:09:12 	Class<?> c = int @T [].class; \n
11:09:12 	                 ^^\n
11:09:12 Syntax error, type annotations are illegal here\n
11:09:12 ----------\n
11:09:12 ]>
11:09:12   NullAnnotationTest>TestCase.runTest:964->testBug452780:7989->AbstractNullAnnotationTest.runConformTestWithLibs:181->AbstractNullAnnotationTest.runConformTestWithLibs:199->AbstractRegressionTest.runConformTest:3409->AbstractRegressionTest.runTest:2920->AbstractRegressionTest.runTest:3195->AbstractRegressionTest.runJavac:2350->AbstractRegressionTest.handleMismatch:2423->TestCase.assertEquals:242->TestCase.assertStringEquals:266 testBug452780 - Javac found warning(s) but Eclipse did not find any.
11:09:12 ----------- Expected ------------
11:09:12 
11:09:12 ------------ but was ------------
11:09:12 Tools2.java:12: warning: [varargs] Varargs method could cause heap pollution from non-reifiable varargs parameter ts\n
11:09:12 		List<@NonNull T> res = Arrays.asList(ts);\n
11:09:12 		                                     ^\n
11:09:12 1 warning\n
11:09:12 
11:09:12 --------- Difference is ----------
11:09:12  expected:<[]> but was:<[Tools2.java:12: warning: [varargs] Varargs method could cause heap pollution from non-reifiable varargs parameter ts\n
11:09:12 		List<@NonNull T> res = Arrays.asList(ts);\n
11:09:12 		                                     ^\n
11:09:12 1 warning\n
11:09:12 ]>
11:09:12   NullAnnotationTest>TestCase.runTest:964->test_default_nullness_002_custom:2354->AbstractRegressionTest.access$0:3038->AbstractRegressionTest.runTest:3195->AbstractRegressionTest.runJavac:2350->AbstractRegressionTest.handleMismatch:2403->TestCase.assertEquals:242->TestCase.assertStringEquals:266 test_default_nullness_002_custom - Eclipse found error(s) but Javac did not find any.
11:09:12 ----------- Expected ------------
11:09:12 
11:09:12 ------------ but was ------------
11:09:12 ----------\n
11:09:12 1. ERROR in Y.java (at line 5)\n
11:09:12 	@Nullable Object getObject(Object o) {\n
11:09:12 	^^^^^^^^^^^^^^^^\n
11:09:12 The return type is incompatible with '@NonNull Object' returned from X.getObject(Object) (mismatching null constraints)\n
11:09:12 ----------\n
11:09:12 2. ERROR in Y.java (at line 5)\n
11:09:12 	@Nullable Object getObject(Object o) {\n
11:09:12 	                           ^^^^^^\n
11:09:12 Illegal redefinition of parameter o, inherited method from X declares this parameter as @Nullable\n
11:09:12 ----------\n
11:09:12 
11:09:12 --------- Difference is ----------
11:09:12  expected:<[]> but was:<[----------\n
11:09:12 1. ERROR in Y.java (at line 5)\n
11:09:12 	@Nullable Object getObject(Object o) {\n
11:09:12 	^^^^^^^^^^^^^^^^\n
11:09:12 The return type is incompatible with '@NonNull Object' returned from X.getObject(Object) (mismatching null constraints)\n
11:09:12 ----------\n
11:09:12 2. ERROR in Y.java (at line 5)\n
11:09:12 	@Nullable Object getObject(Object o) {\n
11:09:12 	                           ^^^^^^\n
11:09:12 Illegal redefinition of parameter o, inherited method from X declares this parameter as @Nullable\n
11:09:12 ----------\n
11:09:12 ]>
11:09:12   NullAnnotationTest>TestCase.runTest:964->test_nullable_field_17:5450->AbstractNullAnnotationTest.runNegativeTestWithLibs:175->AbstractNullAnnotationTest.runNegativeTestWithLibs:153->AbstractNullAnnotationTest.runNegativeTestWithLibs:164->AbstractRegressionTest.runNegativeTest:3507->AbstractRegressionTest.runTest:2920->AbstractRegressionTest.runTest:3195->AbstractRegressionTest.runJavac:2350->AbstractRegressionTest.handleMismatch:2419->TestCase.assertEquals:242->TestCase.assertStringEquals:266 test_nullable_field_17 - Eclipse found warning(s) but Javac did not find any.
11:09:12 ----------- Expected ------------
11:09:12 
11:09:12 ------------ but was ------------
11:09:12 ----------\n
11:09:12 1. INFO in X.java (at line 5)\n
11:09:12 	return this.o.toString();\n
11:09:12 	            ^\n
11:09:12 Potential null pointer access: this expression has a '@Nullable' type\n
11:09:12 ----------\n
11:09:12 
11:09:12 --------- Difference is ----------
11:09:12  expected:<[]> but was:<[----------\n
11:09:12 1. INFO in X.java (at line 5)\n
11:09:12 	return this.o.toString();\n
11:09:12 	            ^\n
11:09:12 Potential null pointer access: this expression has a '@Nullable' type\n
11:09:12 ----------\n
11:09:12 ]>
11:09:12   NullTypeAnnotationTest>TestCase.runTest:964->testBug446442_4:7444->AbstractNullAnnotationTest.runConformTestWithLibs:181->AbstractNullAnnotationTest.runConformTestWithLibs:199->AbstractRegressionTest.runConformTest:3409->AbstractRegressionTest.runTest:2920->AbstractRegressionTest.runTest:3195->AbstractRegressionTest.runJavac:2350->AbstractRegressionTest.handleMismatch:2411->TestCase.assertEquals:242->TestCase.assertStringEquals:266 testBug446442_4 - Javac found error(s) but Eclipse did not find any.
11:09:12 ----------- Expected ------------
11:09:12 
11:09:12 ------------ but was ------------
11:09:12 Test.java:8: error: interface Baz inherits abstract and default for m(Integer) from types Foo and Foo\n
11:09:12 interface Baz extends Foo<Integer, Integer> {}\n
11:09:12 ^\n
11:09:12 1 error\n
11:09:12 
11:09:12 --------- Difference is ----------
11:09:12  expected:<[]> but was:<[Test.java:8: error: interface Baz inherits abstract and default for m(Integer) from types Foo and Foo\n
11:09:12 interface Baz extends Foo<Integer, Integer> {}\n
11:09:12 ^\n
11:09:12 1 error\n
11:09:12 ]>
11:09:12   NullTypeAnnotationTest>TestCase.runTest:964->testBug540264:17720->AbstractNullAnnotationTest.runNegativeTestWithLibs:175->AbstractNullAnnotationTest.runNegativeTestWithLibs:153->AbstractNullAnnotationTest.runNegativeTestWithLibs:164->AbstractRegressionTest.runNegativeTest:3507->AbstractRegressionTest.runTest:2920->AbstractRegressionTest.runTest:3195->AbstractRegressionTest.runJavac:2350->AbstractRegressionTest.handleMismatch:2454 testBug540264: unused excuse org.eclipse.jdt.core.tests.compiler.regression.AbstractRegressionTest$JavacTestOptions$Excuse@58fcb07b for compiler org.eclipse.jdt.core.tests.compiler.regression.AbstractRegressionTest$JavacCompiler@7866ffa
11:09:12   NullTypeAnnotationTest>TestCase.runTest:964->testDefault04_bin:5292->AbstractRegressionTest.access$0:3038->AbstractRegressionTest.runTest:3195->AbstractRegressionTest.runJavac:2350->AbstractRegressionTest.handleMismatch:2403->TestCase.assertEquals:242->TestCase.assertStringEquals:266 testDefault04_bin - Eclipse found error(s) but Javac did not find any.
11:09:12 ----------- Expected ------------
11:09:12 
11:09:12 ------------ but was ------------
11:09:12 ----------\n
11:09:12 1. ERROR in Y.java (at line 3)\n
11:09:12 	x.field = null; // ERR\n
11:09:12 	          ^^^^\n
11:09:12 Null type mismatch: required '@NonNull Number' but the provided value is null\n
11:09:12 ----------\n
11:09:12 
11:09:12 --------- Difference is ----------
11:09:12  expected:<[]> but was:<[----------\n
11:09:12 1. ERROR in Y.java (at line 3)\n
11:09:12 	x.field = null; // ERR\n
11:09:12 	          ^^^^\n
11:09:12 Null type mismatch: required '@NonNull Number' but the provided value is null\n
11:09:12 ----------\n
11:09:12 ]>
11:09:12   NullTypeAnnotationTest>TestCase.runTest:964->testDefault05_custom:4971->AbstractRegressionTest.access$0:3038->AbstractRegressionTest.runTest:3195->AbstractRegressionTest.runJavac:2350->AbstractRegressionTest.handleMismatch:2403->TestCase.assertEquals:242->TestCase.assertStringEquals:266 testDefault05_custom - Eclipse found error(s) but Javac did not find any.
11:09:12 ----------- Expected ------------
11:09:12 
11:09:12 ------------ but was ------------
11:09:12 ----------\n
11:09:12 1. ERROR in test\X.java (at line 3)\n
11:09:12 	Number field; // ERR since uninitialized\n
11:09:12 	       ^^^^^\n
11:09:12 The @NonNull field field may not have been initialized\n
11:09:12 ----------\n
11:09:12 
11:09:12 --------- Difference is ----------
11:09:12  expected:<[]> but was:<[----------\n
11:09:12 1. ERROR in test\X.java (at line 3)\n
11:09:12 	Number field; // ERR since uninitialized\n
11:09:12 	       ^^^^^\n
11:09:12 The @NonNull field field may not have been initialized\n
11:09:12 ----------\n
11:09:12 ]>
11:09:12   NullTypeAnnotationTest>TestCase.runTest:964->testDefault05_custom2:5016->AbstractRegressionTest.access$0:3038->AbstractRegressionTest.runTest:3195->AbstractRegressionTest.runJavac:2350->AbstractRegressionTest.handleMismatch:2403->TestCase.assertEquals:242->TestCase.assertStringEquals:266 testDefault05_custom2 - Eclipse found error(s) but Javac did not find any.
11:09:12 ----------- Expected ------------
11:09:12 
11:09:12 ------------ but was ------------
11:09:12 ----------\n
11:09:12 1. ERROR in test\X.java (at line 3)\n
11:09:12 	Number field; // ERR since uninitialized\n
11:09:12 	       ^^^^^\n
11:09:12 The @NonNull field field may not have been initialized\n
11:09:12 ----------\n
11:09:12 
11:09:12 --------- Difference is ----------
11:09:12  expected:<[]> but was:<[----------\n
11:09:12 1. ERROR in test\X.java (at line 3)\n
11:09:12 	Number field; // ERR since uninitialized\n
11:09:12 	       ^^^^^\n
11:09:12 The @NonNull field field may not have been initialized\n
11:09:12 ----------\n
11:09:12 ]>
11:09:12   PolymorphicSignatureTest>TestCase.runTest:964->testBug475996:91->AbstractRegressionTest.runConformTest:1636->AbstractRegressionTest.runTest:2920->AbstractRegressionTest.runTest:3195->AbstractRegressionTest.runJavac:2350->AbstractRegressionTest.handleMismatch:2411->TestCase.assertEquals:242->TestCase.assertStringEquals:266 testBug475996 - Javac found error(s) but Eclipse did not find any.
11:09:12 ----------- Expected ------------
11:09:12 
11:09:12 ------------ but was ------------
11:09:12 X.java:1: error: cannot find symbol\n
11:09:12 import java.lang.invoke.VarHandle;\n
11:09:12                        ^\n
11:09:12   symbol:   class VarHandle\n
11:09:12   location: package java.lang.invoke\n
11:09:12 X.java:5: error: cannot find symbol\n
11:09:12 	VarHandle RESULT;\n
11:09:12 	^\n
11:09:12   symbol:   class VarHandle\n
11:09:12   location: class X<T>\n
11:09:12   where T is a type-variable:\n
11:09:12     T extends Object declared in class X\n
11:09:12 2 errors\n
11:09:12 
11:09:12 --------- Difference is ----------
11:09:12  expected:<[]> but was:<[X.java:1: error: cannot find symbol\n
11:09:12 import java.lang.invoke.VarHandle;\n
11:09:12                        ^\n
11:09:12   symbol:   class VarHandle\n
11:09:12   location: package java.lang.invoke\n
11:09:12 X.java:5: error: cannot find symbol\n
11:09:12 	VarHandle RESULT;\n
11:09:12 	^\n
11:09:12   symbol:   class VarHandle\n
11:09:12   location: class X<T>\n
11:09:12   where T is a type-variable:\n
11:09:12     T extends Object declared in class X\n
11:09:12 2 errors\n
11:09:12 ]>
11:09:12   ProblemConstructorTest>TestCase.runTest:964->test004:151->AbstractRegressionTest.runNegativeTest:2474->AbstractRegressionTest.runNegativeTest:2485->AbstractRegressionTest.runTest:2920->AbstractRegressionTest.runTest:3195->AbstractRegressionTest.runJavac:2350->AbstractRegressionTest.handleMismatch:2419->TestCase.assertEquals:242->TestCase.assertStringEquals:266 test004 - Eclipse found warning(s) but Javac did not find any.
11:09:12 ----------- Expected ------------
11:09:12 
11:09:12 ------------ but was ------------
11:09:12 ----------\n
11:09:12 1. WARNING in X.java (at line 4)\n
11:09:12 	public int unusedMethod() { return this.state; }\n
11:09:12 	           ^^^^^^^^^^^^^^\n
11:09:12 The method unusedMethod() from the type X.M is never used locally\n
11:09:12 ----------\n
11:09:12 2. WARNING in X.java (at line 5)\n
11:09:12 	public M (int state) { this.state = state;} \n
11:09:12 	       ^^^^^^^^^^^^^\n
11:09:12 The constructor X.M(int) is never used locally\n
11:09:12 ----------\n
11:09:12 3. WARNING in X.java (at line 6)\n
11:09:12 	public int unusedField = 0;\n
11:09:12 	           ^^^^^^^^^^^\n
11:09:12 The value of the field X.M.unusedField is not used\n
11:09:12 ----------\n
11:09:12 4. WARNING in X.java (at line 7)\n
11:09:12 	public class N {}\n
11:09:12 	             ^\n
11:09:12 The type X.M.N is never used locally\n
11:09:12 ----------\n
11:09:12 
11:09:12 --------- Difference is ----------
11:09:12  expected:<[]> but was:<[----------\n
11:09:12 1. WARNING in X.java (at line 4)\n
11:09:12 	public int unusedMethod() { return this.state; }\n
11:09:12 	           ^^^^^^^^^^^^^^\n
11:09:12 The method unusedMethod() from the type X.M is never used locally\n
11:09:12 ----------\n
11:09:12 2. WARNING in X.java (at line 5)\n
11:09:12 	public M (int state) { this.state = state;} \n
11:09:12 	       ^^^^^^^^^^^^^\n
11:09:12 The constructor X.M(int) is never used locally\n
11:09:12 ----------\n
11:09:12 3. WARNING in X.java (at line 6)\n
11:09:12 	public int unusedField = 0;\n
11:09:12 	           ^^^^^^^^^^^\n
11:09:12 The value of the field X.M.unusedField is not used\n
11:09:12 ----------\n
11:09:12 4. WARNING in X.java (at line 7)\n
11:09:12 	public class N {}\n
11:09:12 	             ^\n
11:09:12 The type X.M.N is never used locally\n
11:09:12 ----------\n
11:09:12 ]>
11:09:12   ProblemConstructorTest>TestCase.runTest:964->test005:223->AbstractRegressionTest.runNegativeTest:2474->AbstractRegressionTest.runNegativeTest:2485->AbstractRegressionTest.runTest:2920->AbstractRegressionTest.runTest:3195->AbstractRegressionTest.runJavac:2350->AbstractRegressionTest.handleMismatch:2419->TestCase.assertEquals:242->TestCase.assertStringEquals:266 test005 - Eclipse found warning(s) but Javac did not find any.
11:09:12 ----------- Expected ------------
11:09:12 
11:09:12 ------------ but was ------------
11:09:12 ----------\n
11:09:12 1. WARNING in A.java (at line 3)\n
11:09:12 	B.test();\n
11:09:12 	^^^^^^^^\n
11:09:12 Access to enclosing method test() from the type A.B is emulated by a synthetic accessor method\n
11:09:12 ----------\n
11:09:12 
11:09:12 --------- Difference is ----------
11:09:12  expected:<[]> but was:<[----------\n
11:09:12 1. WARNING in A.java (at line 3)\n
11:09:12 	B.test();\n
11:09:12 	^^^^^^^^\n
11:09:12 Access to enclosing method test() from the type A.B is emulated by a synthetic accessor method\n
11:09:12 ----------\n
11:09:12 ]>
11:09:12   ProblemConstructorTest>TestCase.runTest:964->test006:256->AbstractRegressionTest.runNegativeTest:2474->AbstractRegressionTest.runNegativeTest:2485->AbstractRegressionTest.runTest:2920->AbstractRegressionTest.runTest:3195->AbstractRegressionTest.runJavac:2350->AbstractRegressionTest.handleMismatch:2419->TestCase.assertEquals:242->TestCase.assertStringEquals:266 test006 - Eclipse found warning(s) but Javac did not find any.
11:09:12 ----------- Expected ------------
11:09:12 
11:09:12 ------------ but was ------------
11:09:12 ----------\n
11:09:12 1. WARNING in A.java (at line 3)\n
11:09:12 	B.test();\n
11:09:12 	^^^^^^^^\n
11:09:12 Access to enclosing method test() from the type A.B is emulated by a synthetic accessor method\n
11:09:12 ----------\n
11:09:12 2. WARNING in A.java (at line 8)\n
11:09:12 	public B () { super(""); }\n
11:09:12 	       ^^^^\n
11:09:12 The constructor A.B() is never used locally\n
11:09:12 ----------\n
11:09:12 
11:09:12 --------- Difference is ----------
11:09:12  expected:<[]> but was:<[----------\n
11:09:12 1. WARNING in A.java (at line 3)\n
11:09:12 	B.test();\n
11:09:12 	^^^^^^^^\n
11:09:12 Access to enclosing method test() from the type A.B is emulated by a synthetic accessor method\n
11:09:12 ----------\n
11:09:12 2. WARNING in A.java (at line 8)\n
11:09:12 	public B () { super(""); }\n
11:09:12 	       ^^^^\n
11:09:12 The constructor A.B() is never used locally\n
11:09:12 ----------\n
11:09:12 ]>
11:09:12   ProblemConstructorTest>TestCase.runTest:964->test009:316->AbstractRegressionTest.runNegativeTest:2474->AbstractRegressionTest.runNegativeTest:2485->AbstractRegressionTest.runTest:2920->AbstractRegressionTest.runTest:3195->AbstractRegressionTest.runJavac:2350->AbstractRegressionTest.handleMismatch:2419->TestCase.assertEquals:242->TestCase.assertStringEquals:266 test009 - Eclipse found warning(s) but Javac did not find any.
11:09:12 ----------- Expected ------------
11:09:12 
11:09:12 ------------ but was ------------
11:09:12 ----------\n
11:09:12 1. WARNING in A.java (at line 7)\n
11:09:12 	public B () { super(""); }\n
11:09:12 	       ^^^^\n
11:09:12 The constructor C.B() is never used locally\n
11:09:12 ----------\n
11:09:12 
11:09:12 --------- Difference is ----------
11:09:12  expected:<[]> but was:<[----------\n
11:09:12 1. WARNING in A.java (at line 7)\n
11:09:12 	public B () { super(""); }\n
11:09:12 	       ^^^^\n
11:09:12 The constructor C.B() is never used locally\n
11:09:12 ----------\n
11:09:12 ]>
11:09:12   ProblemConstructorTest>TestCase.runTest:964->test408038a:344->AbstractRegressionTest.runNegativeTest:2592->AbstractRegressionTest.runNegativeTest:2601->AbstractRegressionTest.runTest:2920->AbstractRegressionTest.runTest:3195->AbstractRegressionTest.runJavac:2350->AbstractRegressionTest.handleMismatch:2419->TestCase.assertEquals:242->TestCase.assertStringEquals:266 test408038a - Eclipse found warning(s) but Javac did not find any.
11:09:12 ----------- Expected ------------
11:09:12 
11:09:12 ------------ but was ------------
11:09:12 ----------\n
11:09:12 1. WARNING in X.java (at line 4)\n
11:09:12 	public Y() {}\n
11:09:12 	       ^^^\n
11:09:12 The constructor X.Y() is never used locally\n
11:09:12 ----------\n
11:09:12 
11:09:12 --------- Difference is ----------
11:09:12  expected:<[]> but was:<[----------\n
11:09:12 1. WARNING in X.java (at line 4)\n
11:09:12 	public Y() {}\n
11:09:12 	       ^^^\n
11:09:12 The constructor X.Y() is never used locally\n
11:09:12 ----------\n
11:09:12 ]>
11:09:12   ProblemConstructorTest>TestCase.runTest:964->test408038b:376->AbstractRegressionTest.runNegativeTest:2592->AbstractRegressionTest.runNegativeTest:2601->AbstractRegressionTest.runTest:2920->AbstractRegressionTest.runTest:3195->AbstractRegressionTest.runJavac:2350->AbstractRegressionTest.handleMismatch:2419->TestCase.assertEquals:242->TestCase.assertStringEquals:266 test408038b - Eclipse found warning(s) but Javac did not find any.
11:09:12 ----------- Expected ------------
11:09:12 
11:09:12 ------------ but was ------------
11:09:12 ----------\n
11:09:12 1. WARNING in X.java (at line 4)\n
11:09:12 	public Y() {}\n
11:09:12 	       ^^^\n
11:09:12 The constructor X.Y() is never used locally\n
11:09:12 ----------\n
11:09:12 
11:09:12 --------- Difference is ----------
11:09:12  expected:<[]> but was:<[----------\n
11:09:12 1. WARNING in X.java (at line 4)\n
11:09:12 	public Y() {}\n
11:09:12 	       ^^^\n
11:09:12 The constructor X.Y() is never used locally\n
11:09:12 ----------\n
11:09:12 ]>
11:09:12   ProblemConstructorTest>TestCase.runTest:964->test408038c:408->AbstractRegressionTest.runNegativeTest:2592->AbstractRegressionTest.runNegativeTest:2601->AbstractRegressionTest.runTest:2920->AbstractRegressionTest.runTest:3195->AbstractRegressionTest.runJavac:2350->AbstractRegressionTest.handleMismatch:2423->TestCase.assertEquals:242->TestCase.assertStringEquals:266 test408038c - Javac found warning(s) but Eclipse did not find any.
11:09:12 ----------- Expected ------------
11:09:12 
11:09:12 ------------ but was ------------
11:09:12 X.java:6: warning: [serial] serializable class Y has no definition of serialVersionUID\n
11:09:12 	private static class Y implements Externalizable {\n
11:09:12 	               ^\n
11:09:12 1 warning\n
11:09:12 
11:09:12 --------- Difference is ----------
11:09:12  expected:<[]> but was:<[X.java:6: warning: [serial] serializable class Y has no definition of serialVersionUID\n
11:09:12 	private static class Y implements Externalizable {\n
11:09:12 	               ^\n
11:09:12 1 warning\n
11:09:12 ]>
11:09:12   ProblemConstructorTest>TestCase.runTest:964->test408038e:492->AbstractRegressionTest.runNegativeTest:2474->AbstractRegressionTest.runNegativeTest:2485->AbstractRegressionTest.runTest:2920->AbstractRegressionTest.runTest:3195->AbstractRegressionTest.runJavac:2350->AbstractRegressionTest.handleMismatch:2419->TestCase.assertEquals:242->TestCase.assertStringEquals:266 test408038e - Eclipse found warning(s) but Javac did not find any.
11:09:12 ----------- Expected ------------
11:09:12 
11:09:12 ------------ but was ------------
11:09:12 ----------\n
11:09:12 1. WARNING in X.java (at line 3)\n
11:09:12 	private X(int x) {i = x;}\n
11:09:12 	        ^^^^^^^^\n
11:09:12 The constructor X(int) is never used locally\n
11:09:12 ----------\n
11:09:12 
11:09:12 --------- Difference is ----------
11:09:12  expected:<[]> but was:<[----------\n
11:09:12 1. WARNING in X.java (at line 3)\n
11:09:12 	private X(int x) {i = x;}\n
11:09:12 	        ^^^^^^^^\n
11:09:12 The constructor X(int) is never used locally\n
11:09:12 ----------\n
11:09:12 ]>
11:09:12   ProblemTypeAndMethodTest>TestCase.runTest:964->test376550_11:8188->AbstractRegressionTest.access$0:3038->AbstractRegressionTest.runTest:3195->AbstractRegressionTest.runJavac:2350->AbstractRegressionTest.handleMismatch:2454 test376550_11: unused excuse org.eclipse.jdt.core.tests.compiler.regression.AbstractRegressionTest$JavacTestOptions$Excuse@1f5a1ad4 for compiler org.eclipse.jdt.core.tests.compiler.regression.AbstractRegressionTest$JavacCompiler@7866ffa
11:09:12   ProblemTypeAndMethodTest>TestCase.runTest:964->testBug542829:8789->AbstractRegressionTest.access$0:3038->AbstractRegressionTest.runTest:3195->AbstractRegressionTest.runJavac:2350->AbstractRegressionTest.handleMismatch:2411->TestCase.assertEquals:242->TestCase.assertStringEquals:266 testBug542829 - Javac found error(s) but Eclipse did not find any.
11:09:12 ----------- Expected ------------
11:09:12 
11:09:12 ------------ but was ------------
11:09:12 ./b/Roken.java:4: error: getGood() is not public in Issing; cannot be accessed from outside package\n
11:09:12 		return provider.getGood();\n
11:09:12 		               ^\n
11:09:12 1 error\n
11:09:12 
11:09:12 --------- Difference is ----------
11:09:12  expected:<[]> but was:<[./b/Roken.java:4: error: getGood() is not public in Issing; cannot be accessed from outside package\n
11:09:12 		return provider.getGood();\n
11:09:12 		               ^\n
11:09:12 1 error\n
11:09:12 ]>
11:09:12   ProgrammingProblemsTest>TestCase.runTest:964->test0041:1578->AbstractRegressionTest.runNegativeTest:2474->AbstractRegressionTest.runNegativeTest:2485->AbstractRegressionTest.runTest:2920->AbstractRegressionTest.runTest:3195->AbstractRegressionTest.runJavac:2350->AbstractRegressionTest.handleMismatch:2419->TestCase.assertEquals:242->TestCase.assertStringEquals:266 test0041 - Eclipse found warning(s) but Javac did not find any.
11:09:12 ----------- Expected ------------
11:09:12 
11:09:12 ------------ but was ------------
11:09:12 ----------\n
11:09:12 1. WARNING in X.java (at line 3)\n
11:09:12 	System.out.println(1.0 == 1.0);\n
11:09:12 	                   ^^^^^^^^^^\n
11:09:12 Comparing identical expressions\n
11:09:12 ----------\n
11:09:12 2. WARNING in X.java (at line 4)\n
11:09:12 	System.out.println(1.0f == 1.0f);\n
11:09:12 	                   ^^^^^^^^^^^^\n
11:09:12 Comparing identical expressions\n
11:09:12 ----------\n
11:09:12 
11:09:12 --------- Difference is ----------
11:09:12  expected:<[]> but was:<[----------\n
11:09:12 1. WARNING in X.java (at line 3)\n
11:09:12 	System.out.println(1.0 == 1.0);\n
11:09:12 	                   ^^^^^^^^^^\n
11:09:12 Comparing identical expressions\n
11:09:12 ----------\n
11:09:12 2. WARNING in X.java (at line 4)\n
11:09:12 	System.out.println(1.0f == 1.0f);\n
11:09:12 	                   ^^^^^^^^^^^^\n
11:09:12 Comparing identical expressions\n
11:09:12 ----------\n
11:09:12 ]>
11:09:12   ProgrammingProblemsTest>TestCase.runTest:964->test0044:1657->AbstractRegressionTest.runNegativeTest:2474->AbstractRegressionTest.runNegativeTest:2485->AbstractRegressionTest.runTest:2920->AbstractRegressionTest.runTest:3195->AbstractRegressionTest.runJavac:2350->AbstractRegressionTest.handleMismatch:2419->TestCase.assertEquals:242->TestCase.assertStringEquals:266 test0044 - Eclipse found warning(s) but Javac did not find any.
11:09:12 ----------- Expected ------------
11:09:12 
11:09:12 ------------ but was ------------
11:09:12 ----------\n
11:09:12 1. WARNING in X.java (at line 6)\n
11:09:12 	nvx = nvx;\n
11:09:12 	^^^^^^^^^\n
11:09:12 The assignment to variable nvx has no effect\n
11:09:12 ----------\n
11:09:12 
11:09:12 --------- Difference is ----------
11:09:12  expected:<[]> but was:<[----------\n
11:09:12 1. WARNING in X.java (at line 6)\n
11:09:12 	nvx = nvx;\n
11:09:12 	^^^^^^^^^\n
11:09:12 The assignment to variable nvx has no effect\n
11:09:12 ----------\n
11:09:12 ]>
11:09:12   ProgrammingProblemsTest>TestCase.runTest:964->test0045:1678->AbstractRegressionTest.runNegativeTest:2474->AbstractRegressionTest.runNegativeTest:2485->AbstractRegressionTest.runTest:2920->AbstractRegressionTest.runTest:3195->AbstractRegressionTest.runJavac:2350->AbstractRegressionTest.handleMismatch:2419->TestCase.assertEquals:242->TestCase.assertStringEquals:266 test0045 - Eclipse found warning(s) but Javac did not find any.
11:09:12 ----------- Expected ------------
11:09:12 
11:09:12 ------------ but was ------------
11:09:12 ----------\n
11:09:12 1. WARNING in X.java (at line 2)\n
11:09:12 	volatile int x = this.x;\n
11:09:12 	             ^^^^^^^^^^\n
11:09:12 The assignment to variable x has no effect\n
11:09:12 ----------\n
11:09:12 2. WARNING in X.java (at line 3)\n
11:09:12 	int nvx = this.nvx;\n
11:09:12 	    ^^^^^^^^^^^^^^\n
11:09:12 The assignment to variable nvx has no effect\n
11:09:12 ----------\n
11:09:12 
11:09:12 --------- Difference is ----------
11:09:12  expected:<[]> but was:<[----------\n
11:09:12 1. WARNING in X.java (at line 2)\n
11:09:12 	volatile int x = this.x;\n
11:09:12 	             ^^^^^^^^^^\n
11:09:12 The assignment to variable x has no effect\n
11:09:12 ----------\n
11:09:12 2. WARNING in X.java (at line 3)\n
11:09:12 	int nvx = this.nvx;\n
11:09:12 	    ^^^^^^^^^^^^^^\n
11:09:12 The assignment to variable nvx has no effect\n
11:09:12 ----------\n
11:09:12 ]>
11:09:12   ProgrammingProblemsTest>TestCase.runTest:964->test0046:1706->AbstractRegressionTest.runNegativeTest:2592->AbstractRegressionTest.runNegativeTest:2601->AbstractRegressionTest.runTest:2920->AbstractRegressionTest.runTest:3195->AbstractRegressionTest.runJavac:2350->AbstractRegressionTest.handleMismatch:2419->TestCase.assertEquals:242->TestCase.assertStringEquals:266 test0046 - Eclipse found warning(s) but Javac did not find any.
11:09:12 ----------- Expected ------------
11:09:12 
11:09:12 ------------ but was ------------
11:09:12 ----------\n
11:09:12 1. WARNING in X.java (at line 4)\n
11:09:12 	boolean b=false;\n
11:09:12 	        ^\n
11:09:12 The value of the local variable b is not used\n
11:09:12 ----------\n
11:09:12 2. WARNING in X.java (at line 6)\n
11:09:12 	int k = 2;\n
11:09:12 	    ^\n
11:09:12 The value of the local variable k is not used\n
11:09:12 ----------\n
11:09:12 
11:09:12 --------- Difference is ----------
11:09:12  expected:<[]> but was:<[----------\n
11:09:12 1. WARNING in X.java (at line 4)\n
11:09:12 	boolean b=false;\n
11:09:12 	        ^\n
11:09:12 The value of the local variable b is not used\n
11:09:12 ----------\n
11:09:12 2. WARNING in X.java (at line 6)\n
11:09:12 	int k = 2;\n
11:09:12 	    ^\n
11:09:12 The value of the local variable k is not used\n
11:09:12 ----------\n
11:09:12 ]>
11:09:12   ProgrammingProblemsTest>TestCase.runTest:964->test0046_field:1746->AbstractRegressionTest.runNegativeTest:2592->AbstractRegressionTest.runNegativeTest:2601->AbstractRegressionTest.runTest:2920->AbstractRegressionTest.runTest:3195->AbstractRegressionTest.runJavac:2350->AbstractRegressionTest.handleMismatch:2419->TestCase.assertEquals:242->TestCase.assertStringEquals:266 test0046_field - Eclipse found warning(s) but Javac did not find any.
11:09:12 ----------- Expected ------------
11:09:12 
11:09:12 ------------ but was ------------
11:09:12 ----------\n
11:09:12 1. WARNING in X.java (at line 3)\n
11:09:12 	private boolean b=false;\n
11:09:12 	                ^\n
11:09:12 The value of the field X.b is not used\n
11:09:12 ----------\n
11:09:12 2. WARNING in X.java (at line 4)\n
11:09:12 	private int k = 2;\n
11:09:12 	            ^\n
11:09:12 The value of the field X.k is not used\n
11:09:12 ----------\n
11:09:12 
11:09:12 --------- Difference is ----------
11:09:12  expected:<[]> but was:<[----------\n
11:09:12 1. WARNING in X.java (at line 3)\n
11:09:12 	private boolean b=false;\n
11:09:12 	                ^\n
11:09:12 The value of the field X.b is not used\n
11:09:12 ----------\n
11:09:12 2. WARNING in X.java (at line 4)\n
11:09:12 	private int k = 2;\n
11:09:12 	            ^\n
11:09:12 The value of the field X.k is not used\n
11:09:12 ----------\n
11:09:12 ]>
11:09:12   ProgrammingProblemsTest>TestCase.runTest:964->test0046_field_in_private_type:1865->AbstractRegressionTest.runNegativeTest:2592->AbstractRegressionTest.runNegativeTest:2601->AbstractRegressionTest.runTest:2920->AbstractRegressionTest.runTest:3195->AbstractRegressionTest.runJavac:2350->AbstractRegressionTest.handleMismatch:2419->TestCase.assertEquals:242->TestCase.assertStringEquals:266 test0046_field_in_private_type - Eclipse found warning(s) but Javac did not find any.
11:09:12 ----------- Expected ------------
11:09:12 
11:09:12 ------------ but was ------------
11:09:12 ----------\n
11:09:12 1. WARNING in X.java (at line 4)\n
11:09:12 	public boolean b=false;\n
11:09:12 	               ^\n
11:09:12 The value of the field X.Y.b is not used\n
11:09:12 ----------\n
11:09:12 2. WARNING in X.java (at line 5)\n
11:09:12 	protected int k = 2;\n
11:09:12 	              ^\n
11:09:12 The value of the field X.Y.k is not used\n
11:09:12 ----------\n
11:09:12 
11:09:12 --------- Difference is ----------
11:09:12  expected:<[]> but was:<[----------\n
11:09:12 1. WARNING in X.java (at line 4)\n
11:09:12 	public boolean b=false;\n
11:09:12 	               ^\n
11:09:12 The value of the field X.Y.b is not used\n
11:09:12 ----------\n
11:09:12 2. WARNING in X.java (at line 5)\n
11:09:12 	protected int k = 2;\n
11:09:12 	              ^\n
11:09:12 The value of the field X.Y.k is not used\n
11:09:12 ----------\n
11:09:12 ]>
11:09:12   ProgrammingProblemsTest>TestCase.runTest:964->test0046_field_qualified:1825->AbstractRegressionTest.runNegativeTest:2592->AbstractRegressionTest.runNegativeTest:2601->AbstractRegressionTest.runTest:2920->AbstractRegressionTest.runTest:3195->AbstractRegressionTest.runJavac:2350->AbstractRegressionTest.handleMismatch:2419->TestCase.assertEquals:242->TestCase.assertStringEquals:266 test0046_field_qualified - Eclipse found warning(s) but Javac did not find any.
11:09:12 ----------- Expected ------------
11:09:12 
11:09:12 ------------ but was ------------
11:09:12 ----------\n
11:09:12 1. WARNING in X.java (at line 3)\n
11:09:12 	private boolean b=false;\n
11:09:12 	                ^\n
11:09:12 The value of the field X.b is not used\n
11:09:12 ----------\n
11:09:12 2. WARNING in X.java (at line 4)\n
11:09:12 	private int k = 2;\n
11:09:12 	            ^\n
11:09:12 The value of the field X.k is not used\n
11:09:12 ----------\n
11:09:12 
11:09:12 --------- Difference is ----------
11:09:12  expected:<[]> but was:<[----------\n
11:09:12 1. WARNING in X.java (at line 3)\n
11:09:12 	private boolean b=false;\n
11:09:12 	                ^\n
11:09:12 The value of the field X.b is not used\n
11:09:12 ----------\n
11:09:12 2. WARNING in X.java (at line 4)\n
11:09:12 	private int k = 2;\n
11:09:12 	            ^\n
11:09:12 The value of the field X.k is not used\n
11:09:12 ----------\n
11:09:12 ]>
11:09:12   ProgrammingProblemsTest>TestCase.runTest:964->test0046_field_this_qualified:1785->AbstractRegressionTest.runNegativeTest:2592->AbstractRegressionTest.runNegativeTest:2601->AbstractRegressionTest.runTest:2920->AbstractRegressionTest.runTest:3195->AbstractRegressionTest.runJavac:2350->AbstractRegressionTest.handleMismatch:2419->TestCase.assertEquals:242->TestCase.assertStringEquals:266 test0046_field_this_qualified - Eclipse found warning(s) but Javac did not find any.
11:09:12 ----------- Expected ------------
11:09:12 
11:09:12 ------------ but was ------------
11:09:12 ----------\n
11:09:12 1. WARNING in X.java (at line 3)\n
11:09:12 	private boolean b=false;\n
11:09:12 	                ^\n
11:09:12 The value of the field X.b is not used\n
11:09:12 ----------\n
11:09:12 2. WARNING in X.java (at line 4)\n
11:09:12 	private int k = 2;\n
11:09:12 	            ^\n
11:09:12 The value of the field X.k is not used\n
11:09:12 ----------\n
11:09:12 
11:09:12 --------- Difference is ----------
11:09:12  expected:<[]> but was:<[----------\n
11:09:12 1. WARNING in X.java (at line 3)\n
11:09:12 	private boolean b=false;\n
11:09:12 	                ^\n
11:09:12 The value of the field X.b is not used\n
11:09:12 ----------\n
11:09:12 2. WARNING in X.java (at line 4)\n
11:09:12 	private int k = 2;\n
11:09:12 	            ^\n
11:09:12 The value of the field X.k is not used\n
11:09:12 ----------\n
11:09:12 ]>
11:09:12   ProgrammingProblemsTest>TestCase.runTest:964->test0047:1908->AbstractRegressionTest.runNegativeTest:2592->AbstractRegressionTest.runNegativeTest:2601->AbstractRegressionTest.runTest:2920->AbstractRegressionTest.runTest:3195->AbstractRegressionTest.runJavac:2350->AbstractRegressionTest.handleMismatch:2419->TestCase.assertEquals:242->TestCase.assertStringEquals:266 test0047 - Eclipse found warning(s) but Javac did not find any.
11:09:12 ----------- Expected ------------
11:09:12 
11:09:12 ------------ but was ------------
11:09:12 ----------\n
11:09:12 1. WARNING in X.java (at line 2)\n
11:09:12 	void foo(int param1, int param2, Integer param3) {\n
11:09:12 	             ^^^^^^\n
11:09:12 The value of the parameter param1 is not used\n
11:09:12 ----------\n
11:09:12 2. WARNING in X.java (at line 2)\n
11:09:12 	void foo(int param1, int param2, Integer param3) {\n
11:09:12 	                         ^^^^^^\n
11:09:12 The value of the parameter param2 is not used\n
11:09:12 ----------\n
11:09:12 3. WARNING in X.java (at line 3)\n
11:09:12 	boolean b=false;\n
11:09:12 	        ^\n
11:09:12 The value of the local variable b is not used\n
11:09:12 ----------\n
11:09:12 
11:09:12 --------- Difference is ----------
11:09:12  expected:<[]> but was:<[----------\n
11:09:12 1. WARNING in X.java (at line 2)\n
11:09:12 	void foo(int param1, int param2, Integer param3) {\n
11:09:12 	             ^^^^^^\n
11:09:12 The value of the parameter param1 is not used\n
11:09:12 ----------\n
11:09:12 2. WARNING in X.java (at line 2)\n
11:09:12 	void foo(int param1, int param2, Integer param3) {\n
11:09:12 	                         ^^^^^^\n
11:09:12 The value of the parameter param2 is not used\n
11:09:12 ----------\n
11:09:12 3. WARNING in X.java (at line 3)\n
11:09:12 	boolean b=false;\n
11:09:12 	        ^\n
11:09:12 The value of the local variable b is not used\n
11:09:12 ----------\n
11:09:12 ]>
11:09:12   ProgrammingProblemsTest>TestCase.runTest:964->test0048:1954->AbstractRegressionTest.runNegativeTest:2592->AbstractRegressionTest.runNegativeTest:2601->AbstractRegressionTest.runTest:2920->AbstractRegressionTest.runTest:3195->AbstractRegressionTest.runJavac:2350->AbstractRegressionTest.handleMismatch:2419->TestCase.assertEquals:242->TestCase.assertStringEquals:266 test0048 - Eclipse found warning(s) but Javac did not find any.
11:09:12 ----------- Expected ------------
11:09:12 
11:09:12 ------------ but was ------------
11:09:12 ----------\n
11:09:12 1. WARNING in X.java (at line 3)\n
11:09:12 	boolean b=false;\n
11:09:12 	        ^\n
11:09:12 The value of the local variable b is not used\n
11:09:12 ----------\n
11:09:12 2. WARNING in X.java (at line 9)\n
11:09:12 	public void foo(int param1, int param2) {\n
11:09:12 	                    ^^^^^^\n
11:09:12 The value of the parameter param1 is not used\n
11:09:12 ----------\n
11:09:12 3. WARNING in X.java (at line 9)\n
11:09:12 	public void foo(int param1, int param2) {\n
11:09:12 	                                ^^^^^^\n
11:09:12 The value of the parameter param2 is not used\n
11:09:12 ----------\n
11:09:12 4. WARNING in X.java (at line 10)\n
11:09:12 	boolean b=false;\n
11:09:12 	        ^\n
11:09:12 The value of the local variable b is not used\n
11:09:12 ----------\n
11:09:12 
11:09:12 --------- Difference is ----------
11:09:12  expected:<[]> but was:<[----------\n
11:09:12 1. WARNING in X.java (at line 3)\n
11:09:12 	boolean b=false;\n
11:09:12 	        ^\n
11:09:12 The value of the local variable b is not used\n
11:09:12 ----------\n
11:09:12 2. WARNING in X.java (at line 9)\n
11:09:12 	public void foo(int param1, int param2) {\n
11:09:12 	                    ^^^^^^\n
11:09:12 The value of the parameter param1 is not used\n
11:09:12 ----------\n
11:09:12 3. WARNING in X.java (at line 9)\n
11:09:12 	public void foo(int param1, int param2) {\n
11:09:12 	                                ^^^^^^\n
11:09:12 The value of the parameter param2 is not used\n
11:09:12 ----------\n
11:09:12 4. WARNING in X.java (at line 10)\n
11:09:12 	boolean b=false;\n
11:09:12 	        ^\n
11:09:12 The value of the local variable b is not used\n
11:09:12 ----------\n
11:09:12 ]>
11:09:12   ProgrammingProblemsTest>TestCase.runTest:964->test0049:2019->AbstractRegressionTest.runNegativeTest:2592->AbstractRegressionTest.runNegativeTest:2601->AbstractRegressionTest.runTest:2920->AbstractRegressionTest.runTest:3195->AbstractRegressionTest.runJavac:2350->AbstractRegressionTest.handleMismatch:2419->TestCase.assertEquals:242->TestCase.assertStringEquals:266 test0049 - Eclipse found warning(s) but Javac did not find any.
11:09:12 ----------- Expected ------------
11:09:12 
11:09:12 ------------ but was ------------
11:09:12 ----------\n
11:09:12 1. WARNING in X.java (at line 3)\n
11:09:12 	boolean b=false;\n
11:09:12 	        ^\n
11:09:12 The value of the local variable b is not used\n
11:09:12 ----------\n
11:09:12 2. WARNING in X.java (at line 9)\n
11:09:12 	public void foo(int param1, Integer param3) {\n
11:09:12 	                    ^^^^^^\n
11:09:12 The value of the parameter param1 is not used\n
11:09:12 ----------\n
11:09:12 3. WARNING in X.java (at line 15)\n
11:09:12 	public void foo(int param1, int param2, Integer param3) {\n
11:09:12 	                    ^^^^^^\n
11:09:12 The value of the parameter param1 is not used\n
11:09:12 ----------\n
11:09:12 4. WARNING in X.java (at line 15)\n
11:09:12 	public void foo(int param1, int param2, Integer param3) {\n
11:09:12 	                                ^^^^^^\n
11:09:12 The value of the parameter param2 is not used\n
11:09:12 ----------\n
11:09:12 
11:09:12 --------- Difference is ----------
11:09:12  expected:<[]> but was:<[----------\n
11:09:12 1. WARNING in X.java (at line 3)\n
11:09:12 	boolean b=false;\n
11:09:12 	        ^\n
11:09:12 The value of the local variable b is not used\n
11:09:12 ----------\n
11:09:12 2. WARNING in X.java (at line 9)\n
11:09:12 	public void foo(int param1, Integer param3) {\n
11:09:12 	                    ^^^^^^\n
11:09:12 The value of the parameter param1 is not used\n
11:09:12 ----------\n
11:09:12 3. WARNING in X.java (at line 15)\n
11:09:12 	public void foo(int param1, int param2, Integer param3) {\n
11:09:12 	                    ^^^^^^\n
11:09:12 The value of the parameter param1 is not used\n
11:09:12 ----------\n
11:09:12 4. WARNING in X.java (at line 15)\n
11:09:12 	public void foo(int param1, int param2, Integer param3) {\n
11:09:12 	                                ^^^^^^\n
11:09:12 The value of the parameter param2 is not used\n
11:09:12 ----------\n
11:09:12 ]>
11:09:12   ProgrammingProblemsTest>TestCase.runTest:964->test0050:2075->AbstractRegressionTest.runNegativeTest:2592->AbstractRegressionTest.runNegativeTest:2601->AbstractRegressionTest.runTest:2920->AbstractRegressionTest.runTest:3195->AbstractRegressionTest.runJavac:2350->AbstractRegressionTest.handleMismatch:2419->TestCase.assertEquals:242->TestCase.assertStringEquals:266 test0050 - Eclipse found warning(s) but Javac did not find any.
11:09:12 ----------- Expected ------------
11:09:12 
11:09:12 ------------ but was ------------
11:09:12 ----------\n
11:09:12 1. WARNING in X.java (at line 4)\n
11:09:12 	if (false) {\n
11:09:12         	boolean b=false;\n
11:09:12         	b|=true;\n
11:09:12 		 }\n
11:09:12 	           ^^^^^^^^^^^^^^^^^^^^^^^^^^^^^^^^^^^^^^^^^^^^^^^^^^\n
11:09:12 Dead code\n
11:09:12 ----------\n
11:09:12 2. WARNING in X.java (at line 8)\n
11:09:12 	int k = 2;\n
11:09:12 	    ^\n
11:09:12 The value of the local variable k is not used\n
11:09:12 ----------\n
11:09:12 
11:09:12 --------- Difference is ----------
11:09:12  expected:<[]> but was:<[----------\n
11:09:12 1. WARNING in X.java (at line 4)\n
11:09:12 	if (false) {\n
11:09:12         	boolean b=false;\n
11:09:12         	b|=true;\n
11:09:12 		 }\n
11:09:12 	           ^^^^^^^^^^^^^^^^^^^^^^^^^^^^^^^^^^^^^^^^^^^^^^^^^^\n
11:09:12 Dead code\n
11:09:12 ----------\n
11:09:12 2. WARNING in X.java (at line 8)\n
11:09:12 	int k = 2;\n
11:09:12 	    ^\n
11:09:12 The value of the local variable k is not used\n
11:09:12 ----------\n
11:09:12 ]>
11:09:12   ProgrammingProblemsTest>TestCase.runTest:964->test0051:2117->AbstractRegressionTest.runNegativeTest:2592->AbstractRegressionTest.runNegativeTest:2601->AbstractRegressionTest.runTest:2920->AbstractRegressionTest.runTest:3195->AbstractRegressionTest.runJavac:2350->AbstractRegressionTest.handleMismatch:2419->TestCase.assertEquals:242->TestCase.assertStringEquals:266 test0051 - Eclipse found warning(s) but Javac did not find any.
11:09:12 ----------- Expected ------------
11:09:12 
11:09:12 ------------ but was ------------
11:09:12 ----------\n
11:09:12 1. WARNING in X.java (at line 2)\n
11:09:12 	X(int abc) {\n
11:09:12 	      ^^^\n
11:09:12 The value of the parameter abc is not used\n
11:09:12 ----------\n
11:09:12 
11:09:12 --------- Difference is ----------
11:09:12  expected:<[]> but was:<[----------\n
11:09:12 1. WARNING in X.java (at line 2)\n
11:09:12 	X(int abc) {\n
11:09:12 	      ^^^\n
11:09:12 The value of the parameter abc is not used\n
11:09:12 ----------\n
11:09:12 ]>
11:09:12   ProgrammingProblemsTest>TestCase.runTest:964->test0055:2287->AbstractRegressionTest.runNegativeTest:2592->AbstractRegressionTest.runNegativeTest:2601->AbstractRegressionTest.runTest:2920->AbstractRegressionTest.runTest:3195->AbstractRegressionTest.runJavac:2350->AbstractRegressionTest.handleMismatch:2419->TestCase.assertEquals:242->TestCase.assertStringEquals:266 test0055 - Eclipse found warning(s) but Javac did not find any.
11:09:12 ----------- Expected ------------
11:09:12 
11:09:12 ------------ but was ------------
11:09:12 ----------\n
11:09:12 1. WARNING in test1\E.java (at line 4)\n
11:09:12 	int a= 10;\n
11:09:12 	    ^\n
11:09:12 The value of the local variable a is not used\n
11:09:12 ----------\n
11:09:12 
11:09:12 --------- Difference is ----------
11:09:12  expected:<[]> but was:<[----------\n
11:09:12 1. WARNING in test1\E.java (at line 4)\n
11:09:12 	int a= 10;\n
11:09:12 	    ^\n
11:09:12 The value of the local variable a is not used\n
11:09:12 ----------\n
11:09:12 ]>
11:09:12   ProgrammingProblemsTest>TestCase.runTest:964->test0059:2399->AbstractRegressionTest.runNegativeTest:2592->AbstractRegressionTest.runNegativeTest:2601->AbstractRegressionTest.runTest:2920->AbstractRegressionTest.runTest:3195->AbstractRegressionTest.runJavac:2350->AbstractRegressionTest.handleMismatch:2419->TestCase.assertEquals:242->TestCase.assertStringEquals:266 test0059 - Eclipse found warning(s) but Javac did not find any.
11:09:12 ----------- Expected ------------
11:09:12 
11:09:12 ------------ but was ------------
11:09:12 ----------\n
11:09:12 1. WARNING in X.java (at line 4)\n
11:09:12 	if (a != null){\n
11:09:12         	int j = 3;\n
11:09:12         	j++;\n
11:09:12     	}\n
11:09:12 	              ^^^^^^^^^^^^^^^^^^^^^^^^^^^^^^^^^^^^^^^^^^\n
11:09:12 Dead code\n
11:09:12 ----------\n
11:09:12 2. WARNING in X.java (at line 5)\n
11:09:12 	int j = 3;\n
11:09:12 	    ^\n
11:09:12 The value of the local variable j is not used\n
11:09:12 ----------\n
11:09:12 
11:09:12 --------- Difference is ----------
11:09:12  expected:<[]> but was:<[----------\n
11:09:12 1. WARNING in X.java (at line 4)\n
11:09:12 	if (a != null){\n
11:09:12         	int j = 3;\n
11:09:12         	j++;\n
11:09:12     	}\n
11:09:12 	              ^^^^^^^^^^^^^^^^^^^^^^^^^^^^^^^^^^^^^^^^^^\n
11:09:12 Dead code\n
11:09:12 ----------\n
11:09:12 2. WARNING in X.java (at line 5)\n
11:09:12 	int j = 3;\n
11:09:12 	    ^\n
11:09:12 The value of the local variable j is not used\n
11:09:12 ----------\n
11:09:12 ]>
11:09:12   ProgrammingProblemsTest>TestCase.runTest:964->test0060:2435->AbstractRegressionTest.runNegativeTest:2592->AbstractRegressionTest.runNegativeTest:2601->AbstractRegressionTest.runTest:2920->AbstractRegressionTest.runTest:3195->AbstractRegressionTest.runJavac:2350->AbstractRegressionTest.handleMismatch:2403->TestCase.assertEquals:242->TestCase.assertStringEquals:266 test0060 - Eclipse found error(s) but Javac did not find any.
11:09:12 ----------- Expected ------------
11:09:12 
11:09:12 ------------ but was ------------
11:09:12 ----------\n
11:09:12 1. ERROR in org\eclipse\jdt\internal\compiler\lookup\X.java (at line 7)\n
11:09:12 	if (t1 == t2) { \n
11:09:12 	    ^^^^^^^^\n
11:09:12 The uninterned types TypeBinding and TypeBinding should not be compared using ==/!= operators.\n
11:09:12 ----------\n
11:09:12 2. ERROR in org\eclipse\jdt\internal\compiler\lookup\X.java (at line 9)\n
11:09:12 	if (t1 == t2) {\n
11:09:12 	    ^^^^^^^^\n
11:09:12 The uninterned types TypeBinding and TypeBinding should not be compared using ==/!= operators.\n
11:09:12 ----------\n
11:09:12 3. ERROR in org\eclipse\jdt\internal\compiler\lookup\X.java (at line 16)\n
11:09:12 	if (t1 == t2) { \n
11:09:12 	    ^^^^^^^^\n
11:09:12 The uninterned types TypeBinding and TypeBinding should not be compared using ==/!= operators.\n
11:09:12 ----------\n
11:09:12 4. ERROR in org\eclipse\jdt\internal\compiler\lookup\X.java (at line 18)\n
11:09:12 	if (t1 == t2) {\n
11:09:12 	    ^^^^^^^^\n
11:09:12 The uninterned types TypeBinding and TypeBinding should not be compared using ==/!= operators.\n
11:09:12 ----------\n
11:09:12 5. ERROR in org\eclipse\jdt\internal\compiler\lookup\X.java (at line 28)\n
11:09:12 	if (t1 == t2) { \n
11:09:12 	    ^^^^^^^^\n
11:09:12 The uninterned types TypeBinding and TypeBinding should not be compared using ==/!= operators.\n
11:09:12 ----------\n
11:09:12 
11:09:12 --------- Difference is ----------
11:09:12  expected:<[]> but was:<[----------\n
11:09:12 1. ERROR in org\eclipse\jdt\internal\compiler\lookup\X.java (at line 7)\n
11:09:12 	if (t1 == t2) { \n
11:09:12 	    ^^^^^^^^\n
11:09:12 The uninterned types TypeBinding and TypeBinding should not be compared using ==/!= operators.\n
11:09:12 ----------\n
11:09:12 2. ERROR in org\eclipse\jdt\internal\compiler\lookup\X.java (at line 9)\n
11:09:12 	if (t1 == t2) {\n
11:09:12 	    ^^^^^^^^\n
11:09:12 The uninterned types TypeBinding and TypeBinding should not be compared using ==/!= operators.\n
11:09:12 ----------\n
11:09:12 3. ERROR in org\eclipse\jdt\internal\compiler\lookup\X.java (at line 16)\n
11:09:12 	if (t1 == t2) { \n
11:09:12 	    ^^^^^^^^\n
11:09:12 The uninterned types TypeBinding and TypeBinding should not be compared using ==/!= operators.\n
11:09:12 ----------\n
11:09:12 4. ERROR in org\eclipse\jdt\internal\compiler\lookup\X.java (at line 18)\n
11:09:12 	if (t1 == t2) {\n
11:09:12 	    ^^^^^^^^\n
11:09:12 The uninterned types TypeBinding and TypeBinding should not be compared using ==/!= operators.\n
11:09:12 ----------\n
11:09:12 5. ERROR in org\eclipse\jdt\internal\compiler\lookup\X.java (at line 28)\n
11:09:12 	if (t1 == t2) { \n
11:09:12 	    ^^^^^^^^\n
11:09:12 The uninterned types TypeBinding and TypeBinding should not be compared using ==/!= operators.\n
11:09:12 ----------\n
11:09:12 ]>
11:09:12   ProgrammingProblemsTest>TestCase.runTest:964->test0063:2630->AbstractRegressionTest.runNegativeTest:2592->AbstractRegressionTest.runNegativeTest:2601->AbstractRegressionTest.runTest:2920->AbstractRegressionTest.runTest:3195->AbstractRegressionTest.runJavac:2350->AbstractRegressionTest.handleMismatch:2403->TestCase.assertEquals:242->TestCase.assertStringEquals:266 test0063 - Eclipse found error(s) but Javac did not find any.
11:09:12 ----------- Expected ------------
11:09:12 
11:09:12 ------------ but was ------------
11:09:12 ----------\n
11:09:12 1. ERROR in org\eclipse\jdt\core\dom\X.java (at line 9)\n
11:09:12 	if (t1 == t2) { \n
11:09:12 	    ^^^^^^^^\n
11:09:12 The uninterned types TypeBinding and TypeBinding should not be compared using ==/!= operators.\n
11:09:12 ----------\n
11:09:12 2. ERROR in org\eclipse\jdt\core\dom\X.java (at line 11)\n
11:09:12 	if (t1 == t2) {\n
11:09:12 	    ^^^^^^^^\n
11:09:12 The uninterned types TypeBinding and TypeBinding should not be compared using ==/!= operators.\n
11:09:12 ----------\n
11:09:12 3. ERROR in org\eclipse\jdt\core\dom\X.java (at line 18)\n
11:09:12 	if (t1 == t2) { \n
11:09:12 	    ^^^^^^^^\n
11:09:12 The uninterned types TypeBinding and TypeBinding should not be compared using ==/!= operators.\n
11:09:12 ----------\n
11:09:12 4. ERROR in org\eclipse\jdt\core\dom\X.java (at line 20)\n
11:09:12 	if (t1 == t2) {\n
11:09:12 	    ^^^^^^^^\n
11:09:12 The uninterned types TypeBinding and TypeBinding should not be compared using ==/!= operators.\n
11:09:12 ----------\n
11:09:12 5. ERROR in org\eclipse\jdt\core\dom\X.java (at line 30)\n
11:09:12 	if (t1 == t2) { \n
11:09:12 	    ^^^^^^^^\n
11:09:12 The uninterned types TypeBinding and TypeBinding should not be compared using ==/!= operators.\n
11:09:12 ----------\n
11:09:12 
11:09:12 --------- Difference is ----------
11:09:12  expected:<[]> but was:<[----------\n
11:09:12 1. ERROR in org\eclipse\jdt\core\dom\X.java (at line 9)\n
11:09:12 	if (t1 == t2) { \n
11:09:12 	    ^^^^^^^^\n
11:09:12 The uninterned types TypeBinding and TypeBinding should not be compared using ==/!= operators.\n
11:09:12 ----------\n
11:09:12 2. ERROR in org\eclipse\jdt\core\dom\X.java (at line 11)\n
11:09:12 	if (t1 == t2) {\n
11:09:12 	    ^^^^^^^^\n
11:09:12 The uninterned types TypeBinding and TypeBinding should not be compared using ==/!= operators.\n
11:09:12 ----------\n
11:09:12 3. ERROR in org\eclipse\jdt\core\dom\X.java (at line 18)\n
11:09:12 	if (t1 == t2) { \n
11:09:12 	    ^^^^^^^^\n
11:09:12 The uninterned types TypeBinding and TypeBinding should not be compared using ==/!= operators.\n
11:09:12 ----------\n
11:09:12 4. ERROR in org\eclipse\jdt\core\dom\X.java (at line 20)\n
11:09:12 	if (t1 == t2) {\n
11:09:12 	    ^^^^^^^^\n
11:09:12 The uninterned types TypeBinding and TypeBinding should not be compared using ==/!= operators.\n
11:09:12 ----------\n
11:09:12 5. ERROR in org\eclipse\jdt\core\dom\X.java (at line 30)\n
11:09:12 	if (t1 == t2) { \n
11:09:12 	    ^^^^^^^^\n
11:09:12 The uninterned types TypeBinding and TypeBinding should not be compared using ==/!= operators.\n
11:09:12 ----------\n
11:09:12 ]>
11:09:12   ProgrammingProblemsTest>TestCase.runTest:964->testBug410218a:2714->AbstractRegressionTest.runNegativeTest:2474->AbstractRegressionTest.runNegativeTest:2485->AbstractRegressionTest.runTest:2920->AbstractRegressionTest.runTest:3195->AbstractRegressionTest.runJavac:2350->AbstractRegressionTest.handleMismatch:2419->TestCase.assertEquals:242->TestCase.assertStringEquals:266 testBug410218a - Eclipse found warning(s) but Javac did not find any.
11:09:12 ----------- Expected ------------
11:09:12 
11:09:12 ------------ but was ------------
11:09:12 ----------\n
11:09:12 1. WARNING in X.java (at line 8)\n
11:09:12 	if (set.contains("ONE")) // bad\n
11:09:12 	                 ^^^^^\n
11:09:12 Unlikely argument type String for contains(Object) on a Collection<Short>\n
11:09:12 ----------\n
11:09:12 2. WARNING in X.java (at line 9)\n
11:09:12 	set.remove("ONE"); // bad\n
11:09:12 	           ^^^^^\n
11:09:12 Unlikely argument type String for remove(Object) on a Collection<Short>\n
11:09:12 ----------\n
11:09:12 3. WARNING in X.java (at line 10)\n
11:09:12 	if (set.contains(1)) // bad\n
11:09:12 	                 ^\n
11:09:12 Unlikely argument type int for contains(Object) on a Collection<Short>\n
11:09:12 ----------\n
11:09:12 4. WARNING in X.java (at line 11)\n
11:09:12 	set.remove(1); // bad (tries to remove "Integer 1")\n
11:09:12 	           ^\n
11:09:12 Unlikely argument type int for remove(Object) on a Collection<Short>\n
11:09:12 ----------\n
11:09:12 
11:09:12 --------- Difference is ----------
11:09:12  expected:<[]> but was:<[----------\n
11:09:12 1. WARNING in X.java (at line 8)\n
11:09:12 	if (set.contains("ONE")) // bad\n
11:09:12 	                 ^^^^^\n
11:09:12 Unlikely argument type String for contains(Object) on a Collection<Short>\n
11:09:12 ----------\n
11:09:12 2. WARNING in X.java (at line 9)\n
11:09:12 	set.remove("ONE"); // bad\n
11:09:12 	           ^^^^^\n
11:09:12 Unlikely argument type String for remove(Object) on a Collection<Short>\n
11:09:12 ----------\n
11:09:12 3. WARNING in X.java (at line 10)\n
11:09:12 	if (set.contains(1)) // bad\n
11:09:12 	                 ^\n
11:09:12 Unlikely argument type int for contains(Object) on a Collection<Short>\n
11:09:12 ----------\n
11:09:12 4. WARNING in X.java (at line 11)\n
11:09:12 	set.remove(1); // bad (tries to remove "Integer 1")\n
11:09:12 	           ^\n
11:09:12 Unlikely argument type int for remove(Object) on a Collection<Short>\n
11:09:12 ----------\n
11:09:12 ]>
11:09:12   ProgrammingProblemsTest>TestCase.runTest:964->testBug410218b:2764->AbstractRegressionTest.runNegativeTest:2474->AbstractRegressionTest.runNegativeTest:2485->AbstractRegressionTest.runTest:2920->AbstractRegressionTest.runTest:3195->AbstractRegressionTest.runJavac:2350->AbstractRegressionTest.handleMismatch:2419->TestCase.assertEquals:242->TestCase.assertStringEquals:266 testBug410218b - Eclipse found warning(s) but Javac did not find any.
11:09:12 ----------- Expected ------------
11:09:12 
11:09:12 ------------ but was ------------
11:09:12 ----------\n
11:09:12 1. WARNING in X.java (at line 4)\n
11:09:12 	if (hss.contains(ts)) // bad\n
11:09:12 	                 ^^\n
11:09:12 Unlikely argument type TreeSet<T> for contains(Object) on a Collection<HashSet<T>>\n
11:09:12 ----------\n
11:09:12 2. WARNING in X.java (at line 5)\n
11:09:12 	hss.remove(ts); // bad\n
11:09:12 	           ^^\n
11:09:12 Unlikely argument type TreeSet<T> for remove(Object) on a Collection<HashSet<T>>\n
11:09:12 ----------\n
11:09:12 
11:09:12 --------- Difference is ----------
11:09:12  expected:<[]> but was:<[----------\n
11:09:12 1. WARNING in X.java (at line 4)\n
11:09:12 	if (hss.contains(ts)) // bad\n
11:09:12 	                 ^^\n
11:09:12 Unlikely argument type TreeSet<T> for contains(Object) on a Collection<HashSet<T>>\n
11:09:12 ----------\n
11:09:12 2. WARNING in X.java (at line 5)\n
11:09:12 	hss.remove(ts); // bad\n
11:09:12 	           ^^\n
11:09:12 Unlikely argument type TreeSet<T> for remove(Object) on a Collection<HashSet<T>>\n
11:09:12 ----------\n
11:09:12 ]>
11:09:12   ProgrammingProblemsTest>TestCase.runTest:964->testBug410218b2:2797->AbstractRegressionTest.runNegativeTest:2592->AbstractRegressionTest.runNegativeTest:2601->AbstractRegressionTest.runTest:2920->AbstractRegressionTest.runTest:3195->AbstractRegressionTest.runJavac:2350->AbstractRegressionTest.handleMismatch:2419->TestCase.assertEquals:242->TestCase.assertStringEquals:266 testBug410218b2 - Eclipse found warning(s) but Javac did not find any.
11:09:12 ----------- Expected ------------
11:09:12 
11:09:12 ------------ but was ------------
11:09:12 ----------\n
11:09:12 1. WARNING in X.java (at line 4)\n
11:09:12 	if (hss.contains(ts)) // bad\n
11:09:12 	                 ^^\n
11:09:12 Unlikely argument type TreeSet<T> for contains(Object) on a Collection<HashSet<T>>\n
11:09:12 ----------\n
11:09:12 2. WARNING in X.java (at line 5)\n
11:09:12 	hss.remove(ts); // bad\n
11:09:12 	           ^^\n
11:09:12 Unlikely argument type TreeSet<T> for remove(Object) on a Collection<HashSet<T>>\n
11:09:12 ----------\n
11:09:12 3. WARNING in X.java (at line 6)\n
11:09:12 	if (hss.contains((Set<T>)ts)) // bad (because of strict check)\n
11:09:12 	                 ^^^^^^^^^^\n
11:09:12 Unlikely argument type Set<T> for contains(Object) on a Collection<HashSet<T>>\n
11:09:12 ----------\n
11:09:12 4. WARNING in X.java (at line 7)\n
11:09:12 	hss.remove((Set<T>)ts); // bad (because of strict check)\n
11:09:12 	           ^^^^^^^^^^\n
11:09:12 Unlikely argument type Set<T> for remove(Object) on a Collection<HashSet<T>>\n
11:09:12 ----------\n
11:09:12 
11:09:12 --------- Difference is ----------
11:09:12  expected:<[]> but was:<[----------\n
11:09:12 1. WARNING in X.java (at line 4)\n
11:09:12 	if (hss.contains(ts)) // bad\n
11:09:12 	                 ^^\n
11:09:12 Unlikely argument type TreeSet<T> for contains(Object) on a Collection<HashSet<T>>\n
11:09:12 ----------\n
11:09:12 2. WARNING in X.java (at line 5)\n
11:09:12 	hss.remove(ts); // bad\n
11:09:12 	           ^^\n
11:09:12 Unlikely argument type TreeSet<T> for remove(Object) on a Collection<HashSet<T>>\n
11:09:12 ----------\n
11:09:12 3. WARNING in X.java (at line 6)\n
11:09:12 	if (hss.contains((Set<T>)ts)) // bad (because of strict check)\n
11:09:12 	                 ^^^^^^^^^^\n
11:09:12 Unlikely argument type Set<T> for contains(Object) on a Collection<HashSet<T>>\n
11:09:12 ----------\n
11:09:12 4. WARNING in X.java (at line 7)\n
11:09:12 	hss.remove((Set<T>)ts); // bad (because of strict check)\n
11:09:12 	           ^^^^^^^^^^\n
11:09:12 Unlikely argument type Set<T> for remove(Object) on a Collection<HashSet<T>>\n
11:09:12 ----------\n
11:09:12 ]>
11:09:12   ProgrammingProblemsTest>TestCase.runTest:964->testBug410218c:2841->AbstractRegressionTest.runNegativeTest:2474->AbstractRegressionTest.runNegativeTest:2485->AbstractRegressionTest.runTest:2920->AbstractRegressionTest.runTest:3195->AbstractRegressionTest.runJavac:2350->AbstractRegressionTest.handleMismatch:2419->TestCase.assertEquals:242->TestCase.assertStringEquals:266 testBug410218c - Eclipse found warning(s) but Javac did not find any.
11:09:12 ----------- Expected ------------
11:09:12 
11:09:12 ------------ but was ------------
11:09:12 ----------\n
11:09:12 1. WARNING in X.java (at line 4)\n
11:09:12 	if (m.containsKey("ONE")) // bad\n
11:09:12 	                  ^^^^^\n
11:09:12 Unlikely argument type String for containsKey(Object) on a Map<capture#1-of ? extends Number,Number>\n
11:09:12 ----------\n
11:09:12 2. WARNING in X.java (at line 5)\n
11:09:12 	m.remove("ONE"); // bad\n
11:09:12 	         ^^^^^\n
11:09:12 Unlikely argument type String for remove(Object) on a Map<capture#2-of ? extends Number,Number>\n
11:09:12 ----------\n
11:09:12 3. WARNING in X.java (at line 6)\n
11:09:12 	if (m.containsValue("ONE")) // bad\n
11:09:12 	                    ^^^^^\n
11:09:12 Unlikely argument type String for containsValue(Object) on a Map<capture#3-of ? extends Number,Number>\n
11:09:12 ----------\n
11:09:12 4. WARNING in X.java (at line 7)\n
11:09:12 	m.remove("ONE"); // bad\n
11:09:12 	         ^^^^^\n
11:09:12 Unlikely argument type String for remove(Object) on a Map<capture#4-of ? extends Number,Number>\n
11:09:12 ----------\n
11:09:12 5. WARNING in X.java (at line 14)\n
11:09:12 	return m.get("ONE"); // bad\n
11:09:12 	             ^^^^^\n
11:09:12 Unlikely argument type String for get(Object) on a Map<capture#9-of ? extends Number,Number>\n
11:09:12 ----------\n
11:09:12 
11:09:12 --------- Difference is ----------
11:09:12  expected:<[]> but was:<[----------\n
11:09:12 1. WARNING in X.java (at line 4)\n
11:09:12 	if (m.containsKey("ONE")) // bad\n
11:09:12 	                  ^^^^^\n
11:09:12 Unlikely argument type String for containsKey(Object) on a Map<capture#1-of ? extends Number,Number>\n
11:09:12 ----------\n
11:09:12 2. WARNING in X.java (at line 5)\n
11:09:12 	m.remove("ONE"); // bad\n
11:09:12 	         ^^^^^\n
11:09:12 Unlikely argument type String for remove(Object) on a Map<capture#2-of ? extends Number,Number>\n
11:09:12 ----------\n
11:09:12 3. WARNING in X.java (at line 6)\n
11:09:12 	if (m.containsValue("ONE")) // bad\n
11:09:12 	                    ^^^^^\n
11:09:12 Unlikely argument type String for containsValue(Object) on a Map<capture#3-of ? extends Number,Number>\n
11:09:12 ----------\n
11:09:12 4. WARNING in X.java (at line 7)\n
11:09:12 	m.remove("ONE"); // bad\n
11:09:12 	         ^^^^^\n
11:09:12 Unlikely argument type String for remove(Object) on a Map<capture#4-of ? extends Number,Number>\n
11:09:12 ----------\n
11:09:12 5. WARNING in X.java (at line 14)\n
11:09:12 	return m.get("ONE"); // bad\n
11:09:12 	             ^^^^^\n
11:09:12 Unlikely argument type String for get(Object) on a Map<capture#9-of ? extends Number,Number>\n
11:09:12 ----------\n
11:09:12 ]>
11:09:12   ProgrammingProblemsTest>TestCase.runTest:964->testBug410218d:2895->AbstractRegressionTest.runNegativeTest:2592->AbstractRegressionTest.runNegativeTest:2601->AbstractRegressionTest.runTest:2920->AbstractRegressionTest.runTest:3195->AbstractRegressionTest.runJavac:2350->AbstractRegressionTest.handleMismatch:2403->TestCase.assertEquals:242->TestCase.assertStringEquals:266 testBug410218d - Eclipse found error(s) but Javac did not find any.
11:09:12 ----------- Expected ------------
11:09:12 
11:09:12 ------------ but was ------------
11:09:12 ----------\n
11:09:12 1. ERROR in X.java (at line 10)\n
11:09:12 	numbers.removeAll(stringSet); // bad\n
11:09:12 	                  ^^^^^^^^^\n
11:09:12 Unlikely argument type Set<String> for removeAll(Collection<?>) on a Collection<Number>\n
11:09:12 ----------\n
11:09:12 
11:09:12 --------- Difference is ----------
11:09:12  expected:<[]> but was:<[----------\n
11:09:12 1. ERROR in X.java (at line 10)\n
11:09:12 	numbers.removeAll(stringSet); // bad\n
11:09:12 	                  ^^^^^^^^^\n
11:09:12 Unlikely argument type Set<String> for removeAll(Collection<?>) on a Collection<Number>\n
11:09:12 ----------\n
11:09:12 ]>
11:09:12   ProgrammingProblemsTest>TestCase.runTest:964->testBug410218e:2927->AbstractRegressionTest.runNegativeTest:2592->AbstractRegressionTest.runNegativeTest:2601->AbstractRegressionTest.runTest:2920->AbstractRegressionTest.runTest:3195->AbstractRegressionTest.runJavac:2350->AbstractRegressionTest.handleMismatch:2419->TestCase.assertEquals:242->TestCase.assertStringEquals:266 testBug410218e - Eclipse found warning(s) but Javac did not find any.
11:09:12 ----------- Expected ------------
11:09:12 
11:09:12 ------------ but was ------------
11:09:12 ----------\n
11:09:12 1. WARNING in X.java (at line 4)\n
11:09:12 	return ints.indexOf("ONE"); // bad\n
11:09:12 	                    ^^^^^\n
11:09:12 Unlikely argument type String for indexOf(Object) on a List<Integer>\n
11:09:12 ----------\n
11:09:12 
11:09:12 --------- Difference is ----------
11:09:12  expected:<[]> but was:<[----------\n
11:09:12 1. WARNING in X.java (at line 4)\n
11:09:12 	return ints.indexOf("ONE"); // bad\n
11:09:12 	                    ^^^^^\n
11:09:12 Unlikely argument type String for indexOf(Object) on a List<Integer>\n
11:09:12 ----------\n
11:09:12 ]>
11:09:12   ProgrammingProblemsTest>TestCase.runTest:964->testBug410218f:2961->AbstractRegressionTest.runNegativeTest:2592->AbstractRegressionTest.runNegativeTest:2601->AbstractRegressionTest.runTest:2920->AbstractRegressionTest.runTest:3195->AbstractRegressionTest.runJavac:2350->AbstractRegressionTest.handleMismatch:2419->TestCase.assertEquals:242->TestCase.assertStringEquals:266 testBug410218f - Eclipse found warning(s) but Javac did not find any.
11:09:12 ----------- Expected ------------
11:09:12 
11:09:12 ------------ but was ------------
11:09:12 ----------\n
11:09:12 1. WARNING in test\TestUnlikely.java (at line 30)\n
11:09:12 	c.remove(o); // warning: unrelated interface\n
11:09:12 	         ^\n
11:09:12 Unlikely argument type TestUnlikely.OtherInterface for remove(Object) on a Collection<TestUnlikely.Interface>\n
11:09:12 ----------\n
11:09:12 2. WARNING in test\TestUnlikely.java (at line 37)\n
11:09:12 	c.remove(i); // warning: unrelated interface\n
11:09:12 	         ^\n
11:09:12 Unlikely argument type TestUnlikely.Interface for remove(Object) on a Collection<TestUnlikely.OtherInterface>\n
11:09:12 ----------\n
11:09:12 3. WARNING in test\TestUnlikely.java (at line 39)\n
11:09:12 	c.remove(f); // warning: impossible\n
11:09:12 	         ^\n
11:09:12 Unlikely argument type TestUnlikely.Final for remove(Object) on a Collection<TestUnlikely.OtherInterface>\n
11:09:12 ----------\n
11:09:12 4. WARNING in test\TestUnlikely.java (at line 40)\n
11:09:12 	c.remove(nf); // warning: castable, but not supertype\n
11:09:12 	         ^^\n
11:09:12 Unlikely argument type TestUnlikely.NonFinal for remove(Object) on a Collection<TestUnlikely.OtherInterface>\n
11:09:12 ----------\n
11:09:12 5. WARNING in test\TestUnlikely.java (at line 46)\n
11:09:12 	c.remove(o); // warning: impossible\n
11:09:12 	         ^\n
11:09:12 Unlikely argument type TestUnlikely.OtherInterface for remove(Object) on a Collection<TestUnlikely.Final>\n
11:09:12 ----------\n
11:09:12 6. WARNING in test\TestUnlikely.java (at line 48)\n
11:09:12 	c.remove(nf); // warning: impossible\n
11:09:12 	         ^^\n
11:09:12 Unlikely argument type TestUnlikely.NonFinal for remove(Object) on a Collection<TestUnlikely.Final>\n
11:09:12 ----------\n
11:09:12 7. WARNING in test\TestUnlikely.java (at line 49)\n
11:09:12 	c.remove(s); // warning: impossible\n
11:09:12 	         ^\n
11:09:12 Unlikely argument type TestUnlikely.Sub for remove(Object) on a Collection<TestUnlikely.Final>\n
11:09:12 ----------\n
11:09:12 8. WARNING in test\TestUnlikely.java (at line 54)\n
11:09:12 	c.remove(o); // warning: unrelated interface\n
11:09:12 	         ^\n
11:09:12 Unlikely argument type TestUnlikely.OtherInterface for remove(Object) on a Collection<TestUnlikely.NonFinal>\n
11:09:12 ----------\n
11:09:12 9. WARNING in test\TestUnlikely.java (at line 55)\n
11:09:12 	c.remove(f); // warning: impossible\n
11:09:12 	         ^\n
11:09:12 Unlikely argument type TestUnlikely.Final for remove(Object) on a Collection<TestUnlikely.NonFinal>\n
11:09:12 ----------\n
11:09:12 10. WARNING in test\TestUnlikely.java (at line 63)\n
11:09:12 	c.remove(f); // warning: impossible\n
11:09:12 	         ^\n
11:09:12 Unlikely argument type TestUnlikely.Final for remove(Object) on a Collection<TestUnlikely.Sub>\n
11:09:12 ----------\n
11:09:12 11. WARNING in test\TestUnlikely.java (at line 70)\n
11:09:12 	map.containsKey(value); // warning\n
11:09:12 	                ^^^^^\n
11:09:12 Unlikely argument type V for containsKey(Object) on a Map<K,V>\n
11:09:12 ----------\n
11:09:12 12. WARNING in test\TestUnlikely.java (at line 71)\n
11:09:12 	map.containsValue(key); // warning\n
11:09:12 	                  ^^^\n
11:09:12 Unlikely argument type K for containsValue(Object) on a Map<K,V>\n
11:09:12 ----------\n
11:09:12 13. WARNING in test\TestUnlikely.java (at line 95)\n
11:09:12 	if (c.contains(iterator.next())) { // warning\n
11:09:12 	               ^^^^^^^^^^^^^^^\n
11:09:12 Unlikely argument type U for contains(Object) on a Collection<T>\n
11:09:12 ----------\n
11:09:12 14. WARNING in test\TestUnlikely.java (at line 105)\n
11:09:12 	c.removeAll(other); // warning\n
11:09:12 	            ^^^^^\n
11:09:12 Unlikely argument type Set<TestUnlikely.Final> for removeAll(Collection<?>) on a Collection<TestUnlikely.NonFinal>\n
11:09:12 ----------\n
11:09:12 15. WARNING in test\TestUnlikely.java (at line 111)\n
11:09:12 	Predicate<OtherInterface> p2 = c::contains; // warning\n
11:09:12 	                               ^^^^^^^^^^^\n
11:09:12 Unlikely argument type TestUnlikely.OtherInterface for contains(Object) on a Collection<TestUnlikely.Interface>\n
11:09:12 ----------\n
11:09:12 16. WARNING in test\TestUnlikely.java (at line 112)\n
11:09:12 	BiPredicate<Collection<Interface>, OtherInterface> bp2 = Collection<Interface>::contains; // warning\n
11:09:12 	                                                         ^^^^^^^^^^^^^^^^^^^^^^^^^^^^^^^\n
11:09:12 Unlikely argument type TestUnlikely.OtherInterface for contains(Object) on a Collection<TestUnlikely.Interface>\n
11:09:12 ----------\n
11:09:12 17. INFO in test\TestUnlikely.java (at line 120)\n
11:09:12 	s.equals(i); // info\n
11:09:12 	         ^\n
11:09:12 Unlikely argument type for equals(): Integer seems to be unrelated to String\n
11:09:12 ----------\n
11:09:12 18. INFO in test\TestUnlikely.java (at line 121)\n
11:09:12 	i.equals(s); // info\n
11:09:12 	         ^\n
11:09:12 Unlikely argument type for equals(): String seems to be unrelated to Integer\n
11:09:12 ----------\n
11:09:12 19. INFO in test\TestUnlikely.java (at line 125)\n
11:09:12 	Predicate<String> p1 = i::equals; // info\n
11:09:12 	                       ^^^^^^^^^\n
11:09:12 Unlikely argument type for equals(): String seems to be unrelated to Integer\n
11:09:12 ----------\n
11:09:12 20. INFO in test\TestUnlikely.java (at line 128)\n
11:09:12 	BiPredicate<String, Integer> bp2 = Object::equals; // info\n
11:09:12 	                                   ^^^^^^^^^^^^^^\n
11:09:12 Unlikely argument type for equals(): Integer seems to be unrelated to String\n
11:09:12 ----------\n
11:09:12 21. INFO in test\TestUnlikely.java (at line 131)\n
11:09:12 	Objects.equals(s, i); // info\n
11:09:12 	                  ^\n
11:09:12 Unlikely argument type for equals(): Integer seems to be unrelated to String\n
11:09:12 ----------\n
11:09:12 22. INFO in test\TestUnlikely.java (at line 132)\n
11:09:12 	Objects.equals(i, s); // info\n
11:09:12 	                  ^\n
11:09:12 Unlikely argument type for equals(): String seems to be unrelated to Integer\n
11:09:12 ----------\n
11:09:12 23. INFO in test\TestUnlikely.java (at line 136)\n
11:09:12 	BiPredicate<String, Integer> bp3 = Objects::equals; // info\n
11:09:12 	                                   ^^^^^^^^^^^^^^^\n
11:09:12 Unlikely argument type for equals(): Integer seems to be unrelated to String\n
11:09:12 ----------\n
11:09:12 
11:09:12 --------- Difference is ----------
11:09:12  expected:<[]> but was:<[----------\n
11:09:12 1. WARNING in test\TestUnlikely.java (at line 30)\n
11:09:12 	c.remove(o); // warning: unrelated interface\n
11:09:12 	         ^\n
11:09:12 Unlikely argument type TestUnlikely.OtherInterface for remove(Object) on a Collection<TestUnlikely.Interface>\n
11:09:12 ----------\n
11:09:12 2. WARNING in test\TestUnlikely.java (at line 37)\n
11:09:12 	c.remove(i); // warning: unrelated interface\n
11:09:12 	         ^\n
11:09:12 Unlikely argument type TestUnlikely.Interface for remove(Object) on a Collection<TestUnlikely.OtherInterface>\n
11:09:12 ----------\n
11:09:12 3. WARNING in test\TestUnlikely.java (at line 39)\n
11:09:12 	c.remove(f); // warning: impossible\n
11:09:12 	         ^\n
11:09:12 Unlikely argument type TestUnlikely.Final for remove(Object) on a Collection<TestUnlikely.OtherInterface>\n
11:09:12 ----------\n
11:09:12 4. WARNING in test\TestUnlikely.java (at line 40)\n
11:09:12 	c.remove(nf); // warning: castable, but not supertype\n
11:09:12 	         ^^\n
11:09:12 Unlikely argument type TestUnlikely.NonFinal for remove(Object) on a Collection<TestUnlikely.OtherInterface>\n
11:09:12 ----------\n
11:09:12 5. WARNING in test\TestUnlikely.java (at line 46)\n
11:09:12 	c.remove(o); // warning: impossible\n
11:09:12 	         ^\n
11:09:12 Unlikely argument type TestUnlikely.OtherInterface for remove(Object) on a Collection<TestUnlikely.Final>\n
11:09:12 ----------\n
11:09:12 6. WARNING in test\TestUnlikely.java (at line 48)\n
11:09:12 	c.remove(nf); // warning: impossible\n
11:09:12 	         ^^\n
11:09:12 Unlikely argument type TestUnlikely.NonFinal for remove(Object) on a Collection<TestUnlikely.Final>\n
11:09:12 ----------\n
11:09:12 7. WARNING in test\TestUnlikely.java (at line 49)\n
11:09:12 	c.remove(s); // warning: impossible\n
11:09:12 	         ^\n
11:09:12 Unlikely argument type TestUnlikely.Sub for remove(Object) on a Collection<TestUnlikely.Final>\n
11:09:12 ----------\n
11:09:12 8. WARNING in test\TestUnlikely.java (at line 54)\n
11:09:12 	c.remove(o); // warning: unrelated interface\n
11:09:12 	         ^\n
11:09:12 Unlikely argument type TestUnlikely.OtherInterface for remove(Object) on a Collection<TestUnlikely.NonFinal>\n
11:09:12 ----------\n
11:09:12 9. WARNING in test\TestUnlikely.java (at line 55)\n
11:09:12 	c.remove(f); // warning: impossible\n
11:09:12 	         ^\n
11:09:12 Unlikely argument type TestUnlikely.Final for remove(Object) on a Collection<TestUnlikely.NonFinal>\n
11:09:12 ----------\n
11:09:12 10. WARNING in test\TestUnlikely.java (at line 63)\n
11:09:12 	c.remove(f); // warning: impossible\n
11:09:12 	         ^\n
11:09:12 Unlikely argument type TestUnlikely.Final for remove(Object) on a Collection<TestUnlikely.Sub>\n
11:09:12 ----------\n
11:09:12 11. WARNING in test\TestUnlikely.java (at line 70)\n
11:09:12 	map.containsKey(value); // warning\n
11:09:12 	                ^^^^^\n
11:09:12 Unlikely argument type V for containsKey(Object) on a Map<K,V>\n
11:09:12 ----------\n
11:09:12 12. WARNING in test\TestUnlikely.java (at line 71)\n
11:09:12 	map.containsValue(key); // warning\n
11:09:12 	                  ^^^\n
11:09:12 Unlikely argument type K for containsValue(Object) on a Map<K,V>\n
11:09:12 ----------\n
11:09:12 13. WARNING in test\TestUnlikely.java (at line 95)\n
11:09:12 	if (c.contains(iterator.next())) { // warning\n
11:09:12 	               ^^^^^^^^^^^^^^^\n
11:09:12 Unlikely argument type U for contains(Object) on a Collection<T>\n
11:09:12 ----------\n
11:09:12 14. WARNING in test\TestUnlikely.java (at line 105)\n
11:09:12 	c.removeAll(other); // warning\n
11:09:12 	            ^^^^^\n
11:09:12 Unlikely argument type Set<TestUnlikely.Final> for removeAll(Collection<?>) on a Collection<TestUnlikely.NonFinal>\n
11:09:12 ----------\n
11:09:12 15. WARNING in test\TestUnlikely.java (at line 111)\n
11:09:12 	Predicate<OtherInterface> p2 = c::contains; // warning\n
11:09:12 	                               ^^^^^^^^^^^\n
11:09:12 Unlikely argument type TestUnlikely.OtherInterface for contains(Object) on a Collection<TestUnlikely.Interface>\n
11:09:12 ----------\n
11:09:12 16. WARNING in test\TestUnlikely.java (at line 112)\n
11:09:12 	BiPredicate<Collection<Interface>, OtherInterface> bp2 = Collection<Interface>::contains; // warning\n
11:09:12 	                                                         ^^^^^^^^^^^^^^^^^^^^^^^^^^^^^^^\n
11:09:12 Unlikely argument type TestUnlikely.OtherInterface for contains(Object) on a Collection<TestUnlikely.Interface>\n
11:09:12 ----------\n
11:09:12 17. INFO in test\TestUnlikely.java (at line 120)\n
11:09:12 	s.equals(i); // info\n
11:09:12 	         ^\n
11:09:12 Unlikely argument type for equals(): Integer seems to be unrelated to String\n
11:09:12 ----------\n
11:09:12 18. INFO in test\TestUnlikely.java (at line 121)\n
11:09:12 	i.equals(s); // info\n
11:09:12 	         ^\n
11:09:12 Unlikely argument type for equals(): String seems to be unrelated to Integer\n
11:09:12 ----------\n
11:09:12 19. INFO in test\TestUnlikely.java (at line 125)\n
11:09:12 	Predicate<String> p1 = i::equals; // info\n
11:09:12 	                       ^^^^^^^^^\n
11:09:12 Unlikely argument type for equals(): String seems to be unrelated to Integer\n
11:09:12 ----------\n
11:09:12 20. INFO in test\TestUnlikely.java (at line 128)\n
11:09:12 	BiPredicate<String, Integer> bp2 = Object::equals; // info\n
11:09:12 	                                   ^^^^^^^^^^^^^^\n
11:09:12 Unlikely argument type for equals(): Integer seems to be unrelated to String\n
11:09:12 ----------\n
11:09:12 21. INFO in test\TestUnlikely.java (at line 131)\n
11:09:12 	Objects.equals(s, i); // info\n
11:09:12 	                  ^\n
11:09:12 Unlikely argument type for equals(): Integer seems to be unrelated to String\n
11:09:12 ----------\n
11:09:12 22. INFO in test\TestUnlikely.java (at line 132)\n
11:09:12 	Objects.equals(i, s); // info\n
11:09:12 	                  ^\n
11:09:12 Unlikely argument type for equals(): String seems to be unrelated to Integer\n
11:09:12 ----------\n
11:09:12 23. INFO in test\TestUnlikely.java (at line 136)\n
11:09:12 	BiPredicate<String, Integer> bp3 = Objects::equals; // info\n
11:09:12 	                                   ^^^^^^^^^^^^^^^\n
11:09:12 Unlikely argument type for equals(): Integer seems to be unrelated to String\n
11:09:12 ----------\n
11:09:12 ]>
11:09:12   ProgrammingProblemsTest>TestCase.runTest:964->testBug514956c:3268->AbstractRegressionTest.runNegativeTest:2592->AbstractRegressionTest.runNegativeTest:2601->AbstractRegressionTest.runTest:2920->AbstractRegressionTest.runTest:3195->AbstractRegressionTest.runJavac:2350->AbstractRegressionTest.handleMismatch:2403->TestCase.assertEquals:242->TestCase.assertStringEquals:266 testBug514956c - Eclipse found error(s) but Javac did not find any.
11:09:12 ----------- Expected ------------
11:09:12 
11:09:12 ------------ but was ------------
11:09:12 ----------\n
11:09:12 1. ERROR in Unlikely.java (at line 6)\n
11:09:12 	return i1.equals((I1)this);\n
11:09:12 	                 ^^^^^^^^\n
11:09:12 Unnecessary cast from Unlikely to I1\n
11:09:12 ----------\n
11:09:12 2. ERROR in Unlikely.java (at line 9)\n
11:09:12 	return i1.equals((I3)i2);\n
11:09:12 	                 ^^^^^^\n
11:09:12 Unnecessary cast from I2 to I3\n
11:09:12 ----------\n
11:09:12 3. WARNING in Unlikely.java (at line 9)\n
11:09:12 	return i1.equals((I3)i2);\n
11:09:12 	                 ^^^^^^\n
11:09:12 Unlikely argument type for equals(): I3 seems to be unrelated to I1\n
11:09:12 ----------\n
11:09:12 
11:09:12 --------- Difference is ----------
11:09:12  expected:<[]> but was:<[----------\n
11:09:12 1. ERROR in Unlikely.java (at line 6)\n
11:09:12 	return i1.equals((I1)this);\n
11:09:12 	                 ^^^^^^^^\n
11:09:12 Unnecessary cast from Unlikely to I1\n
11:09:12 ----------\n
11:09:12 2. ERROR in Unlikely.java (at line 9)\n
11:09:12 	return i1.equals((I3)i2);\n
11:09:12 	                 ^^^^^^\n
11:09:12 Unnecessary cast from I2 to I3\n
11:09:12 ----------\n
11:09:12 3. WARNING in Unlikely.java (at line 9)\n
11:09:12 	return i1.equals((I3)i2);\n
11:09:12 	                 ^^^^^^\n
11:09:12 Unlikely argument type for equals(): I3 seems to be unrelated to I1\n
11:09:12 ----------\n
11:09:12 ]>
11:09:12   ResourceLeakTests>TestCase.runTest:964->testBug473317:5362->runLeakTest:75->AbstractRegressionTest.runNegativeTest:2682->AbstractRegressionTest.runTest:2920->AbstractRegressionTest.runTest:3195->AbstractRegressionTest.runJavac:2350->AbstractRegressionTest.handleMismatch:2454 testBug473317: unused excuse org.eclipse.jdt.core.tests.compiler.regression.AbstractRegressionTest$JavacTestOptions$Excuse@58fcb07b for compiler org.eclipse.jdt.core.tests.compiler.regression.AbstractRegressionTest$JavacCompiler@7866ffa
11:09:12   RuntimeTests>TestCase.runTest:964->test0600_reflection:148->AbstractRegressionTest.runConformTest:3339->AbstractRegressionTest.runTest:2920->AbstractRegressionTest.runTest:3195->AbstractRegressionTest.runJavac:2350->AbstractRegressionTest.handleMismatch:2454 test0600_reflection: unused excuse org.eclipse.jdt.core.tests.compiler.regression.AbstractRegressionTest$JavacTestOptions$EclipseJustification$3@5a88ecb9 for compiler org.eclipse.jdt.core.tests.compiler.regression.AbstractRegressionTest$JavacCompiler@7866ffa
11:09:12   ScannerTest>TestCase.runTest:964->test045:961->AbstractRegressionTest.runConformTest:1689->AbstractRegressionTest.runConformTest:1692->AbstractRegressionTest.runTest:2920->AbstractRegressionTest.runTest:3195->AbstractRegressionTest.runJavac:2350->AbstractRegressionTest.handleMismatch:2411->TestCase.assertEquals:242->TestCase.assertStringEquals:266 test045 - Javac found error(s) but Eclipse did not find any.
11:09:12 ----------- Expected ------------
11:09:12 
11:09:12 ------------ but was ------------
11:09:12 _X.java:5: error: variable i is already defined in method main(String[])\n
11:09:12 		String i\u0001;\n
11:09:12 		       ^\n
11:09:12 _X.java:6: error: variable i is already defined in method main(String[])\n
11:09:12 		String i\u0002;\n
11:09:12 		       ^\n
11:09:12 _X.java:7: error: variable i is already defined in method main(String[])\n
11:09:12 		String i\u0003;\n
11:09:12 		       ^\n
11:09:12 _X.java:8: error: variable i is already defined in method main(String[])\n
11:09:12 		String i\u0004;\n
11:09:12 		       ^\n
11:09:12 _X.java:9: error: variable i is already defined in method main(String[])\n
11:09:12 		String i\u0005;\n
11:09:12 		       ^\n
11:09:12 _X.java:10: error: variable i is already defined in method main(String[])\n
11:09:12 		String i\u0006;\n
11:09:12 		       ^\n
11:09:12 _X.java:11: error: variable i is already defined in method main(String[])\n
11:09:12 		String i\u0007;\n
11:09:12 		       ^\n
11:09:12 _X.java:12: error: variable i is already defined in method main(String[])\n
11:09:12 		String i\u0008;\n
11:09:12 		       ^\n
11:09:12 _X.java:13: error: variable i is already defined in method main(String[])\n
11:09:12 		String i\u000e;\n
11:09:12 		       ^\n
11:09:12 _X.java:14: error: variable i is already defined in method main(String[])\n
11:09:12 		String i\u000f;\n
11:09:12 		       ^\n
11:09:12 _X.java:15: error: variable i is already defined in method main(String[])\n
11:09:12 		String i\u0010;\n
11:09:12 		       ^\n
11:09:12 _X.java:16: error: variable i is already defined in method main(String[])\n
11:09:12 		String i\u0011;\n
11:09:12 		       ^\n
11:09:12 _X.java:17: error: variable i is already defined in method main(String[])\n
11:09:12 		String i\u0012;\n
11:09:12 		       ^\n
11:09:12 _X.java:18: error: variable i is already defined in method main(String[])\n
11:09:12 		String i\u0013;\n
11:09:12 		       ^\n
11:09:12 _X.java:19: error: variable i is already defined in method main(String[])\n
11:09:12 		String i\u0014;\n
11:09:12 		       ^\n
11:09:12 _X.java:20: error: variable i is already defined in method main(String[])\n
11:09:12 		String i\u0015;\n
11:09:12 		       ^\n
11:09:12 _X.java:21: error: variable i is already defined in method main(String[])\n
11:09:12 		String i\u0016;\n
11:09:12 		       ^\n
11:09:12 _X.java:22: error: variable i is already defined in method main(String[])\n
11:09:12 		String i\u0017;\n
11:09:12 		       ^\n
11:09:12 _X.java:23: error: variable i is already defined in method main(String[])\n
11:09:12 		String i\u0018;\n
11:09:12 		       ^\n
11:09:12 _X.java:24: error: variable i is already defined in method main(String[])\n
11:09:12 		String i\u0019;\n
11:09:12 		       ^\n
11:09:12 _X.java:25: error: variable i is already defined in method main(String[])\n
11:09:12 		String i\u001a;\n
11:09:12 		       ^\n
11:09:12 _X.java:26: error: variable i is already defined in method main(String[])\n
11:09:12 		String i\u001b;\n
11:09:12 		       ^\n
11:09:12 _X.java:27: error: variable i is already defined in method main(String[])\n
11:09:12 		String i\u007f;\n
11:09:12 		       ^\n
11:09:12 23 errors\n
11:09:12 
11:09:12 --------- Difference is ----------
11:09:12  expected:<[]> but was:<[_X.java:5: error: variable i is already defined in method main(String[])\n
11:09:12 		String i\u0001;\n
11:09:12 		       ^\n
11:09:12 _X.java:6: error: variable i is already defined in method main(String[])\n
11:09:12 		String i\u0002;\n
11:09:12 		       ^\n
11:09:12 _X.java:7: error: variable i is already defined in method main(String[])\n
11:09:12 		String i\u0003;\n
11:09:12 		       ^\n
11:09:12 _X.java:8: error: variable i is already defined in method main(String[])\n
11:09:12 		String i\u0004;\n
11:09:12 		       ^\n
11:09:12 _X.java:9: error: variable i is already defined in method main(String[])\n
11:09:12 		String i\u0005;\n
11:09:12 		       ^\n
11:09:12 _X.java:10: error: variable i is already defined in method main(String[])\n
11:09:12 		String i\u0006;\n
11:09:12 		       ^\n
11:09:12 _X.java:11: error: variable i is already defined in method main(String[])\n
11:09:12 		String i\u0007;\n
11:09:12 		       ^\n
11:09:12 _X.java:12: error: variable i is already defined in method main(String[])\n
11:09:12 		String i\u0008;\n
11:09:12 		       ^\n
11:09:12 _X.java:13: error: variable i is already defined in method main(String[])\n
11:09:12 		String i\u000e;\n
11:09:12 		       ^\n
11:09:12 _X.java:14: error: variable i is already defined in method main(String[])\n
11:09:12 		String i\u000f;\n
11:09:12 		       ^\n
11:09:12 _X.java:15: error: variable i is already defined in method main(String[])\n
11:09:12 		String i\u0010;\n
11:09:12 		       ^\n
11:09:12 _X.java:16: error: variable i is already defined in method main(String[])\n
11:09:12 		String i\u0011;\n
11:09:12 		       ^\n
11:09:12 _X.java:17: error: variable i is already defined in method main(String[])\n
11:09:12 		String i\u0012;\n
11:09:12 		       ^\n
11:09:12 _X.java:18: error: variable i is already defined in method main(String[])\n
11:09:12 		String i\u0013;\n
11:09:12 		       ^\n
11:09:12 _X.java:19: error: variable i is already defined in method main(String[])\n
11:09:12 		String i\u0014;\n
11:09:12 		       ^\n
11:09:12 _X.java:20: error: variable i is already defined in method main(String[])\n
11:09:12 		String i\u0015;\n
11:09:12 		       ^\n
11:09:12 _X.java:21: error: variable i is already defined in method main(String[])\n
11:09:12 		String i\u0016;\n
11:09:12 		       ^\n
11:09:12 _X.java:22: error: variable i is already defined in method main(String[])\n
11:09:12 		String i\u0017;\n
11:09:12 		       ^\n
11:09:12 _X.java:23: error: variable i is already defined in method main(String[])\n
11:09:12 		String i\u0018;\n
11:09:12 		       ^\n
11:09:12 _X.java:24: error: variable i is already defined in method main(String[])\n
11:09:12 		String i\u0019;\n
11:09:12 		       ^\n
11:09:12 _X.java:25: error: variable i is already defined in method main(String[])\n
11:09:12 		String i\u001a;\n
11:09:12 		       ^\n
11:09:12 _X.java:26: error: variable i is already defined in method main(String[])\n
11:09:12 		String i\u001b;\n
11:09:12 		       ^\n
11:09:12 _X.java:27: error: variable i is already defined in method main(String[])\n
11:09:12 		String i\u007f;\n
11:09:12 		       ^\n
11:09:12 23 errors\n
11:09:12 ]>
11:09:12   SerialVersionUIDTests>TestCase.runTest:964->test011:220->AbstractRegressionTest.runNegativeTest:2592->AbstractRegressionTest.runNegativeTest:2601->AbstractRegressionTest.runTest:2920->AbstractRegressionTest.runTest:3195->AbstractRegressionTest.runJavac:2350->AbstractRegressionTest.handleMismatch:2403->TestCase.assertEquals:242->TestCase.assertStringEquals:266 test011 - Eclipse found error(s) but Javac did not find any.
11:09:12 ----------- Expected ------------
11:09:12 
11:09:12 ------------ but was ------------
11:09:12 ----------\n
11:09:12 1. ERROR in X.java (at line 2)\n
11:09:12 	private static final long serialVersionUID = 1L;\n
11:09:12 	                          ^^^^^^^^^^^^^^^^\n
11:09:12 The value of the field X.serialVersionUID is not used\n
11:09:12 ----------\n
11:09:12 
11:09:12 --------- Difference is ----------
11:09:12  expected:<[]> but was:<[----------\n
11:09:12 1. ERROR in X.java (at line 2)\n
11:09:12 	private static final long serialVersionUID = 1L;\n
11:09:12 	                          ^^^^^^^^^^^^^^^^\n
11:09:12 The value of the field X.serialVersionUID is not used\n
11:09:12 ----------\n
11:09:12 ]>
11:09:12   SerialVersionUIDTests>TestCase.runTest:964->test012:243->AbstractRegressionTest.runNegativeTest:2592->AbstractRegressionTest.runNegativeTest:2601->AbstractRegressionTest.runTest:2920->AbstractRegressionTest.runTest:3195->AbstractRegressionTest.runJavac:2350->AbstractRegressionTest.handleMismatch:2403->TestCase.assertEquals:242->TestCase.assertStringEquals:266 test012 - Eclipse found error(s) but Javac did not find any.
11:09:12 ----------- Expected ------------
11:09:12 
11:09:12 ------------ but was ------------
11:09:12 ----------\n
11:09:12 1. ERROR in X.java (at line 2)\n
11:09:12 	private static final long serialVersionUID = 1L;\n
11:09:12 	                          ^^^^^^^^^^^^^^^^\n
11:09:12 The value of the field X<T>.serialVersionUID is not used\n
11:09:12 ----------\n
11:09:12 
11:09:12 --------- Difference is ----------
11:09:12  expected:<[]> but was:<[----------\n
11:09:12 1. ERROR in X.java (at line 2)\n
11:09:12 	private static final long serialVersionUID = 1L;\n
11:09:12 	                          ^^^^^^^^^^^^^^^^\n
11:09:12 The value of the field X<T>.serialVersionUID is not used\n
11:09:12 ----------\n
11:09:12 ]>
11:09:12   SerialVersionUIDTests>TestCase.runTest:964->test013:266->AbstractRegressionTest.runNegativeTest:2592->AbstractRegressionTest.runNegativeTest:2601->AbstractRegressionTest.runTest:2920->AbstractRegressionTest.runTest:3195->AbstractRegressionTest.runJavac:2350->AbstractRegressionTest.handleMismatch:2403->TestCase.assertEquals:242->TestCase.assertStringEquals:266 test013 - Eclipse found error(s) but Javac did not find any.
11:09:12 ----------- Expected ------------
11:09:12 
11:09:12 ------------ but was ------------
11:09:12 ----------\n
11:09:12 1. ERROR in X.java (at line 2)\n
11:09:12 	private static final long serialPersistentFields = 1L;\n
11:09:12 	                          ^^^^^^^^^^^^^^^^^^^^^^\n
11:09:12 The value of the field X<T>.serialPersistentFields is not used\n
11:09:12 ----------\n
11:09:12 
11:09:12 --------- Difference is ----------
11:09:12  expected:<[]> but was:<[----------\n
11:09:12 1. ERROR in X.java (at line 2)\n
11:09:12 	private static final long serialPersistentFields = 1L;\n
11:09:12 	                          ^^^^^^^^^^^^^^^^^^^^^^\n
11:09:12 The value of the field X<T>.serialPersistentFields is not used\n
11:09:12 ----------\n
11:09:12 ]>
11:09:12   SerialVersionUIDTests>TestCase.runTest:964->test014:288->AbstractRegressionTest.runNegativeTest:2592->AbstractRegressionTest.runNegativeTest:2601->AbstractRegressionTest.runTest:2920->AbstractRegressionTest.runTest:3195->AbstractRegressionTest.runJavac:2350->AbstractRegressionTest.handleMismatch:2403->TestCase.assertEquals:242->TestCase.assertStringEquals:266 test014 - Eclipse found error(s) but Javac did not find any.
11:09:12 ----------- Expected ------------
11:09:12 
11:09:12 ------------ but was ------------
11:09:12 ----------\n
11:09:12 1. ERROR in X.java (at line 2)\n
11:09:12 	private static final long serialPersistentFields = 1L;\n
11:09:12 	                          ^^^^^^^^^^^^^^^^^^^^^^\n
11:09:12 The value of the field X.serialPersistentFields is not used\n
11:09:12 ----------\n
11:09:12 
11:09:12 --------- Difference is ----------
11:09:12  expected:<[]> but was:<[----------\n
11:09:12 1. ERROR in X.java (at line 2)\n
11:09:12 	private static final long serialPersistentFields = 1L;\n
11:09:12 	                          ^^^^^^^^^^^^^^^^^^^^^^\n
11:09:12 The value of the field X.serialPersistentFields is not used\n
11:09:12 ----------\n
11:09:12 ]>
11:09:12   SerialVersionUIDTests>TestCase.runTest:964->test015:311->AbstractRegressionTest.runNegativeTest:2592->AbstractRegressionTest.runNegativeTest:2601->AbstractRegressionTest.runTest:2920->AbstractRegressionTest.runTest:3195->AbstractRegressionTest.runJavac:2350->AbstractRegressionTest.handleMismatch:2403->TestCase.assertEquals:242->TestCase.assertStringEquals:266 test015 - Eclipse found error(s) but Javac did not find any.
11:09:12 ----------- Expected ------------
11:09:12 
11:09:12 ------------ but was ------------
11:09:12 ----------\n
11:09:12 1. ERROR in X.java (at line 5)\n
11:09:12 	private int i;\n
11:09:12 	            ^\n
11:09:12 The value of the field X<T>.i is not used\n
11:09:12 ----------\n
11:09:12 
11:09:12 --------- Difference is ----------
11:09:12  expected:<[]> but was:<[----------\n
11:09:12 1. ERROR in X.java (at line 5)\n
11:09:12 	private int i;\n
11:09:12 	            ^\n
11:09:12 The value of the field X<T>.i is not used\n
11:09:12 ----------\n
11:09:12 ]>
11:09:12   SerialVersionUIDTests>TestCase.runTest:964->test016:336->AbstractRegressionTest.runNegativeTest:2592->AbstractRegressionTest.runNegativeTest:2601->AbstractRegressionTest.runTest:2920->AbstractRegressionTest.runTest:3195->AbstractRegressionTest.runJavac:2350->AbstractRegressionTest.handleMismatch:2403->TestCase.assertEquals:242->TestCase.assertStringEquals:266 test016 - Eclipse found error(s) but Javac did not find any.
11:09:12 ----------- Expected ------------
11:09:12 
11:09:12 ------------ but was ------------
11:09:12 ----------\n
11:09:12 1. ERROR in X.java (at line 5)\n
11:09:12 	private int i;\n
11:09:12 	            ^\n
11:09:12 The value of the field X.i is not used\n
11:09:12 ----------\n
11:09:12 
11:09:12 --------- Difference is ----------
11:09:12  expected:<[]> but was:<[----------\n
11:09:12 1. ERROR in X.java (at line 5)\n
11:09:12 	private int i;\n
11:09:12 	            ^\n
11:09:12 The value of the field X.i is not used\n
11:09:12 ----------\n
11:09:12 ]>
11:09:12   StaticImportTest>TestCase.runTest:964->test074:2538->AbstractRegressionTest.runConformTest:1689->AbstractRegressionTest.runConformTest:1692->AbstractRegressionTest.runTest:2920->AbstractRegressionTest.runTest:3195->AbstractRegressionTest.runJavac:2350->AbstractRegressionTest.handleMismatch:2411->TestCase.assertEquals:242->TestCase.assertStringEquals:266 test074 - Javac found error(s) but Eclipse did not find any.
11:09:12 ----------- Expected ------------
11:09:12 
11:09:12 ------------ but was ------------
11:09:12 test/Outer.java:4: error: cannot find symbol\n
11:09:12     int i = VALUE;\n
11:09:12             ^\n
11:09:12   symbol:   variable VALUE\n
11:09:12   location: class Outer\n
11:09:12 1 error\n
11:09:12 
11:09:12 --------- Difference is ----------
11:09:12  expected:<[]> but was:<[test/Outer.java:4: error: cannot find symbol\n
11:09:12     int i = VALUE;\n
11:09:12             ^\n
11:09:12   symbol:   variable VALUE\n
11:09:12   location: class Outer\n
11:09:12 1 error\n
11:09:12 ]>
11:09:12   StaticImportTest>TestCase.runTest:964->test078:2648->AbstractRegressionTest.runNegativeTest:2474->AbstractRegressionTest.runNegativeTest:2485->AbstractRegressionTest.runTest:2920->AbstractRegressionTest.runTest:3195->AbstractRegressionTest.runJavac:2350->AbstractRegressionTest.handleMismatch:2403->TestCase.assertEquals:242->TestCase.assertStringEquals:266 test078 - Eclipse found error(s) but Javac did not find any.
11:09:12 ----------- Expected ------------
11:09:12 
11:09:12 ------------ but was ------------
11:09:12 ----------\n
11:09:12 1. ERROR in A\A.java (at line 3)\n
11:09:12 	import B.B.C1;\n
11:09:12 	       ^^^^^^\n
11:09:12 The import B.B.C1 collides with another import statement\n
11:09:12 ----------\n
11:09:12 
11:09:12 --------- Difference is ----------
11:09:12  expected:<[]> but was:<[----------\n
11:09:12 1. ERROR in A\A.java (at line 3)\n
11:09:12 	import B.B.C1;\n
11:09:12 	       ^^^^^^\n
11:09:12 The import B.B.C1 collides with another import statement\n
11:09:12 ----------\n
11:09:12 ]>
11:09:12   StaticImportTest>TestCase.runTest:964->test079:2682->AbstractRegressionTest.runNegativeTest:2474->AbstractRegressionTest.runNegativeTest:2485->AbstractRegressionTest.runTest:2920->AbstractRegressionTest.runTest:3195->AbstractRegressionTest.runJavac:2350->AbstractRegressionTest.handleMismatch:2419->TestCase.assertEquals:242->TestCase.assertStringEquals:266 test079 - Eclipse found warning(s) but Javac did not find any.
11:09:12 ----------- Expected ------------
11:09:12 
11:09:12 ------------ but was ------------
11:09:12 ----------\n
11:09:12 1. WARNING in A\A.java (at line 2)\n
11:09:12 	import static B.B.C1;\n
11:09:12 	              ^^^^^^\n
11:09:12 The import B.B.C1 is never used\n
11:09:12 ----------\n
11:09:12 
11:09:12 --------- Difference is ----------
11:09:12  expected:<[]> but was:<[----------\n
11:09:12 1. WARNING in A\A.java (at line 2)\n
11:09:12 	import static B.B.C1;\n
11:09:12 	              ^^^^^^\n
11:09:12 The import B.B.C1 is never used\n
11:09:12 ----------\n
11:09:12 ]>
11:09:12   SwitchTest>TestCase.runTest:964->test014:610->AbstractRegressionTest.runNegativeTest:2592->AbstractRegressionTest.runNegativeTest:2601->AbstractRegressionTest.runTest:2920->AbstractRegressionTest.runTest:3195->AbstractRegressionTest.runJavac:2350->AbstractRegressionTest.handleMismatch:2407->TestCase.assertEquals:242->TestCase.assertStringEquals:266 test014 - Eclipse found error(s) but Javac only found warning(s).
11:09:12 ----------- Expected ------------
11:09:12 ----------\n
11:09:12 1. ERROR in X.java (at line 18)\n
11:09:12 	case 6://WRONG\n
11:09:12 	^^^^^^\n
11:09:12 Switch case may be entered by falling through previous case. If intended, add a new comment //$FALL-THROUGH$ on the line above\n
11:09:12 ----------\n
11:09:12 
11:09:12 ------------ but was ------------
11:09:12 X.java:8: warning: [fallthrough] possible fall-through into case\n
11:09:12 			case 2://OK\n
11:09:12 			^\n
11:09:12 X.java:10: warning: [fallthrough] possible fall-through into case\n
11:09:12 			case 3://OK\n
11:09:12 			^\n
11:09:12 X.java:13: warning: [fallthrough] possible fall-through into case\n
11:09:12 			case 4://OK\n
11:09:12 			^\n
11:09:12 X.java:18: warning: [fallthrough] possible fall-through into case\n
11:09:12 			case 6://WRONG\n
11:09:12 			^\n
11:09:12 X.java:22: warning: [fallthrough] possible fall-through into case\n
11:09:12 			case 7://OK\n
11:09:12 			^\n
11:09:12 5 warnings\n
11:09:12 
11:09:12 --------- Difference is ----------
11:09:12  expected:<[----------\n
11:09:12 1. ERROR in X.java (at line 18)\n
11:09:12 	case 6://WRONG\n
11:09:12 	^^^^^^\n
11:09:12 Switch case may be entered by falling through previous case. If intended, add a new comment //$FALL-THROUGH$ on the line above\n
11:09:12 ----------]\n
11:09:12 > but was:<[X.java:8: warning: [fallthrough] possible fall-through into case\n
11:09:12 			case 2://OK\n
11:09:12 			^\n
11:09:12 X.java:10: warning: [fallthrough] possible fall-through into case\n
11:09:12 			case 3://OK\n
11:09:12 			^\n
11:09:12 X.java:13: warning: [fallthrough] possible fall-through into case\n
11:09:12 			case 4://OK\n
11:09:12 			^\n
11:09:12 X.java:18: warning: [fallthrough] possible fall-through into case\n
11:09:12 			case 6://WRONG\n
11:09:12 			^\n
11:09:12 X.java:22: warning: [fallthrough] possible fall-through into case\n
11:09:12 			case 7://OK\n
11:09:12 			^\n
11:09:12 5 warnings]\n
11:09:12 >
11:09:12   SwitchTest>TestCase.runTest:964->test015:653->AbstractRegressionTest.runNegativeTest:2592->AbstractRegressionTest.runNegativeTest:2601->AbstractRegressionTest.runTest:2920->AbstractRegressionTest.runTest:3195->AbstractRegressionTest.runJavac:2350->AbstractRegressionTest.handleMismatch:2407->TestCase.assertEquals:242->TestCase.assertStringEquals:266 test015 - Eclipse found error(s) but Javac only found warning(s).
11:09:12 ----------- Expected ------------
11:09:12 ----------\n
11:09:12 1. ERROR in X.java (at line 18)\n
11:09:12 	case 6://WRONG\n
11:09:12 	^^^^^^\n
11:09:12 Switch case may be entered by falling through previous case. If intended, add a new comment //$FALL-THROUGH$ on the line above\n
11:09:12 ----------\n
11:09:12 
11:09:12 ------------ but was ------------
11:09:12 X.java:8: warning: [fallthrough] possible fall-through into case\n
11:09:12 			case 2://OK\n
11:09:12 			^\n
11:09:12 X.java:10: warning: [fallthrough] possible fall-through into case\n
11:09:12 			case 3://OK\n
11:09:12 			^\n
11:09:12 X.java:13: warning: [fallthrough] possible fall-through into case\n
11:09:12 			case 4://OK\n
11:09:12 			^\n
11:09:12 X.java:18: warning: [fallthrough] possible fall-through into case\n
11:09:12 			case 6://WRONG\n
11:09:12 			^\n
11:09:12 X.java:22: warning: [fallthrough] possible fall-through into case\n
11:09:12 			case 7://OK\n
11:09:12 			^\n
11:09:12 5 warnings\n
11:09:12 
11:09:12 --------- Difference is ----------
11:09:12  expected:<[----------\n
11:09:12 1. ERROR in X.java (at line 18)\n
11:09:12 	case 6://WRONG\n
11:09:12 	^^^^^^\n
11:09:12 Switch case may be entered by falling through previous case. If intended, add a new comment //$FALL-THROUGH$ on the line above\n
11:09:12 ----------]\n
11:09:12 > but was:<[X.java:8: warning: [fallthrough] possible fall-through into case\n
11:09:12 			case 2://OK\n
11:09:12 			^\n
11:09:12 X.java:10: warning: [fallthrough] possible fall-through into case\n
11:09:12 			case 3://OK\n
11:09:12 			^\n
11:09:12 X.java:13: warning: [fallthrough] possible fall-through into case\n
11:09:12 			case 4://OK\n
11:09:12 			^\n
11:09:12 X.java:18: warning: [fallthrough] possible fall-through into case\n
11:09:12 			case 6://WRONG\n
11:09:12 			^\n
11:09:12 X.java:22: warning: [fallthrough] possible fall-through into case\n
11:09:12 			case 7://OK\n
11:09:12 			^\n
11:09:12 5 warnings]\n
11:09:12 >
11:09:12   SwitchTest>TestCase.runTest:964->test016:696->AbstractRegressionTest.runNegativeTest:2592->AbstractRegressionTest.runNegativeTest:2601->AbstractRegressionTest.runTest:2920->AbstractRegressionTest.runTest:3195->AbstractRegressionTest.runJavac:2350->AbstractRegressionTest.handleMismatch:2407->TestCase.assertEquals:242->TestCase.assertStringEquals:266 test016 - Eclipse found error(s) but Javac only found warning(s).
11:09:12 ----------- Expected ------------
11:09:12 ----------\n
11:09:12 1. ERROR in X.java (at line 8)\n
11:09:12 	case 2://WRONG\n
11:09:12 	^^^^^^\n
11:09:12 Switch case may be entered by falling through previous case. If intended, add a new comment //$FALL-THROUGH$ on the line above\n
11:09:12 ----------\n
11:09:12 
11:09:12 ------------ but was ------------
11:09:12 X.java:8: warning: [fallthrough] possible fall-through into case\n
11:09:12 			case 2://WRONG\n
11:09:12 			^\n
11:09:12 1 warning\n
11:09:12 
11:09:12 --------- Difference is ----------
11:09:12  expected:<[----------\n
11:09:12 1. ERROR in X.java (at line 8)\n
11:09:12 	case 2://WRONG\n
11:09:12 	^^^^^^\n
11:09:12 Switch case may be entered by falling through previous case. If intended, add a new comment //$FALL-THROUGH$ on the line above\n
11:09:12 ----------]\n
11:09:12 > but was:<[X.java:8: warning: [fallthrough] possible fall-through into case\n
11:09:12 			case 2://WRONG\n
11:09:12 			^\n
11:09:12 1 warning]\n
11:09:12 >
11:09:12   SwitchTest>TestCase.runTest:964->test017:725->AbstractRegressionTest.runNegativeTest:2592->AbstractRegressionTest.runNegativeTest:2601->AbstractRegressionTest.runTest:2920->AbstractRegressionTest.runTest:3195->AbstractRegressionTest.runJavac:2350->AbstractRegressionTest.handleMismatch:2407->TestCase.assertEquals:242->TestCase.assertStringEquals:266 test017 - Eclipse found error(s) but Javac only found warning(s).
11:09:12 ----------- Expected ------------
11:09:12 ----------\n
11:09:12 1. ERROR in X.java (at line 10)\n
11:09:12 	default :\n
11:09:12 	^^^^^^^\n
11:09:12 Switch case may be entered by falling through previous case. If intended, add a new comment //$FALL-THROUGH$ on the line above\n
11:09:12 ----------\n
11:09:12 
11:09:12 ------------ but was ------------
11:09:12 X.java:10: warning: [fallthrough] possible fall-through into case\n
11:09:12 			default :\n
11:09:12 			^\n
11:09:12 1 warning\n
11:09:12 
11:09:12 --------- Difference is ----------
11:09:12  expected:<[----------\n
11:09:12 1. ERROR in X.java (at line 10)\n
11:09:12 	default :\n
11:09:12 	^^^^^^^\n
11:09:12 Switch case may be entered by falling through previous case. If intended, add a new comment //$FALL-THROUGH$ on the line above\n
11:09:12 ----------]\n
11:09:12 > but was:<[X.java:10: warning: [fallthrough] possible fall-through into case\n
11:09:12 			default :\n
11:09:12 			^\n
11:09:12 1 warning]\n
11:09:12 >
11:09:12   SwitchTest>TestCase.runTest:964->test387146a:2572->AbstractRegressionTest.runNegativeTest:2592->AbstractRegressionTest.runNegativeTest:2601->AbstractRegressionTest.runTest:2920->AbstractRegressionTest.runTest:3195->AbstractRegressionTest.runJavac:2350->AbstractRegressionTest.handleMismatch:2423->TestCase.assertEquals:242->TestCase.assertStringEquals:266 test387146a - Javac found warning(s) but Eclipse did not find any.
11:09:12 ----------- Expected ------------
11:09:12 
11:09:12 ------------ but was ------------
11:09:12 X.java:10: warning: [fallthrough] possible fall-through into case\n
11:09:12 		case 2:\n
11:09:12 		^\n
11:09:12 1 warning\n
11:09:12 
11:09:12 --------- Difference is ----------
11:09:12  expected:<[]> but was:<[X.java:10: warning: [fallthrough] possible fall-through into case\n
11:09:12 		case 2:\n
11:09:12 		^\n
11:09:12 1 warning\n
11:09:12 ]>
11:09:12   SwitchTest>TestCase.runTest:964->test387146b:2601->AbstractRegressionTest.runNegativeTest:2592->AbstractRegressionTest.runNegativeTest:2601->AbstractRegressionTest.runTest:2920->AbstractRegressionTest.runTest:3195->AbstractRegressionTest.runJavac:2350->AbstractRegressionTest.handleMismatch:2423->TestCase.assertEquals:242->TestCase.assertStringEquals:266 test387146b - Javac found warning(s) but Eclipse did not find any.
11:09:12 ----------- Expected ------------
11:09:12 
11:09:12 ------------ but was ------------
11:09:12 X.java:10: warning: [fallthrough] possible fall-through into case\n
11:09:12 		case 2:\n
11:09:12 		^\n
11:09:12 1 warning\n
11:09:12 
11:09:12 --------- Difference is ----------
11:09:12  expected:<[]> but was:<[X.java:10: warning: [fallthrough] possible fall-through into case\n
11:09:12 		case 2:\n
11:09:12 		^\n
11:09:12 1 warning\n
11:09:12 ]>
11:09:12   SwitchTest>TestCase.runTest:964->test410892_4:2782->AbstractRegressionTest.runNegativeTest:2592->AbstractRegressionTest.runNegativeTest:2601->AbstractRegressionTest.runTest:2920->AbstractRegressionTest.runTest:3195->AbstractRegressionTest.runJavac:2350->AbstractRegressionTest.handleMismatch:2419->TestCase.assertEquals:242->TestCase.assertStringEquals:266 test410892_4 - Eclipse found warning(s) but Javac did not find any.
11:09:12 ----------- Expected ------------
11:09:12 
11:09:12 ------------ but was ------------
11:09:12 ----------\n
11:09:12 1. WARNING in X.java (at line 4)\n
11:09:12 	int var2 = 0;\n
11:09:12 	    ^^^^\n
11:09:12 The value of the local variable var2 is not used\n
11:09:12 ----------\n
11:09:12 
11:09:12 --------- Difference is ----------
11:09:12  expected:<[]> but was:<[----------\n
11:09:12 1. WARNING in X.java (at line 4)\n
11:09:12 	int var2 = 0;\n
11:09:12 	    ^^^^\n
11:09:12 The value of the local variable var2 is not used\n
11:09:12 ----------\n
11:09:12 ]>
11:09:12   SwitchTest>TestCase.runTest:964->test410892_5:2817->AbstractRegressionTest.runNegativeTest:2592->AbstractRegressionTest.runNegativeTest:2601->AbstractRegressionTest.runTest:2920->AbstractRegressionTest.runTest:3195->AbstractRegressionTest.runJavac:2350->AbstractRegressionTest.handleMismatch:2419->TestCase.assertEquals:242->TestCase.assertStringEquals:266 test410892_5 - Eclipse found warning(s) but Javac did not find any.
11:09:12 ----------- Expected ------------
11:09:12 
11:09:12 ------------ but was ------------
11:09:12 ----------\n
11:09:12 1. WARNING in X.java (at line 4)\n
11:09:12 	int var2 = 0;\n
11:09:12 	    ^^^^\n
11:09:12 The value of the local variable var2 is not used\n
11:09:12 ----------\n
11:09:12 
11:09:12 --------- Difference is ----------
11:09:12  expected:<[]> but was:<[----------\n
11:09:12 1. WARNING in X.java (at line 4)\n
11:09:12 	int var2 = 0;\n
11:09:12 	    ^^^^\n
11:09:12 The value of the local variable var2 is not used\n
11:09:12 ----------\n
11:09:12 ]>
11:09:12   SwitchTest>TestCase.runTest:964->test410892_6:2853->AbstractRegressionTest.runNegativeTest:2592->AbstractRegressionTest.runNegativeTest:2601->AbstractRegressionTest.runTest:2920->AbstractRegressionTest.runTest:3195->AbstractRegressionTest.runJavac:2350->AbstractRegressionTest.handleMismatch:2419->TestCase.assertEquals:242->TestCase.assertStringEquals:266 test410892_6 - Eclipse found warning(s) but Javac did not find any.
11:09:12 ----------- Expected ------------
11:09:12 
11:09:12 ------------ but was ------------
11:09:12 ----------\n
11:09:12 1. WARNING in X.java (at line 4)\n
11:09:12 	int var2 = 0;\n
11:09:12 	    ^^^^\n
11:09:12 The value of the local variable var2 is not used\n
11:09:12 ----------\n
11:09:12 
11:09:12 --------- Difference is ----------
11:09:12  expected:<[]> but was:<[----------\n
11:09:12 1. WARNING in X.java (at line 4)\n
11:09:12 	int var2 = 0;\n
11:09:12 	    ^^^^\n
11:09:12 The value of the local variable var2 is not used\n
11:09:12 ----------\n
11:09:12 ]>
11:09:12   SwitchTest>TestCase.runTest:964->testBug374605:2144->AbstractRegressionTest.runNegativeTest:2592->AbstractRegressionTest.runNegativeTest:2601->AbstractRegressionTest.runTest:2920->AbstractRegressionTest.runTest:3195->AbstractRegressionTest.runJavac:2350->AbstractRegressionTest.handleMismatch:2419->TestCase.assertEquals:242->TestCase.assertStringEquals:266 testBug374605 - Eclipse found warning(s) but Javac did not find any.
11:09:12 ----------- Expected ------------
11:09:12 
11:09:12 ------------ but was ------------
11:09:12 ----------\n
11:09:12 1. WARNING in p\X.java (at line 4)\n
11:09:12 	switch (i) {\n
11:09:12 	        ^\n
11:09:12 The switch statement should have a default case\n
11:09:12 ----------\n
11:09:12 
11:09:12 --------- Difference is ----------
11:09:12  expected:<[]> but was:<[----------\n
11:09:12 1. WARNING in p\X.java (at line 4)\n
11:09:12 	switch (i) {\n
11:09:12 	        ^\n
11:09:12 The switch statement should have a default case\n
11:09:12 ----------\n
11:09:12 ]>
11:09:12   XLargeTest>TestCase.runTest:964->test0016:14523->AbstractRegressionTest.runConformTest:1689->AbstractRegressionTest.runConformTest:1692->AbstractRegressionTest.runTest:2920->AbstractRegressionTest.runTest:3195->AbstractRegressionTest.runJavac:2350->AbstractRegressionTest.handleMismatch:2411->TestCase.assertEquals:242->TestCase.assertStringEquals:266 test0016 - Javac found error(s) but Eclipse did not find any.
11:09:12 ----------- Expected ------------
11:09:12 
11:09:12 ------------ but was ------------
11:09:12 X.java:2: error: code too large\n
11:09:12 	X0(0),\n
11:09:12 	^\n
11:09:12 1 error\n
11:09:12 
11:09:12 --------- Difference is ----------
11:09:12  expected:<[]> but was:<[X.java:2: error: code too large\n
11:09:12 	X0(0),\n
11:09:12 	^\n
11:09:12 1 error\n
11:09:12 ]>
11:09:12 
11:09:12 Tests run: 12521, Failures: 197, Errors: 0, Skipped: 0
11:09:12 
11:09:14 [INFO] ------------------------------------------------------------------------
11:09:14 [INFO] Reactor Summary:
11:09:14 [INFO] 
11:09:14 [INFO] org.eclipse.jdt.core 3.18.0-SNAPSHOT ............... SUCCESS [ 44.092 s]
11:09:14 [INFO] org.eclipse.jdt.core.tests.compiler 3.12.900-SNAPSHOT FAILURE [  02:06 h]
11:09:14 [INFO] ------------------------------------------------------------------------
11:09:14 [INFO] BUILD FAILURE
11:09:14 [INFO] ------------------------------------------------------------------------
11:09:14 [INFO] Total time:  02:08 h
11:09:14 [INFO] Finished at: 2019-05-12T11:09:14-04:00
11:09:14 [INFO] ------------------------------------------------------------------------
11:09:14 [ERROR] Failed to execute goal org.eclipse.tycho:tycho-surefire-plugin:1.4.0:test (default-test) on project org.eclipse.jdt.core.tests.compiler: There are test failures.
11:09:14 [ERROR] 
11:09:14 [ERROR] Please refer to /jobs/genie.jdt/eclipse.jdt.core-run.javac-1.8/workspace/org.eclipse.jdt.core.tests.compiler/target/surefire-reports for the individual test results.
11:09:14 [ERROR] -> [Help 1]
11:09:14 [ERROR] 
11:09:14 [ERROR] To see the full stack trace of the errors, re-run Maven with the -e switch.
11:09:14 [ERROR] Re-run Maven using the -X switch to enable full debug logging.
11:09:14 [ERROR] 
11:09:14 [ERROR] For more information about the errors and possible solutions, please read the following articles:
11:09:14 [ERROR] [Help 1] http://cwiki.apache.org/confluence/display/MAVEN/MojoFailureException
11:09:14 [ERROR] 
11:09:14 [ERROR] After correcting the problems, you can resume the build with the command
11:09:14 [ERROR]   mvn <goals> -rf :org.eclipse.jdt.core.tests.compiler
11:09:15 Build step 'Invoke top-level Maven targets' marked build as failure
11:09:15 Recording test results
11:09:17 Sending e-mails to: stephan.herrmann@berlin.de
11:09:17 Started calculate disk usage of build
11:09:17 Finished Calculation of disk usage of build in 0 seconds
11:09:21 Started calculate disk usage of workspace
11:09:22 Finished Calculation of disk usage of workspace in 0 seconds
11:09:24 Finished: FAILURE