FailedConsole Output

Skipping 11,786 KB.. Full Log
  JavadocBugsTest>TestCase.runTest:957->testBug233187a:7855->AbstractRegressionTest.runNegativeTest:2703->AbstractRegressionTest.runNegativeTest:2714->AbstractRegressionTest.runTest:3149->AbstractRegressionTest.runTest:3514->AbstractRegressionTest.runJavac:2577->AbstractRegressionTest.handleMismatch:2632->TestCase.assertEquals:242->TestCase.assertStringEquals:266 testBug233187a - Eclipse found error(s) but Javac did not find any.
05:56:45 ----------- Expected ------------
05:56:45 
05:56:45 ------------ but was ------------
05:56:45 ----------\n
05:56:45 1. ERROR in test\a\X.java (at line 10)\n
05:56:45 	* {@link X.Y#foo(test.a.X.Y.Z)} KO for javadoc tool\n
05:56:45 	             ^^^\n
05:56:45 Javadoc: The method foo(X.Y.Z[]) in the type X.Y is not applicable for the arguments (X.Y.Z)\n
05:56:45 ----------\n
05:56:45 2. ERROR in test\a\X.java (at line 11)\n
05:56:45 	* {@link X.Y#foo(no_test.a.X.Y.Z[])} KO for javadoc tool\n
05:56:45 	                 ^^^^^^^^^^^^^^^\n
05:56:45 Javadoc: no_test[] cannot be resolved to a type\n
05:56:45 ----------\n
05:56:45 3. ERROR in test\a\X.java (at line 12)\n
05:56:45 	* {@link X.Y#foo(Y.Z[])} KO for javadoc tool\n
05:56:45 	                 ^^^\n
05:56:45 Javadoc: Invalid member type qualification\n
05:56:45 ----------\n
05:56:45 4. ERROR in test\a\X.java (at line 13)\n
05:56:45 	* {@link test.a.X.Y#foo(Y.Z[])} KO for javadoc tool\n
05:56:45 	                        ^^^\n
05:56:45 Javadoc: Invalid member type qualification\n
05:56:45 ----------\n
05:56:45 
05:56:45 --------- Difference is ----------
05:56:45  expected:<[]> but was:<[----------\n
05:56:45 1. ERROR in test\a\X.java (at line 10)\n
05:56:45 	* {@link X.Y#foo(test.a.X.Y.Z)} KO for javadoc tool\n
05:56:45 	             ^^^\n
05:56:45 Javadoc: The method foo(X.Y.Z[]) in the type X.Y is not applicable for the arguments (X.Y.Z)\n
05:56:45 ----------\n
05:56:45 2. ERROR in test\a\X.java (at line 11)\n
05:56:45 	* {@link X.Y#foo(no_test.a.X.Y.Z[])} KO for javadoc tool\n
05:56:45 	                 ^^^^^^^^^^^^^^^\n
05:56:45 Javadoc: no_test[] cannot be resolved to a type\n
05:56:45 ----------\n
05:56:45 3. ERROR in test\a\X.java (at line 12)\n
05:56:45 	* {@link X.Y#foo(Y.Z[])} KO for javadoc tool\n
05:56:45 	                 ^^^\n
05:56:45 Javadoc: Invalid member type qualification\n
05:56:45 ----------\n
05:56:45 4. ERROR in test\a\X.java (at line 13)\n
05:56:45 	* {@link test.a.X.Y#foo(Y.Z[])} KO for javadoc tool\n
05:56:45 	                        ^^^\n
05:56:45 Javadoc: Invalid member type qualification\n
05:56:45 ----------\n
05:56:45 ]>
05:56:45   JavadocBugsTest>TestCase.runTest:957->testBug233187b:7884->AbstractRegressionTest.runNegativeTest:2703->AbstractRegressionTest.runNegativeTest:2714->AbstractRegressionTest.runTest:3149->AbstractRegressionTest.runTest:3514->AbstractRegressionTest.runJavac:2577->AbstractRegressionTest.handleMismatch:2632->TestCase.assertEquals:242->TestCase.assertStringEquals:266 testBug233187b - Eclipse found error(s) but Javac did not find any.
05:56:45 ----------- Expected ------------
05:56:45 
05:56:45 ------------ but was ------------
05:56:45 ----------\n
05:56:45 1. ERROR in test\b\X.java (at line 10)\n
05:56:45 	* {@link X.Y#foo(test.b.X.Y.Z[])} KO for javadoc tool\n
05:56:45 	             ^^^\n
05:56:45 Javadoc: The method foo(X.Y.Z) in the type X.Y is not applicable for the arguments (X.Y.Z[])\n
05:56:45 ----------\n
05:56:45 2. ERROR in test\b\X.java (at line 11)\n
05:56:45 	* {@link X.Y#foo(no_test.b.X.Y.Z)} KO for javadoc tool\n
05:56:45 	                 ^^^^^^^^^^^^^^^\n
05:56:45 Javadoc: no_test cannot be resolved to a type\n
05:56:45 ----------\n
05:56:45 3. ERROR in test\b\X.java (at line 12)\n
05:56:45 	* {@link X.Y#foo(Y.Z)} KO for javadoc tool\n
05:56:45 	                 ^^^\n
05:56:45 Javadoc: Invalid member type qualification\n
05:56:45 ----------\n
05:56:45 4. ERROR in test\b\X.java (at line 13)\n
05:56:45 	* {@link test.b.X.Y#foo(Y.Z)} KO for javadoc tool\n
05:56:45 	                        ^^^\n
05:56:45 Javadoc: Invalid member type qualification\n
05:56:45 ----------\n
05:56:45 
05:56:45 --------- Difference is ----------
05:56:45  expected:<[]> but was:<[----------\n
05:56:45 1. ERROR in test\b\X.java (at line 10)\n
05:56:45 	* {@link X.Y#foo(test.b.X.Y.Z[])} KO for javadoc tool\n
05:56:45 	             ^^^\n
05:56:45 Javadoc: The method foo(X.Y.Z) in the type X.Y is not applicable for the arguments (X.Y.Z[])\n
05:56:45 ----------\n
05:56:45 2. ERROR in test\b\X.java (at line 11)\n
05:56:45 	* {@link X.Y#foo(no_test.b.X.Y.Z)} KO for javadoc tool\n
05:56:45 	                 ^^^^^^^^^^^^^^^\n
05:56:45 Javadoc: no_test cannot be resolved to a type\n
05:56:45 ----------\n
05:56:45 3. ERROR in test\b\X.java (at line 12)\n
05:56:45 	* {@link X.Y#foo(Y.Z)} KO for javadoc tool\n
05:56:45 	                 ^^^\n
05:56:45 Javadoc: Invalid member type qualification\n
05:56:45 ----------\n
05:56:45 4. ERROR in test\b\X.java (at line 13)\n
05:56:45 	* {@link test.b.X.Y#foo(Y.Z)} KO for javadoc tool\n
05:56:45 	                        ^^^\n
05:56:45 Javadoc: Invalid member type qualification\n
05:56:45 ----------\n
05:56:45 ]>
05:56:45   JavadocBugsTest>TestCase.runTest:957->testBug254825:8112->AbstractRegressionTest.runNegativeTest:2703->AbstractRegressionTest.runNegativeTest:2714->AbstractRegressionTest.runTest:3149->AbstractRegressionTest.runTest:3514->AbstractRegressionTest.runJavac:2577->AbstractRegressionTest.handleMismatch:2632->TestCase.assertEquals:242->TestCase.assertStringEquals:266 testBug254825 - Eclipse found error(s) but Javac did not find any.
05:56:45 ----------- Expected ------------
05:56:45 
05:56:45 ------------ but was ------------
05:56:45 ----------\n
05:56:45 1. ERROR in X.java (at line 4)\n
05:56:45 	/** @see #o */\n
05:56:45 	          ^\n
05:56:45 Javadoc: o cannot be resolved or is not a field\n
05:56:45 ----------\n
05:56:45 
05:56:45 --------- Difference is ----------
05:56:45  expected:<[]> but was:<[----------\n
05:56:45 1. ERROR in X.java (at line 4)\n
05:56:45 	/** @see #o */\n
05:56:45 	          ^\n
05:56:45 Javadoc: o cannot be resolved or is not a field\n
05:56:45 ----------\n
05:56:45 ]>
05:56:45   JavadocBugsTest>TestCase.runTest:957->testBug254825b:8133->AbstractRegressionTest.runNegativeTest:2703->AbstractRegressionTest.runNegativeTest:2714->AbstractRegressionTest.runTest:3149->AbstractRegressionTest.runTest:3514->AbstractRegressionTest.runJavac:2577->AbstractRegressionTest.handleMismatch:2632->TestCase.assertEquals:242->TestCase.assertStringEquals:266 testBug254825b - Eclipse found error(s) but Javac did not find any.
05:56:45 ----------- Expected ------------
05:56:45 
05:56:45 ------------ but was ------------
05:56:45 ----------\n
05:56:45 1. ERROR in X.java (at line 2)\n
05:56:45 	/** @see #o */\n
05:56:45 	          ^\n
05:56:45 Javadoc: o cannot be resolved or is not a field\n
05:56:45 ----------\n
05:56:45 
05:56:45 --------- Difference is ----------
05:56:45  expected:<[]> but was:<[----------\n
05:56:45 1. ERROR in X.java (at line 2)\n
05:56:45 	/** @see #o */\n
05:56:45 	          ^\n
05:56:45 Javadoc: o cannot be resolved or is not a field\n
05:56:45 ----------\n
05:56:45 ]>
05:56:45   JavadocBugsTest>TestCase.runTest:957->testBug258798_1:8167->AbstractRegressionTest.runNegativeTest:2703->AbstractRegressionTest.runNegativeTest:2714->AbstractRegressionTest.runTest:3149->AbstractRegressionTest.runTest:3514->AbstractRegressionTest.runJavac:2577->AbstractRegressionTest.handleMismatch:2648->TestCase.assertEquals:242->TestCase.assertStringEquals:266 testBug258798_1 - Eclipse found warning(s) but Javac did not find any.
05:56:45 ----------- Expected ------------
05:56:45 
05:56:45 ------------ but was ------------
05:56:45 ----------\n
05:56:45 1. WARNING in X.java (at line 5)\n
05:56:45 	X(int i) {\n
05:56:45 	      ^\n
05:56:45 Javadoc: Missing tag for parameter i\n
05:56:45 ----------\n
05:56:45 
05:56:45 --------- Difference is ----------
05:56:45  expected:<[]> but was:<[----------\n
05:56:45 1. WARNING in X.java (at line 5)\n
05:56:45 	X(int i) {\n
05:56:45 	      ^\n
05:56:45 Javadoc: Missing tag for parameter i\n
05:56:45 ----------\n
05:56:45 ]>
05:56:45   JavadocBugsTest>TestCase.runTest:957->testBug258798_2a:8188->AbstractRegressionTest.runNegativeTest:2703->AbstractRegressionTest.runNegativeTest:2714->AbstractRegressionTest.runTest:3149->AbstractRegressionTest.runTest:3514->AbstractRegressionTest.runJavac:2577->AbstractRegressionTest.handleMismatch:2648->TestCase.assertEquals:242->TestCase.assertStringEquals:266 testBug258798_2a - Eclipse found warning(s) but Javac did not find any.
05:56:45 ----------- Expected ------------
05:56:45 
05:56:45 ------------ but was ------------
05:56:45 ----------\n
05:56:45 1. WARNING in X.java (at line 6)\n
05:56:45 	Y(double d) { super(0); }\n
05:56:45 	         ^\n
05:56:45 Javadoc: Missing tag for parameter d\n
05:56:45 ----------\n
05:56:45 
05:56:45 --------- Difference is ----------
05:56:45  expected:<[]> but was:<[----------\n
05:56:45 1. WARNING in X.java (at line 6)\n
05:56:45 	Y(double d) { super(0); }\n
05:56:45 	         ^\n
05:56:45 Javadoc: Missing tag for parameter d\n
05:56:45 ----------\n
05:56:45 ]>
05:56:45   JavadocBugsTest>TestCase.runTest:957->testBug258798_2b:8210->AbstractRegressionTest.runNegativeTest:2703->AbstractRegressionTest.runNegativeTest:2714->AbstractRegressionTest.runTest:3149->AbstractRegressionTest.runTest:3514->AbstractRegressionTest.runJavac:2577->AbstractRegressionTest.handleMismatch:2648->TestCase.assertEquals:242->TestCase.assertStringEquals:266 testBug258798_2b - Eclipse found warning(s) but Javac did not find any.
05:56:45 ----------- Expected ------------
05:56:45 
05:56:45 ------------ but was ------------
05:56:45 ----------\n
05:56:45 1. WARNING in X.java (at line 7)\n
05:56:45 	Y(List<U> lu) { super(null); }\n
05:56:45 	          ^^\n
05:56:45 Javadoc: Missing tag for parameter lu\n
05:56:45 ----------\n
05:56:45 
05:56:45 --------- Difference is ----------
05:56:45  expected:<[]> but was:<[----------\n
05:56:45 1. WARNING in X.java (at line 7)\n
05:56:45 	Y(List<U> lu) { super(null); }\n
05:56:45 	          ^^\n
05:56:45 Javadoc: Missing tag for parameter lu\n
05:56:45 ----------\n
05:56:45 ]>
05:56:45   JavadocBugsTest>TestCase.runTest:957->testBug258798_2c:8234->AbstractRegressionTest.runNegativeTest:2703->AbstractRegressionTest.runNegativeTest:2714->AbstractRegressionTest.runTest:3149->AbstractRegressionTest.runTest:3514->AbstractRegressionTest.runJavac:2577->AbstractRegressionTest.handleMismatch:2648->TestCase.assertEquals:242->TestCase.assertStringEquals:266 testBug258798_2c - Eclipse found warning(s) but Javac did not find any.
05:56:45 ----------- Expected ------------
05:56:45 
05:56:45 ------------ but was ------------
05:56:45 ----------\n
05:56:45 1. WARNING in X.java (at line 7)\n
05:56:45 	Y(List<U> lu) { super(lu); }\n
05:56:45 	          ^^\n
05:56:45 Javadoc: Missing tag for parameter lu\n
05:56:45 ----------\n
05:56:45 
05:56:45 --------- Difference is ----------
05:56:45  expected:<[]> but was:<[----------\n
05:56:45 1. WARNING in X.java (at line 7)\n
05:56:45 	Y(List<U> lu) { super(lu); }\n
05:56:45 	          ^^\n
05:56:45 Javadoc: Missing tag for parameter lu\n
05:56:45 ----------\n
05:56:45 ]>
05:56:45   JavadocBugsTest>TestCase.runTest:957->testBug267833_3:8500->AbstractRegressionTest.runNegativeTest:2703->AbstractRegressionTest.runNegativeTest:2714->AbstractRegressionTest.runTest:3149->AbstractRegressionTest.runTest:3514->AbstractRegressionTest.runJavac:2577->AbstractRegressionTest.handleMismatch:2632->TestCase.assertEquals:242->TestCase.assertStringEquals:266 testBug267833_3 - Eclipse found error(s) but Javac did not find any.
05:56:45 ----------- Expected ------------
05:56:45 
05:56:45 ------------ but was ------------
05:56:45 ----------\n
05:56:45 1. ERROR in X.java (at line 3)\n
05:56:45 	* Description {@see String} , {@return int}, {@since 1.0}, {@param i}, {@throws NullPointerException}\n
05:56:45 	                ^^^\n
05:56:45 Javadoc: Unexpected tag\n
05:56:45 ----------\n
05:56:45 2. ERROR in X.java (at line 3)\n
05:56:45 	* Description {@see String} , {@return int}, {@since 1.0}, {@param i}, {@throws NullPointerException}\n
05:56:45 	                                ^^^^^^\n
05:56:45 Javadoc: Unexpected tag\n
05:56:45 ----------\n
05:56:45 3. ERROR in X.java (at line 3)\n
05:56:45 	* Description {@see String} , {@return int}, {@since 1.0}, {@param i}, {@throws NullPointerException}\n
05:56:45 	                                               ^^^^^\n
05:56:45 Javadoc: Unexpected tag\n
05:56:45 ----------\n
05:56:45 4. ERROR in X.java (at line 3)\n
05:56:45 	* Description {@see String} , {@return int}, {@since 1.0}, {@param i}, {@throws NullPointerException}\n
05:56:45 	                                                             ^^^^^\n
05:56:45 Javadoc: Unexpected tag\n
05:56:45 ----------\n
05:56:45 5. ERROR in X.java (at line 3)\n
05:56:45 	* Description {@see String} , {@return int}, {@since 1.0}, {@param i}, {@throws NullPointerException}\n
05:56:45 	                                                                         ^^^^^^\n
05:56:45 Javadoc: Unexpected tag\n
05:56:45 ----------\n
05:56:45 6. ERROR in X.java (at line 4)\n
05:56:45 	* and more {@author jay}, {@category cat}, {@deprecated}, {@exception NullPointerException}, {@version 1.1}\n
05:56:45 	             ^^^^^^\n
05:56:45 Javadoc: Unexpected tag\n
05:56:45 ----------\n
05:56:45 7. ERROR in X.java (at line 4)\n
05:56:45 	* and more {@author jay}, {@category cat}, {@deprecated}, {@exception NullPointerException}, {@version 1.1}\n
05:56:45 	                            ^^^^^^^^\n
05:56:45 Javadoc: Unexpected tag\n
05:56:45 ----------\n
05:56:45 8. ERROR in X.java (at line 4)\n
05:56:45 	* and more {@author jay}, {@category cat}, {@deprecated}, {@exception NullPointerException}, {@version 1.1}\n
05:56:45 	                                             ^^^^^^^^^^\n
05:56:45 Javadoc: Unexpected tag\n
05:56:45 ----------\n
05:56:45 9. ERROR in X.java (at line 4)\n
05:56:45 	* and more {@author jay}, {@category cat}, {@deprecated}, {@exception NullPointerException}, {@version 1.1}\n
05:56:45 	                                                            ^^^^^^^^^\n
05:56:45 Javadoc: Unexpected tag\n
05:56:45 ----------\n
05:56:45 10. ERROR in X.java (at line 4)\n
05:56:45 	* and more {@author jay}, {@category cat}, {@deprecated}, {@exception NullPointerException}, {@version 1.1}\n
05:56:45 	                                                                                               ^^^^^^^\n
05:56:45 Javadoc: Unexpected tag\n
05:56:45 ----------\n
05:56:45 11. ERROR in X.java (at line 5)\n
05:56:45 	* and more {@since 1.0}, {@serial 0L}, {@serialData data}, {@serialField field}\n
05:56:45 	             ^^^^^\n
05:56:45 Javadoc: Unexpected tag\n
05:56:45 ----------\n
05:56:45 12. ERROR in X.java (at line 5)\n
05:56:45 	* and more {@since 1.0}, {@serial 0L}, {@serialData data}, {@serialField field}\n
05:56:45 	                           ^^^^^^\n
05:56:45 Javadoc: Unexpected tag\n
05:56:45 ----------\n
05:56:45 13. ERROR in X.java (at line 5)\n
05:56:45 	* and more {@since 1.0}, {@serial 0L}, {@serialData data}, {@serialField field}\n
05:56:45 	                                         ^^^^^^^^^^\n
05:56:45 Javadoc: Unexpected tag\n
05:56:45 ----------\n
05:56:45 14. ERROR in X.java (at line 5)\n
05:56:45 	* and more {@since 1.0}, {@serial 0L}, {@serialData data}, {@serialField field}\n
05:56:45 	                                                             ^^^^^^^^^^^\n
05:56:45 Javadoc: Unexpected tag\n
05:56:45 ----------\n
05:56:45 
05:56:45 --------- Difference is ----------
05:56:45  expected:<[]> but was:<[----------\n
05:56:45 1. ERROR in X.java (at line 3)\n
05:56:45 	* Description {@see String} , {@return int}, {@since 1.0}, {@param i}, {@throws NullPointerException}\n
05:56:45 	                ^^^\n
05:56:45 Javadoc: Unexpected tag\n
05:56:45 ----------\n
05:56:45 2. ERROR in X.java (at line 3)\n
05:56:45 	* Description {@see String} , {@return int}, {@since 1.0}, {@param i}, {@throws NullPointerException}\n
05:56:45 	                                ^^^^^^\n
05:56:45 Javadoc: Unexpected tag\n
05:56:45 ----------\n
05:56:45 3. ERROR in X.java (at line 3)\n
05:56:45 	* Description {@see String} , {@return int}, {@since 1.0}, {@param i}, {@throws NullPointerException}\n
05:56:45 	                                               ^^^^^\n
05:56:45 Javadoc: Unexpected tag\n
05:56:45 ----------\n
05:56:45 4. ERROR in X.java (at line 3)\n
05:56:45 	* Description {@see String} , {@return int}, {@since 1.0}, {@param i}, {@throws NullPointerException}\n
05:56:45 	                                                             ^^^^^\n
05:56:45 Javadoc: Unexpected tag\n
05:56:45 ----------\n
05:56:45 5. ERROR in X.java (at line 3)\n
05:56:45 	* Description {@see String} , {@return int}, {@since 1.0}, {@param i}, {@throws NullPointerException}\n
05:56:45 	                                                                         ^^^^^^\n
05:56:45 Javadoc: Unexpected tag\n
05:56:45 ----------\n
05:56:45 6. ERROR in X.java (at line 4)\n
05:56:45 	* and more {@author jay}, {@category cat}, {@deprecated}, {@exception NullPointerException}, {@version 1.1}\n
05:56:45 	             ^^^^^^\n
05:56:45 Javadoc: Unexpected tag\n
05:56:45 ----------\n
05:56:45 7. ERROR in X.java (at line 4)\n
05:56:45 	* and more {@author jay}, {@category cat}, {@deprecated}, {@exception NullPointerException}, {@version 1.1}\n
05:56:45 	                            ^^^^^^^^\n
05:56:45 Javadoc: Unexpected tag\n
05:56:45 ----------\n
05:56:45 8. ERROR in X.java (at line 4)\n
05:56:45 	* and more {@author jay}, {@category cat}, {@deprecated}, {@exception NullPointerException}, {@version 1.1}\n
05:56:45 	                                             ^^^^^^^^^^\n
05:56:45 Javadoc: Unexpected tag\n
05:56:45 ----------\n
05:56:45 9. ERROR in X.java (at line 4)\n
05:56:45 	* and more {@author jay}, {@category cat}, {@deprecated}, {@exception NullPointerException}, {@version 1.1}\n
05:56:45 	                                                            ^^^^^^^^^\n
05:56:45 Javadoc: Unexpected tag\n
05:56:45 ----------\n
05:56:45 10. ERROR in X.java (at line 4)\n
05:56:45 	* and more {@author jay}, {@category cat}, {@deprecated}, {@exception NullPointerException}, {@version 1.1}\n
05:56:45 	                                                                                               ^^^^^^^\n
05:56:45 Javadoc: Unexpected tag\n
05:56:45 ----------\n
05:56:45 11. ERROR in X.java (at line 5)\n
05:56:45 	* and more {@since 1.0}, {@serial 0L}, {@serialData data}, {@serialField field}\n
05:56:45 	             ^^^^^\n
05:56:45 Javadoc: Unexpected tag\n
05:56:45 ----------\n
05:56:45 12. ERROR in X.java (at line 5)\n
05:56:45 	* and more {@since 1.0}, {@serial 0L}, {@serialData data}, {@serialField field}\n
05:56:45 	                           ^^^^^^\n
05:56:45 Javadoc: Unexpected tag\n
05:56:45 ----------\n
05:56:45 13. ERROR in X.java (at line 5)\n
05:56:45 	* and more {@since 1.0}, {@serial 0L}, {@serialData data}, {@serialField field}\n
05:56:45 	                                         ^^^^^^^^^^\n
05:56:45 Javadoc: Unexpected tag\n
05:56:45 ----------\n
05:56:45 14. ERROR in X.java (at line 5)\n
05:56:45 	* and more {@since 1.0}, {@serial 0L}, {@serialData data}, {@serialField field}\n
05:56:45 	                                                             ^^^^^^^^^^^\n
05:56:45 Javadoc: Unexpected tag\n
05:56:45 ----------\n
05:56:45 ]>
05:56:45   JavadocBugsTest>TestCase.runTest:957->testBug281609a:8594->AbstractRegressionTest.runNegativeTest:2703->AbstractRegressionTest.runNegativeTest:2714->AbstractRegressionTest.runTest:3149->AbstractRegressionTest.runTest:3514->AbstractRegressionTest.runJavac:2577->AbstractRegressionTest.handleMismatch:2632->TestCase.assertEquals:242->TestCase.assertStringEquals:266 testBug281609a - Eclipse found error(s) but Javac did not find any.
05:56:45 ----------- Expected ------------
05:56:45 
05:56:45 ------------ but was ------------
05:56:45 ----------\n
05:56:45 1. ERROR in pkg\X.java (at line 7)\n
05:56:45 	* @see PKG\n
05:56:45 	       ^^^\n
05:56:45 Javadoc: PKG cannot be resolved to a type\n
05:56:45 ----------\n
05:56:45 
05:56:45 --------- Difference is ----------
05:56:45  expected:<[]> but was:<[----------\n
05:56:45 1. ERROR in pkg\X.java (at line 7)\n
05:56:45 	* @see PKG\n
05:56:45 	       ^^^\n
05:56:45 Javadoc: PKG cannot be resolved to a type\n
05:56:45 ----------\n
05:56:45 ]>
05:56:45   JavadocBugsTest>TestCase.runTest:957->testBug73352a:3108->AbstractRegressionTest.runConformTest:3658->AbstractRegressionTest.runTest:3149->AbstractRegressionTest.runTest:3514->AbstractRegressionTest.runJavac:2577->AbstractRegressionTest.handleMismatch:2683 testBug73352a: unused excuse org.eclipse.jdt.core.tests.compiler.regression.AbstractRegressionTest$JavacTestOptions$Excuse@2a92128 for compiler org.eclipse.jdt.core.tests.compiler.regression.AbstractRegressionTest$JavacCompiler@528070fe
05:56:45   JavadocBugsTest>TestCase.runTest:957->testBug73352c:3240->AbstractRegressionTest.runConformTest:3658->AbstractRegressionTest.runTest:3149->AbstractRegressionTest.runTest:3514->AbstractRegressionTest.runJavac:2577->AbstractRegressionTest.handleMismatch:2683 testBug73352c: unused excuse org.eclipse.jdt.core.tests.compiler.regression.AbstractRegressionTest$JavacTestOptions$Excuse@2a92128 for compiler org.eclipse.jdt.core.tests.compiler.regression.AbstractRegressionTest$JavacCompiler@528070fe
05:56:45   JavadocTestForClass>TestCase.runTest:957->test055:1067->AbstractRegressionTest.runNegativeTest:2703->AbstractRegressionTest.runNegativeTest:2714->AbstractRegressionTest.runTest:3149->AbstractRegressionTest.runTest:3514->AbstractRegressionTest.runJavac:2577->AbstractRegressionTest.handleMismatch:2636->TestCase.assertEquals:242->TestCase.assertStringEquals:266 test055 - Eclipse found error(s) but Javac only found warning(s).
05:56:45 ----------- Expected ------------
05:56:45 ----------\n
05:56:45 1. ERROR in X.java (at line 5)\n
05:56:45 	* <li> {@link Entry} </li>\n
05:56:45 	              ^^^^^\n
05:56:45 Javadoc: Invalid member type qualification\n
05:56:45 ----------\n
05:56:45 
05:56:45 ------------ but was ------------
05:56:45 X.java:8: warning: [rawtypes] found raw type: Map\n
05:56:45 public interface X extends Map {\n
05:56:45                            ^\n
05:56:45   missing type arguments for generic class Map<K,V>\n
05:56:45   where K,V are type-variables:\n
05:56:45     K extends Object declared in interface Map\n
05:56:45     V extends Object declared in interface Map\n
05:56:45 X.java:9: warning: [rawtypes] found raw type: Entry\n
05:56:45 	Entry e = null;\n
05:56:45 	^\n
05:56:45   missing type arguments for generic class Entry<K,V>\n
05:56:45   where K,V are type-variables:\n
05:56:45     K extends Object declared in interface Entry\n
05:56:45     V extends Object declared in interface Entry\n
05:56:45 2 warnings\n
05:56:45 
05:56:45 --------- Difference is ----------
05:56:45  expected:<[----------\n
05:56:45 1. ERROR in X.java (at line 5)\n
05:56:45 	* <li> {@link Entry} </li>\n
05:56:45 	              ^^^^^\n
05:56:45 Javadoc: Invalid member type qualification\n
05:56:45 ----------]\n
05:56:45 > but was:<[X.java:8: warning: [rawtypes] found raw type: Map\n
05:56:45 public interface X extends Map {\n
05:56:45                            ^\n
05:56:45   missing type arguments for generic class Map<K,V>\n
05:56:45   where K,V are type-variables:\n
05:56:45     K extends Object declared in interface Map\n
05:56:45     V extends Object declared in interface Map\n
05:56:45 X.java:9: warning: [rawtypes] found raw type: Entry\n
05:56:45 	Entry e = null;\n
05:56:45 	^\n
05:56:45   missing type arguments for generic class Entry<K,V>\n
05:56:45   where K,V are type-variables:\n
05:56:45     K extends Object declared in interface Entry\n
05:56:45     V extends Object declared in interface Entry\n
05:56:45 2 warnings]\n
05:56:45 >
05:56:45   JavadocTest_1_5>TestCase.runTest:957->testBug247037a:3887->AbstractRegressionTest.runNegativeTest:2703->AbstractRegressionTest.runNegativeTest:2714->AbstractRegressionTest.runTest:3149->AbstractRegressionTest.runTest:3514->AbstractRegressionTest.runJavac:2577->AbstractRegressionTest.handleMismatch:2632->TestCase.assertEquals:242->TestCase.assertStringEquals:266 testBug247037a - Eclipse found error(s) but Javac did not find any.
05:56:45 ----------- Expected ------------
05:56:45 
05:56:45 ------------ but was ------------
05:56:45 ----------\n
05:56:45 1. ERROR in pack\package-info.java (at line 2)\n
05:56:45 	* {@inheritDoc}\n
05:56:45 	    ^^^^^^^^^^\n
05:56:45 Javadoc: Unexpected tag\n
05:56:45 ----------\n
05:56:45 2. ERROR in pack\package-info.java (at line 3)\n
05:56:45 	* @since {@inheritDoc}\n
05:56:45 	           ^^^^^^^^^^\n
05:56:45 Javadoc: Unexpected tag\n
05:56:45 ----------\n
05:56:45 3. ERROR in pack\package-info.java (at line 4)\n
05:56:45 	* @blah {@inheritDoc}\n
05:56:45 	          ^^^^^^^^^^\n
05:56:45 Javadoc: Unexpected tag\n
05:56:45 ----------\n
05:56:45 
05:56:45 --------- Difference is ----------
05:56:45  expected:<[]> but was:<[----------\n
05:56:45 1. ERROR in pack\package-info.java (at line 2)\n
05:56:45 	* {@inheritDoc}\n
05:56:45 	    ^^^^^^^^^^\n
05:56:45 Javadoc: Unexpected tag\n
05:56:45 ----------\n
05:56:45 2. ERROR in pack\package-info.java (at line 3)\n
05:56:45 	* @since {@inheritDoc}\n
05:56:45 	           ^^^^^^^^^^\n
05:56:45 Javadoc: Unexpected tag\n
05:56:45 ----------\n
05:56:45 3. ERROR in pack\package-info.java (at line 4)\n
05:56:45 	* @blah {@inheritDoc}\n
05:56:45 	          ^^^^^^^^^^\n
05:56:45 Javadoc: Unexpected tag\n
05:56:45 ----------\n
05:56:45 ]>
05:56:45   JavadocTest_1_5>TestCase.runTest:957->testBug247037b:3919->AbstractRegressionTest.runNegativeTest:2703->AbstractRegressionTest.runNegativeTest:2714->AbstractRegressionTest.runTest:3149->AbstractRegressionTest.runTest:3514->AbstractRegressionTest.runJavac:2577->AbstractRegressionTest.handleMismatch:2632->TestCase.assertEquals:242->TestCase.assertStringEquals:266 testBug247037b - Eclipse found error(s) but Javac did not find any.
05:56:45 ----------- Expected ------------
05:56:45 
05:56:45 ------------ but was ------------
05:56:45 ----------\n
05:56:45 1. ERROR in pack\package-info.java (at line 2)\n
05:56:45 	* @return {@inheritDoc}\n
05:56:45 	   ^^^^^^\n
05:56:45 Javadoc: Unexpected tag\n
05:56:45 ----------\n
05:56:45 2. ERROR in pack\package-info.java (at line 2)\n
05:56:45 	* @return {@inheritDoc}\n
05:56:45 	            ^^^^^^^^^^\n
05:56:45 Javadoc: Unexpected tag\n
05:56:45 ----------\n
05:56:45 3. ERROR in pack\package-info.java (at line 3)\n
05:56:45 	* @param blah {@inheritDoc}\n
05:56:45 	   ^^^^^\n
05:56:45 Javadoc: Unexpected tag\n
05:56:45 ----------\n
05:56:45 4. ERROR in pack\package-info.java (at line 3)\n
05:56:45 	* @param blah {@inheritDoc}\n
05:56:45 	                ^^^^^^^^^^\n
05:56:45 Javadoc: Unexpected tag\n
05:56:45 ----------\n
05:56:45 
05:56:45 --------- Difference is ----------
05:56:45  expected:<[]> but was:<[----------\n
05:56:45 1. ERROR in pack\package-info.java (at line 2)\n
05:56:45 	* @return {@inheritDoc}\n
05:56:45 	   ^^^^^^\n
05:56:45 Javadoc: Unexpected tag\n
05:56:45 ----------\n
05:56:45 2. ERROR in pack\package-info.java (at line 2)\n
05:56:45 	* @return {@inheritDoc}\n
05:56:45 	            ^^^^^^^^^^\n
05:56:45 Javadoc: Unexpected tag\n
05:56:45 ----------\n
05:56:45 3. ERROR in pack\package-info.java (at line 3)\n
05:56:45 	* @param blah {@inheritDoc}\n
05:56:45 	   ^^^^^\n
05:56:45 Javadoc: Unexpected tag\n
05:56:45 ----------\n
05:56:45 4. ERROR in pack\package-info.java (at line 3)\n
05:56:45 	* @param blah {@inheritDoc}\n
05:56:45 	                ^^^^^^^^^^\n
05:56:45 Javadoc: Unexpected tag\n
05:56:45 ----------\n
05:56:45 ]>
05:56:45   JavadocTest_1_5>TestCase.runTest:957->testBug284333:3960->AbstractRegressionTest.runNegativeTest:2703->AbstractRegressionTest.runNegativeTest:2714->AbstractRegressionTest.runTest:3149->AbstractRegressionTest.runTest:3514->AbstractRegressionTest.runJavac:2577->AbstractRegressionTest.handleMismatch:2632->TestCase.assertEquals:242->TestCase.assertStringEquals:266 testBug284333 - Eclipse found error(s) but Javac did not find any.
05:56:45 ----------- Expected ------------
05:56:45 
05:56:45 ------------ but was ------------
05:56:45 ----------\n
05:56:45 1. ERROR in foo\bar\package-info.java (at line 2)\n
05:56:45 	* @see ClassInSamePackage#SOME_FIELD\n
05:56:45 	       ^^^^^^^^^^^^^^^^^^\n
05:56:45 Javadoc: Invalid reference\n
05:56:45 ----------\n
05:56:45 2. ERROR in foo\bar\package-info.java (at line 4)\n
05:56:45 	* @see ClassInSamePackage#SOME_FIELD\n
05:56:45 	       ^^^^^^^^^^^^^^^^^^\n
05:56:45 Javadoc: Invalid reference\n
05:56:45 ----------\n
05:56:45 3. ERROR in foo\bar\package-info.java (at line 5)\n
05:56:45 	* @see ClassInSubPackage#foo\n
05:56:45 	       ^^^^^^^^^^^^^^^^^\n
05:56:45 Javadoc: ClassInSubPackage cannot be resolved to a type\n
05:56:45 ----------\n
05:56:45 4. ERROR in foo\bar\package-info.java (at line 7)\n
05:56:45 	* @see ClassInSubPackage#foo\n
05:56:45 	       ^^^^^^^^^^^^^^^^^\n
05:56:45 Javadoc: ClassInSubPackage cannot be resolved to a type\n
05:56:45 ----------\n
05:56:45 5. ERROR in foo\bar\package-info.java (at line 8)\n
05:56:45 	* @see ClassInEnclosingPackage\n
05:56:45 	       ^^^^^^^^^^^^^^^^^^^^^^^\n
05:56:45 Javadoc: ClassInEnclosingPackage cannot be resolved to a type\n
05:56:45 ----------\n
05:56:45 6. ERROR in foo\bar\package-info.java (at line 10)\n
05:56:45 	* @see ClassInEnclosingPackage\n
05:56:45 	       ^^^^^^^^^^^^^^^^^^^^^^^\n
05:56:45 Javadoc: ClassInEnclosingPackage cannot be resolved to a type\n
05:56:45 ----------\n
05:56:45 
05:56:45 --------- Difference is ----------
05:56:45  expected:<[]> but was:<[----------\n
05:56:45 1. ERROR in foo\bar\package-info.java (at line 2)\n
05:56:45 	* @see ClassInSamePackage#SOME_FIELD\n
05:56:45 	       ^^^^^^^^^^^^^^^^^^\n
05:56:45 Javadoc: Invalid reference\n
05:56:45 ----------\n
05:56:45 2. ERROR in foo\bar\package-info.java (at line 4)\n
05:56:45 	* @see ClassInSamePackage#SOME_FIELD\n
05:56:45 	       ^^^^^^^^^^^^^^^^^^\n
05:56:45 Javadoc: Invalid reference\n
05:56:45 ----------\n
05:56:45 3. ERROR in foo\bar\package-info.java (at line 5)\n
05:56:45 	* @see ClassInSubPackage#foo\n
05:56:45 	       ^^^^^^^^^^^^^^^^^\n
05:56:45 Javadoc: ClassInSubPackage cannot be resolved to a type\n
05:56:45 ----------\n
05:56:45 4. ERROR in foo\bar\package-info.java (at line 7)\n
05:56:45 	* @see ClassInSubPackage#foo\n
05:56:45 	       ^^^^^^^^^^^^^^^^^\n
05:56:45 Javadoc: ClassInSubPackage cannot be resolved to a type\n
05:56:45 ----------\n
05:56:45 5. ERROR in foo\bar\package-info.java (at line 8)\n
05:56:45 	* @see ClassInEnclosingPackage\n
05:56:45 	       ^^^^^^^^^^^^^^^^^^^^^^^\n
05:56:45 Javadoc: ClassInEnclosingPackage cannot be resolved to a type\n
05:56:45 ----------\n
05:56:45 6. ERROR in foo\bar\package-info.java (at line 10)\n
05:56:45 	* @see ClassInEnclosingPackage\n
05:56:45 	       ^^^^^^^^^^^^^^^^^^^^^^^\n
05:56:45 Javadoc: ClassInEnclosingPackage cannot be resolved to a type\n
05:56:45 ----------\n
05:56:45 ]>
05:56:45   JavadocTest_1_5>TestCase.runTest:957->testBug284333a:4039->AbstractRegressionTest.runNegativeTest:2703->AbstractRegressionTest.runNegativeTest:2714->AbstractRegressionTest.runTest:3149->AbstractRegressionTest.runTest:3514->AbstractRegressionTest.runJavac:2577->AbstractRegressionTest.handleMismatch:2632->TestCase.assertEquals:242->TestCase.assertStringEquals:266 testBug284333a - Eclipse found error(s) but Javac did not find any.
05:56:45 ----------- Expected ------------
05:56:45 
05:56:45 ------------ but was ------------
05:56:45 ----------\n
05:56:45 1. ERROR in foo\bar\NotAPackageInfo.java (at line 9)\n
05:56:45 	* @see ClassInSubPackage#foo\n
05:56:45 	       ^^^^^^^^^^^^^^^^^\n
05:56:45 Javadoc: ClassInSubPackage cannot be resolved to a type\n
05:56:45 ----------\n
05:56:45 2. ERROR in foo\bar\NotAPackageInfo.java (at line 11)\n
05:56:45 	* @see ClassInSubPackage#foo\n
05:56:45 	       ^^^^^^^^^^^^^^^^^\n
05:56:45 Javadoc: ClassInSubPackage cannot be resolved to a type\n
05:56:45 ----------\n
05:56:45 3. ERROR in foo\bar\NotAPackageInfo.java (at line 15)\n
05:56:45 	* @see ClassInEnclosingPackage\n
05:56:45 	       ^^^^^^^^^^^^^^^^^^^^^^^\n
05:56:45 Javadoc: ClassInEnclosingPackage cannot be resolved to a type\n
05:56:45 ----------\n
05:56:45 4. ERROR in foo\bar\NotAPackageInfo.java (at line 17)\n
05:56:45 	* @see ClassInEnclosingPackage\n
05:56:45 	       ^^^^^^^^^^^^^^^^^^^^^^^\n
05:56:45 Javadoc: ClassInEnclosingPackage cannot be resolved to a type\n
05:56:45 ----------\n
05:56:45 
05:56:45 --------- Difference is ----------
05:56:45  expected:<[]> but was:<[----------\n
05:56:45 1. ERROR in foo\bar\NotAPackageInfo.java (at line 9)\n
05:56:45 	* @see ClassInSubPackage#foo\n
05:56:45 	       ^^^^^^^^^^^^^^^^^\n
05:56:45 Javadoc: ClassInSubPackage cannot be resolved to a type\n
05:56:45 ----------\n
05:56:45 2. ERROR in foo\bar\NotAPackageInfo.java (at line 11)\n
05:56:45 	* @see ClassInSubPackage#foo\n
05:56:45 	       ^^^^^^^^^^^^^^^^^\n
05:56:45 Javadoc: ClassInSubPackage cannot be resolved to a type\n
05:56:45 ----------\n
05:56:45 3. ERROR in foo\bar\NotAPackageInfo.java (at line 15)\n
05:56:45 	* @see ClassInEnclosingPackage\n
05:56:45 	       ^^^^^^^^^^^^^^^^^^^^^^^\n
05:56:45 Javadoc: ClassInEnclosingPackage cannot be resolved to a type\n
05:56:45 ----------\n
05:56:45 4. ERROR in foo\bar\NotAPackageInfo.java (at line 17)\n
05:56:45 	* @see ClassInEnclosingPackage\n
05:56:45 	       ^^^^^^^^^^^^^^^^^^^^^^^\n
05:56:45 Javadoc: ClassInEnclosingPackage cannot be resolved to a type\n
05:56:45 ----------\n
05:56:45 ]>
05:56:45   LambdaExpressionsTest>TestCase.runTest:957->test039:1033->AbstractRegressionTest.runConformTest:1870->AbstractRegressionTest.runConformTest:1873->AbstractRegressionTest.runTest:3149->AbstractRegressionTest.runTest:3514->AbstractRegressionTest.runJavac:2577->AbstractRegressionTest.handleMismatch:2656->TestCase.assertEquals:242->TestCase.assertStringEquals:266 test039 - Eclipse/Javac standard output mismatch.
05:56:45 ----------- Expected ------------
05:56:45 class X cannot be cast to class I (X and I are in unnamed module of loader
05:56:45 ------------ but was ------------
05:56:45 class X cannot be cast to class I (X and I are in unnamed module of loader 'app')
05:56:45 --------- Difference is ----------
05:56:45  expected:<...med module of loader[]> but was:<...med module of loader[ 'app')]>
05:56:45   LookupTest>TestCase.runTest:957->test103:3426->AbstractRegressionTest.runNegativeTest:2703->AbstractRegressionTest.runNegativeTest:2714->AbstractRegressionTest.runTest:3149->AbstractRegressionTest.runTest:3514->AbstractRegressionTest.runJavac:2577->AbstractRegressionTest.handleMismatch:2648->TestCase.assertEquals:242->TestCase.assertStringEquals:266 test103 - Eclipse found warning(s) but Javac did not find any.
05:56:45 ----------- Expected ------------
05:56:45 
05:56:45 ------------ but was ------------
05:56:45 ----------\n
05:56:45 1. WARNING in A.java (at line 2)\n
05:56:45 	private int x;\n
05:56:45 	            ^\n
05:56:45 The value of the field A.x is not used\n
05:56:45 ----------\n
05:56:45 2. WARNING in A.java (at line 4)\n
05:56:45 	private int x;\n
05:56:45 	            ^\n
05:56:45 The value of the field A.B.x is not used\n
05:56:45 ----------\n
05:56:45 3. WARNING in A.java (at line 5)\n
05:56:45 	private C c = new C() {\n
05:56:45 	          ^\n
05:56:45 The value of the field A.B.c is not used\n
05:56:45 ----------\n
05:56:45 4. WARNING in A.java (at line 6)\n
05:56:45 	void foo() {\n
05:56:45 	     ^^^^^\n
05:56:45 The method foo() from the type new A.C(){} is never used locally\n
05:56:45 ----------\n
05:56:45 5. WARNING in A.java (at line 7)\n
05:56:45 	x = 3;\n
05:56:45 	^\n
05:56:45 Write access to enclosing field A.B.x is emulated by a synthetic accessor method\n
05:56:45 ----------\n
05:56:45 6. WARNING in A.java (at line 12)\n
05:56:45 	private int x;\n
05:56:45 	            ^\n
05:56:45 The value of the field A.C.x is not used\n
05:56:45 ----------\n
05:56:45 
05:56:45 --------- Difference is ----------
05:56:45  expected:<[]> but was:<[----------\n
05:56:45 1. WARNING in A.java (at line 2)\n
05:56:45 	private int x;\n
05:56:45 	            ^\n
05:56:45 The value of the field A.x is not used\n
05:56:45 ----------\n
05:56:45 2. WARNING in A.java (at line 4)\n
05:56:45 	private int x;\n
05:56:45 	            ^\n
05:56:45 The value of the field A.B.x is not used\n
05:56:45 ----------\n
05:56:45 3. WARNING in A.java (at line 5)\n
05:56:45 	private C c = new C() {\n
05:56:45 	          ^\n
05:56:45 The value of the field A.B.c is not used\n
05:56:45 ----------\n
05:56:45 4. WARNING in A.java (at line 6)\n
05:56:45 	void foo() {\n
05:56:45 	     ^^^^^\n
05:56:45 The method foo() from the type new A.C(){} is never used locally\n
05:56:45 ----------\n
05:56:45 5. WARNING in A.java (at line 7)\n
05:56:45 	x = 3;\n
05:56:45 	^\n
05:56:45 Write access to enclosing field A.B.x is emulated by a synthetic accessor method\n
05:56:45 ----------\n
05:56:45 6. WARNING in A.java (at line 12)\n
05:56:45 	private int x;\n
05:56:45 	            ^\n
05:56:45 The value of the field A.C.x is not used\n
05:56:45 ----------\n
05:56:45 ]>
05:56:45   LookupTest>TestCase.runTest:957->test105:3550->AbstractRegressionTest.runNegativeTest:2703->AbstractRegressionTest.runNegativeTest:2714->AbstractRegressionTest.runTest:3149->AbstractRegressionTest.runTest:3514->AbstractRegressionTest.runJavac:2577->AbstractRegressionTest.handleMismatch:2648->TestCase.assertEquals:242->TestCase.assertStringEquals:266 test105 - Eclipse found warning(s) but Javac did not find any.
05:56:45 ----------- Expected ------------
05:56:45 
05:56:45 ------------ but was ------------
05:56:45 ----------\n
05:56:45 1. WARNING in A.java (at line 2)\n
05:56:45 	private int x;\n
05:56:45 	            ^\n
05:56:45 The value of the field A.x is not used\n
05:56:45 ----------\n
05:56:45 2. WARNING in A.java (at line 3)\n
05:56:45 	private C c = new C() {\n
05:56:45 	          ^\n
05:56:45 The value of the field A.c is not used\n
05:56:45 ----------\n
05:56:45 3. WARNING in A.java (at line 4)\n
05:56:45 	void foo() {\n
05:56:45 	     ^^^^^\n
05:56:45 The method foo() from the type new A.C(){} is never used locally\n
05:56:45 ----------\n
05:56:45 4. WARNING in A.java (at line 5)\n
05:56:45 	x = 3;\n
05:56:45 	^\n
05:56:45 Write access to enclosing field A.x is emulated by a synthetic accessor method\n
05:56:45 ----------\n
05:56:45 5. WARNING in A.java (at line 9)\n
05:56:45 	private int x;\n
05:56:45 	            ^\n
05:56:45 The value of the field A.C.x is not used\n
05:56:45 ----------\n
05:56:45 
05:56:45 --------- Difference is ----------
05:56:45  expected:<[]> but was:<[----------\n
05:56:45 1. WARNING in A.java (at line 2)\n
05:56:45 	private int x;\n
05:56:45 	            ^\n
05:56:45 The value of the field A.x is not used\n
05:56:45 ----------\n
05:56:45 2. WARNING in A.java (at line 3)\n
05:56:45 	private C c = new C() {\n
05:56:45 	          ^\n
05:56:45 The value of the field A.c is not used\n
05:56:45 ----------\n
05:56:45 3. WARNING in A.java (at line 4)\n
05:56:45 	void foo() {\n
05:56:45 	     ^^^^^\n
05:56:45 The method foo() from the type new A.C(){} is never used locally\n
05:56:45 ----------\n
05:56:45 4. WARNING in A.java (at line 5)\n
05:56:45 	x = 3;\n
05:56:45 	^\n
05:56:45 Write access to enclosing field A.x is emulated by a synthetic accessor method\n
05:56:45 ----------\n
05:56:45 5. WARNING in A.java (at line 9)\n
05:56:45 	private int x;\n
05:56:45 	            ^\n
05:56:45 The value of the field A.C.x is not used\n
05:56:45 ----------\n
05:56:45 ]>
05:56:45   MethodHandleTest>TestCase.runTest:957->test009:279->AbstractRegressionTest.runNegativeTest:3872->AbstractRegressionTest.runTest:3149->AbstractRegressionTest.runTest:3514->AbstractRegressionTest.runJavac:2577->AbstractRegressionTest.handleMismatch:2683 test009: unused excuse org.eclipse.jdt.core.tests.compiler.regression.AbstractRegressionTest$JavacTestOptions$Excuse@4d6406df for compiler org.eclipse.jdt.core.tests.compiler.regression.AbstractRegressionTest$JavacCompiler@528070fe
05:56:45   MethodHandleTest>TestCase.runTest:957->test010:315->AbstractRegressionTest.runNegativeTest:3872->AbstractRegressionTest.runTest:3149->AbstractRegressionTest.runTest:3514->AbstractRegressionTest.runJavac:2577->AbstractRegressionTest.handleMismatch:2683 test010: unused excuse org.eclipse.jdt.core.tests.compiler.regression.AbstractRegressionTest$JavacTestOptions$Excuse@4d6406df for compiler org.eclipse.jdt.core.tests.compiler.regression.AbstractRegressionTest$JavacCompiler@528070fe
05:56:45   MethodVerifyTest>TestCase.runTest:957->test025e:1714->AbstractRegressionTest.runConformTest:3658->AbstractRegressionTest.runTest:3149->AbstractRegressionTest.runTest:3514->AbstractRegressionTest.runJavac:2577->AbstractRegressionTest.handleMismatch:2683 test025e: unused excuse org.eclipse.jdt.core.tests.compiler.regression.AbstractRegressionTest$JavacTestOptions$Excuse@2a92128 for compiler org.eclipse.jdt.core.tests.compiler.regression.AbstractRegressionTest$JavacCompiler@528070fe
05:56:45   MethodVerifyTest>TestCase.runTest:957->test025f:1748->AbstractRegressionTest.runConformTest:3658->AbstractRegressionTest.runTest:3149->AbstractRegressionTest.runTest:3514->AbstractRegressionTest.runJavac:2577->AbstractRegressionTest.handleMismatch:2683 test025f: unused excuse org.eclipse.jdt.core.tests.compiler.regression.AbstractRegressionTest$JavacTestOptions$Excuse@2a92128 for compiler org.eclipse.jdt.core.tests.compiler.regression.AbstractRegressionTest$JavacCompiler@528070fe
05:56:45   MethodVerifyTest>TestCase.runTest:957->test041:2862->AbstractRegressionTest.runConformTest:3658->AbstractRegressionTest.runTest:3149->AbstractRegressionTest.runTest:3514->AbstractRegressionTest.runJavac:2577->AbstractRegressionTest.handleMismatch:2683 test041: unused excuse org.eclipse.jdt.core.tests.compiler.regression.AbstractRegressionTest$JavacTestOptions$EclipseJustification$1@6656e0cb for compiler org.eclipse.jdt.core.tests.compiler.regression.AbstractRegressionTest$JavacCompiler@528070fe
05:56:45   MethodVerifyTest>TestCase.runTest:957->test041a:2884->AbstractRegressionTest.runConformTest:3658->AbstractRegressionTest.runTest:3149->AbstractRegressionTest.runTest:3514->AbstractRegressionTest.runJavac:2577->AbstractRegressionTest.handleMismatch:2683 test041a: unused excuse org.eclipse.jdt.core.tests.compiler.regression.AbstractRegressionTest$JavacTestOptions$EclipseJustification$1@6656e0cb for compiler org.eclipse.jdt.core.tests.compiler.regression.AbstractRegressionTest$JavacCompiler@528070fe
05:56:45   MethodVerifyTest>TestCase.runTest:957->test043:2995->AbstractRegressionTest.runNegativeTest:3767->AbstractRegressionTest.runTest:3149->AbstractRegressionTest.runTest:3514->AbstractRegressionTest.runJavac:2577->AbstractRegressionTest.handleMismatch:2683 test043: unused excuse org.eclipse.jdt.core.tests.compiler.regression.AbstractRegressionTest$JavacTestOptions$EclipseJustification@255509de for compiler org.eclipse.jdt.core.tests.compiler.regression.AbstractRegressionTest$JavacCompiler@528070fe
05:56:45   MethodVerifyTest>TestCase.runTest:957->test145:9264->AbstractRegressionTest.runConformTest:1870->AbstractRegressionTest.runConformTest:1873->AbstractRegressionTest.runTest:3149->AbstractRegressionTest.runTest:3514->AbstractRegressionTest.runJavac:2577->AbstractRegressionTest.handleMismatch:2640->TestCase.assertEquals:242->TestCase.assertStringEquals:266 test145 - Javac found error(s) but Eclipse did not find any.
05:56:45 ----------- Expected ------------
05:56:45 
05:56:45 ------------ but was ------------
05:56:45 BaseImpl.java:3: error: name clash: setValue(String) in BaseImpl overrides a method whose erasure is the same as another method, yet neither overrides the other\n
05:56:45 class BaseImpl extends Base<String> { public void setValue(String object) {} }\n
05:56:45                                                   ^\n
05:56:45   first method:  setValue(Object) in Base\n
05:56:45   second method: setValue(Tvalue) in BaseInterface\n
05:56:45   where Tvalue is a type-variable:\n
05:56:45     Tvalue extends Object declared in interface BaseInterface\n
05:56:45 1 error\n
05:56:45 
05:56:45 --------- Difference is ----------
05:56:45  expected:<[]> but was:<[BaseImpl.java:3: error: name clash: setValue(String) in BaseImpl overrides a method whose erasure is the same as another method, yet neither overrides the other\n
05:56:45 class BaseImpl extends Base<String> { public void setValue(String object) {} }\n
05:56:45                                                   ^\n
05:56:45   first method:  setValue(Object) in Base\n
05:56:45   second method: setValue(Tvalue) in BaseInterface\n
05:56:45   where Tvalue is a type-variable:\n
05:56:45     Tvalue extends Object declared in interface BaseInterface\n
05:56:45 1 error\n
05:56:45 ]>
05:56:45   MethodVerifyTest>TestCase.runTest:957->test169:10108->AbstractRegressionTest.runNegativeTest:3872->AbstractRegressionTest.runTest:3149->AbstractRegressionTest.runTest:3514->AbstractRegressionTest.runJavac:2577->AbstractRegressionTest.handleMismatch:2683 test169: unused excuse org.eclipse.jdt.core.tests.compiler.regression.AbstractRegressionTest$JavacTestOptions$Excuse@2a92128 for compiler org.eclipse.jdt.core.tests.compiler.regression.AbstractRegressionTest$JavacCompiler@528070fe
05:56:45   MethodVerifyTest>TestCase.runTest:957->test169a:10140->AbstractRegressionTest.runNegativeTest:3872->AbstractRegressionTest.runTest:3149->AbstractRegressionTest.runTest:3514->AbstractRegressionTest.runJavac:2577->AbstractRegressionTest.handleMismatch:2683 test169a: unused excuse org.eclipse.jdt.core.tests.compiler.regression.AbstractRegressionTest$JavacTestOptions$Excuse@2a92128 for compiler org.eclipse.jdt.core.tests.compiler.regression.AbstractRegressionTest$JavacCompiler@528070fe
05:56:45   MethodVerifyTest>TestCase.runTest:957->test175:10289->AbstractRegressionTest.runNegativeTest:3872->AbstractRegressionTest.runTest:3149->AbstractRegressionTest.runTest:3514->AbstractRegressionTest.runJavac:2577->AbstractRegressionTest.handleMismatch:2683 test175: unused excuse org.eclipse.jdt.core.tests.compiler.regression.AbstractRegressionTest$JavacTestOptions$Excuse@2a92128 for compiler org.eclipse.jdt.core.tests.compiler.regression.AbstractRegressionTest$JavacCompiler@528070fe
05:56:45   MethodVerifyTest>TestCase.runTest:957->test188:10972->AbstractRegressionTest.runNegativeTest:3872->AbstractRegressionTest.runTest:3149->AbstractRegressionTest.runTest:3514->AbstractRegressionTest.runJavac:2577->AbstractRegressionTest.handleMismatch:2683 test188: unused excuse org.eclipse.jdt.core.tests.compiler.regression.AbstractRegressionTest$JavacTestOptions$Excuse@2a92128 for compiler org.eclipse.jdt.core.tests.compiler.regression.AbstractRegressionTest$JavacCompiler@528070fe
05:56:45   MethodVerifyTest>TestCase.runTest:957->test201:11430->AbstractRegressionTest.runConformTest:1870->AbstractRegressionTest.runConformTest:1873->AbstractRegressionTest.runTest:3149->AbstractRegressionTest.runTest:3514->AbstractRegressionTest.runJavac:2577->AbstractRegressionTest.handleMismatch:2640->TestCase.assertEquals:242->TestCase.assertStringEquals:266 test201 - Javac found error(s) but Eclipse did not find any.
05:56:45 ----------- Expected ------------
05:56:45 
05:56:45 ------------ but was ------------
05:56:45 A.java:4: error: types J<CAP#1> and K<T3> are incompatible; both define get(), but with unrelated return types\n
05:56:45 interface A<T3 extends K<T3> & J<? extends I>> extends J<I> {}\n
05:56:45             ^\n
05:56:45   where T3 is a type-variable:\n
05:56:45     T3 extends K<T3>,J<? extends I> declared in interface A\n
05:56:45   where CAP#1 is a fresh type-variable:\n
05:56:45     CAP#1 extends I from capture of ? extends I\n
05:56:45 A.java:5: error: types K<T4> and J<CAP#1> are incompatible; both define get(), but with unrelated return types\n
05:56:45 interface B<T4 extends J<? extends I> & K<T4>> extends J<I> {}\n
05:56:45             ^\n
05:56:45   where T4 is a type-variable:\n
05:56:45     T4 extends J<? extends I>,K<T4> declared in interface B\n
05:56:45   where CAP#1 is a fresh type-variable:\n
05:56:45     CAP#1 extends I from capture of ? extends I\n
05:56:45 2 errors\n
05:56:45 
05:56:45 --------- Difference is ----------
05:56:45  expected:<[]> but was:<[A.java:4: error: types J<CAP#1> and K<T3> are incompatible; both define get(), but with unrelated return types\n
05:56:45 interface A<T3 extends K<T3> & J<? extends I>> extends J<I> {}\n
05:56:45             ^\n
05:56:45   where T3 is a type-variable:\n
05:56:45     T3 extends K<T3>,J<? extends I> declared in interface A\n
05:56:45   where CAP#1 is a fresh type-variable:\n
05:56:45     CAP#1 extends I from capture of ? extends I\n
05:56:45 A.java:5: error: types K<T4> and J<CAP#1> are incompatible; both define get(), but with unrelated return types\n
05:56:45 interface B<T4 extends J<? extends I> & K<T4>> extends J<I> {}\n
05:56:45             ^\n
05:56:45   where T4 is a type-variable:\n
05:56:45     T4 extends J<? extends I>,K<T4> declared in interface B\n
05:56:45   where CAP#1 is a fresh type-variable:\n
05:56:45     CAP#1 extends I from capture of ? extends I\n
05:56:45 2 errors\n
05:56:45 ]>
05:56:45   MethodVerifyTest>TestCase.runTest:957->test204:11484->AbstractRegressionTest.runConformTest:1870->AbstractRegressionTest.runConformTest:1873->AbstractRegressionTest.runTest:3149->AbstractRegressionTest.runTest:3514->AbstractRegressionTest.runJavac:2577->AbstractRegressionTest.handleMismatch:2640->TestCase.assertEquals:242->TestCase.assertStringEquals:266 test204 - Javac found error(s) but Eclipse did not find any.
05:56:45 ----------- Expected ------------
05:56:45 
05:56:45 ------------ but was ------------
05:56:45 OverrideBug.java:6: error: name clash: put(K#1,List<V#1>) in OverrideBug overrides a method whose erasure is the same as another method, yet neither overrides the other\n
05:56:45 public List<V> put(final K arg0, final List<V> arg1) {\n
05:56:45                ^\n
05:56:45   first method:  put(K#1,V#1) in OverrideBug\n
05:56:45   second method: put(K#2,V#2) in Map\n
05:56:45   where K#1,V#1,K#2,V#2 are type-variables:\n
05:56:45     K#1 extends Object declared in class OverrideBug\n
05:56:45     V#1 extends Object declared in class OverrideBug\n
05:56:45     K#2 extends Object declared in interface Map\n
05:56:45     V#2 extends Object declared in interface Map\n
05:56:45 OverrideBug.java:9: error: name clash: put(K#1,V#1) in OverrideBug and put(K#2,V#2) in Map have the same erasure, yet neither overrides the other\n
05:56:45 public List<V> put(final K arg0, final V arg1) {\n
05:56:45                ^\n
05:56:45   where K#1,V#1,K#2,V#2 are type-variables:\n
05:56:45     K#1 extends Object declared in class OverrideBug\n
05:56:45     V#1 extends Object declared in class OverrideBug\n
05:56:45     K#2 extends Object declared in interface Map\n
05:56:45     V#2 extends Object declared in interface Map\n
05:56:45 2 errors\n
05:56:45 
05:56:45 --------- Difference is ----------
05:56:45  expected:<[]> but was:<[OverrideBug.java:6: error: name clash: put(K#1,List<V#1>) in OverrideBug overrides a method whose erasure is the same as another method, yet neither overrides the other\n
05:56:45 public List<V> put(final K arg0, final List<V> arg1) {\n
05:56:45                ^\n
05:56:45   first method:  put(K#1,V#1) in OverrideBug\n
05:56:45   second method: put(K#2,V#2) in Map\n
05:56:45   where K#1,V#1,K#2,V#2 are type-variables:\n
05:56:45     K#1 extends Object declared in class OverrideBug\n
05:56:45     V#1 extends Object declared in class OverrideBug\n
05:56:45     K#2 extends Object declared in interface Map\n
05:56:45     V#2 extends Object declared in interface Map\n
05:56:45 OverrideBug.java:9: error: name clash: put(K#1,V#1) in OverrideBug and put(K#2,V#2) in Map have the same erasure, yet neither overrides the other\n
05:56:45 public List<V> put(final K arg0, final V arg1) {\n
05:56:45                ^\n
05:56:45   where K#1,V#1,K#2,V#2 are type-variables:\n
05:56:45     K#1 extends Object declared in class OverrideBug\n
05:56:45     V#1 extends Object declared in class OverrideBug\n
05:56:45     K#2 extends Object declared in interface Map\n
05:56:45     V#2 extends Object declared in interface Map\n
05:56:45 2 errors\n
05:56:45 ]>
05:56:45   MethodVerifyTest>TestCase.runTest:957->test330435:12265->AbstractRegressionTest.runNegativeTest:2821->AbstractRegressionTest.runNegativeTest:2830->AbstractRegressionTest.runTest:3149->AbstractRegressionTest.runTest:3514->AbstractRegressionTest.runJavac:2577->AbstractRegressionTest.handleMismatch:2632->TestCase.assertEquals:242->TestCase.assertStringEquals:266 test330435 - Eclipse found error(s) but Javac did not find any.
05:56:45 ----------- Expected ------------
05:56:45 
05:56:45 ------------ but was ------------
05:56:45 ----------\n
05:56:45 1. ERROR in X.java (at line 3)\n
05:56:45 	String[] a = A.asList(args).toArray(new String[0]);\n
05:56:45 	             ^^^^^^^^^^^^^^^^^^^^^^^^^^^^^^^^^^^^^\n
05:56:45 Type mismatch: cannot convert from Object[] to String[]\n
05:56:45 ----------\n
05:56:45 
05:56:45 --------- Difference is ----------
05:56:45  expected:<[]> but was:<[----------\n
05:56:45 1. ERROR in X.java (at line 3)\n
05:56:45 	String[] a = A.asList(args).toArray(new String[0]);\n
05:56:45 	             ^^^^^^^^^^^^^^^^^^^^^^^^^^^^^^^^^^^^^\n
05:56:45 Type mismatch: cannot convert from Object[] to String[]\n
05:56:45 ----------\n
05:56:45 ]>
05:56:45   MethodVerifyTest>TestCase.runTest:957->test330445:12217->AbstractRegressionTest.runConformTest:2049->AbstractRegressionTest.runTest:3149->AbstractRegressionTest.runTest:3514->AbstractRegressionTest.runJavac:2577->AbstractRegressionTest.handleMismatch:2640->TestCase.assertEquals:242->TestCase.assertStringEquals:266 test330445 - Javac found error(s) but Eclipse did not find any.
05:56:45 ----------- Expected ------------
05:56:45 
05:56:45 ------------ but was ------------
05:56:45 X.java:4: error: incompatible types: Properties cannot be converted to Map<String,String>\n
05:56:45         Y.foo(new Properties());\n
05:56:45               ^\n
05:56:45 Note: Some messages have been simplified; recompile with -Xdiags:verbose to get full output\n
05:56:45 1 error\n
05:56:45 
05:56:45 --------- Difference is ----------
05:56:45  expected:<[]> but was:<[X.java:4: error: incompatible types: Properties cannot be converted to Map<String,String>\n
05:56:45         Y.foo(new Properties());\n
05:56:45               ^\n
05:56:45 Note: Some messages have been simplified; recompile with -Xdiags:verbose to get full output\n
05:56:45 1 error\n
05:56:45 ]>
05:56:45   MethodVerifyTest>TestCase.runTest:957->test331446:12375->AbstractRegressionTest.runConformTest:2049->AbstractRegressionTest.runTest:3149->AbstractRegressionTest.runTest:3514->AbstractRegressionTest.runJavac:2577->AbstractRegressionTest.handleMismatch:2640->TestCase.assertEquals:242->TestCase.assertStringEquals:266 test331446 - Javac found error(s) but Eclipse did not find any.
05:56:45 ----------- Expected ------------
05:56:45 
05:56:45 ------------ but was ------------
05:56:45 X.java:6: warning: [rawtypes] found raw type: Comparator\n
05:56:45 		Comparator comparator = new Comparator() {\n
05:56:45 		^\n
05:56:45   missing type arguments for generic class Comparator<T>\n
05:56:45   where T is a type-variable:\n
05:56:45     T extends Object declared in interface Comparator\n
05:56:45 X.java:6: warning: [rawtypes] found raw type: Comparator\n
05:56:45 		Comparator comparator = new Comparator() {\n
05:56:45 		                            ^\n
05:56:45   missing type arguments for generic class Comparator<T>\n
05:56:45   where T is a type-variable:\n
05:56:45     T extends Object declared in interface Comparator\n
05:56:45 X.java:12: warning: [rawtypes] found raw type: ArrayList\n
05:56:45 		Test.assertEquals("Test", comparator, new ArrayList(), new ArrayList());\n
05:56:45 		                                          ^\n
05:56:45   missing type arguments for generic class ArrayList<E>\n
05:56:45   where E is a type-variable:\n
05:56:45     E extends Object declared in class ArrayList\n
05:56:45 X.java:12: warning: [rawtypes] found raw type: ArrayList\n
05:56:45 		Test.assertEquals("Test", comparator, new ArrayList(), new ArrayList());\n
05:56:45 		                                                           ^\n
05:56:45   missing type arguments for generic class ArrayList<E>\n
05:56:45   where E is a type-variable:\n
05:56:45     E extends Object declared in class ArrayList\n
05:56:45 X.java:12: error: reference to assertEquals is ambiguous\n
05:56:45 		Test.assertEquals("Test", comparator, new ArrayList(), new ArrayList());\n
05:56:45 		    ^\n
05:56:45   both method <T#1>assertEquals(String,Comparator<T#1>,List<T#1>,List<T#1>) in Test and method <T#2>assertEquals(String,Comparator<T#2>,T#2,T#2) in Test match\n
05:56:45   where T#1,T#2 are type-variables:\n
05:56:45     T#1 extends Object declared in method <T#1>assertEquals(String,Comparator<T#1>,List<T#1>,List<T#1>)\n
05:56:45     T#2 extends Object declared in method <T#2>assertEquals(String,Comparator<T#2>,T#2,T#2)\n
05:56:45 X.java:12: warning: [unchecked] unchecked method invocation: method assertEquals in class Test is applied to given types\n
05:56:45 		Test.assertEquals("Test", comparator, new ArrayList(), new ArrayList());\n
05:56:45 		                 ^\n
05:56:45   required: String,Comparator<T>,List<T>,List<T>\n
05:56:45   found: String,Comparator,ArrayList,ArrayList\n
05:56:45   where T is a type-variable:\n
05:56:45     T extends Object declared in method <T>assertEquals(String,Comparator<T>,List<T>,List<T>)\n
05:56:45 X.java:12: warning: [unchecked] unchecked conversion\n
05:56:45 		Test.assertEquals("Test", comparator, new ArrayList(), new ArrayList());\n
05:56:45 		                          ^\n
05:56:45   required: Comparator<T>\n
05:56:45   found:    Comparator\n
05:56:45   where T is a type-variable:\n
05:56:45     T extends Object declared in method <T>assertEquals(String,Comparator<T>,List<T>,List<T>)\n
05:56:45 X.java:12: warning: [unchecked] unchecked conversion\n
05:56:45 		Test.assertEquals("Test", comparator, new ArrayList(), new ArrayList());\n
05:56:45 		                                      ^\n
05:56:45   required: List<T>\n
05:56:45   found:    ArrayList\n
05:56:45   where T is a type-variable:\n
05:56:45     T extends Object declared in method <T>assertEquals(String,Comparator<T>,List<T>,List<T>)\n
05:56:45 X.java:12: warning: [unchecked] unchecked conversion\n
05:56:45 		Test.assertEquals("Test", comparator, new ArrayList(), new ArrayList());\n
05:56:45 		                                                       ^\n
05:56:45   required: List<T>\n
05:56:45   found:    ArrayList\n
05:56:45   where T is a type-variable:\n
05:56:45     T extends Object declared in method <T>assertEquals(String,Comparator<T>,List<T>,List<T>)\n
05:56:45 1 error\n
05:56:45 8 warnings\n
05:56:45 
05:56:45 --------- Difference is ----------
05:56:45  expected:<[]> but was:<[X.java:6: warning: [rawtypes] found raw type: Comparator\n
05:56:45 		Comparator comparator = new Comparator() {\n
05:56:45 		^\n
05:56:45   missing type arguments for generic class Comparator<T>\n
05:56:45   where T is a type-variable:\n
05:56:45     T extends Object declared in interface Comparator\n
05:56:45 X.java:6: warning: [rawtypes] found raw type: Comparator\n
05:56:45 		Comparator comparator = new Comparator() {\n
05:56:45 		                            ^\n
05:56:45   missing type arguments for generic class Comparator<T>\n
05:56:45   where T is a type-variable:\n
05:56:45     T extends Object declared in interface Comparator\n
05:56:45 X.java:12: warning: [rawtypes] found raw type: ArrayList\n
05:56:45 		Test.assertEquals("Test", comparator, new ArrayList(), new ArrayList());\n
05:56:45 		                                          ^\n
05:56:45   missing type arguments for generic class ArrayList<E>\n
05:56:45   where E is a type-variable:\n
05:56:45     E extends Object declared in class ArrayList\n
05:56:45 X.java:12: warning: [rawtypes] found raw type: ArrayList\n
05:56:45 		Test.assertEquals("Test", comparator, new ArrayList(), new ArrayList());\n
05:56:45 		                                                           ^\n
05:56:45   missing type arguments for generic class ArrayList<E>\n
05:56:45   where E is a type-variable:\n
05:56:45     E extends Object declared in class ArrayList\n
05:56:45 X.java:12: error: reference to assertEquals is ambiguous\n
05:56:45 		Test.assertEquals("Test", comparator, new ArrayList(), new ArrayList());\n
05:56:45 		    ^\n
05:56:45   both method <T#1>assertEquals(String,Comparator<T#1>,List<T#1>,List<T#1>) in Test and method <T#2>assertEquals(String,Comparator<T#2>,T#2,T#2) in Test match\n
05:56:45   where T#1,T#2 are type-variables:\n
05:56:45     T#1 extends Object declared in method <T#1>assertEquals(String,Comparator<T#1>,List<T#1>,List<T#1>)\n
05:56:45     T#2 extends Object declared in method <T#2>assertEquals(String,Comparator<T#2>,T#2,T#2)\n
05:56:45 X.java:12: warning: [unchecked] unchecked method invocation: method assertEquals in class Test is applied to given types\n
05:56:45 		Test.assertEquals("Test", comparator, new ArrayList(), new ArrayList());\n
05:56:45 		                 ^\n
05:56:45   required: String,Comparator<T>,List<T>,List<T>\n
05:56:45   found: String,Comparator,ArrayList,ArrayList\n
05:56:45   where T is a type-variable:\n
05:56:45     T extends Object declared in method <T>assertEquals(String,Comparator<T>,List<T>,List<T>)\n
05:56:45 X.java:12: warning: [unchecked] unchecked conversion\n
05:56:45 		Test.assertEquals("Test", comparator, new ArrayList(), new ArrayList());\n
05:56:45 		                          ^\n
05:56:45   required: Comparator<T>\n
05:56:45   found:    Comparator\n
05:56:45   where T is a type-variable:\n
05:56:45     T extends Object declared in method <T>assertEquals(String,Comparator<T>,List<T>,List<T>)\n
05:56:45 X.java:12: warning: [unchecked] unchecked conversion\n
05:56:45 		Test.assertEquals("Test", comparator, new ArrayList(), new ArrayList());\n
05:56:45 		                                      ^\n
05:56:45   required: List<T>\n
05:56:45   found:    ArrayList\n
05:56:45   where T is a type-variable:\n
05:56:45     T extends Object declared in method <T>assertEquals(String,Comparator<T>,List<T>,List<T>)\n
05:56:45 X.java:12: warning: [unchecked] unchecked conversion\n
05:56:45 		Test.assertEquals("Test", comparator, new ArrayList(), new ArrayList());\n
05:56:45 		                                                       ^\n
05:56:45   required: List<T>\n
05:56:45   found:    ArrayList\n
05:56:45   where T is a type-variable:\n
05:56:45     T extends Object declared in method <T>assertEquals(String,Comparator<T>,List<T>,List<T>)\n
05:56:45 1 error\n
05:56:45 8 warnings\n
05:56:45 ]>
05:56:45   MethodVerifyTest>TestCase.runTest:957->testBug536978_comment2:14395->AbstractRegressionTest.runNegativeTest:2703->AbstractRegressionTest.runNegativeTest:2714->AbstractRegressionTest.runTest:3149->AbstractRegressionTest.runTest:3514->AbstractRegressionTest.runJavac:2577->AbstractRegressionTest.handleMismatch:2636->TestCase.assertEquals:242->TestCase.assertStringEquals:266 testBug536978_comment2 - Eclipse found error(s) but Javac only found warning(s).
05:56:45 ----------- Expected ------------
05:56:45 ----------\n
05:56:45 1. ERROR in SimpleDemo.java (at line 22)\n
05:56:45 	protected SimpleResult test(AbstractResult request) {\n
05:56:45 	          ^^^^^^^^^^^^\n
05:56:45 The return type is incompatible with AbstractDemo<Request,Response>.test(Request)\n
05:56:45 ----------\n
05:56:45 
05:56:45 ------------ but was ------------
05:56:45 SimpleDemo.java:22: warning: [unchecked] test(AbstractResult) in SimpleDemo overrides test(Request) in AbstractDemo\n
05:56:45     protected SimpleResult test(AbstractResult request) {\n
05:56:45                            ^\n
05:56:45   return type requires unchecked conversion from SimpleResult to Response#2\n
05:56:45   where Request,Response#1,Response#2 are type-variables:\n
05:56:45     Request extends AbstractResult declared in class AbstractDemo\n
05:56:45     Response#1 extends AbstractResult declared in class AbstractDemo\n
05:56:45     Response#2 extends AbstractResult declared in class SimpleDemo\n
05:56:45 1 warning\n
05:56:45 
05:56:45 --------- Difference is ----------
05:56:45  expected:<[----------\n
05:56:45 1. ERROR in SimpleDemo.java (at line 22)\n
05:56:45 	protected SimpleResult test(AbstractResult request) {\n
05:56:45 	          ^^^^^^^^^^^^\n
05:56:45 The return type is incompatible with AbstractDemo<Request,Response>.test(Request)\n
05:56:45 ----------]\n
05:56:45 > but was:<[SimpleDemo.java:22: warning: [unchecked] test(AbstractResult) in SimpleDemo overrides test(Request) in AbstractDemo\n
05:56:45     protected SimpleResult test(AbstractResult request) {\n
05:56:45                            ^\n
05:56:45   return type requires unchecked conversion from SimpleResult to Response#2\n
05:56:45   where Request,Response#1,Response#2 are type-variables:\n
05:56:45     Request extends AbstractResult declared in class AbstractDemo\n
05:56:45     Response#1 extends AbstractResult declared in class AbstractDemo\n
05:56:45     Response#2 extends AbstractResult declared in class SimpleDemo\n
05:56:45 1 warning]\n
05:56:45 >
05:56:45   MethodVerifyTest>TestCase.runTest:957->testBug536978_comment5:14441->AbstractRegressionTest.runConformTest:1870->AbstractRegressionTest.runConformTest:1873->AbstractRegressionTest.runTest:3149->AbstractRegressionTest.runTest:3514->AbstractRegressionTest.runJavac:2577->AbstractRegressionTest.handleMismatch:2656->TestCase.assertEquals:242->TestCase.assertStringEquals:266 testBug536978_comment5 - Eclipse/Javac standard output mismatch.
05:56:45 ----------- Expected ------------
05:56:45 class Result1 cannot be cast to class OtherResult (Result1 and OtherResult are in unnamed module of loader
05:56:45 ------------ but was ------------
05:56:45 class Result1 cannot be cast to class OtherResult (Result1 and OtherResult are in unnamed module of loader 'app')
05:56:45 --------- Difference is ----------
05:56:45  expected:<...med module of loader[]> but was:<...med module of loader[ 'app')]>
05:56:45   NegativeTypeAnnotationTest>TestCase.runTest:957->test420038:4116->AbstractRegressionTest.runNegativeTest:2703->AbstractRegressionTest.runNegativeTest:2714->AbstractRegressionTest.runTest:3149->AbstractRegressionTest.runTest:3514->AbstractRegressionTest.runJavac:2577->AbstractRegressionTest.handleMismatch:2632->TestCase.assertEquals:242->TestCase.assertStringEquals:266 test420038 - Eclipse found error(s) but Javac did not find any.
05:56:45 ----------- Expected ------------
05:56:45 
05:56:45 ------------ but was ------------
05:56:45 ----------\n
05:56:45 1. ERROR in X.java (at line 8)\n
05:56:45 	Class<?> c = int @T [].class; \n
05:56:45 	                 ^^\n
05:56:45 Syntax error, type annotations are illegal here\n
05:56:45 ----------\n
05:56:45 
05:56:45 --------- Difference is ----------
05:56:45  expected:<[]> but was:<[----------\n
05:56:45 1. ERROR in X.java (at line 8)\n
05:56:45 	Class<?> c = int @T [].class; \n
05:56:45 	                 ^^\n
05:56:45 Syntax error, type annotations are illegal here\n
05:56:45 ----------\n
05:56:45 ]>
05:56:45   NullAnnotationTest>TestCase.runTest:957->testBug452780:7991->AbstractNullAnnotationTest.runConformTestWithLibs:183->AbstractNullAnnotationTest.runConformTestWithLibs:201->AbstractRegressionTest.runConformTest:3728->AbstractRegressionTest.runTest:3149->AbstractRegressionTest.runTest:3514->AbstractRegressionTest.runJavac:2577->AbstractRegressionTest.handleMismatch:2652->TestCase.assertEquals:242->TestCase.assertStringEquals:266 testBug452780 - Javac found warning(s) but Eclipse did not find any.
05:56:45 ----------- Expected ------------
05:56:45 
05:56:45 ------------ but was ------------
05:56:45 Tools2.java:12: warning: [varargs] Varargs method could cause heap pollution from non-reifiable varargs parameter ts\n
05:56:45 		List<@NonNull T> res = Arrays.asList(ts);\n
05:56:45 		                                     ^\n
05:56:45 1 warning\n
05:56:45 
05:56:45 --------- Difference is ----------
05:56:45  expected:<[]> but was:<[Tools2.java:12: warning: [varargs] Varargs method could cause heap pollution from non-reifiable varargs parameter ts\n
05:56:45 		List<@NonNull T> res = Arrays.asList(ts);\n
05:56:45 		                                     ^\n
05:56:45 1 warning\n
05:56:45 ]>
05:56:45   NullAnnotationTest>TestCase.runTest:957->test_default_nullness_002_custom:2356->AbstractRegressionTest.runTest:3264->AbstractRegressionTest.runTest:3514->AbstractRegressionTest.runJavac:2577->AbstractRegressionTest.handleMismatch:2632->TestCase.assertEquals:242->TestCase.assertStringEquals:266 test_default_nullness_002_custom - Eclipse found error(s) but Javac did not find any.
05:56:45 ----------- Expected ------------
05:56:45 
05:56:45 ------------ but was ------------
05:56:45 ----------\n
05:56:45 1. ERROR in Y.java (at line 5)\n
05:56:45 	@Nullable Object getObject(Object o) {\n
05:56:45 	^^^^^^^^^^^^^^^^\n
05:56:45 The return type is incompatible with '@NonNull Object' returned from X.getObject(Object) (mismatching null constraints)\n
05:56:45 ----------\n
05:56:45 2. ERROR in Y.java (at line 5)\n
05:56:45 	@Nullable Object getObject(Object o) {\n
05:56:45 	                           ^^^^^^\n
05:56:45 Illegal redefinition of parameter o, inherited method from X declares this parameter as @Nullable\n
05:56:45 ----------\n
05:56:45 
05:56:45 --------- Difference is ----------
05:56:45  expected:<[]> but was:<[----------\n
05:56:45 1. ERROR in Y.java (at line 5)\n
05:56:45 	@Nullable Object getObject(Object o) {\n
05:56:45 	^^^^^^^^^^^^^^^^\n
05:56:45 The return type is incompatible with '@NonNull Object' returned from X.getObject(Object) (mismatching null constraints)\n
05:56:45 ----------\n
05:56:45 2. ERROR in Y.java (at line 5)\n
05:56:45 	@Nullable Object getObject(Object o) {\n
05:56:45 	                           ^^^^^^\n
05:56:45 Illegal redefinition of parameter o, inherited method from X declares this parameter as @Nullable\n
05:56:45 ----------\n
05:56:45 ]>
05:56:45   NullAnnotationTest>TestCase.runTest:957->test_nullable_field_17:5452->AbstractNullAnnotationTest.runNegativeTestWithLibs:177->AbstractNullAnnotationTest.runNegativeTestWithLibs:155->AbstractNullAnnotationTest.runNegativeTestWithLibs:166->AbstractRegressionTest.runNegativeTest:3872->AbstractRegressionTest.runTest:3149->AbstractRegressionTest.runTest:3514->AbstractRegressionTest.runJavac:2577->AbstractRegressionTest.handleMismatch:2648->TestCase.assertEquals:242->TestCase.assertStringEquals:266 test_nullable_field_17 - Eclipse found warning(s) but Javac did not find any.
05:56:45 ----------- Expected ------------
05:56:45 
05:56:45 ------------ but was ------------
05:56:45 ----------\n
05:56:45 1. INFO in X.java (at line 5)\n
05:56:45 	return this.o.toString();\n
05:56:45 	            ^\n
05:56:45 Potential null pointer access: this expression has a '@Nullable' type\n
05:56:45 ----------\n
05:56:45 
05:56:45 --------- Difference is ----------
05:56:45  expected:<[]> but was:<[----------\n
05:56:45 1. INFO in X.java (at line 5)\n
05:56:45 	return this.o.toString();\n
05:56:45 	            ^\n
05:56:45 Potential null pointer access: this expression has a '@Nullable' type\n
05:56:45 ----------\n
05:56:45 ]>
05:56:45   NullTypeAnnotationTest>TestCase.runTest:957->testBug446442_4:7472->AbstractNullAnnotationTest.runConformTestWithLibs:183->AbstractNullAnnotationTest.runConformTestWithLibs:201->AbstractRegressionTest.runConformTest:3728->AbstractRegressionTest.runTest:3149->AbstractRegressionTest.runTest:3514->AbstractRegressionTest.runJavac:2577->AbstractRegressionTest.handleMismatch:2640->TestCase.assertEquals:242->TestCase.assertStringEquals:266 testBug446442_4 - Javac found error(s) but Eclipse did not find any.
05:56:45 ----------- Expected ------------
05:56:45 
05:56:45 ------------ but was ------------
05:56:45 Test.java:8: error: interface Baz inherits abstract and default for m(Integer) from types Foo and Foo\n
05:56:45 interface Baz extends Foo<Integer, Integer> {}\n
05:56:45 ^\n
05:56:45 1 error\n
05:56:45 
05:56:45 --------- Difference is ----------
05:56:45  expected:<[]> but was:<[Test.java:8: error: interface Baz inherits abstract and default for m(Integer) from types Foo and Foo\n
05:56:45 interface Baz extends Foo<Integer, Integer> {}\n
05:56:45 ^\n
05:56:45 1 error\n
05:56:45 ]>
05:56:45   PolymorphicSignatureTest>TestCase.runTest:957->testBug475996:91->AbstractRegressionTest.runConformTest:1817->AbstractRegressionTest.runTest:3149->AbstractRegressionTest.runTest:3514->AbstractRegressionTest.runJavac:2577->AbstractRegressionTest.handleMismatch:2640->TestCase.assertEquals:242->TestCase.assertStringEquals:266 testBug475996 - Javac found error(s) but Eclipse did not find any.
05:56:45 ----------- Expected ------------
05:56:45 
05:56:45 ------------ but was ------------
05:56:45 X.java:1: error: cannot find symbol\n
05:56:45 import java.lang.invoke.VarHandle;\n
05:56:45                        ^\n
05:56:45   symbol:   class VarHandle\n
05:56:45   location: package java.lang.invoke\n
05:56:45 X.java:5: error: cannot find symbol\n
05:56:45 	VarHandle RESULT;\n
05:56:45 	^\n
05:56:45   symbol:   class VarHandle\n
05:56:45   location: class X<T>\n
05:56:45   where T is a type-variable:\n
05:56:45     T extends Object declared in class X\n
05:56:45 2 errors\n
05:56:45 
05:56:45 --------- Difference is ----------
05:56:45  expected:<[]> but was:<[X.java:1: error: cannot find symbol\n
05:56:45 import java.lang.invoke.VarHandle;\n
05:56:45                        ^\n
05:56:45   symbol:   class VarHandle\n
05:56:45   location: package java.lang.invoke\n
05:56:45 X.java:5: error: cannot find symbol\n
05:56:45 	VarHandle RESULT;\n
05:56:45 	^\n
05:56:45   symbol:   class VarHandle\n
05:56:45   location: class X<T>\n
05:56:45   where T is a type-variable:\n
05:56:45     T extends Object declared in class X\n
05:56:45 2 errors\n
05:56:45 ]>
05:56:45   ProblemConstructorTest>TestCase.runTest:957->test004:151->AbstractRegressionTest.runNegativeTest:2703->AbstractRegressionTest.runNegativeTest:2714->AbstractRegressionTest.runTest:3149->AbstractRegressionTest.runTest:3514->AbstractRegressionTest.runJavac:2577->AbstractRegressionTest.handleMismatch:2648->TestCase.assertEquals:242->TestCase.assertStringEquals:266 test004 - Eclipse found warning(s) but Javac did not find any.
05:56:45 ----------- Expected ------------
05:56:45 
05:56:45 ------------ but was ------------
05:56:45 ----------\n
05:56:45 1. WARNING in X.java (at line 4)\n
05:56:45 	public int unusedMethod() { return this.state; }\n
05:56:45 	           ^^^^^^^^^^^^^^\n
05:56:45 The method unusedMethod() from the type X.M is never used locally\n
05:56:45 ----------\n
05:56:45 2. WARNING in X.java (at line 5)\n
05:56:45 	public M (int state) { this.state = state;} \n
05:56:45 	       ^^^^^^^^^^^^^\n
05:56:45 The constructor X.M(int) is never used locally\n
05:56:45 ----------\n
05:56:45 3. WARNING in X.java (at line 6)\n
05:56:45 	public int unusedField = 0;\n
05:56:45 	           ^^^^^^^^^^^\n
05:56:45 The value of the field X.M.unusedField is not used\n
05:56:45 ----------\n
05:56:45 4. WARNING in X.java (at line 7)\n
05:56:45 	public class N {}\n
05:56:45 	             ^\n
05:56:45 The type X.M.N is never used locally\n
05:56:45 ----------\n
05:56:45 
05:56:45 --------- Difference is ----------
05:56:45  expected:<[]> but was:<[----------\n
05:56:45 1. WARNING in X.java (at line 4)\n
05:56:45 	public int unusedMethod() { return this.state; }\n
05:56:45 	           ^^^^^^^^^^^^^^\n
05:56:45 The method unusedMethod() from the type X.M is never used locally\n
05:56:45 ----------\n
05:56:45 2. WARNING in X.java (at line 5)\n
05:56:45 	public M (int state) { this.state = state;} \n
05:56:45 	       ^^^^^^^^^^^^^\n
05:56:45 The constructor X.M(int) is never used locally\n
05:56:45 ----------\n
05:56:45 3. WARNING in X.java (at line 6)\n
05:56:45 	public int unusedField = 0;\n
05:56:45 	           ^^^^^^^^^^^\n
05:56:45 The value of the field X.M.unusedField is not used\n
05:56:45 ----------\n
05:56:45 4. WARNING in X.java (at line 7)\n
05:56:45 	public class N {}\n
05:56:45 	             ^\n
05:56:45 The type X.M.N is never used locally\n
05:56:45 ----------\n
05:56:45 ]>
05:56:45   ProblemConstructorTest>TestCase.runTest:957->test005:223->AbstractRegressionTest.runNegativeTest:2703->AbstractRegressionTest.runNegativeTest:2714->AbstractRegressionTest.runTest:3149->AbstractRegressionTest.runTest:3514->AbstractRegressionTest.runJavac:2577->AbstractRegressionTest.handleMismatch:2648->TestCase.assertEquals:242->TestCase.assertStringEquals:266 test005 - Eclipse found warning(s) but Javac did not find any.
05:56:45 ----------- Expected ------------
05:56:45 
05:56:45 ------------ but was ------------
05:56:45 ----------\n
05:56:45 1. WARNING in A.java (at line 3)\n
05:56:45 	B.test();\n
05:56:45 	^^^^^^^^\n
05:56:45 Access to enclosing method test() from the type A.B is emulated by a synthetic accessor method\n
05:56:45 ----------\n
05:56:45 
05:56:45 --------- Difference is ----------
05:56:45  expected:<[]> but was:<[----------\n
05:56:45 1. WARNING in A.java (at line 3)\n
05:56:45 	B.test();\n
05:56:45 	^^^^^^^^\n
05:56:45 Access to enclosing method test() from the type A.B is emulated by a synthetic accessor method\n
05:56:45 ----------\n
05:56:45 ]>
05:56:45   ProblemConstructorTest>TestCase.runTest:957->test006:256->AbstractRegressionTest.runNegativeTest:2703->AbstractRegressionTest.runNegativeTest:2714->AbstractRegressionTest.runTest:3149->AbstractRegressionTest.runTest:3514->AbstractRegressionTest.runJavac:2577->AbstractRegressionTest.handleMismatch:2648->TestCase.assertEquals:242->TestCase.assertStringEquals:266 test006 - Eclipse found warning(s) but Javac did not find any.
05:56:45 ----------- Expected ------------
05:56:45 
05:56:45 ------------ but was ------------
05:56:45 ----------\n
05:56:45 1. WARNING in A.java (at line 3)\n
05:56:45 	B.test();\n
05:56:45 	^^^^^^^^\n
05:56:45 Access to enclosing method test() from the type A.B is emulated by a synthetic accessor method\n
05:56:45 ----------\n
05:56:45 2. WARNING in A.java (at line 8)\n
05:56:45 	public B () { super(""); }\n
05:56:45 	       ^^^^\n
05:56:45 The constructor A.B() is never used locally\n
05:56:45 ----------\n
05:56:45 
05:56:45 --------- Difference is ----------
05:56:45  expected:<[]> but was:<[----------\n
05:56:45 1. WARNING in A.java (at line 3)\n
05:56:45 	B.test();\n
05:56:45 	^^^^^^^^\n
05:56:45 Access to enclosing method test() from the type A.B is emulated by a synthetic accessor method\n
05:56:45 ----------\n
05:56:45 2. WARNING in A.java (at line 8)\n
05:56:45 	public B () { super(""); }\n
05:56:45 	       ^^^^\n
05:56:45 The constructor A.B() is never used locally\n
05:56:45 ----------\n
05:56:45 ]>
05:56:45   ProblemConstructorTest>TestCase.runTest:957->test009:316->AbstractRegressionTest.runNegativeTest:2703->AbstractRegressionTest.runNegativeTest:2714->AbstractRegressionTest.runTest:3149->AbstractRegressionTest.runTest:3514->AbstractRegressionTest.runJavac:2577->AbstractRegressionTest.handleMismatch:2648->TestCase.assertEquals:242->TestCase.assertStringEquals:266 test009 - Eclipse found warning(s) but Javac did not find any.
05:56:45 ----------- Expected ------------
05:56:45 
05:56:45 ------------ but was ------------
05:56:45 ----------\n
05:56:45 1. WARNING in A.java (at line 7)\n
05:56:45 	public B () { super(""); }\n
05:56:45 	       ^^^^\n
05:56:45 The constructor C.B() is never used locally\n
05:56:45 ----------\n
05:56:45 
05:56:45 --------- Difference is ----------
05:56:45  expected:<[]> but was:<[----------\n
05:56:45 1. WARNING in A.java (at line 7)\n
05:56:45 	public B () { super(""); }\n
05:56:45 	       ^^^^\n
05:56:45 The constructor C.B() is never used locally\n
05:56:45 ----------\n
05:56:45 ]>
05:56:45   ProblemConstructorTest>TestCase.runTest:957->test408038a:344->AbstractRegressionTest.runNegativeTest:2821->AbstractRegressionTest.runNegativeTest:2830->AbstractRegressionTest.runTest:3149->AbstractRegressionTest.runTest:3514->AbstractRegressionTest.runJavac:2577->AbstractRegressionTest.handleMismatch:2648->TestCase.assertEquals:242->TestCase.assertStringEquals:266 test408038a - Eclipse found warning(s) but Javac did not find any.
05:56:45 ----------- Expected ------------
05:56:45 
05:56:45 ------------ but was ------------
05:56:45 ----------\n
05:56:45 1. WARNING in X.java (at line 4)\n
05:56:45 	public Y() {}\n
05:56:45 	       ^^^\n
05:56:45 The constructor X.Y() is never used locally\n
05:56:45 ----------\n
05:56:45 
05:56:45 --------- Difference is ----------
05:56:45  expected:<[]> but was:<[----------\n
05:56:45 1. WARNING in X.java (at line 4)\n
05:56:45 	public Y() {}\n
05:56:45 	       ^^^\n
05:56:45 The constructor X.Y() is never used locally\n
05:56:45 ----------\n
05:56:45 ]>
05:56:45   ProblemConstructorTest>TestCase.runTest:957->test408038b:376->AbstractRegressionTest.runNegativeTest:2821->AbstractRegressionTest.runNegativeTest:2830->AbstractRegressionTest.runTest:3149->AbstractRegressionTest.runTest:3514->AbstractRegressionTest.runJavac:2577->AbstractRegressionTest.handleMismatch:2648->TestCase.assertEquals:242->TestCase.assertStringEquals:266 test408038b - Eclipse found warning(s) but Javac did not find any.
05:56:45 ----------- Expected ------------
05:56:45 
05:56:45 ------------ but was ------------
05:56:45 ----------\n
05:56:45 1. WARNING in X.java (at line 4)\n
05:56:45 	public Y() {}\n
05:56:45 	       ^^^\n
05:56:45 The constructor X.Y() is never used locally\n
05:56:45 ----------\n
05:56:45 
05:56:45 --------- Difference is ----------
05:56:45  expected:<[]> but was:<[----------\n
05:56:45 1. WARNING in X.java (at line 4)\n
05:56:45 	public Y() {}\n
05:56:45 	       ^^^\n
05:56:45 The constructor X.Y() is never used locally\n
05:56:45 ----------\n
05:56:45 ]>
05:56:45   ProblemConstructorTest>TestCase.runTest:957->test408038c:408->AbstractRegressionTest.runNegativeTest:2821->AbstractRegressionTest.runNegativeTest:2830->AbstractRegressionTest.runTest:3149->AbstractRegressionTest.runTest:3514->AbstractRegressionTest.runJavac:2577->AbstractRegressionTest.handleMismatch:2652->TestCase.assertEquals:242->TestCase.assertStringEquals:266 test408038c - Javac found warning(s) but Eclipse did not find any.
05:56:45 ----------- Expected ------------
05:56:45 
05:56:45 ------------ but was ------------
05:56:45 X.java:6: warning: [serial] serializable class Y has no definition of serialVersionUID\n
05:56:45 	private static class Y implements Externalizable {\n
05:56:45 	               ^\n
05:56:45 1 warning\n
05:56:45 
05:56:45 --------- Difference is ----------
05:56:45  expected:<[]> but was:<[X.java:6: warning: [serial] serializable class Y has no definition of serialVersionUID\n
05:56:45 	private static class Y implements Externalizable {\n
05:56:45 	               ^\n
05:56:45 1 warning\n
05:56:45 ]>
05:56:45   ProblemConstructorTest>TestCase.runTest:957->test408038e:492->AbstractRegressionTest.runNegativeTest:2703->AbstractRegressionTest.runNegativeTest:2714->AbstractRegressionTest.runTest:3149->AbstractRegressionTest.runTest:3514->AbstractRegressionTest.runJavac:2577->AbstractRegressionTest.handleMismatch:2648->TestCase.assertEquals:242->TestCase.assertStringEquals:266 test408038e - Eclipse found warning(s) but Javac did not find any.
05:56:45 ----------- Expected ------------
05:56:45 
05:56:45 ------------ but was ------------
05:56:45 ----------\n
05:56:45 1. WARNING in X.java (at line 3)\n
05:56:45 	private X(int x) {i = x;}\n
05:56:45 	        ^^^^^^^^\n
05:56:45 The constructor X(int) is never used locally\n
05:56:45 ----------\n
05:56:45 
05:56:45 --------- Difference is ----------
05:56:45  expected:<[]> but was:<[----------\n
05:56:45 1. WARNING in X.java (at line 3)\n
05:56:45 	private X(int x) {i = x;}\n
05:56:45 	        ^^^^^^^^\n
05:56:45 The constructor X(int) is never used locally\n
05:56:45 ----------\n
05:56:45 ]>
05:56:45   ProgrammingProblemsTest>TestCase.runTest:957->test0041:1579->AbstractRegressionTest.runNegativeTest:2703->AbstractRegressionTest.runNegativeTest:2714->AbstractRegressionTest.runTest:3149->AbstractRegressionTest.runTest:3514->AbstractRegressionTest.runJavac:2577->AbstractRegressionTest.handleMismatch:2648->TestCase.assertEquals:242->TestCase.assertStringEquals:266 test0041 - Eclipse found warning(s) but Javac did not find any.
05:56:45 ----------- Expected ------------
05:56:45 
05:56:45 ------------ but was ------------
05:56:45 ----------\n
05:56:45 1. WARNING in X.java (at line 3)\n
05:56:45 	System.out.println(1.0 == 1.0);\n
05:56:45 	                   ^^^^^^^^^^\n
05:56:45 Comparing identical expressions\n
05:56:45 ----------\n
05:56:45 2. WARNING in X.java (at line 4)\n
05:56:45 	System.out.println(1.0f == 1.0f);\n
05:56:45 	                   ^^^^^^^^^^^^\n
05:56:45 Comparing identical expressions\n
05:56:45 ----------\n
05:56:45 
05:56:45 --------- Difference is ----------
05:56:45  expected:<[]> but was:<[----------\n
05:56:45 1. WARNING in X.java (at line 3)\n
05:56:45 	System.out.println(1.0 == 1.0);\n
05:56:45 	                   ^^^^^^^^^^\n
05:56:45 Comparing identical expressions\n
05:56:45 ----------\n
05:56:45 2. WARNING in X.java (at line 4)\n
05:56:45 	System.out.println(1.0f == 1.0f);\n
05:56:45 	                   ^^^^^^^^^^^^\n
05:56:45 Comparing identical expressions\n
05:56:45 ----------\n
05:56:45 ]>
05:56:45   ProgrammingProblemsTest>TestCase.runTest:957->test0044:1658->AbstractRegressionTest.runNegativeTest:2703->AbstractRegressionTest.runNegativeTest:2714->AbstractRegressionTest.runTest:3149->AbstractRegressionTest.runTest:3514->AbstractRegressionTest.runJavac:2577->AbstractRegressionTest.handleMismatch:2648->TestCase.assertEquals:242->TestCase.assertStringEquals:266 test0044 - Eclipse found warning(s) but Javac did not find any.
05:56:45 ----------- Expected ------------
05:56:45 
05:56:45 ------------ but was ------------
05:56:45 ----------\n
05:56:45 1. WARNING in X.java (at line 6)\n
05:56:45 	nvx = nvx;\n
05:56:45 	^^^^^^^^^\n
05:56:45 The assignment to variable nvx has no effect\n
05:56:45 ----------\n
05:56:45 
05:56:45 --------- Difference is ----------
05:56:45  expected:<[]> but was:<[----------\n
05:56:45 1. WARNING in X.java (at line 6)\n
05:56:45 	nvx = nvx;\n
05:56:45 	^^^^^^^^^\n
05:56:45 The assignment to variable nvx has no effect\n
05:56:45 ----------\n
05:56:45 ]>
05:56:45   ProgrammingProblemsTest>TestCase.runTest:957->test0045:1679->AbstractRegressionTest.runNegativeTest:2703->AbstractRegressionTest.runNegativeTest:2714->AbstractRegressionTest.runTest:3149->AbstractRegressionTest.runTest:3514->AbstractRegressionTest.runJavac:2577->AbstractRegressionTest.handleMismatch:2648->TestCase.assertEquals:242->TestCase.assertStringEquals:266 test0045 - Eclipse found warning(s) but Javac did not find any.
05:56:45 ----------- Expected ------------
05:56:45 
05:56:45 ------------ but was ------------
05:56:45 ----------\n
05:56:45 1. WARNING in X.java (at line 2)\n
05:56:45 	volatile int x = this.x;\n
05:56:45 	             ^^^^^^^^^^\n
05:56:45 The assignment to variable x has no effect\n
05:56:45 ----------\n
05:56:45 2. WARNING in X.java (at line 3)\n
05:56:45 	int nvx = this.nvx;\n
05:56:45 	    ^^^^^^^^^^^^^^\n
05:56:45 The assignment to variable nvx has no effect\n
05:56:45 ----------\n
05:56:45 
05:56:45 --------- Difference is ----------
05:56:45  expected:<[]> but was:<[----------\n
05:56:45 1. WARNING in X.java (at line 2)\n
05:56:45 	volatile int x = this.x;\n
05:56:45 	             ^^^^^^^^^^\n
05:56:45 The assignment to variable x has no effect\n
05:56:45 ----------\n
05:56:45 2. WARNING in X.java (at line 3)\n
05:56:45 	int nvx = this.nvx;\n
05:56:45 	    ^^^^^^^^^^^^^^\n
05:56:45 The assignment to variable nvx has no effect\n
05:56:45 ----------\n
05:56:45 ]>
05:56:45   ProgrammingProblemsTest>TestCase.runTest:957->test0046:1707->AbstractRegressionTest.runNegativeTest:2821->AbstractRegressionTest.runNegativeTest:2830->AbstractRegressionTest.runTest:3149->AbstractRegressionTest.runTest:3514->AbstractRegressionTest.runJavac:2577->AbstractRegressionTest.handleMismatch:2648->TestCase.assertEquals:242->TestCase.assertStringEquals:266 test0046 - Eclipse found warning(s) but Javac did not find any.
05:56:45 ----------- Expected ------------
05:56:45 
05:56:45 ------------ but was ------------
05:56:45 ----------\n
05:56:45 1. WARNING in X.java (at line 4)\n
05:56:45 	boolean b=false;\n
05:56:45 	        ^\n
05:56:45 The value of the local variable b is not used\n
05:56:45 ----------\n
05:56:45 2. WARNING in X.java (at line 6)\n
05:56:45 	int k = 2;\n
05:56:45 	    ^\n
05:56:45 The value of the local variable k is not used\n
05:56:45 ----------\n
05:56:45 
05:56:45 --------- Difference is ----------
05:56:45  expected:<[]> but was:<[----------\n
05:56:45 1. WARNING in X.java (at line 4)\n
05:56:45 	boolean b=false;\n
05:56:45 	        ^\n
05:56:45 The value of the local variable b is not used\n
05:56:45 ----------\n
05:56:45 2. WARNING in X.java (at line 6)\n
05:56:45 	int k = 2;\n
05:56:45 	    ^\n
05:56:45 The value of the local variable k is not used\n
05:56:45 ----------\n
05:56:45 ]>
05:56:45   ProgrammingProblemsTest>TestCase.runTest:957->test0046_field:1747->AbstractRegressionTest.runNegativeTest:2821->AbstractRegressionTest.runNegativeTest:2830->AbstractRegressionTest.runTest:3149->AbstractRegressionTest.runTest:3514->AbstractRegressionTest.runJavac:2577->AbstractRegressionTest.handleMismatch:2648->TestCase.assertEquals:242->TestCase.assertStringEquals:266 test0046_field - Eclipse found warning(s) but Javac did not find any.
05:56:45 ----------- Expected ------------
05:56:45 
05:56:45 ------------ but was ------------
05:56:45 ----------\n
05:56:45 1. WARNING in X.java (at line 3)\n
05:56:45 	private boolean b=false;\n
05:56:45 	                ^\n
05:56:45 The value of the field X.b is not used\n
05:56:45 ----------\n
05:56:45 2. WARNING in X.java (at line 4)\n
05:56:45 	private int k = 2;\n
05:56:45 	            ^\n
05:56:45 The value of the field X.k is not used\n
05:56:45 ----------\n
05:56:45 
05:56:45 --------- Difference is ----------
05:56:45  expected:<[]> but was:<[----------\n
05:56:45 1. WARNING in X.java (at line 3)\n
05:56:45 	private boolean b=false;\n
05:56:45 	                ^\n
05:56:45 The value of the field X.b is not used\n
05:56:45 ----------\n
05:56:45 2. WARNING in X.java (at line 4)\n
05:56:45 	private int k = 2;\n
05:56:45 	            ^\n
05:56:45 The value of the field X.k is not used\n
05:56:45 ----------\n
05:56:45 ]>
05:56:45   ProgrammingProblemsTest>TestCase.runTest:957->test0046_field_in_private_type:1866->AbstractRegressionTest.runNegativeTest:2821->AbstractRegressionTest.runNegativeTest:2830->AbstractRegressionTest.runTest:3149->AbstractRegressionTest.runTest:3514->AbstractRegressionTest.runJavac:2577->AbstractRegressionTest.handleMismatch:2648->TestCase.assertEquals:242->TestCase.assertStringEquals:266 test0046_field_in_private_type - Eclipse found warning(s) but Javac did not find any.
05:56:45 ----------- Expected ------------
05:56:45 
05:56:45 ------------ but was ------------
05:56:45 ----------\n
05:56:45 1. WARNING in X.java (at line 4)\n
05:56:45 	public boolean b=false;\n
05:56:45 	               ^\n
05:56:45 The value of the field X.Y.b is not used\n
05:56:45 ----------\n
05:56:45 2. WARNING in X.java (at line 5)\n
05:56:45 	protected int k = 2;\n
05:56:45 	              ^\n
05:56:45 The value of the field X.Y.k is not used\n
05:56:45 ----------\n
05:56:45 
05:56:45 --------- Difference is ----------
05:56:45  expected:<[]> but was:<[----------\n
05:56:45 1. WARNING in X.java (at line 4)\n
05:56:45 	public boolean b=false;\n
05:56:45 	               ^\n
05:56:45 The value of the field X.Y.b is not used\n
05:56:45 ----------\n
05:56:45 2. WARNING in X.java (at line 5)\n
05:56:45 	protected int k = 2;\n
05:56:45 	              ^\n
05:56:45 The value of the field X.Y.k is not used\n
05:56:45 ----------\n
05:56:45 ]>
05:56:45   ProgrammingProblemsTest>TestCase.runTest:957->test0046_field_qualified:1826->AbstractRegressionTest.runNegativeTest:2821->AbstractRegressionTest.runNegativeTest:2830->AbstractRegressionTest.runTest:3149->AbstractRegressionTest.runTest:3514->AbstractRegressionTest.runJavac:2577->AbstractRegressionTest.handleMismatch:2648->TestCase.assertEquals:242->TestCase.assertStringEquals:266 test0046_field_qualified - Eclipse found warning(s) but Javac did not find any.
05:56:45 ----------- Expected ------------
05:56:45 
05:56:45 ------------ but was ------------
05:56:45 ----------\n
05:56:45 1. WARNING in X.java (at line 3)\n
05:56:45 	private boolean b=false;\n
05:56:45 	                ^\n
05:56:45 The value of the field X.b is not used\n
05:56:45 ----------\n
05:56:45 2. WARNING in X.java (at line 4)\n
05:56:45 	private int k = 2;\n
05:56:45 	            ^\n
05:56:45 The value of the field X.k is not used\n
05:56:45 ----------\n
05:56:45 
05:56:45 --------- Difference is ----------
05:56:45  expected:<[]> but was:<[----------\n
05:56:45 1. WARNING in X.java (at line 3)\n
05:56:45 	private boolean b=false;\n
05:56:45 	                ^\n
05:56:45 The value of the field X.b is not used\n
05:56:45 ----------\n
05:56:45 2. WARNING in X.java (at line 4)\n
05:56:45 	private int k = 2;\n
05:56:45 	            ^\n
05:56:45 The value of the field X.k is not used\n
05:56:45 ----------\n
05:56:45 ]>
05:56:45   ProgrammingProblemsTest>TestCase.runTest:957->test0046_field_this_qualified:1786->AbstractRegressionTest.runNegativeTest:2821->AbstractRegressionTest.runNegativeTest:2830->AbstractRegressionTest.runTest:3149->AbstractRegressionTest.runTest:3514->AbstractRegressionTest.runJavac:2577->AbstractRegressionTest.handleMismatch:2648->TestCase.assertEquals:242->TestCase.assertStringEquals:266 test0046_field_this_qualified - Eclipse found warning(s) but Javac did not find any.
05:56:45 ----------- Expected ------------
05:56:45 
05:56:45 ------------ but was ------------
05:56:45 ----------\n
05:56:45 1. WARNING in X.java (at line 3)\n
05:56:45 	private boolean b=false;\n
05:56:45 	                ^\n
05:56:45 The value of the field X.b is not used\n
05:56:45 ----------\n
05:56:45 2. WARNING in X.java (at line 4)\n
05:56:45 	private int k = 2;\n
05:56:45 	            ^\n
05:56:45 The value of the field X.k is not used\n
05:56:45 ----------\n
05:56:45 
05:56:45 --------- Difference is ----------
05:56:45  expected:<[]> but was:<[----------\n
05:56:45 1. WARNING in X.java (at line 3)\n
05:56:45 	private boolean b=false;\n
05:56:45 	                ^\n
05:56:45 The value of the field X.b is not used\n
05:56:45 ----------\n
05:56:45 2. WARNING in X.java (at line 4)\n
05:56:45 	private int k = 2;\n
05:56:45 	            ^\n
05:56:45 The value of the field X.k is not used\n
05:56:45 ----------\n
05:56:45 ]>
05:56:45   ProgrammingProblemsTest>TestCase.runTest:957->test0047:1909->AbstractRegressionTest.runNegativeTest:2821->AbstractRegressionTest.runNegativeTest:2830->AbstractRegressionTest.runTest:3149->AbstractRegressionTest.runTest:3514->AbstractRegressionTest.runJavac:2577->AbstractRegressionTest.handleMismatch:2648->TestCase.assertEquals:242->TestCase.assertStringEquals:266 test0047 - Eclipse found warning(s) but Javac did not find any.
05:56:45 ----------- Expected ------------
05:56:45 
05:56:45 ------------ but was ------------
05:56:45 ----------\n
05:56:45 1. WARNING in X.java (at line 2)\n
05:56:45 	void foo(int param1, int param2, Integer param3) {\n
05:56:45 	             ^^^^^^\n
05:56:45 The value of the parameter param1 is not used\n
05:56:45 ----------\n
05:56:45 2. WARNING in X.java (at line 2)\n
05:56:45 	void foo(int param1, int param2, Integer param3) {\n
05:56:45 	                         ^^^^^^\n
05:56:45 The value of the parameter param2 is not used\n
05:56:45 ----------\n
05:56:45 3. WARNING in X.java (at line 3)\n
05:56:45 	boolean b=false;\n
05:56:45 	        ^\n
05:56:45 The value of the local variable b is not used\n
05:56:45 ----------\n
05:56:45 
05:56:45 --------- Difference is ----------
05:56:45  expected:<[]> but was:<[----------\n
05:56:45 1. WARNING in X.java (at line 2)\n
05:56:45 	void foo(int param1, int param2, Integer param3) {\n
05:56:45 	             ^^^^^^\n
05:56:45 The value of the parameter param1 is not used\n
05:56:45 ----------\n
05:56:45 2. WARNING in X.java (at line 2)\n
05:56:45 	void foo(int param1, int param2, Integer param3) {\n
05:56:45 	                         ^^^^^^\n
05:56:45 The value of the parameter param2 is not used\n
05:56:45 ----------\n
05:56:45 3. WARNING in X.java (at line 3)\n
05:56:45 	boolean b=false;\n
05:56:45 	        ^\n
05:56:45 The value of the local variable b is not used\n
05:56:45 ----------\n
05:56:45 ]>
05:56:45   ProgrammingProblemsTest>TestCase.runTest:957->test0048:1955->AbstractRegressionTest.runNegativeTest:2821->AbstractRegressionTest.runNegativeTest:2830->AbstractRegressionTest.runTest:3149->AbstractRegressionTest.runTest:3514->AbstractRegressionTest.runJavac:2577->AbstractRegressionTest.handleMismatch:2648->TestCase.assertEquals:242->TestCase.assertStringEquals:266 test0048 - Eclipse found warning(s) but Javac did not find any.
05:56:45 ----------- Expected ------------
05:56:45 
05:56:45 ------------ but was ------------
05:56:45 ----------\n
05:56:45 1. WARNING in X.java (at line 3)\n
05:56:45 	boolean b=false;\n
05:56:45 	        ^\n
05:56:45 The value of the local variable b is not used\n
05:56:45 ----------\n
05:56:45 2. WARNING in X.java (at line 9)\n
05:56:45 	public void foo(int param1, int param2) {\n
05:56:45 	                    ^^^^^^\n
05:56:45 The value of the parameter param1 is not used\n
05:56:45 ----------\n
05:56:45 3. WARNING in X.java (at line 9)\n
05:56:45 	public void foo(int param1, int param2) {\n
05:56:45 	                                ^^^^^^\n
05:56:45 The value of the parameter param2 is not used\n
05:56:45 ----------\n
05:56:45 4. WARNING in X.java (at line 10)\n
05:56:45 	boolean b=false;\n
05:56:45 	        ^\n
05:56:45 The value of the local variable b is not used\n
05:56:45 ----------\n
05:56:45 
05:56:45 --------- Difference is ----------
05:56:45  expected:<[]> but was:<[----------\n
05:56:45 1. WARNING in X.java (at line 3)\n
05:56:45 	boolean b=false;\n
05:56:45 	        ^\n
05:56:45 The value of the local variable b is not used\n
05:56:45 ----------\n
05:56:45 2. WARNING in X.java (at line 9)\n
05:56:45 	public void foo(int param1, int param2) {\n
05:56:45 	                    ^^^^^^\n
05:56:45 The value of the parameter param1 is not used\n
05:56:45 ----------\n
05:56:45 3. WARNING in X.java (at line 9)\n
05:56:45 	public void foo(int param1, int param2) {\n
05:56:45 	                                ^^^^^^\n
05:56:45 The value of the parameter param2 is not used\n
05:56:45 ----------\n
05:56:45 4. WARNING in X.java (at line 10)\n
05:56:45 	boolean b=false;\n
05:56:45 	        ^\n
05:56:45 The value of the local variable b is not used\n
05:56:45 ----------\n
05:56:45 ]>
05:56:45   ProgrammingProblemsTest>TestCase.runTest:957->test0049:2020->AbstractRegressionTest.runNegativeTest:2821->AbstractRegressionTest.runNegativeTest:2830->AbstractRegressionTest.runTest:3149->AbstractRegressionTest.runTest:3514->AbstractRegressionTest.runJavac:2577->AbstractRegressionTest.handleMismatch:2648->TestCase.assertEquals:242->TestCase.assertStringEquals:266 test0049 - Eclipse found warning(s) but Javac did not find any.
05:56:45 ----------- Expected ------------
05:56:45 
05:56:45 ------------ but was ------------
05:56:45 ----------\n
05:56:45 1. WARNING in X.java (at line 3)\n
05:56:45 	boolean b=false;\n
05:56:45 	        ^\n
05:56:45 The value of the local variable b is not used\n
05:56:45 ----------\n
05:56:45 2. WARNING in X.java (at line 9)\n
05:56:45 	public void foo(int param1, Integer param3) {\n
05:56:45 	                    ^^^^^^\n
05:56:45 The value of the parameter param1 is not used\n
05:56:45 ----------\n
05:56:45 3. WARNING in X.java (at line 15)\n
05:56:45 	public void foo(int param1, int param2, Integer param3) {\n
05:56:45 	                    ^^^^^^\n
05:56:45 The value of the parameter param1 is not used\n
05:56:45 ----------\n
05:56:45 4. WARNING in X.java (at line 15)\n
05:56:45 	public void foo(int param1, int param2, Integer param3) {\n
05:56:45 	                                ^^^^^^\n
05:56:45 The value of the parameter param2 is not used\n
05:56:45 ----------\n
05:56:45 
05:56:45 --------- Difference is ----------
05:56:45  expected:<[]> but was:<[----------\n
05:56:45 1. WARNING in X.java (at line 3)\n
05:56:45 	boolean b=false;\n
05:56:45 	        ^\n
05:56:45 The value of the local variable b is not used\n
05:56:45 ----------\n
05:56:45 2. WARNING in X.java (at line 9)\n
05:56:45 	public void foo(int param1, Integer param3) {\n
05:56:45 	                    ^^^^^^\n
05:56:45 The value of the parameter param1 is not used\n
05:56:45 ----------\n
05:56:45 3. WARNING in X.java (at line 15)\n
05:56:45 	public void foo(int param1, int param2, Integer param3) {\n
05:56:45 	                    ^^^^^^\n
05:56:45 The value of the parameter param1 is not used\n
05:56:45 ----------\n
05:56:45 4. WARNING in X.java (at line 15)\n
05:56:45 	public void foo(int param1, int param2, Integer param3) {\n
05:56:45 	                                ^^^^^^\n
05:56:45 The value of the parameter param2 is not used\n
05:56:45 ----------\n
05:56:45 ]>
05:56:45   ProgrammingProblemsTest>TestCase.runTest:957->test0050:2076->AbstractRegressionTest.runNegativeTest:2821->AbstractRegressionTest.runNegativeTest:2830->AbstractRegressionTest.runTest:3149->AbstractRegressionTest.runTest:3514->AbstractRegressionTest.runJavac:2577->AbstractRegressionTest.handleMismatch:2648->TestCase.assertEquals:242->TestCase.assertStringEquals:266 test0050 - Eclipse found warning(s) but Javac did not find any.
05:56:45 ----------- Expected ------------
05:56:45 
05:56:45 ------------ but was ------------
05:56:45 ----------\n
05:56:45 1. WARNING in X.java (at line 4)\n
05:56:45 	if (false) {\n
05:56:45         	boolean b=false;\n
05:56:45         	b|=true;\n
05:56:45 		 }\n
05:56:45 	           ^^^^^^^^^^^^^^^^^^^^^^^^^^^^^^^^^^^^^^^^^^^^^^^^^^\n
05:56:45 Dead code\n
05:56:45 ----------\n
05:56:45 2. WARNING in X.java (at line 8)\n
05:56:45 	int k = 2;\n
05:56:45 	    ^\n
05:56:45 The value of the local variable k is not used\n
05:56:45 ----------\n
05:56:45 
05:56:45 --------- Difference is ----------
05:56:45  expected:<[]> but was:<[----------\n
05:56:45 1. WARNING in X.java (at line 4)\n
05:56:45 	if (false) {\n
05:56:45         	boolean b=false;\n
05:56:45         	b|=true;\n
05:56:45 		 }\n
05:56:45 	           ^^^^^^^^^^^^^^^^^^^^^^^^^^^^^^^^^^^^^^^^^^^^^^^^^^\n
05:56:45 Dead code\n
05:56:45 ----------\n
05:56:45 2. WARNING in X.java (at line 8)\n
05:56:45 	int k = 2;\n
05:56:45 	    ^\n
05:56:45 The value of the local variable k is not used\n
05:56:45 ----------\n
05:56:45 ]>
05:56:45   ProgrammingProblemsTest>TestCase.runTest:957->test0051:2118->AbstractRegressionTest.runNegativeTest:2821->AbstractRegressionTest.runNegativeTest:2830->AbstractRegressionTest.runTest:3149->AbstractRegressionTest.runTest:3514->AbstractRegressionTest.runJavac:2577->AbstractRegressionTest.handleMismatch:2648->TestCase.assertEquals:242->TestCase.assertStringEquals:266 test0051 - Eclipse found warning(s) but Javac did not find any.
05:56:45 ----------- Expected ------------
05:56:45 
05:56:45 ------------ but was ------------
05:56:45 ----------\n
05:56:45 1. WARNING in X.java (at line 2)\n
05:56:45 	X(int abc) {\n
05:56:45 	      ^^^\n
05:56:45 The value of the parameter abc is not used\n
05:56:45 ----------\n
05:56:45 
05:56:45 --------- Difference is ----------
05:56:45  expected:<[]> but was:<[----------\n
05:56:45 1. WARNING in X.java (at line 2)\n
05:56:45 	X(int abc) {\n
05:56:45 	      ^^^\n
05:56:45 The value of the parameter abc is not used\n
05:56:45 ----------\n
05:56:45 ]>
05:56:45   ProgrammingProblemsTest>TestCase.runTest:957->test0055:2288->AbstractRegressionTest.runNegativeTest:2821->AbstractRegressionTest.runNegativeTest:2830->AbstractRegressionTest.runTest:3149->AbstractRegressionTest.runTest:3514->AbstractRegressionTest.runJavac:2577->AbstractRegressionTest.handleMismatch:2648->TestCase.assertEquals:242->TestCase.assertStringEquals:266 test0055 - Eclipse found warning(s) but Javac did not find any.
05:56:45 ----------- Expected ------------
05:56:45 
05:56:45 ------------ but was ------------
05:56:45 ----------\n
05:56:45 1. WARNING in test1\E.java (at line 4)\n
05:56:45 	int a= 10;\n
05:56:45 	    ^\n
05:56:45 The value of the local variable a is not used\n
05:56:45 ----------\n
05:56:45 
05:56:45 --------- Difference is ----------
05:56:45  expected:<[]> but was:<[----------\n
05:56:45 1. WARNING in test1\E.java (at line 4)\n
05:56:45 	int a= 10;\n
05:56:45 	    ^\n
05:56:45 The value of the local variable a is not used\n
05:56:45 ----------\n
05:56:45 ]>
05:56:45   ProgrammingProblemsTest>TestCase.runTest:957->test0059:2400->AbstractRegressionTest.runNegativeTest:2821->AbstractRegressionTest.runNegativeTest:2830->AbstractRegressionTest.runTest:3149->AbstractRegressionTest.runTest:3514->AbstractRegressionTest.runJavac:2577->AbstractRegressionTest.handleMismatch:2648->TestCase.assertEquals:242->TestCase.assertStringEquals:266 test0059 - Eclipse found warning(s) but Javac did not find any.
05:56:45 ----------- Expected ------------
05:56:45 
05:56:45 ------------ but was ------------
05:56:45 ----------\n
05:56:45 1. WARNING in X.java (at line 4)\n
05:56:45 	if (a != null){\n
05:56:45         	int j = 3;\n
05:56:45         	j++;\n
05:56:45     	}\n
05:56:45 	              ^^^^^^^^^^^^^^^^^^^^^^^^^^^^^^^^^^^^^^^^^^\n
05:56:45 Dead code\n
05:56:45 ----------\n
05:56:45 2. WARNING in X.java (at line 5)\n
05:56:45 	int j = 3;\n
05:56:45 	    ^\n
05:56:45 The value of the local variable j is not used\n
05:56:45 ----------\n
05:56:45 
05:56:45 --------- Difference is ----------
05:56:45  expected:<[]> but was:<[----------\n
05:56:45 1. WARNING in X.java (at line 4)\n
05:56:45 	if (a != null){\n
05:56:45         	int j = 3;\n
05:56:45         	j++;\n
05:56:45     	}\n
05:56:45 	              ^^^^^^^^^^^^^^^^^^^^^^^^^^^^^^^^^^^^^^^^^^\n
05:56:45 Dead code\n
05:56:45 ----------\n
05:56:45 2. WARNING in X.java (at line 5)\n
05:56:45 	int j = 3;\n
05:56:45 	    ^\n
05:56:45 The value of the local variable j is not used\n
05:56:45 ----------\n
05:56:45 ]>
05:56:45   ProgrammingProblemsTest>TestCase.runTest:957->test0060:2436->AbstractRegressionTest.runNegativeTest:2821->AbstractRegressionTest.runNegativeTest:2830->AbstractRegressionTest.runTest:3149->AbstractRegressionTest.runTest:3514->AbstractRegressionTest.runJavac:2577->AbstractRegressionTest.handleMismatch:2632->TestCase.assertEquals:242->TestCase.assertStringEquals:266 test0060 - Eclipse found error(s) but Javac did not find any.
05:56:45 ----------- Expected ------------
05:56:45 
05:56:45 ------------ but was ------------
05:56:45 ----------\n
05:56:45 1. ERROR in org\eclipse\jdt\internal\compiler\lookup\X.java (at line 7)\n
05:56:45 	if (t1 == t2) { \n
05:56:45 	    ^^^^^^^^\n
05:56:45 The uninterned types TypeBinding and TypeBinding should not be compared using ==/!= operators.\n
05:56:45 ----------\n
05:56:45 2. ERROR in org\eclipse\jdt\internal\compiler\lookup\X.java (at line 9)\n
05:56:45 	if (t1 == t2) {\n
05:56:45 	    ^^^^^^^^\n
05:56:45 The uninterned types TypeBinding and TypeBinding should not be compared using ==/!= operators.\n
05:56:45 ----------\n
05:56:45 3. ERROR in org\eclipse\jdt\internal\compiler\lookup\X.java (at line 16)\n
05:56:45 	if (t1 == t2) { \n
05:56:45 	    ^^^^^^^^\n
05:56:45 The uninterned types TypeBinding and TypeBinding should not be compared using ==/!= operators.\n
05:56:45 ----------\n
05:56:45 4. ERROR in org\eclipse\jdt\internal\compiler\lookup\X.java (at line 18)\n
05:56:45 	if (t1 == t2) {\n
05:56:45 	    ^^^^^^^^\n
05:56:45 The uninterned types TypeBinding and TypeBinding should not be compared using ==/!= operators.\n
05:56:45 ----------\n
05:56:45 5. ERROR in org\eclipse\jdt\internal\compiler\lookup\X.java (at line 28)\n
05:56:45 	if (t1 == t2) { \n
05:56:45 	    ^^^^^^^^\n
05:56:45 The uninterned types TypeBinding and TypeBinding should not be compared using ==/!= operators.\n
05:56:45 ----------\n
05:56:45 
05:56:45 --------- Difference is ----------
05:56:45  expected:<[]> but was:<[----------\n
05:56:45 1. ERROR in org\eclipse\jdt\internal\compiler\lookup\X.java (at line 7)\n
05:56:45 	if (t1 == t2) { \n
05:56:45 	    ^^^^^^^^\n
05:56:45 The uninterned types TypeBinding and TypeBinding should not be compared using ==/!= operators.\n
05:56:45 ----------\n
05:56:45 2. ERROR in org\eclipse\jdt\internal\compiler\lookup\X.java (at line 9)\n
05:56:45 	if (t1 == t2) {\n
05:56:45 	    ^^^^^^^^\n
05:56:45 The uninterned types TypeBinding and TypeBinding should not be compared using ==/!= operators.\n
05:56:45 ----------\n
05:56:45 3. ERROR in org\eclipse\jdt\internal\compiler\lookup\X.java (at line 16)\n
05:56:45 	if (t1 == t2) { \n
05:56:45 	    ^^^^^^^^\n
05:56:45 The uninterned types TypeBinding and TypeBinding should not be compared using ==/!= operators.\n
05:56:45 ----------\n
05:56:45 4. ERROR in org\eclipse\jdt\internal\compiler\lookup\X.java (at line 18)\n
05:56:45 	if (t1 == t2) {\n
05:56:45 	    ^^^^^^^^\n
05:56:45 The uninterned types TypeBinding and TypeBinding should not be compared using ==/!= operators.\n
05:56:45 ----------\n
05:56:45 5. ERROR in org\eclipse\jdt\internal\compiler\lookup\X.java (at line 28)\n
05:56:45 	if (t1 == t2) { \n
05:56:45 	    ^^^^^^^^\n
05:56:45 The uninterned types TypeBinding and TypeBinding should not be compared using ==/!= operators.\n
05:56:45 ----------\n
05:56:45 ]>
05:56:45   ProgrammingProblemsTest>TestCase.runTest:957->test0063:2631->AbstractRegressionTest.runNegativeTest:2821->AbstractRegressionTest.runNegativeTest:2830->AbstractRegressionTest.runTest:3149->AbstractRegressionTest.runTest:3514->AbstractRegressionTest.runJavac:2577->AbstractRegressionTest.handleMismatch:2632->TestCase.assertEquals:242->TestCase.assertStringEquals:266 test0063 - Eclipse found error(s) but Javac did not find any.
05:56:45 ----------- Expected ------------
05:56:45 
05:56:45 ------------ but was ------------
05:56:45 ----------\n
05:56:45 1. ERROR in org\eclipse\jdt\core\dom\X.java (at line 9)\n
05:56:45 	if (t1 == t2) { \n
05:56:45 	    ^^^^^^^^\n
05:56:45 The uninterned types TypeBinding and TypeBinding should not be compared using ==/!= operators.\n
05:56:45 ----------\n
05:56:45 2. ERROR in org\eclipse\jdt\core\dom\X.java (at line 11)\n
05:56:45 	if (t1 == t2) {\n
05:56:45 	    ^^^^^^^^\n
05:56:45 The uninterned types TypeBinding and TypeBinding should not be compared using ==/!= operators.\n
05:56:45 ----------\n
05:56:45 3. ERROR in org\eclipse\jdt\core\dom\X.java (at line 18)\n
05:56:45 	if (t1 == t2) { \n
05:56:45 	    ^^^^^^^^\n
05:56:45 The uninterned types TypeBinding and TypeBinding should not be compared using ==/!= operators.\n
05:56:45 ----------\n
05:56:45 4. ERROR in org\eclipse\jdt\core\dom\X.java (at line 20)\n
05:56:45 	if (t1 == t2) {\n
05:56:45 	    ^^^^^^^^\n
05:56:45 The uninterned types TypeBinding and TypeBinding should not be compared using ==/!= operators.\n
05:56:45 ----------\n
05:56:45 5. ERROR in org\eclipse\jdt\core\dom\X.java (at line 30)\n
05:56:45 	if (t1 == t2) { \n
05:56:45 	    ^^^^^^^^\n
05:56:45 The uninterned types TypeBinding and TypeBinding should not be compared using ==/!= operators.\n
05:56:45 ----------\n
05:56:45 
05:56:45 --------- Difference is ----------
05:56:45  expected:<[]> but was:<[----------\n
05:56:45 1. ERROR in org\eclipse\jdt\core\dom\X.java (at line 9)\n
05:56:45 	if (t1 == t2) { \n
05:56:45 	    ^^^^^^^^\n
05:56:45 The uninterned types TypeBinding and TypeBinding should not be compared using ==/!= operators.\n
05:56:45 ----------\n
05:56:45 2. ERROR in org\eclipse\jdt\core\dom\X.java (at line 11)\n
05:56:45 	if (t1 == t2) {\n
05:56:45 	    ^^^^^^^^\n
05:56:45 The uninterned types TypeBinding and TypeBinding should not be compared using ==/!= operators.\n
05:56:45 ----------\n
05:56:45 3. ERROR in org\eclipse\jdt\core\dom\X.java (at line 18)\n
05:56:45 	if (t1 == t2) { \n
05:56:45 	    ^^^^^^^^\n
05:56:45 The uninterned types TypeBinding and TypeBinding should not be compared using ==/!= operators.\n
05:56:45 ----------\n
05:56:45 4. ERROR in org\eclipse\jdt\core\dom\X.java (at line 20)\n
05:56:45 	if (t1 == t2) {\n
05:56:45 	    ^^^^^^^^\n
05:56:45 The uninterned types TypeBinding and TypeBinding should not be compared using ==/!= operators.\n
05:56:45 ----------\n
05:56:45 5. ERROR in org\eclipse\jdt\core\dom\X.java (at line 30)\n
05:56:45 	if (t1 == t2) { \n
05:56:45 	    ^^^^^^^^\n
05:56:45 The uninterned types TypeBinding and TypeBinding should not be compared using ==/!= operators.\n
05:56:45 ----------\n
05:56:45 ]>
05:56:45   ProgrammingProblemsTest>TestCase.runTest:957->testBug410218a:2715->AbstractRegressionTest.runNegativeTest:2703->AbstractRegressionTest.runNegativeTest:2714->AbstractRegressionTest.runTest:3149->AbstractRegressionTest.runTest:3514->AbstractRegressionTest.runJavac:2577->AbstractRegressionTest.handleMismatch:2648->TestCase.assertEquals:242->TestCase.assertStringEquals:266 testBug410218a - Eclipse found warning(s) but Javac did not find any.
05:56:45 ----------- Expected ------------
05:56:45 
05:56:45 ------------ but was ------------
05:56:45 ----------\n
05:56:45 1. WARNING in X.java (at line 8)\n
05:56:45 	if (set.contains("ONE")) // bad\n
05:56:45 	                 ^^^^^\n
05:56:45 Unlikely argument type String for contains(Object) on a Collection<Short>\n
05:56:45 ----------\n
05:56:45 2. WARNING in X.java (at line 9)\n
05:56:45 	set.remove("ONE"); // bad\n
05:56:45 	           ^^^^^\n
05:56:45 Unlikely argument type String for remove(Object) on a Collection<Short>\n
05:56:45 ----------\n
05:56:45 3. WARNING in X.java (at line 10)\n
05:56:45 	if (set.contains(1)) // bad\n
05:56:45 	                 ^\n
05:56:45 Unlikely argument type int for contains(Object) on a Collection<Short>\n
05:56:45 ----------\n
05:56:45 4. WARNING in X.java (at line 11)\n
05:56:45 	set.remove(1); // bad (tries to remove "Integer 1")\n
05:56:45 	           ^\n
05:56:45 Unlikely argument type int for remove(Object) on a Collection<Short>\n
05:56:45 ----------\n
05:56:45 
05:56:45 --------- Difference is ----------
05:56:45  expected:<[]> but was:<[----------\n
05:56:45 1. WARNING in X.java (at line 8)\n
05:56:45 	if (set.contains("ONE")) // bad\n
05:56:45 	                 ^^^^^\n
05:56:45 Unlikely argument type String for contains(Object) on a Collection<Short>\n
05:56:45 ----------\n
05:56:45 2. WARNING in X.java (at line 9)\n
05:56:45 	set.remove("ONE"); // bad\n
05:56:45 	           ^^^^^\n
05:56:45 Unlikely argument type String for remove(Object) on a Collection<Short>\n
05:56:45 ----------\n
05:56:45 3. WARNING in X.java (at line 10)\n
05:56:45 	if (set.contains(1)) // bad\n
05:56:45 	                 ^\n
05:56:45 Unlikely argument type int for contains(Object) on a Collection<Short>\n
05:56:45 ----------\n
05:56:45 4. WARNING in X.java (at line 11)\n
05:56:45 	set.remove(1); // bad (tries to remove "Integer 1")\n
05:56:45 	           ^\n
05:56:45 Unlikely argument type int for remove(Object) on a Collection<Short>\n
05:56:45 ----------\n
05:56:45 ]>
05:56:45   ProgrammingProblemsTest>TestCase.runTest:957->testBug410218b:2765->AbstractRegressionTest.runNegativeTest:2703->AbstractRegressionTest.runNegativeTest:2714->AbstractRegressionTest.runTest:3149->AbstractRegressionTest.runTest:3514->AbstractRegressionTest.runJavac:2577->AbstractRegressionTest.handleMismatch:2648->TestCase.assertEquals:242->TestCase.assertStringEquals:266 testBug410218b - Eclipse found warning(s) but Javac did not find any.
05:56:45 ----------- Expected ------------
05:56:45 
05:56:45 ------------ but was ------------
05:56:45 ----------\n
05:56:45 1. WARNING in X.java (at line 4)\n
05:56:45 	if (hss.contains(ts)) // bad\n
05:56:45 	                 ^^\n
05:56:45 Unlikely argument type TreeSet<T> for contains(Object) on a Collection<HashSet<T>>\n
05:56:45 ----------\n
05:56:45 2. WARNING in X.java (at line 5)\n
05:56:45 	hss.remove(ts); // bad\n
05:56:45 	           ^^\n
05:56:45 Unlikely argument type TreeSet<T> for remove(Object) on a Collection<HashSet<T>>\n
05:56:45 ----------\n
05:56:45 
05:56:45 --------- Difference is ----------
05:56:45  expected:<[]> but was:<[----------\n
05:56:45 1. WARNING in X.java (at line 4)\n
05:56:45 	if (hss.contains(ts)) // bad\n
05:56:45 	                 ^^\n
05:56:45 Unlikely argument type TreeSet<T> for contains(Object) on a Collection<HashSet<T>>\n
05:56:45 ----------\n
05:56:45 2. WARNING in X.java (at line 5)\n
05:56:45 	hss.remove(ts); // bad\n
05:56:45 	           ^^\n
05:56:45 Unlikely argument type TreeSet<T> for remove(Object) on a Collection<HashSet<T>>\n
05:56:45 ----------\n
05:56:45 ]>
05:56:45   ProgrammingProblemsTest>TestCase.runTest:957->testBug410218b2:2798->AbstractRegressionTest.runNegativeTest:2821->AbstractRegressionTest.runNegativeTest:2830->AbstractRegressionTest.runTest:3149->AbstractRegressionTest.runTest:3514->AbstractRegressionTest.runJavac:2577->AbstractRegressionTest.handleMismatch:2648->TestCase.assertEquals:242->TestCase.assertStringEquals:266 testBug410218b2 - Eclipse found warning(s) but Javac did not find any.
05:56:45 ----------- Expected ------------
05:56:45 
05:56:45 ------------ but was ------------
05:56:45 ----------\n
05:56:45 1. WARNING in X.java (at line 4)\n
05:56:45 	if (hss.contains(ts)) // bad\n
05:56:45 	                 ^^\n
05:56:45 Unlikely argument type TreeSet<T> for contains(Object) on a Collection<HashSet<T>>\n
05:56:45 ----------\n
05:56:45 2. WARNING in X.java (at line 5)\n
05:56:45 	hss.remove(ts); // bad\n
05:56:45 	           ^^\n
05:56:45 Unlikely argument type TreeSet<T> for remove(Object) on a Collection<HashSet<T>>\n
05:56:45 ----------\n
05:56:45 3. WARNING in X.java (at line 6)\n
05:56:45 	if (hss.contains((Set<T>)ts)) // bad (because of strict check)\n
05:56:45 	                 ^^^^^^^^^^\n
05:56:45 Unlikely argument type Set<T> for contains(Object) on a Collection<HashSet<T>>\n
05:56:45 ----------\n
05:56:45 4. WARNING in X.java (at line 7)\n
05:56:45 	hss.remove((Set<T>)ts); // bad (because of strict check)\n
05:56:45 	           ^^^^^^^^^^\n
05:56:45 Unlikely argument type Set<T> for remove(Object) on a Collection<HashSet<T>>\n
05:56:45 ----------\n
05:56:45 
05:56:45 --------- Difference is ----------
05:56:45  expected:<[]> but was:<[----------\n
05:56:45 1. WARNING in X.java (at line 4)\n
05:56:45 	if (hss.contains(ts)) // bad\n
05:56:45 	                 ^^\n
05:56:45 Unlikely argument type TreeSet<T> for contains(Object) on a Collection<HashSet<T>>\n
05:56:45 ----------\n
05:56:45 2. WARNING in X.java (at line 5)\n
05:56:45 	hss.remove(ts); // bad\n
05:56:45 	           ^^\n
05:56:45 Unlikely argument type TreeSet<T> for remove(Object) on a Collection<HashSet<T>>\n
05:56:45 ----------\n
05:56:45 3. WARNING in X.java (at line 6)\n
05:56:45 	if (hss.contains((Set<T>)ts)) // bad (because of strict check)\n
05:56:45 	                 ^^^^^^^^^^\n
05:56:45 Unlikely argument type Set<T> for contains(Object) on a Collection<HashSet<T>>\n
05:56:45 ----------\n
05:56:45 4. WARNING in X.java (at line 7)\n
05:56:45 	hss.remove((Set<T>)ts); // bad (because of strict check)\n
05:56:45 	           ^^^^^^^^^^\n
05:56:45 Unlikely argument type Set<T> for remove(Object) on a Collection<HashSet<T>>\n
05:56:45 ----------\n
05:56:45 ]>
05:56:45   ProgrammingProblemsTest>TestCase.runTest:957->testBug410218c:2842->AbstractRegressionTest.runNegativeTest:2703->AbstractRegressionTest.runNegativeTest:2714->AbstractRegressionTest.runTest:3149->AbstractRegressionTest.runTest:3514->AbstractRegressionTest.runJavac:2577->AbstractRegressionTest.handleMismatch:2648->TestCase.assertEquals:242->TestCase.assertStringEquals:266 testBug410218c - Eclipse found warning(s) but Javac did not find any.
05:56:45 ----------- Expected ------------
05:56:45 
05:56:45 ------------ but was ------------
05:56:45 ----------\n
05:56:45 1. WARNING in X.java (at line 4)\n
05:56:45 	if (m.containsKey("ONE")) // bad\n
05:56:45 	                  ^^^^^\n
05:56:45 Unlikely argument type String for containsKey(Object) on a Map<capture#1-of ? extends Number,Number>\n
05:56:45 ----------\n
05:56:45 2. WARNING in X.java (at line 5)\n
05:56:45 	m.remove("ONE"); // bad\n
05:56:45 	         ^^^^^\n
05:56:45 Unlikely argument type String for remove(Object) on a Map<capture#2-of ? extends Number,Number>\n
05:56:45 ----------\n
05:56:45 3. WARNING in X.java (at line 6)\n
05:56:45 	if (m.containsValue("ONE")) // bad\n
05:56:45 	                    ^^^^^\n
05:56:45 Unlikely argument type String for containsValue(Object) on a Map<capture#3-of ? extends Number,Number>\n
05:56:45 ----------\n
05:56:45 4. WARNING in X.java (at line 7)\n
05:56:45 	m.remove("ONE"); // bad\n
05:56:45 	         ^^^^^\n
05:56:45 Unlikely argument type String for remove(Object) on a Map<capture#4-of ? extends Number,Number>\n
05:56:45 ----------\n
05:56:45 5. WARNING in X.java (at line 14)\n
05:56:45 	return m.get("ONE"); // bad\n
05:56:45 	             ^^^^^\n
05:56:45 Unlikely argument type String for get(Object) on a Map<capture#9-of ? extends Number,Number>\n
05:56:45 ----------\n
05:56:45 
05:56:45 --------- Difference is ----------
05:56:45  expected:<[]> but was:<[----------\n
05:56:45 1. WARNING in X.java (at line 4)\n
05:56:45 	if (m.containsKey("ONE")) // bad\n
05:56:45 	                  ^^^^^\n
05:56:45 Unlikely argument type String for containsKey(Object) on a Map<capture#1-of ? extends Number,Number>\n
05:56:45 ----------\n
05:56:45 2. WARNING in X.java (at line 5)\n
05:56:45 	m.remove("ONE"); // bad\n
05:56:45 	         ^^^^^\n
05:56:45 Unlikely argument type String for remove(Object) on a Map<capture#2-of ? extends Number,Number>\n
05:56:45 ----------\n
05:56:45 3. WARNING in X.java (at line 6)\n
05:56:45 	if (m.containsValue("ONE")) // bad\n
05:56:45 	                    ^^^^^\n
05:56:45 Unlikely argument type String for containsValue(Object) on a Map<capture#3-of ? extends Number,Number>\n
05:56:45 ----------\n
05:56:45 4. WARNING in X.java (at line 7)\n
05:56:45 	m.remove("ONE"); // bad\n
05:56:45 	         ^^^^^\n
05:56:45 Unlikely argument type String for remove(Object) on a Map<capture#4-of ? extends Number,Number>\n
05:56:45 ----------\n
05:56:45 5. WARNING in X.java (at line 14)\n
05:56:45 	return m.get("ONE"); // bad\n
05:56:45 	             ^^^^^\n
05:56:45 Unlikely argument type String for get(Object) on a Map<capture#9-of ? extends Number,Number>\n
05:56:45 ----------\n
05:56:45 ]>
05:56:45   ProgrammingProblemsTest>TestCase.runTest:957->testBug410218d:2896->AbstractRegressionTest.runNegativeTest:2821->AbstractRegressionTest.runNegativeTest:2830->AbstractRegressionTest.runTest:3149->AbstractRegressionTest.runTest:3514->AbstractRegressionTest.runJavac:2577->AbstractRegressionTest.handleMismatch:2632->TestCase.assertEquals:242->TestCase.assertStringEquals:266 testBug410218d - Eclipse found error(s) but Javac did not find any.
05:56:45 ----------- Expected ------------
05:56:45 
05:56:45 ------------ but was ------------
05:56:45 ----------\n
05:56:45 1. ERROR in X.java (at line 10)\n
05:56:45 	numbers.removeAll(stringSet); // bad\n
05:56:45 	                  ^^^^^^^^^\n
05:56:45 Unlikely argument type Set<String> for removeAll(Collection<?>) on a Collection<Number>\n
05:56:45 ----------\n
05:56:45 
05:56:45 --------- Difference is ----------
05:56:45  expected:<[]> but was:<[----------\n
05:56:45 1. ERROR in X.java (at line 10)\n
05:56:45 	numbers.removeAll(stringSet); // bad\n
05:56:45 	                  ^^^^^^^^^\n
05:56:45 Unlikely argument type Set<String> for removeAll(Collection<?>) on a Collection<Number>\n
05:56:45 ----------\n
05:56:45 ]>
05:56:45   ProgrammingProblemsTest>TestCase.runTest:957->testBug410218e:2928->AbstractRegressionTest.runNegativeTest:2821->AbstractRegressionTest.runNegativeTest:2830->AbstractRegressionTest.runTest:3149->AbstractRegressionTest.runTest:3514->AbstractRegressionTest.runJavac:2577->AbstractRegressionTest.handleMismatch:2648->TestCase.assertEquals:242->TestCase.assertStringEquals:266 testBug410218e - Eclipse found warning(s) but Javac did not find any.
05:56:45 ----------- Expected ------------
05:56:45 
05:56:45 ------------ but was ------------
05:56:45 ----------\n
05:56:45 1. WARNING in X.java (at line 4)\n
05:56:45 	return ints.indexOf("ONE"); // bad\n
05:56:45 	                    ^^^^^\n
05:56:45 Unlikely argument type String for indexOf(Object) on a List<Integer>\n
05:56:45 ----------\n
05:56:45 
05:56:45 --------- Difference is ----------
05:56:45  expected:<[]> but was:<[----------\n
05:56:45 1. WARNING in X.java (at line 4)\n
05:56:45 	return ints.indexOf("ONE"); // bad\n
05:56:45 	                    ^^^^^\n
05:56:45 Unlikely argument type String for indexOf(Object) on a List<Integer>\n
05:56:45 ----------\n
05:56:45 ]>
05:56:45   ProgrammingProblemsTest>TestCase.runTest:957->testBug410218f:2962->AbstractRegressionTest.runNegativeTest:2821->AbstractRegressionTest.runNegativeTest:2830->AbstractRegressionTest.runTest:3149->AbstractRegressionTest.runTest:3514->AbstractRegressionTest.runJavac:2577->AbstractRegressionTest.handleMismatch:2648->TestCase.assertEquals:242->TestCase.assertStringEquals:266 testBug410218f - Eclipse found warning(s) but Javac did not find any.
05:56:45 ----------- Expected ------------
05:56:45 
05:56:45 ------------ but was ------------
05:56:45 ----------\n
05:56:45 1. WARNING in test\TestUnlikely.java (at line 30)\n
05:56:45 	c.remove(o); // warning: unrelated interface\n
05:56:45 	         ^\n
05:56:45 Unlikely argument type TestUnlikely.OtherInterface for remove(Object) on a Collection<TestUnlikely.Interface>\n
05:56:45 ----------\n
05:56:45 2. WARNING in test\TestUnlikely.java (at line 37)\n
05:56:45 	c.remove(i); // warning: unrelated interface\n
05:56:45 	         ^\n
05:56:45 Unlikely argument type TestUnlikely.Interface for remove(Object) on a Collection<TestUnlikely.OtherInterface>\n
05:56:45 ----------\n
05:56:45 3. WARNING in test\TestUnlikely.java (at line 39)\n
05:56:45 	c.remove(f); // warning: impossible\n
05:56:45 	         ^\n
05:56:45 Unlikely argument type TestUnlikely.Final for remove(Object) on a Collection<TestUnlikely.OtherInterface>\n
05:56:45 ----------\n
05:56:45 4. WARNING in test\TestUnlikely.java (at line 40)\n
05:56:45 	c.remove(nf); // warning: castable, but not supertype\n
05:56:45 	         ^^\n
05:56:45 Unlikely argument type TestUnlikely.NonFinal for remove(Object) on a Collection<TestUnlikely.OtherInterface>\n
05:56:45 ----------\n
05:56:45 5. WARNING in test\TestUnlikely.java (at line 46)\n
05:56:45 	c.remove(o); // warning: impossible\n
05:56:45 	         ^\n
05:56:45 Unlikely argument type TestUnlikely.OtherInterface for remove(Object) on a Collection<TestUnlikely.Final>\n
05:56:45 ----------\n
05:56:45 6. WARNING in test\TestUnlikely.java (at line 48)\n
05:56:45 	c.remove(nf); // warning: impossible\n
05:56:45 	         ^^\n
05:56:45 Unlikely argument type TestUnlikely.NonFinal for remove(Object) on a Collection<TestUnlikely.Final>\n
05:56:45 ----------\n
05:56:45 7. WARNING in test\TestUnlikely.java (at line 49)\n
05:56:45 	c.remove(s); // warning: impossible\n
05:56:45 	         ^\n
05:56:45 Unlikely argument type TestUnlikely.Sub for remove(Object) on a Collection<TestUnlikely.Final>\n
05:56:45 ----------\n
05:56:45 8. WARNING in test\TestUnlikely.java (at line 54)\n
05:56:45 	c.remove(o); // warning: unrelated interface\n
05:56:45 	         ^\n
05:56:45 Unlikely argument type TestUnlikely.OtherInterface for remove(Object) on a Collection<TestUnlikely.NonFinal>\n
05:56:45 ----------\n
05:56:45 9. WARNING in test\TestUnlikely.java (at line 55)\n
05:56:45 	c.remove(f); // warning: impossible\n
05:56:45 	         ^\n
05:56:45 Unlikely argument type TestUnlikely.Final for remove(Object) on a Collection<TestUnlikely.NonFinal>\n
05:56:45 ----------\n
05:56:45 10. WARNING in test\TestUnlikely.java (at line 63)\n
05:56:45 	c.remove(f); // warning: impossible\n
05:56:45 	         ^\n
05:56:45 Unlikely argument type TestUnlikely.Final for remove(Object) on a Collection<TestUnlikely.Sub>\n
05:56:45 ----------\n
05:56:45 11. WARNING in test\TestUnlikely.java (at line 70)\n
05:56:45 	map.containsKey(value); // warning\n
05:56:45 	                ^^^^^\n
05:56:45 Unlikely argument type V for containsKey(Object) on a Map<K,V>\n
05:56:45 ----------\n
05:56:45 12. WARNING in test\TestUnlikely.java (at line 71)\n
05:56:45 	map.containsValue(key); // warning\n
05:56:45 	                  ^^^\n
05:56:45 Unlikely argument type K for containsValue(Object) on a Map<K,V>\n
05:56:45 ----------\n
05:56:45 13. WARNING in test\TestUnlikely.java (at line 95)\n
05:56:45 	if (c.contains(iterator.next())) { // warning\n
05:56:45 	               ^^^^^^^^^^^^^^^\n
05:56:45 Unlikely argument type U for contains(Object) on a Collection<T>\n
05:56:45 ----------\n
05:56:45 14. WARNING in test\TestUnlikely.java (at line 105)\n
05:56:45 	c.removeAll(other); // warning\n
05:56:45 	            ^^^^^\n
05:56:45 Unlikely argument type Set<TestUnlikely.Final> for removeAll(Collection<?>) on a Collection<TestUnlikely.NonFinal>\n
05:56:45 ----------\n
05:56:45 15. WARNING in test\TestUnlikely.java (at line 111)\n
05:56:45 	Predicate<OtherInterface> p2 = c::contains; // warning\n
05:56:45 	                               ^^^^^^^^^^^\n
05:56:45 Unlikely argument type TestUnlikely.OtherInterface for contains(Object) on a Collection<TestUnlikely.Interface>\n
05:56:45 ----------\n
05:56:45 16. WARNING in test\TestUnlikely.java (at line 112)\n
05:56:45 	BiPredicate<Collection<Interface>, OtherInterface> bp2 = Collection<Interface>::contains; // warning\n
05:56:45 	                                                         ^^^^^^^^^^^^^^^^^^^^^^^^^^^^^^^\n
05:56:45 Unlikely argument type TestUnlikely.OtherInterface for contains(Object) on a Collection<TestUnlikely.Interface>\n
05:56:45 ----------\n
05:56:45 17. INFO in test\TestUnlikely.java (at line 120)\n
05:56:45 	s.equals(i); // info\n
05:56:45 	         ^\n
05:56:45 Unlikely argument type for equals(): Integer seems to be unrelated to String\n
05:56:45 ----------\n
05:56:45 18. INFO in test\TestUnlikely.java (at line 121)\n
05:56:45 	i.equals(s); // info\n
05:56:45 	         ^\n
05:56:45 Unlikely argument type for equals(): String seems to be unrelated to Integer\n
05:56:45 ----------\n
05:56:45 19. INFO in test\TestUnlikely.java (at line 125)\n
05:56:45 	Predicate<String> p1 = i::equals; // info\n
05:56:45 	                       ^^^^^^^^^\n
05:56:45 Unlikely argument type for equals(): String seems to be unrelated to Integer\n
05:56:45 ----------\n
05:56:45 20. INFO in test\TestUnlikely.java (at line 128)\n
05:56:45 	BiPredicate<String, Integer> bp2 = Object::equals; // info\n
05:56:45 	                                   ^^^^^^^^^^^^^^\n
05:56:45 Unlikely argument type for equals(): Integer seems to be unrelated to String\n
05:56:45 ----------\n
05:56:45 21. INFO in test\TestUnlikely.java (at line 131)\n
05:56:45 	Objects.equals(s, i); // info\n
05:56:45 	                  ^\n
05:56:45 Unlikely argument type for equals(): Integer seems to be unrelated to String\n
05:56:45 ----------\n
05:56:45 22. INFO in test\TestUnlikely.java (at line 132)\n
05:56:45 	Objects.equals(i, s); // info\n
05:56:45 	                  ^\n
05:56:45 Unlikely argument type for equals(): String seems to be unrelated to Integer\n
05:56:45 ----------\n
05:56:45 23. INFO in test\TestUnlikely.java (at line 136)\n
05:56:45 	BiPredicate<String, Integer> bp3 = Objects::equals; // info\n
05:56:45 	                                   ^^^^^^^^^^^^^^^\n
05:56:45 Unlikely argument type for equals(): Integer seems to be unrelated to String\n
05:56:45 ----------\n
05:56:45 
05:56:45 --------- Difference is ----------
05:56:45  expected:<[]> but was:<[----------\n
05:56:45 1. WARNING in test\TestUnlikely.java (at line 30)\n
05:56:45 	c.remove(o); // warning: unrelated interface\n
05:56:45 	         ^\n
05:56:45 Unlikely argument type TestUnlikely.OtherInterface for remove(Object) on a Collection<TestUnlikely.Interface>\n
05:56:45 ----------\n
05:56:45 2. WARNING in test\TestUnlikely.java (at line 37)\n
05:56:45 	c.remove(i); // warning: unrelated interface\n
05:56:45 	         ^\n
05:56:45 Unlikely argument type TestUnlikely.Interface for remove(Object) on a Collection<TestUnlikely.OtherInterface>\n
05:56:45 ----------\n
05:56:45 3. WARNING in test\TestUnlikely.java (at line 39)\n
05:56:45 	c.remove(f); // warning: impossible\n
05:56:45 	         ^\n
05:56:45 Unlikely argument type TestUnlikely.Final for remove(Object) on a Collection<TestUnlikely.OtherInterface>\n
05:56:45 ----------\n
05:56:45 4. WARNING in test\TestUnlikely.java (at line 40)\n
05:56:45 	c.remove(nf); // warning: castable, but not supertype\n
05:56:45 	         ^^\n
05:56:45 Unlikely argument type TestUnlikely.NonFinal for remove(Object) on a Collection<TestUnlikely.OtherInterface>\n
05:56:45 ----------\n
05:56:45 5. WARNING in test\TestUnlikely.java (at line 46)\n
05:56:45 	c.remove(o); // warning: impossible\n
05:56:45 	         ^\n
05:56:45 Unlikely argument type TestUnlikely.OtherInterface for remove(Object) on a Collection<TestUnlikely.Final>\n
05:56:45 ----------\n
05:56:45 6. WARNING in test\TestUnlikely.java (at line 48)\n
05:56:45 	c.remove(nf); // warning: impossible\n
05:56:45 	         ^^\n
05:56:45 Unlikely argument type TestUnlikely.NonFinal for remove(Object) on a Collection<TestUnlikely.Final>\n
05:56:45 ----------\n
05:56:45 7. WARNING in test\TestUnlikely.java (at line 49)\n
05:56:45 	c.remove(s); // warning: impossible\n
05:56:45 	         ^\n
05:56:45 Unlikely argument type TestUnlikely.Sub for remove(Object) on a Collection<TestUnlikely.Final>\n
05:56:45 ----------\n
05:56:45 8. WARNING in test\TestUnlikely.java (at line 54)\n
05:56:45 	c.remove(o); // warning: unrelated interface\n
05:56:45 	         ^\n
05:56:45 Unlikely argument type TestUnlikely.OtherInterface for remove(Object) on a Collection<TestUnlikely.NonFinal>\n
05:56:45 ----------\n
05:56:45 9. WARNING in test\TestUnlikely.java (at line 55)\n
05:56:45 	c.remove(f); // warning: impossible\n
05:56:45 	         ^\n
05:56:45 Unlikely argument type TestUnlikely.Final for remove(Object) on a Collection<TestUnlikely.NonFinal>\n
05:56:45 ----------\n
05:56:45 10. WARNING in test\TestUnlikely.java (at line 63)\n
05:56:45 	c.remove(f); // warning: impossible\n
05:56:45 	         ^\n
05:56:45 Unlikely argument type TestUnlikely.Final for remove(Object) on a Collection<TestUnlikely.Sub>\n
05:56:45 ----------\n
05:56:45 11. WARNING in test\TestUnlikely.java (at line 70)\n
05:56:45 	map.containsKey(value); // warning\n
05:56:45 	                ^^^^^\n
05:56:45 Unlikely argument type V for containsKey(Object) on a Map<K,V>\n
05:56:45 ----------\n
05:56:45 12. WARNING in test\TestUnlikely.java (at line 71)\n
05:56:45 	map.containsValue(key); // warning\n
05:56:45 	                  ^^^\n
05:56:45 Unlikely argument type K for containsValue(Object) on a Map<K,V>\n
05:56:45 ----------\n
05:56:45 13. WARNING in test\TestUnlikely.java (at line 95)\n
05:56:45 	if (c.contains(iterator.next())) { // warning\n
05:56:45 	               ^^^^^^^^^^^^^^^\n
05:56:45 Unlikely argument type U for contains(Object) on a Collection<T>\n
05:56:45 ----------\n
05:56:45 14. WARNING in test\TestUnlikely.java (at line 105)\n
05:56:45 	c.removeAll(other); // warning\n
05:56:45 	            ^^^^^\n
05:56:45 Unlikely argument type Set<TestUnlikely.Final> for removeAll(Collection<?>) on a Collection<TestUnlikely.NonFinal>\n
05:56:45 ----------\n
05:56:45 15. WARNING in test\TestUnlikely.java (at line 111)\n
05:56:45 	Predicate<OtherInterface> p2 = c::contains; // warning\n
05:56:45 	                               ^^^^^^^^^^^\n
05:56:45 Unlikely argument type TestUnlikely.OtherInterface for contains(Object) on a Collection<TestUnlikely.Interface>\n
05:56:45 ----------\n
05:56:45 16. WARNING in test\TestUnlikely.java (at line 112)\n
05:56:45 	BiPredicate<Collection<Interface>, OtherInterface> bp2 = Collection<Interface>::contains; // warning\n
05:56:45 	                                                         ^^^^^^^^^^^^^^^^^^^^^^^^^^^^^^^\n
05:56:45 Unlikely argument type TestUnlikely.OtherInterface for contains(Object) on a Collection<TestUnlikely.Interface>\n
05:56:45 ----------\n
05:56:45 17. INFO in test\TestUnlikely.java (at line 120)\n
05:56:45 	s.equals(i); // info\n
05:56:45 	         ^\n
05:56:45 Unlikely argument type for equals(): Integer seems to be unrelated to String\n
05:56:45 ----------\n
05:56:45 18. INFO in test\TestUnlikely.java (at line 121)\n
05:56:45 	i.equals(s); // info\n
05:56:45 	         ^\n
05:56:45 Unlikely argument type for equals(): String seems to be unrelated to Integer\n
05:56:45 ----------\n
05:56:45 19. INFO in test\TestUnlikely.java (at line 125)\n
05:56:45 	Predicate<String> p1 = i::equals; // info\n
05:56:45 	                       ^^^^^^^^^\n
05:56:45 Unlikely argument type for equals(): String seems to be unrelated to Integer\n
05:56:45 ----------\n
05:56:45 20. INFO in test\TestUnlikely.java (at line 128)\n
05:56:45 	BiPredicate<String, Integer> bp2 = Object::equals; // info\n
05:56:45 	                                   ^^^^^^^^^^^^^^\n
05:56:45 Unlikely argument type for equals(): Integer seems to be unrelated to String\n
05:56:45 ----------\n
05:56:45 21. INFO in test\TestUnlikely.java (at line 131)\n
05:56:45 	Objects.equals(s, i); // info\n
05:56:45 	                  ^\n
05:56:45 Unlikely argument type for equals(): Integer seems to be unrelated to String\n
05:56:45 ----------\n
05:56:45 22. INFO in test\TestUnlikely.java (at line 132)\n
05:56:45 	Objects.equals(i, s); // info\n
05:56:45 	                  ^\n
05:56:45 Unlikely argument type for equals(): String seems to be unrelated to Integer\n
05:56:45 ----------\n
05:56:45 23. INFO in test\TestUnlikely.java (at line 136)\n
05:56:45 	BiPredicate<String, Integer> bp3 = Objects::equals; // info\n
05:56:45 	                                   ^^^^^^^^^^^^^^^\n
05:56:45 Unlikely argument type for equals(): Integer seems to be unrelated to String\n
05:56:45 ----------\n
05:56:45 ]>
05:56:45   ProgrammingProblemsTest>TestCase.runTest:957->testBug514956c:3269->AbstractRegressionTest.runNegativeTest:2821->AbstractRegressionTest.runNegativeTest:2830->AbstractRegressionTest.runTest:3149->AbstractRegressionTest.runTest:3514->AbstractRegressionTest.runJavac:2577->AbstractRegressionTest.handleMismatch:2632->TestCase.assertEquals:242->TestCase.assertStringEquals:266 testBug514956c - Eclipse found error(s) but Javac did not find any.
05:56:45 ----------- Expected ------------
05:56:45 
05:56:45 ------------ but was ------------
05:56:45 ----------\n
05:56:45 1. ERROR in Unlikely.java (at line 6)\n
05:56:45 	return i1.equals((I1)this);\n
05:56:45 	                 ^^^^^^^^\n
05:56:45 Unnecessary cast from Unlikely to I1\n
05:56:45 ----------\n
05:56:45 2. ERROR in Unlikely.java (at line 9)\n
05:56:45 	return i1.equals((I3)i2);\n
05:56:45 	                 ^^^^^^\n
05:56:45 Unnecessary cast from I2 to I3\n
05:56:45 ----------\n
05:56:45 3. WARNING in Unlikely.java (at line 9)\n
05:56:45 	return i1.equals((I3)i2);\n
05:56:45 	                 ^^^^^^\n
05:56:45 Unlikely argument type for equals(): I3 seems to be unrelated to I1\n
05:56:45 ----------\n
05:56:45 
05:56:45 --------- Difference is ----------
05:56:45  expected:<[]> but was:<[----------\n
05:56:45 1. ERROR in Unlikely.java (at line 6)\n
05:56:45 	return i1.equals((I1)this);\n
05:56:45 	                 ^^^^^^^^\n
05:56:45 Unnecessary cast from Unlikely to I1\n
05:56:45 ----------\n
05:56:45 2. ERROR in Unlikely.java (at line 9)\n
05:56:45 	return i1.equals((I3)i2);\n
05:56:45 	                 ^^^^^^\n
05:56:45 Unnecessary cast from I2 to I3\n
05:56:45 ----------\n
05:56:45 3. WARNING in Unlikely.java (at line 9)\n
05:56:45 	return i1.equals((I3)i2);\n
05:56:45 	                 ^^^^^^\n
05:56:45 Unlikely argument type for equals(): I3 seems to be unrelated to I1\n
05:56:45 ----------\n
05:56:45 ]>
05:56:45   RuntimeTests>TestCase.runTest:957->test0600_reflection:148->AbstractRegressionTest.runConformTest:3658->AbstractRegressionTest.runTest:3149->AbstractRegressionTest.runTest:3514->AbstractRegressionTest.runJavac:2577->AbstractRegressionTest.handleMismatch:2683 test0600_reflection: unused excuse org.eclipse.jdt.core.tests.compiler.regression.AbstractRegressionTest$JavacTestOptions$EclipseJustification$3@236e6563 for compiler org.eclipse.jdt.core.tests.compiler.regression.AbstractRegressionTest$JavacCompiler@528070fe
05:56:45   ScannerTest>TestCase.runTest:957->test045:961->AbstractRegressionTest.runConformTest:1870->AbstractRegressionTest.runConformTest:1873->AbstractRegressionTest.runTest:3149->AbstractRegressionTest.runTest:3514->AbstractRegressionTest.runJavac:2577->AbstractRegressionTest.handleMismatch:2640->TestCase.assertEquals:242->TestCase.assertStringEquals:266 test045 - Javac found error(s) but Eclipse did not find any.
05:56:45 ----------- Expected ------------
05:56:45 
05:56:45 ------------ but was ------------
05:56:45 _X.java:5: error: variable i is already defined in method main(String[])\n
05:56:45 		String i\u0001;\n
05:56:45 		       ^\n
05:56:45 _X.java:6: error: variable i is already defined in method main(String[])\n
05:56:45 		String i\u0002;\n
05:56:45 		       ^\n
05:56:45 _X.java:7: error: variable i is already defined in method main(String[])\n
05:56:45 		String i\u0003;\n
05:56:45 		       ^\n
05:56:45 _X.java:8: error: variable i is already defined in method main(String[])\n
05:56:45 		String i\u0004;\n
05:56:45 		       ^\n
05:56:45 _X.java:9: error: variable i is already defined in method main(String[])\n
05:56:45 		String i\u0005;\n
05:56:45 		       ^\n
05:56:45 _X.java:10: error: variable i is already defined in method main(String[])\n
05:56:45 		String i\u0006;\n
05:56:45 		       ^\n
05:56:45 _X.java:11: error: variable i is already defined in method main(String[])\n
05:56:45 		String i\u0007;\n
05:56:45 		       ^\n
05:56:45 _X.java:12: error: variable i is already defined in method main(String[])\n
05:56:45 		String i\u0008;\n
05:56:45 		       ^\n
05:56:45 _X.java:13: error: variable i is already defined in method main(String[])\n
05:56:45 		String i\u000e;\n
05:56:45 		       ^\n
05:56:45 _X.java:14: error: variable i is already defined in method main(String[])\n
05:56:45 		String i\u000f;\n
05:56:45 		       ^\n
05:56:45 _X.java:15: error: variable i is already defined in method main(String[])\n
05:56:45 		String i\u0010;\n
05:56:45 		       ^\n
05:56:45 _X.java:16: error: variable i is already defined in method main(String[])\n
05:56:45 		String i\u0011;\n
05:56:45 		       ^\n
05:56:45 _X.java:17: error: variable i is already defined in method main(String[])\n
05:56:45 		String i\u0012;\n
05:56:45 		       ^\n
05:56:45 _X.java:18: error: variable i is already defined in method main(String[])\n
05:56:45 		String i\u0013;\n
05:56:45 		       ^\n
05:56:45 _X.java:19: error: variable i is already defined in method main(String[])\n
05:56:45 		String i\u0014;\n
05:56:45 		       ^\n
05:56:45 _X.java:20: error: variable i is already defined in method main(String[])\n
05:56:45 		String i\u0015;\n
05:56:45 		       ^\n
05:56:45 _X.java:21: error: variable i is already defined in method main(String[])\n
05:56:45 		String i\u0016;\n
05:56:45 		       ^\n
05:56:45 _X.java:22: error: variable i is already defined in method main(String[])\n
05:56:45 		String i\u0017;\n
05:56:45 		       ^\n
05:56:45 _X.java:23: error: variable i is already defined in method main(String[])\n
05:56:45 		String i\u0018;\n
05:56:45 		       ^\n
05:56:45 _X.java:24: error: variable i is already defined in method main(String[])\n
05:56:45 		String i\u0019;\n
05:56:45 		       ^\n
05:56:45 _X.java:25: error: variable i is already defined in method main(String[])\n
05:56:45 		String i\u001a;\n
05:56:45 		       ^\n
05:56:45 _X.java:26: error: variable i is already defined in method main(String[])\n
05:56:45 		String i\u001b;\n
05:56:45 		       ^\n
05:56:45 _X.java:27: error: variable i is already defined in method main(String[])\n
05:56:45 		String i\u007f;\n
05:56:45 		       ^\n
05:56:45 23 errors\n
05:56:45 
05:56:45 --------- Difference is ----------
05:56:45  expected:<[]> but was:<[_X.java:5: error: variable i is already defined in method main(String[])\n
05:56:45 		String i\u0001;\n
05:56:45 		       ^\n
05:56:45 _X.java:6: error: variable i is already defined in method main(String[])\n
05:56:45 		String i\u0002;\n
05:56:45 		       ^\n
05:56:45 _X.java:7: error: variable i is already defined in method main(String[])\n
05:56:45 		String i\u0003;\n
05:56:45 		       ^\n
05:56:45 _X.java:8: error: variable i is already defined in method main(String[])\n
05:56:45 		String i\u0004;\n
05:56:45 		       ^\n
05:56:45 _X.java:9: error: variable i is already defined in method main(String[])\n
05:56:45 		String i\u0005;\n
05:56:45 		       ^\n
05:56:45 _X.java:10: error: variable i is already defined in method main(String[])\n
05:56:45 		String i\u0006;\n
05:56:45 		       ^\n
05:56:45 _X.java:11: error: variable i is already defined in method main(String[])\n
05:56:45 		String i\u0007;\n
05:56:45 		       ^\n
05:56:45 _X.java:12: error: variable i is already defined in method main(String[])\n
05:56:45 		String i\u0008;\n
05:56:45 		       ^\n
05:56:45 _X.java:13: error: variable i is already defined in method main(String[])\n
05:56:45 		String i\u000e;\n
05:56:45 		       ^\n
05:56:45 _X.java:14: error: variable i is already defined in method main(String[])\n
05:56:45 		String i\u000f;\n
05:56:45 		       ^\n
05:56:45 _X.java:15: error: variable i is already defined in method main(String[])\n
05:56:45 		String i\u0010;\n
05:56:45 		       ^\n
05:56:45 _X.java:16: error: variable i is already defined in method main(String[])\n
05:56:45 		String i\u0011;\n
05:56:45 		       ^\n
05:56:45 _X.java:17: error: variable i is already defined in method main(String[])\n
05:56:45 		String i\u0012;\n
05:56:45 		       ^\n
05:56:45 _X.java:18: error: variable i is already defined in method main(String[])\n
05:56:45 		String i\u0013;\n
05:56:45 		       ^\n
05:56:45 _X.java:19: error: variable i is already defined in method main(String[])\n
05:56:45 		String i\u0014;\n
05:56:45 		       ^\n
05:56:45 _X.java:20: error: variable i is already defined in method main(String[])\n
05:56:45 		String i\u0015;\n
05:56:45 		       ^\n
05:56:45 _X.java:21: error: variable i is already defined in method main(String[])\n
05:56:45 		String i\u0016;\n
05:56:45 		       ^\n
05:56:45 _X.java:22: error: variable i is already defined in method main(String[])\n
05:56:45 		String i\u0017;\n
05:56:45 		       ^\n
05:56:45 _X.java:23: error: variable i is already defined in method main(String[])\n
05:56:45 		String i\u0018;\n
05:56:45 		       ^\n
05:56:45 _X.java:24: error: variable i is already defined in method main(String[])\n
05:56:45 		String i\u0019;\n
05:56:45 		       ^\n
05:56:45 _X.java:25: error: variable i is already defined in method main(String[])\n
05:56:45 		String i\u001a;\n
05:56:45 		       ^\n
05:56:45 _X.java:26: error: variable i is already defined in method main(String[])\n
05:56:45 		String i\u001b;\n
05:56:45 		       ^\n
05:56:45 _X.java:27: error: variable i is already defined in method main(String[])\n
05:56:45 		String i\u007f;\n
05:56:45 		       ^\n
05:56:45 23 errors\n
05:56:45 ]>
05:56:45   SerialVersionUIDTests>TestCase.runTest:957->test011:221->AbstractRegressionTest.runNegativeTest:2821->AbstractRegressionTest.runNegativeTest:2830->AbstractRegressionTest.runTest:3149->AbstractRegressionTest.runTest:3514->AbstractRegressionTest.runJavac:2577->AbstractRegressionTest.handleMismatch:2632->TestCase.assertEquals:242->TestCase.assertStringEquals:266 test011 - Eclipse found error(s) but Javac did not find any.
05:56:45 ----------- Expected ------------
05:56:45 
05:56:45 ------------ but was ------------
05:56:45 ----------\n
05:56:45 1. ERROR in X.java (at line 2)\n
05:56:45 	private static final long serialVersionUID = 1L;\n
05:56:45 	                          ^^^^^^^^^^^^^^^^\n
05:56:45 The value of the field X.serialVersionUID is not used\n
05:56:45 ----------\n
05:56:45 
05:56:45 --------- Difference is ----------
05:56:45  expected:<[]> but was:<[----------\n
05:56:45 1. ERROR in X.java (at line 2)\n
05:56:45 	private static final long serialVersionUID = 1L;\n
05:56:45 	                          ^^^^^^^^^^^^^^^^\n
05:56:45 The value of the field X.serialVersionUID is not used\n
05:56:45 ----------\n
05:56:45 ]>
05:56:45   SerialVersionUIDTests>TestCase.runTest:957->test012:244->AbstractRegressionTest.runNegativeTest:2821->AbstractRegressionTest.runNegativeTest:2830->AbstractRegressionTest.runTest:3149->AbstractRegressionTest.runTest:3514->AbstractRegressionTest.runJavac:2577->AbstractRegressionTest.handleMismatch:2632->TestCase.assertEquals:242->TestCase.assertStringEquals:266 test012 - Eclipse found error(s) but Javac did not find any.
05:56:45 ----------- Expected ------------
05:56:45 
05:56:45 ------------ but was ------------
05:56:45 ----------\n
05:56:45 1. ERROR in X.java (at line 2)\n
05:56:45 	private static final long serialVersionUID = 1L;\n
05:56:45 	                          ^^^^^^^^^^^^^^^^\n
05:56:45 The value of the field X<T>.serialVersionUID is not used\n
05:56:45 ----------\n
05:56:45 
05:56:45 --------- Difference is ----------
05:56:45  expected:<[]> but was:<[----------\n
05:56:45 1. ERROR in X.java (at line 2)\n
05:56:45 	private static final long serialVersionUID = 1L;\n
05:56:45 	                          ^^^^^^^^^^^^^^^^\n
05:56:45 The value of the field X<T>.serialVersionUID is not used\n
05:56:45 ----------\n
05:56:45 ]>
05:56:45   SerialVersionUIDTests>TestCase.runTest:957->test013:267->AbstractRegressionTest.runNegativeTest:2821->AbstractRegressionTest.runNegativeTest:2830->AbstractRegressionTest.runTest:3149->AbstractRegressionTest.runTest:3514->AbstractRegressionTest.runJavac:2577->AbstractRegressionTest.handleMismatch:2632->TestCase.assertEquals:242->TestCase.assertStringEquals:266 test013 - Eclipse found error(s) but Javac did not find any.
05:56:45 ----------- Expected ------------
05:56:45 
05:56:45 ------------ but was ------------
05:56:45 ----------\n
05:56:45 1. ERROR in X.java (at line 2)\n
05:56:45 	private static final long serialPersistentFields = 1L;\n
05:56:45 	                          ^^^^^^^^^^^^^^^^^^^^^^\n
05:56:45 The value of the field X<T>.serialPersistentFields is not used\n
05:56:45 ----------\n
05:56:45 
05:56:45 --------- Difference is ----------
05:56:45  expected:<[]> but was:<[----------\n
05:56:45 1. ERROR in X.java (at line 2)\n
05:56:45 	private static final long serialPersistentFields = 1L;\n
05:56:45 	                          ^^^^^^^^^^^^^^^^^^^^^^\n
05:56:45 The value of the field X<T>.serialPersistentFields is not used\n
05:56:45 ----------\n
05:56:45 ]>
05:56:45   SerialVersionUIDTests>TestCase.runTest:957->test014:289->AbstractRegressionTest.runNegativeTest:2821->AbstractRegressionTest.runNegativeTest:2830->AbstractRegressionTest.runTest:3149->AbstractRegressionTest.runTest:3514->AbstractRegressionTest.runJavac:2577->AbstractRegressionTest.handleMismatch:2632->TestCase.assertEquals:242->TestCase.assertStringEquals:266 test014 - Eclipse found error(s) but Javac did not find any.
05:56:45 ----------- Expected ------------
05:56:45 
05:56:45 ------------ but was ------------
05:56:45 ----------\n
05:56:45 1. ERROR in X.java (at line 2)\n
05:56:45 	private static final long serialPersistentFields = 1L;\n
05:56:45 	                          ^^^^^^^^^^^^^^^^^^^^^^\n
05:56:45 The value of the field X.serialPersistentFields is not used\n
05:56:45 ----------\n
05:56:45 
05:56:45 --------- Difference is ----------
05:56:45  expected:<[]> but was:<[----------\n
05:56:45 1. ERROR in X.java (at line 2)\n
05:56:45 	private static final long serialPersistentFields = 1L;\n
05:56:45 	                          ^^^^^^^^^^^^^^^^^^^^^^\n
05:56:45 The value of the field X.serialPersistentFields is not used\n
05:56:45 ----------\n
05:56:45 ]>
05:56:45   SerialVersionUIDTests>TestCase.runTest:957->test015:312->AbstractRegressionTest.runNegativeTest:2821->AbstractRegressionTest.runNegativeTest:2830->AbstractRegressionTest.runTest:3149->AbstractRegressionTest.runTest:3514->AbstractRegressionTest.runJavac:2577->AbstractRegressionTest.handleMismatch:2632->TestCase.assertEquals:242->TestCase.assertStringEquals:266 test015 - Eclipse found error(s) but Javac did not find any.
05:56:45 ----------- Expected ------------
05:56:45 
05:56:45 ------------ but was ------------
05:56:45 ----------\n
05:56:45 1. ERROR in X.java (at line 5)\n
05:56:45 	private int i;\n
05:56:45 	            ^\n
05:56:45 The value of the field X<T>.i is not used\n
05:56:45 ----------\n
05:56:45 
05:56:45 --------- Difference is ----------
05:56:45  expected:<[]> but was:<[----------\n
05:56:45 1. ERROR in X.java (at line 5)\n
05:56:45 	private int i;\n
05:56:45 	            ^\n
05:56:45 The value of the field X<T>.i is not used\n
05:56:45 ----------\n
05:56:45 ]>
05:56:45   SerialVersionUIDTests>TestCase.runTest:957->test016:337->AbstractRegressionTest.runNegativeTest:2821->AbstractRegressionTest.runNegativeTest:2830->AbstractRegressionTest.runTest:3149->AbstractRegressionTest.runTest:3514->AbstractRegressionTest.runJavac:2577->AbstractRegressionTest.handleMismatch:2632->TestCase.assertEquals:242->TestCase.assertStringEquals:266 test016 - Eclipse found error(s) but Javac did not find any.
05:56:45 ----------- Expected ------------
05:56:45 
05:56:45 ------------ but was ------------
05:56:45 ----------\n
05:56:45 1. ERROR in X.java (at line 5)\n
05:56:45 	private int i;\n
05:56:45 	            ^\n
05:56:45 The value of the field X.i is not used\n
05:56:45 ----------\n
05:56:45 
05:56:45 --------- Difference is ----------
05:56:45  expected:<[]> but was:<[----------\n
05:56:45 1. ERROR in X.java (at line 5)\n
05:56:45 	private int i;\n
05:56:45 	            ^\n
05:56:45 The value of the field X.i is not used\n
05:56:45 ----------\n
05:56:45 ]>
05:56:45   StaticImportTest>TestCase.runTest:957->test074:2538->AbstractRegressionTest.runConformTest:1870->AbstractRegressionTest.runConformTest:1873->AbstractRegressionTest.runTest:3149->AbstractRegressionTest.runTest:3514->AbstractRegressionTest.runJavac:2577->AbstractRegressionTest.handleMismatch:2640->TestCase.assertEquals:242->TestCase.assertStringEquals:266 test074 - Javac found error(s) but Eclipse did not find any.
05:56:45 ----------- Expected ------------
05:56:45 
05:56:45 ------------ but was ------------
05:56:45 test/Outer.java:4: error: cannot find symbol\n
05:56:45     int i = VALUE;\n
05:56:45             ^\n
05:56:45   symbol:   variable VALUE\n
05:56:45   location: class Outer\n
05:56:45 1 error\n
05:56:45 
05:56:45 --------- Difference is ----------
05:56:45  expected:<[]> but was:<[test/Outer.java:4: error: cannot find symbol\n
05:56:45     int i = VALUE;\n
05:56:45             ^\n
05:56:45   symbol:   variable VALUE\n
05:56:45   location: class Outer\n
05:56:45 1 error\n
05:56:45 ]>
05:56:45   StaticImportTest>TestCase.runTest:957->test078:2648->AbstractRegressionTest.runNegativeTest:2703->AbstractRegressionTest.runNegativeTest:2714->AbstractRegressionTest.runTest:3149->AbstractRegressionTest.runTest:3514->AbstractRegressionTest.runJavac:2577->AbstractRegressionTest.handleMismatch:2632->TestCase.assertEquals:242->TestCase.assertStringEquals:266 test078 - Eclipse found error(s) but Javac did not find any.
05:56:45 ----------- Expected ------------
05:56:45 
05:56:45 ------------ but was ------------
05:56:45 ----------\n
05:56:45 1. ERROR in A\A.java (at line 3)\n
05:56:45 	import B.B.C1;\n
05:56:45 	       ^^^^^^\n
05:56:45 The import B.B.C1 collides with another import statement\n
05:56:45 ----------\n
05:56:45 
05:56:45 --------- Difference is ----------
05:56:45  expected:<[]> but was:<[----------\n
05:56:45 1. ERROR in A\A.java (at line 3)\n
05:56:45 	import B.B.C1;\n
05:56:45 	       ^^^^^^\n
05:56:45 The import B.B.C1 collides with another import statement\n
05:56:45 ----------\n
05:56:45 ]>
05:56:45   StaticImportTest>TestCase.runTest:957->test079:2682->AbstractRegressionTest.runNegativeTest:2703->AbstractRegressionTest.runNegativeTest:2714->AbstractRegressionTest.runTest:3149->AbstractRegressionTest.runTest:3514->AbstractRegressionTest.runJavac:2577->AbstractRegressionTest.handleMismatch:2648->TestCase.assertEquals:242->TestCase.assertStringEquals:266 test079 - Eclipse found warning(s) but Javac did not find any.
05:56:45 ----------- Expected ------------
05:56:45 
05:56:45 ------------ but was ------------
05:56:45 ----------\n
05:56:45 1. WARNING in A\A.java (at line 2)\n
05:56:45 	import static B.B.C1;\n
05:56:45 	              ^^^^^^\n
05:56:45 The import B.B.C1 is never used\n
05:56:45 ----------\n
05:56:45 
05:56:45 --------- Difference is ----------
05:56:45  expected:<[]> but was:<[----------\n
05:56:45 1. WARNING in A\A.java (at line 2)\n
05:56:45 	import static B.B.C1;\n
05:56:45 	              ^^^^^^\n
05:56:45 The import B.B.C1 is never used\n
05:56:45 ----------\n
05:56:45 ]>
05:56:45   SwitchTest>TestCase.runTest:957->test014:610->AbstractRegressionTest.runNegativeTest:2821->AbstractRegressionTest.runNegativeTest:2830->AbstractRegressionTest.runTest:3149->AbstractRegressionTest.runTest:3514->AbstractRegressionTest.runJavac:2577->AbstractRegressionTest.handleMismatch:2636->TestCase.assertEquals:242->TestCase.assertStringEquals:266 test014 - Eclipse found error(s) but Javac only found warning(s).
05:56:45 ----------- Expected ------------
05:56:45 ----------\n
05:56:45 1. ERROR in X.java (at line 18)\n
05:56:45 	case 6://WRONG\n
05:56:45 	^^^^^^\n
05:56:45 Switch case may be entered by falling through previous case. If intended, add a new comment //$FALL-THROUGH$ on the line above\n
05:56:45 ----------\n
05:56:45 
05:56:45 ------------ but was ------------
05:56:45 X.java:8: warning: [fallthrough] possible fall-through into case\n
05:56:45 			case 2://OK\n
05:56:45 			^\n
05:56:45 X.java:10: warning: [fallthrough] possible fall-through into case\n
05:56:45 			case 3://OK\n
05:56:45 			^\n
05:56:45 X.java:13: warning: [fallthrough] possible fall-through into case\n
05:56:45 			case 4://OK\n
05:56:45 			^\n
05:56:45 X.java:18: warning: [fallthrough] possible fall-through into case\n
05:56:45 			case 6://WRONG\n
05:56:45 			^\n
05:56:45 X.java:22: warning: [fallthrough] possible fall-through into case\n
05:56:45 			case 7://OK\n
05:56:45 			^\n
05:56:45 5 warnings\n
05:56:45 
05:56:45 --------- Difference is ----------
05:56:45  expected:<[----------\n
05:56:45 1. ERROR in X.java (at line 18)\n
05:56:45 	case 6://WRONG\n
05:56:45 	^^^^^^\n
05:56:45 Switch case may be entered by falling through previous case. If intended, add a new comment //$FALL-THROUGH$ on the line above\n
05:56:45 ----------]\n
05:56:45 > but was:<[X.java:8: warning: [fallthrough] possible fall-through into case\n
05:56:45 			case 2://OK\n
05:56:45 			^\n
05:56:45 X.java:10: warning: [fallthrough] possible fall-through into case\n
05:56:45 			case 3://OK\n
05:56:45 			^\n
05:56:45 X.java:13: warning: [fallthrough] possible fall-through into case\n
05:56:45 			case 4://OK\n
05:56:45 			^\n
05:56:45 X.java:18: warning: [fallthrough] possible fall-through into case\n
05:56:45 			case 6://WRONG\n
05:56:45 			^\n
05:56:45 X.java:22: warning: [fallthrough] possible fall-through into case\n
05:56:45 			case 7://OK\n
05:56:45 			^\n
05:56:45 5 warnings]\n
05:56:45 >
05:56:45   SwitchTest>TestCase.runTest:957->test015:653->AbstractRegressionTest.runNegativeTest:2821->AbstractRegressionTest.runNegativeTest:2830->AbstractRegressionTest.runTest:3149->AbstractRegressionTest.runTest:3514->AbstractRegressionTest.runJavac:2577->AbstractRegressionTest.handleMismatch:2636->TestCase.assertEquals:242->TestCase.assertStringEquals:266 test015 - Eclipse found error(s) but Javac only found warning(s).
05:56:45 ----------- Expected ------------
05:56:45 ----------\n
05:56:45 1. ERROR in X.java (at line 18)\n
05:56:45 	case 6://WRONG\n
05:56:45 	^^^^^^\n
05:56:45 Switch case may be entered by falling through previous case. If intended, add a new comment //$FALL-THROUGH$ on the line above\n
05:56:45 ----------\n
05:56:45 
05:56:45 ------------ but was ------------
05:56:45 X.java:8: warning: [fallthrough] possible fall-through into case\n
05:56:45 			case 2://OK\n
05:56:45 			^\n
05:56:45 X.java:10: warning: [fallthrough] possible fall-through into case\n
05:56:45 			case 3://OK\n
05:56:45 			^\n
05:56:45 X.java:13: warning: [fallthrough] possible fall-through into case\n
05:56:45 			case 4://OK\n
05:56:45 			^\n
05:56:45 X.java:18: warning: [fallthrough] possible fall-through into case\n
05:56:45 			case 6://WRONG\n
05:56:45 			^\n
05:56:45 X.java:22: warning: [fallthrough] possible fall-through into case\n
05:56:45 			case 7://OK\n
05:56:45 			^\n
05:56:45 5 warnings\n
05:56:45 
05:56:45 --------- Difference is ----------
05:56:45  expected:<[----------\n
05:56:45 1. ERROR in X.java (at line 18)\n
05:56:45 	case 6://WRONG\n
05:56:45 	^^^^^^\n
05:56:45 Switch case may be entered by falling through previous case. If intended, add a new comment //$FALL-THROUGH$ on the line above\n
05:56:45 ----------]\n
05:56:45 > but was:<[X.java:8: warning: [fallthrough] possible fall-through into case\n
05:56:45 			case 2://OK\n
05:56:45 			^\n
05:56:45 X.java:10: warning: [fallthrough] possible fall-through into case\n
05:56:45 			case 3://OK\n
05:56:45 			^\n
05:56:45 X.java:13: warning: [fallthrough] possible fall-through into case\n
05:56:45 			case 4://OK\n
05:56:45 			^\n
05:56:45 X.java:18: warning: [fallthrough] possible fall-through into case\n
05:56:45 			case 6://WRONG\n
05:56:45 			^\n
05:56:45 X.java:22: warning: [fallthrough] possible fall-through into case\n
05:56:45 			case 7://OK\n
05:56:45 			^\n
05:56:45 5 warnings]\n
05:56:45 >
05:56:45   SwitchTest>TestCase.runTest:957->test016:696->AbstractRegressionTest.runNegativeTest:2821->AbstractRegressionTest.runNegativeTest:2830->AbstractRegressionTest.runTest:3149->AbstractRegressionTest.runTest:3514->AbstractRegressionTest.runJavac:2577->AbstractRegressionTest.handleMismatch:2636->TestCase.assertEquals:242->TestCase.assertStringEquals:266 test016 - Eclipse found error(s) but Javac only found warning(s).
05:56:45 ----------- Expected ------------
05:56:45 ----------\n
05:56:45 1. ERROR in X.java (at line 8)\n
05:56:45 	case 2://WRONG\n
05:56:45 	^^^^^^\n
05:56:45 Switch case may be entered by falling through previous case. If intended, add a new comment //$FALL-THROUGH$ on the line above\n
05:56:45 ----------\n
05:56:45 
05:56:45 ------------ but was ------------
05:56:45 X.java:8: warning: [fallthrough] possible fall-through into case\n
05:56:45 			case 2://WRONG\n
05:56:45 			^\n
05:56:45 1 warning\n
05:56:45 
05:56:45 --------- Difference is ----------
05:56:45  expected:<[----------\n
05:56:45 1. ERROR in X.java (at line 8)\n
05:56:45 	case 2://WRONG\n
05:56:45 	^^^^^^\n
05:56:45 Switch case may be entered by falling through previous case. If intended, add a new comment //$FALL-THROUGH$ on the line above\n
05:56:45 ----------]\n
05:56:45 > but was:<[X.java:8: warning: [fallthrough] possible fall-through into case\n
05:56:45 			case 2://WRONG\n
05:56:45 			^\n
05:56:45 1 warning]\n
05:56:45 >
05:56:45   SwitchTest>TestCase.runTest:957->test017:725->AbstractRegressionTest.runNegativeTest:2821->AbstractRegressionTest.runNegativeTest:2830->AbstractRegressionTest.runTest:3149->AbstractRegressionTest.runTest:3514->AbstractRegressionTest.runJavac:2577->AbstractRegressionTest.handleMismatch:2636->TestCase.assertEquals:242->TestCase.assertStringEquals:266 test017 - Eclipse found error(s) but Javac only found warning(s).
05:56:45 ----------- Expected ------------
05:56:45 ----------\n
05:56:45 1. ERROR in X.java (at line 10)\n
05:56:45 	default :\n
05:56:45 	^^^^^^^\n
05:56:45 Switch case may be entered by falling through previous case. If intended, add a new comment //$FALL-THROUGH$ on the line above\n
05:56:45 ----------\n
05:56:45 
05:56:45 ------------ but was ------------
05:56:45 X.java:10: warning: [fallthrough] possible fall-through into case\n
05:56:45 			default :\n
05:56:45 			^\n
05:56:45 1 warning\n
05:56:45 
05:56:45 --------- Difference is ----------
05:56:45  expected:<[----------\n
05:56:45 1. ERROR in X.java (at line 10)\n
05:56:45 	default :\n
05:56:45 	^^^^^^^\n
05:56:45 Switch case may be entered by falling through previous case. If intended, add a new comment //$FALL-THROUGH$ on the line above\n
05:56:45 ----------]\n
05:56:45 > but was:<[X.java:10: warning: [fallthrough] possible fall-through into case\n
05:56:45 			default :\n
05:56:45 			^\n
05:56:45 1 warning]\n
05:56:45 >
05:56:45   SwitchTest>TestCase.runTest:957->test387146a:2572->AbstractRegressionTest.runNegativeTest:2821->AbstractRegressionTest.runNegativeTest:2830->AbstractRegressionTest.runTest:3149->AbstractRegressionTest.runTest:3514->AbstractRegressionTest.runJavac:2577->AbstractRegressionTest.handleMismatch:2652->TestCase.assertEquals:242->TestCase.assertStringEquals:266 test387146a - Javac found warning(s) but Eclipse did not find any.
05:56:45 ----------- Expected ------------
05:56:45 
05:56:45 ------------ but was ------------
05:56:45 X.java:10: warning: [fallthrough] possible fall-through into case\n
05:56:45 		case 2:\n
05:56:45 		^\n
05:56:45 1 warning\n
05:56:45 
05:56:45 --------- Difference is ----------
05:56:45  expected:<[]> but was:<[X.java:10: warning: [fallthrough] possible fall-through into case\n
05:56:45 		case 2:\n
05:56:45 		^\n
05:56:45 1 warning\n
05:56:45 ]>
05:56:45   SwitchTest>TestCase.runTest:957->test387146b:2601->AbstractRegressionTest.runNegativeTest:2821->AbstractRegressionTest.runNegativeTest:2830->AbstractRegressionTest.runTest:3149->AbstractRegressionTest.runTest:3514->AbstractRegressionTest.runJavac:2577->AbstractRegressionTest.handleMismatch:2652->TestCase.assertEquals:242->TestCase.assertStringEquals:266 test387146b - Javac found warning(s) but Eclipse did not find any.
05:56:45 ----------- Expected ------------
05:56:45 
05:56:45 ------------ but was ------------
05:56:45 X.java:10: warning: [fallthrough] possible fall-through into case\n
05:56:45 		case 2:\n
05:56:45 		^\n
05:56:45 1 warning\n
05:56:45 
05:56:45 --------- Difference is ----------
05:56:45  expected:<[]> but was:<[X.java:10: warning: [fallthrough] possible fall-through into case\n
05:56:45 		case 2:\n
05:56:45 		^\n
05:56:45 1 warning\n
05:56:45 ]>
05:56:45   SwitchTest>TestCase.runTest:957->test410892_4:2782->AbstractRegressionTest.runNegativeTest:2821->AbstractRegressionTest.runNegativeTest:2830->AbstractRegressionTest.runTest:3149->AbstractRegressionTest.runTest:3514->AbstractRegressionTest.runJavac:2577->AbstractRegressionTest.handleMismatch:2648->TestCase.assertEquals:242->TestCase.assertStringEquals:266 test410892_4 - Eclipse found warning(s) but Javac did not find any.
05:56:45 ----------- Expected ------------
05:56:45 
05:56:45 ------------ but was ------------
05:56:45 ----------\n
05:56:45 1. WARNING in X.java (at line 4)\n
05:56:45 	int var2 = 0;\n
05:56:45 	    ^^^^\n
05:56:45 The value of the local variable var2 is not used\n
05:56:45 ----------\n
05:56:45 
05:56:45 --------- Difference is ----------
05:56:45  expected:<[]> but was:<[----------\n
05:56:45 1. WARNING in X.java (at line 4)\n
05:56:45 	int var2 = 0;\n
05:56:45 	    ^^^^\n
05:56:45 The value of the local variable var2 is not used\n
05:56:45 ----------\n
05:56:45 ]>
05:56:45   SwitchTest>TestCase.runTest:957->test410892_5:2817->AbstractRegressionTest.runNegativeTest:2821->AbstractRegressionTest.runNegativeTest:2830->AbstractRegressionTest.runTest:3149->AbstractRegressionTest.runTest:3514->AbstractRegressionTest.runJavac:2577->AbstractRegressionTest.handleMismatch:2648->TestCase.assertEquals:242->TestCase.assertStringEquals:266 test410892_5 - Eclipse found warning(s) but Javac did not find any.
05:56:45 ----------- Expected ------------
05:56:45 
05:56:45 ------------ but was ------------
05:56:45 ----------\n
05:56:45 1. WARNING in X.java (at line 4)\n
05:56:45 	int var2 = 0;\n
05:56:45 	    ^^^^\n
05:56:45 The value of the local variable var2 is not used\n
05:56:45 ----------\n
05:56:45 
05:56:45 --------- Difference is ----------
05:56:45  expected:<[]> but was:<[----------\n
05:56:45 1. WARNING in X.java (at line 4)\n
05:56:45 	int var2 = 0;\n
05:56:45 	    ^^^^\n
05:56:45 The value of the local variable var2 is not used\n
05:56:45 ----------\n
05:56:45 ]>
05:56:45   SwitchTest>TestCase.runTest:957->test410892_6:2853->AbstractRegressionTest.runNegativeTest:2821->AbstractRegressionTest.runNegativeTest:2830->AbstractRegressionTest.runTest:3149->AbstractRegressionTest.runTest:3514->AbstractRegressionTest.runJavac:2577->AbstractRegressionTest.handleMismatch:2648->TestCase.assertEquals:242->TestCase.assertStringEquals:266 test410892_6 - Eclipse found warning(s) but Javac did not find any.
05:56:45 ----------- Expected ------------
05:56:45 
05:56:45 ------------ but was ------------
05:56:45 ----------\n
05:56:45 1. WARNING in X.java (at line 4)\n
05:56:45 	int var2 = 0;\n
05:56:45 	    ^^^^\n
05:56:45 The value of the local variable var2 is not used\n
05:56:45 ----------\n
05:56:45 
05:56:45 --------- Difference is ----------
05:56:45  expected:<[]> but was:<[----------\n
05:56:45 1. WARNING in X.java (at line 4)\n
05:56:45 	int var2 = 0;\n
05:56:45 	    ^^^^\n
05:56:45 The value of the local variable var2 is not used\n
05:56:45 ----------\n
05:56:45 ]>
05:56:45   SwitchTest>TestCase.runTest:957->testBug374605:2144->AbstractRegressionTest.runNegativeTest:2821->AbstractRegressionTest.runNegativeTest:2830->AbstractRegressionTest.runTest:3149->AbstractRegressionTest.runTest:3514->AbstractRegressionTest.runJavac:2577->AbstractRegressionTest.handleMismatch:2648->TestCase.assertEquals:242->TestCase.assertStringEquals:266 testBug374605 - Eclipse found warning(s) but Javac did not find any.
05:56:45 ----------- Expected ------------
05:56:45 
05:56:45 ------------ but was ------------
05:56:45 ----------\n
05:56:45 1. WARNING in p\X.java (at line 4)\n
05:56:45 	switch (i) {\n
05:56:45 	        ^\n
05:56:45 The switch statement should have a default case\n
05:56:45 ----------\n
05:56:45 
05:56:45 --------- Difference is ----------
05:56:45  expected:<[]> but was:<[----------\n
05:56:45 1. WARNING in p\X.java (at line 4)\n
05:56:45 	switch (i) {\n
05:56:45 	        ^\n
05:56:45 The switch statement should have a default case\n
05:56:45 ----------\n
05:56:45 ]>
05:56:45   XLargeTest>TestCase.runTest:957->test0016:14523->AbstractRegressionTest.runConformTest:1870->AbstractRegressionTest.runConformTest:1873->AbstractRegressionTest.runTest:3149->AbstractRegressionTest.runTest:3514->AbstractRegressionTest.runJavac:2577->AbstractRegressionTest.handleMismatch:2640->TestCase.assertEquals:242->TestCase.assertStringEquals:266 test0016 - Javac found error(s) but Eclipse did not find any.
05:56:45 ----------- Expected ------------
05:56:45 
05:56:45 ------------ but was ------------
05:56:45 X.java:2: error: code too large\n
05:56:45 	X0(0),\n
05:56:45 	^\n
05:56:45 1 error\n
05:56:45 
05:56:45 --------- Difference is ----------
05:56:45  expected:<[]> but was:<[X.java:2: error: code too large\n
05:56:45 	X0(0),\n
05:56:45 	^\n
05:56:45 1 error\n
05:56:45 ]>
05:56:45 
05:56:45 Tests run: 12644, Failures: 192, Errors: 0, Skipped: 0
05:56:45 
05:56:45 [INFO] ------------------------------------------------------------------------
05:56:46 [INFO] Reactor Summary:
05:56:46 [INFO] 
05:56:46 [INFO] org.eclipse.jdt.core 3.25.0-SNAPSHOT ............... SUCCESS [01:11 min]
05:56:46 [INFO] org.eclipse.jdt.core.tests.compiler 3.12.1500-SNAPSHOT FAILURE [52:41 min]
05:56:46 [INFO] ------------------------------------------------------------------------
05:56:46 [INFO] BUILD FAILURE
05:56:46 [INFO] ------------------------------------------------------------------------
05:56:46 [INFO] Total time:  55:06 min
05:56:46 [INFO] Finished at: 2021-01-02T10:56:46Z
05:56:46 [INFO] ------------------------------------------------------------------------
05:56:46 [ERROR] Failed to execute goal org.eclipse.tycho:tycho-surefire-plugin:2.2.0-SNAPSHOT:test (default-test) on project org.eclipse.jdt.core.tests.compiler: There are test failures.
05:56:46 [ERROR] 
05:56:46 [ERROR] Please refer to /home/jenkins/agent/workspace/eclipse.jdt.core-run.javac-1.8/org.eclipse.jdt.core.tests.compiler/target/surefire-reports for the individual test results.
05:56:46 [ERROR] -> [Help 1]
05:56:46 org.apache.maven.lifecycle.LifecycleExecutionException: Failed to execute goal org.eclipse.tycho:tycho-surefire-plugin:2.2.0-SNAPSHOT:test (default-test) on project org.eclipse.jdt.core.tests.compiler: There are test failures.
05:56:46 
05:56:46 Please refer to /home/jenkins/agent/workspace/eclipse.jdt.core-run.javac-1.8/org.eclipse.jdt.core.tests.compiler/target/surefire-reports for the individual test results.
05:56:46     at org.apache.maven.lifecycle.internal.MojoExecutor.execute (MojoExecutor.java:215)
05:56:46     at org.apache.maven.lifecycle.internal.MojoExecutor.execute (MojoExecutor.java:156)
05:56:46     at org.apache.maven.lifecycle.internal.MojoExecutor.execute (MojoExecutor.java:148)
05:56:46     at org.apache.maven.lifecycle.internal.LifecycleModuleBuilder.buildProject (LifecycleModuleBuilder.java:117)
05:56:46     at org.apache.maven.lifecycle.internal.LifecycleModuleBuilder.buildProject (LifecycleModuleBuilder.java:81)
05:56:46     at org.apache.maven.lifecycle.internal.builder.singlethreaded.SingleThreadedBuilder.build (SingleThreadedBuilder.java:56)
05:56:46     at org.apache.maven.lifecycle.internal.LifecycleStarter.execute (LifecycleStarter.java:128)
05:56:46     at org.apache.maven.DefaultMaven.doExecute (DefaultMaven.java:305)
05:56:46     at org.apache.maven.DefaultMaven.doExecute (DefaultMaven.java:192)
05:56:46     at org.apache.maven.DefaultMaven.execute (DefaultMaven.java:105)
05:56:46     at org.apache.maven.cli.MavenCli.execute (MavenCli.java:957)
05:56:46     at org.apache.maven.cli.MavenCli.doMain (MavenCli.java:289)
05:56:46     at org.apache.maven.cli.MavenCli.main (MavenCli.java:193)
05:56:46     at jdk.internal.reflect.NativeMethodAccessorImpl.invoke0 (Native Method)
05:56:46     at jdk.internal.reflect.NativeMethodAccessorImpl.invoke (NativeMethodAccessorImpl.java:62)
05:56:46     at jdk.internal.reflect.DelegatingMethodAccessorImpl.invoke (DelegatingMethodAccessorImpl.java:43)
05:56:46     at java.lang.reflect.Method.invoke (Method.java:566)
05:56:46     at org.codehaus.plexus.classworlds.launcher.Launcher.launchEnhanced (Launcher.java:282)
05:56:46     at org.codehaus.plexus.classworlds.launcher.Launcher.launch (Launcher.java:225)
05:56:46     at org.codehaus.plexus.classworlds.launcher.Launcher.mainWithExitCode (Launcher.java:406)
05:56:46     at org.codehaus.plexus.classworlds.launcher.Launcher.main (Launcher.java:347)
05:56:46 Caused by: org.apache.maven.plugin.MojoFailureException: There are test failures.
05:56:46 
05:56:46 Please refer to /home/jenkins/agent/workspace/eclipse.jdt.core-run.javac-1.8/org.eclipse.jdt.core.tests.compiler/target/surefire-reports for the individual test results.
05:56:46     at org.eclipse.tycho.surefire.TestMojo.runTest (TestMojo.java:1066)
05:56:46     at org.eclipse.tycho.surefire.TestMojo.execute (TestMojo.java:714)
05:56:46     at org.apache.maven.plugin.DefaultBuildPluginManager.executeMojo (DefaultBuildPluginManager.java:137)
05:56:46     at org.apache.maven.lifecycle.internal.MojoExecutor.execute (MojoExecutor.java:210)
05:56:46     at org.apache.maven.lifecycle.internal.MojoExecutor.execute (MojoExecutor.java:156)
05:56:46     at org.apache.maven.lifecycle.internal.MojoExecutor.execute (MojoExecutor.java:148)
05:56:46     at org.apache.maven.lifecycle.internal.LifecycleModuleBuilder.buildProject (LifecycleModuleBuilder.java:117)
05:56:46     at org.apache.maven.lifecycle.internal.LifecycleModuleBuilder.buildProject (LifecycleModuleBuilder.java:81)
05:56:46     at org.apache.maven.lifecycle.internal.builder.singlethreaded.SingleThreadedBuilder.build (SingleThreadedBuilder.java:56)
05:56:46     at org.apache.maven.lifecycle.internal.LifecycleStarter.execute (LifecycleStarter.java:128)
05:56:46     at org.apache.maven.DefaultMaven.doExecute (DefaultMaven.java:305)
05:56:46     at org.apache.maven.DefaultMaven.doExecute (DefaultMaven.java:192)
05:56:46     at org.apache.maven.DefaultMaven.execute (DefaultMaven.java:105)
05:56:46     at org.apache.maven.cli.MavenCli.execute (MavenCli.java:957)
05:56:46     at org.apache.maven.cli.MavenCli.doMain (MavenCli.java:289)
05:56:46     at org.apache.maven.cli.MavenCli.main (MavenCli.java:193)
05:56:46     at jdk.internal.reflect.NativeMethodAccessorImpl.invoke0 (Native Method)
05:56:46     at jdk.internal.reflect.NativeMethodAccessorImpl.invoke (NativeMethodAccessorImpl.java:62)
05:56:46     at jdk.internal.reflect.DelegatingMethodAccessorImpl.invoke (DelegatingMethodAccessorImpl.java:43)
05:56:46     at java.lang.reflect.Method.invoke (Method.java:566)
05:56:46     at org.codehaus.plexus.classworlds.launcher.Launcher.launchEnhanced (Launcher.java:282)
05:56:46     at org.codehaus.plexus.classworlds.launcher.Launcher.launch (Launcher.java:225)
05:56:46     at org.codehaus.plexus.classworlds.launcher.Launcher.mainWithExitCode (Launcher.java:406)
05:56:46     at org.codehaus.plexus.classworlds.launcher.Launcher.main (Launcher.java:347)
05:56:46 [ERROR] 
05:56:46 [ERROR] 
05:56:46 [ERROR] For more information about the errors and possible solutions, please read the following articles:
05:56:46 [ERROR] [Help 1] http://cwiki.apache.org/confluence/display/MAVEN/MojoFailureException
05:56:46 [ERROR] 
05:56:46 [ERROR] After correcting the problems, you can resume the build with the command
05:56:46 [ERROR]   mvn <args> -rf :org.eclipse.jdt.core.tests.compiler
05:56:46 Build step 'Invoke top-level Maven targets' marked build as failure
05:56:47 Archiving artifacts
05:56:48 Recording test results
05:56:48 [Checks API] No suitable checks publisher found.
05:56:49 Sending e-mails to: sravankumarl@in.ibm.com
05:56:49 Email was triggered for: Failure - Any
05:56:50 Sending email for trigger: Failure - Any
05:56:50 An attempt to send an e-mail to empty list of recipients, ignored.
05:56:50 Finished: FAILURE