FailedConsole Output

Skipping 8,222 KB.. Full Log
.X.Y.Z[])} KO for javadoc tool\n
02:16:44 	                 ^^^^^^^^^^^^^^^\n
02:16:44 Javadoc: no_test[] cannot be resolved to a type\n
02:16:44 ----------\n
02:16:44 3. ERROR in test\a\X.java (at line 12)\n
02:16:44 	* {@link X.Y#foo(Y.Z[])} KO for javadoc tool\n
02:16:44 	                 ^^^\n
02:16:44 Javadoc: Invalid member type qualification\n
02:16:44 ----------\n
02:16:44 4. ERROR in test\a\X.java (at line 13)\n
02:16:44 	* {@link test.a.X.Y#foo(Y.Z[])} KO for javadoc tool\n
02:16:44 	                        ^^^\n
02:16:44 Javadoc: Invalid member type qualification\n
02:16:44 ----------\n
02:16:44 ]>
02:16:44   JavadocBugsTest>TestCase.runTest:964->testBug233187b:7882->AbstractRegressionTest.runNegativeTest:2474->AbstractRegressionTest.runNegativeTest:2485->AbstractRegressionTest.runTest:2920->AbstractRegressionTest.runTest:3195->AbstractRegressionTest.runJavac:2350->AbstractRegressionTest.handleMismatch:2403->TestCase.assertEquals:242->TestCase.assertStringEquals:266 testBug233187b - Eclipse found error(s) but Javac did not find any.
02:16:44 ----------- Expected ------------
02:16:44 
02:16:44 ------------ but was ------------
02:16:44 ----------\n
02:16:44 1. ERROR in test\b\X.java (at line 10)\n
02:16:44 	* {@link X.Y#foo(test.b.X.Y.Z[])} KO for javadoc tool\n
02:16:44 	             ^^^\n
02:16:44 Javadoc: The method foo(X.Y.Z) in the type X.Y is not applicable for the arguments (X.Y.Z[])\n
02:16:44 ----------\n
02:16:44 2. ERROR in test\b\X.java (at line 11)\n
02:16:44 	* {@link X.Y#foo(no_test.b.X.Y.Z)} KO for javadoc tool\n
02:16:44 	                 ^^^^^^^^^^^^^^^\n
02:16:44 Javadoc: no_test cannot be resolved to a type\n
02:16:44 ----------\n
02:16:44 3. ERROR in test\b\X.java (at line 12)\n
02:16:44 	* {@link X.Y#foo(Y.Z)} KO for javadoc tool\n
02:16:44 	                 ^^^\n
02:16:44 Javadoc: Invalid member type qualification\n
02:16:44 ----------\n
02:16:44 4. ERROR in test\b\X.java (at line 13)\n
02:16:44 	* {@link test.b.X.Y#foo(Y.Z)} KO for javadoc tool\n
02:16:44 	                        ^^^\n
02:16:44 Javadoc: Invalid member type qualification\n
02:16:44 ----------\n
02:16:44 
02:16:44 --------- Difference is ----------
02:16:44  expected:<[]> but was:<[----------\n
02:16:44 1. ERROR in test\b\X.java (at line 10)\n
02:16:44 	* {@link X.Y#foo(test.b.X.Y.Z[])} KO for javadoc tool\n
02:16:44 	             ^^^\n
02:16:44 Javadoc: The method foo(X.Y.Z) in the type X.Y is not applicable for the arguments (X.Y.Z[])\n
02:16:44 ----------\n
02:16:44 2. ERROR in test\b\X.java (at line 11)\n
02:16:44 	* {@link X.Y#foo(no_test.b.X.Y.Z)} KO for javadoc tool\n
02:16:44 	                 ^^^^^^^^^^^^^^^\n
02:16:44 Javadoc: no_test cannot be resolved to a type\n
02:16:44 ----------\n
02:16:44 3. ERROR in test\b\X.java (at line 12)\n
02:16:44 	* {@link X.Y#foo(Y.Z)} KO for javadoc tool\n
02:16:44 	                 ^^^\n
02:16:44 Javadoc: Invalid member type qualification\n
02:16:44 ----------\n
02:16:44 4. ERROR in test\b\X.java (at line 13)\n
02:16:44 	* {@link test.b.X.Y#foo(Y.Z)} KO for javadoc tool\n
02:16:44 	                        ^^^\n
02:16:44 Javadoc: Invalid member type qualification\n
02:16:44 ----------\n
02:16:44 ]>
02:16:44   JavadocBugsTest>TestCase.runTest:964->testBug254825:8110->AbstractRegressionTest.runNegativeTest:2474->AbstractRegressionTest.runNegativeTest:2485->AbstractRegressionTest.runTest:2920->AbstractRegressionTest.runTest:3195->AbstractRegressionTest.runJavac:2350->AbstractRegressionTest.handleMismatch:2403->TestCase.assertEquals:242->TestCase.assertStringEquals:266 testBug254825 - Eclipse found error(s) but Javac did not find any.
02:16:44 ----------- Expected ------------
02:16:44 
02:16:44 ------------ but was ------------
02:16:44 ----------\n
02:16:44 1. ERROR in X.java (at line 4)\n
02:16:44 	/** @see #o */\n
02:16:44 	          ^\n
02:16:44 Javadoc: o cannot be resolved or is not a field\n
02:16:44 ----------\n
02:16:44 
02:16:44 --------- Difference is ----------
02:16:44  expected:<[]> but was:<[----------\n
02:16:44 1. ERROR in X.java (at line 4)\n
02:16:44 	/** @see #o */\n
02:16:44 	          ^\n
02:16:44 Javadoc: o cannot be resolved or is not a field\n
02:16:44 ----------\n
02:16:44 ]>
02:16:44   JavadocBugsTest>TestCase.runTest:964->testBug254825b:8131->AbstractRegressionTest.runNegativeTest:2474->AbstractRegressionTest.runNegativeTest:2485->AbstractRegressionTest.runTest:2920->AbstractRegressionTest.runTest:3195->AbstractRegressionTest.runJavac:2350->AbstractRegressionTest.handleMismatch:2403->TestCase.assertEquals:242->TestCase.assertStringEquals:266 testBug254825b - Eclipse found error(s) but Javac did not find any.
02:16:44 ----------- Expected ------------
02:16:44 
02:16:44 ------------ but was ------------
02:16:44 ----------\n
02:16:44 1. ERROR in X.java (at line 2)\n
02:16:44 	/** @see #o */\n
02:16:44 	          ^\n
02:16:44 Javadoc: o cannot be resolved or is not a field\n
02:16:44 ----------\n
02:16:44 
02:16:44 --------- Difference is ----------
02:16:44  expected:<[]> but was:<[----------\n
02:16:44 1. ERROR in X.java (at line 2)\n
02:16:44 	/** @see #o */\n
02:16:44 	          ^\n
02:16:44 Javadoc: o cannot be resolved or is not a field\n
02:16:44 ----------\n
02:16:44 ]>
02:16:44   JavadocBugsTest>TestCase.runTest:964->testBug258798_1:8165->AbstractRegressionTest.runNegativeTest:2474->AbstractRegressionTest.runNegativeTest:2485->AbstractRegressionTest.runTest:2920->AbstractRegressionTest.runTest:3195->AbstractRegressionTest.runJavac:2350->AbstractRegressionTest.handleMismatch:2419->TestCase.assertEquals:242->TestCase.assertStringEquals:266 testBug258798_1 - Eclipse found warning(s) but Javac did not find any.
02:16:44 ----------- Expected ------------
02:16:44 
02:16:44 ------------ but was ------------
02:16:44 ----------\n
02:16:44 1. WARNING in X.java (at line 5)\n
02:16:44 	X(int i) {\n
02:16:44 	      ^\n
02:16:44 Javadoc: Missing tag for parameter i\n
02:16:44 ----------\n
02:16:44 
02:16:44 --------- Difference is ----------
02:16:44  expected:<[]> but was:<[----------\n
02:16:44 1. WARNING in X.java (at line 5)\n
02:16:44 	X(int i) {\n
02:16:44 	      ^\n
02:16:44 Javadoc: Missing tag for parameter i\n
02:16:44 ----------\n
02:16:44 ]>
02:16:44   JavadocBugsTest>TestCase.runTest:964->testBug258798_2a:8186->AbstractRegressionTest.runNegativeTest:2474->AbstractRegressionTest.runNegativeTest:2485->AbstractRegressionTest.runTest:2920->AbstractRegressionTest.runTest:3195->AbstractRegressionTest.runJavac:2350->AbstractRegressionTest.handleMismatch:2419->TestCase.assertEquals:242->TestCase.assertStringEquals:266 testBug258798_2a - Eclipse found warning(s) but Javac did not find any.
02:16:44 ----------- Expected ------------
02:16:44 
02:16:44 ------------ but was ------------
02:16:44 ----------\n
02:16:44 1. WARNING in X.java (at line 6)\n
02:16:44 	Y(double d) { super(0); }\n
02:16:44 	         ^\n
02:16:44 Javadoc: Missing tag for parameter d\n
02:16:44 ----------\n
02:16:44 
02:16:44 --------- Difference is ----------
02:16:44  expected:<[]> but was:<[----------\n
02:16:44 1. WARNING in X.java (at line 6)\n
02:16:44 	Y(double d) { super(0); }\n
02:16:44 	         ^\n
02:16:44 Javadoc: Missing tag for parameter d\n
02:16:44 ----------\n
02:16:44 ]>
02:16:44   JavadocBugsTest>TestCase.runTest:964->testBug258798_2b:8208->AbstractRegressionTest.runNegativeTest:2474->AbstractRegressionTest.runNegativeTest:2485->AbstractRegressionTest.runTest:2920->AbstractRegressionTest.runTest:3195->AbstractRegressionTest.runJavac:2350->AbstractRegressionTest.handleMismatch:2419->TestCase.assertEquals:242->TestCase.assertStringEquals:266 testBug258798_2b - Eclipse found warning(s) but Javac did not find any.
02:16:44 ----------- Expected ------------
02:16:44 
02:16:44 ------------ but was ------------
02:16:44 ----------\n
02:16:44 1. WARNING in X.java (at line 7)\n
02:16:44 	Y(List<U> lu) { super(null); }\n
02:16:44 	          ^^\n
02:16:44 Javadoc: Missing tag for parameter lu\n
02:16:44 ----------\n
02:16:44 
02:16:44 --------- Difference is ----------
02:16:44  expected:<[]> but was:<[----------\n
02:16:44 1. WARNING in X.java (at line 7)\n
02:16:44 	Y(List<U> lu) { super(null); }\n
02:16:44 	          ^^\n
02:16:44 Javadoc: Missing tag for parameter lu\n
02:16:44 ----------\n
02:16:44 ]>
02:16:44   JavadocBugsTest>TestCase.runTest:964->testBug258798_2c:8232->AbstractRegressionTest.runNegativeTest:2474->AbstractRegressionTest.runNegativeTest:2485->AbstractRegressionTest.runTest:2920->AbstractRegressionTest.runTest:3195->AbstractRegressionTest.runJavac:2350->AbstractRegressionTest.handleMismatch:2419->TestCase.assertEquals:242->TestCase.assertStringEquals:266 testBug258798_2c - Eclipse found warning(s) but Javac did not find any.
02:16:44 ----------- Expected ------------
02:16:44 
02:16:44 ------------ but was ------------
02:16:44 ----------\n
02:16:44 1. WARNING in X.java (at line 7)\n
02:16:44 	Y(List<U> lu) { super(lu); }\n
02:16:44 	          ^^\n
02:16:44 Javadoc: Missing tag for parameter lu\n
02:16:44 ----------\n
02:16:44 
02:16:44 --------- Difference is ----------
02:16:44  expected:<[]> but was:<[----------\n
02:16:44 1. WARNING in X.java (at line 7)\n
02:16:44 	Y(List<U> lu) { super(lu); }\n
02:16:44 	          ^^\n
02:16:44 Javadoc: Missing tag for parameter lu\n
02:16:44 ----------\n
02:16:44 ]>
02:16:44   JavadocBugsTest>TestCase.runTest:964->testBug267833_3:8498->AbstractRegressionTest.runNegativeTest:2474->AbstractRegressionTest.runNegativeTest:2485->AbstractRegressionTest.runTest:2920->AbstractRegressionTest.runTest:3195->AbstractRegressionTest.runJavac:2350->AbstractRegressionTest.handleMismatch:2403->TestCase.assertEquals:242->TestCase.assertStringEquals:266 testBug267833_3 - Eclipse found error(s) but Javac did not find any.
02:16:44 ----------- Expected ------------
02:16:44 
02:16:44 ------------ but was ------------
02:16:44 ----------\n
02:16:44 1. ERROR in X.java (at line 3)\n
02:16:44 	* Description {@see String} , {@return int}, {@since 1.0}, {@param i}, {@throws NullPointerException}\n
02:16:44 	                ^^^\n
02:16:44 Javadoc: Unexpected tag\n
02:16:44 ----------\n
02:16:44 2. ERROR in X.java (at line 3)\n
02:16:44 	* Description {@see String} , {@return int}, {@since 1.0}, {@param i}, {@throws NullPointerException}\n
02:16:44 	                                ^^^^^^\n
02:16:44 Javadoc: Unexpected tag\n
02:16:44 ----------\n
02:16:44 3. ERROR in X.java (at line 3)\n
02:16:44 	* Description {@see String} , {@return int}, {@since 1.0}, {@param i}, {@throws NullPointerException}\n
02:16:44 	                                               ^^^^^\n
02:16:44 Javadoc: Unexpected tag\n
02:16:44 ----------\n
02:16:44 4. ERROR in X.java (at line 3)\n
02:16:44 	* Description {@see String} , {@return int}, {@since 1.0}, {@param i}, {@throws NullPointerException}\n
02:16:44 	                                                             ^^^^^\n
02:16:44 Javadoc: Unexpected tag\n
02:16:44 ----------\n
02:16:44 5. ERROR in X.java (at line 3)\n
02:16:44 	* Description {@see String} , {@return int}, {@since 1.0}, {@param i}, {@throws NullPointerException}\n
02:16:44 	                                                                         ^^^^^^\n
02:16:44 Javadoc: Unexpected tag\n
02:16:44 ----------\n
02:16:44 6. ERROR in X.java (at line 4)\n
02:16:44 	* and more {@author jay}, {@category cat}, {@deprecated}, {@exception NullPointerException}, {@version 1.1}\n
02:16:44 	             ^^^^^^\n
02:16:44 Javadoc: Unexpected tag\n
02:16:44 ----------\n
02:16:44 7. ERROR in X.java (at line 4)\n
02:16:44 	* and more {@author jay}, {@category cat}, {@deprecated}, {@exception NullPointerException}, {@version 1.1}\n
02:16:44 	                            ^^^^^^^^\n
02:16:44 Javadoc: Unexpected tag\n
02:16:44 ----------\n
02:16:44 8. ERROR in X.java (at line 4)\n
02:16:44 	* and more {@author jay}, {@category cat}, {@deprecated}, {@exception NullPointerException}, {@version 1.1}\n
02:16:44 	                                             ^^^^^^^^^^\n
02:16:44 Javadoc: Unexpected tag\n
02:16:44 ----------\n
02:16:44 9. ERROR in X.java (at line 4)\n
02:16:44 	* and more {@author jay}, {@category cat}, {@deprecated}, {@exception NullPointerException}, {@version 1.1}\n
02:16:44 	                                                            ^^^^^^^^^\n
02:16:44 Javadoc: Unexpected tag\n
02:16:44 ----------\n
02:16:44 10. ERROR in X.java (at line 4)\n
02:16:44 	* and more {@author jay}, {@category cat}, {@deprecated}, {@exception NullPointerException}, {@version 1.1}\n
02:16:44 	                                                                                               ^^^^^^^\n
02:16:44 Javadoc: Unexpected tag\n
02:16:44 ----------\n
02:16:44 11. ERROR in X.java (at line 5)\n
02:16:44 	* and more {@since 1.0}, {@serial 0L}, {@serialData data}, {@serialField field}\n
02:16:44 	             ^^^^^\n
02:16:44 Javadoc: Unexpected tag\n
02:16:44 ----------\n
02:16:44 12. ERROR in X.java (at line 5)\n
02:16:44 	* and more {@since 1.0}, {@serial 0L}, {@serialData data}, {@serialField field}\n
02:16:44 	                           ^^^^^^\n
02:16:44 Javadoc: Unexpected tag\n
02:16:44 ----------\n
02:16:44 13. ERROR in X.java (at line 5)\n
02:16:44 	* and more {@since 1.0}, {@serial 0L}, {@serialData data}, {@serialField field}\n
02:16:44 	                                         ^^^^^^^^^^\n
02:16:44 Javadoc: Unexpected tag\n
02:16:44 ----------\n
02:16:44 14. ERROR in X.java (at line 5)\n
02:16:44 	* and more {@since 1.0}, {@serial 0L}, {@serialData data}, {@serialField field}\n
02:16:44 	                                                             ^^^^^^^^^^^\n
02:16:44 Javadoc: Unexpected tag\n
02:16:44 ----------\n
02:16:44 
02:16:44 --------- Difference is ----------
02:16:44  expected:<[]> but was:<[----------\n
02:16:44 1. ERROR in X.java (at line 3)\n
02:16:44 	* Description {@see String} , {@return int}, {@since 1.0}, {@param i}, {@throws NullPointerException}\n
02:16:44 	                ^^^\n
02:16:44 Javadoc: Unexpected tag\n
02:16:44 ----------\n
02:16:44 2. ERROR in X.java (at line 3)\n
02:16:44 	* Description {@see String} , {@return int}, {@since 1.0}, {@param i}, {@throws NullPointerException}\n
02:16:44 	                                ^^^^^^\n
02:16:44 Javadoc: Unexpected tag\n
02:16:44 ----------\n
02:16:44 3. ERROR in X.java (at line 3)\n
02:16:44 	* Description {@see String} , {@return int}, {@since 1.0}, {@param i}, {@throws NullPointerException}\n
02:16:44 	                                               ^^^^^\n
02:16:44 Javadoc: Unexpected tag\n
02:16:44 ----------\n
02:16:44 4. ERROR in X.java (at line 3)\n
02:16:44 	* Description {@see String} , {@return int}, {@since 1.0}, {@param i}, {@throws NullPointerException}\n
02:16:44 	                                                             ^^^^^\n
02:16:44 Javadoc: Unexpected tag\n
02:16:44 ----------\n
02:16:44 5. ERROR in X.java (at line 3)\n
02:16:44 	* Description {@see String} , {@return int}, {@since 1.0}, {@param i}, {@throws NullPointerException}\n
02:16:44 	                                                                         ^^^^^^\n
02:16:44 Javadoc: Unexpected tag\n
02:16:44 ----------\n
02:16:44 6. ERROR in X.java (at line 4)\n
02:16:44 	* and more {@author jay}, {@category cat}, {@deprecated}, {@exception NullPointerException}, {@version 1.1}\n
02:16:44 	             ^^^^^^\n
02:16:44 Javadoc: Unexpected tag\n
02:16:44 ----------\n
02:16:44 7. ERROR in X.java (at line 4)\n
02:16:44 	* and more {@author jay}, {@category cat}, {@deprecated}, {@exception NullPointerException}, {@version 1.1}\n
02:16:44 	                            ^^^^^^^^\n
02:16:44 Javadoc: Unexpected tag\n
02:16:44 ----------\n
02:16:44 8. ERROR in X.java (at line 4)\n
02:16:44 	* and more {@author jay}, {@category cat}, {@deprecated}, {@exception NullPointerException}, {@version 1.1}\n
02:16:44 	                                             ^^^^^^^^^^\n
02:16:44 Javadoc: Unexpected tag\n
02:16:44 ----------\n
02:16:44 9. ERROR in X.java (at line 4)\n
02:16:44 	* and more {@author jay}, {@category cat}, {@deprecated}, {@exception NullPointerException}, {@version 1.1}\n
02:16:44 	                                                            ^^^^^^^^^\n
02:16:44 Javadoc: Unexpected tag\n
02:16:44 ----------\n
02:16:44 10. ERROR in X.java (at line 4)\n
02:16:44 	* and more {@author jay}, {@category cat}, {@deprecated}, {@exception NullPointerException}, {@version 1.1}\n
02:16:44 	                                                                                               ^^^^^^^\n
02:16:44 Javadoc: Unexpected tag\n
02:16:44 ----------\n
02:16:44 11. ERROR in X.java (at line 5)\n
02:16:44 	* and more {@since 1.0}, {@serial 0L}, {@serialData data}, {@serialField field}\n
02:16:44 	             ^^^^^\n
02:16:44 Javadoc: Unexpected tag\n
02:16:44 ----------\n
02:16:44 12. ERROR in X.java (at line 5)\n
02:16:44 	* and more {@since 1.0}, {@serial 0L}, {@serialData data}, {@serialField field}\n
02:16:44 	                           ^^^^^^\n
02:16:44 Javadoc: Unexpected tag\n
02:16:44 ----------\n
02:16:44 13. ERROR in X.java (at line 5)\n
02:16:44 	* and more {@since 1.0}, {@serial 0L}, {@serialData data}, {@serialField field}\n
02:16:44 	                                         ^^^^^^^^^^\n
02:16:44 Javadoc: Unexpected tag\n
02:16:44 ----------\n
02:16:44 14. ERROR in X.java (at line 5)\n
02:16:44 	* and more {@since 1.0}, {@serial 0L}, {@serialData data}, {@serialField field}\n
02:16:44 	                                                             ^^^^^^^^^^^\n
02:16:44 Javadoc: Unexpected tag\n
02:16:44 ----------\n
02:16:44 ]>
02:16:44   JavadocBugsTest>TestCase.runTest:964->testBug281609a:8592->AbstractRegressionTest.runNegativeTest:2474->AbstractRegressionTest.runNegativeTest:2485->AbstractRegressionTest.runTest:2920->AbstractRegressionTest.runTest:3195->AbstractRegressionTest.runJavac:2350->AbstractRegressionTest.handleMismatch:2403->TestCase.assertEquals:242->TestCase.assertStringEquals:266 testBug281609a - Eclipse found error(s) but Javac did not find any.
02:16:44 ----------- Expected ------------
02:16:44 
02:16:44 ------------ but was ------------
02:16:44 ----------\n
02:16:44 1. ERROR in pkg\X.java (at line 7)\n
02:16:44 	* @see PKG\n
02:16:44 	       ^^^\n
02:16:44 Javadoc: PKG cannot be resolved to a type\n
02:16:44 ----------\n
02:16:44 
02:16:44 --------- Difference is ----------
02:16:44  expected:<[]> but was:<[----------\n
02:16:44 1. ERROR in pkg\X.java (at line 7)\n
02:16:44 	* @see PKG\n
02:16:44 	       ^^^\n
02:16:44 Javadoc: PKG cannot be resolved to a type\n
02:16:44 ----------\n
02:16:44 ]>
02:16:44   JavadocBugsTest>TestCase.runTest:964->testBug73352a:3106->AbstractRegressionTest.runConformTest:3339->AbstractRegressionTest.runTest:2920->AbstractRegressionTest.runTest:3195->AbstractRegressionTest.runJavac:2350->AbstractRegressionTest.handleMismatch:2454 testBug73352a: unused excuse org.eclipse.jdt.core.tests.compiler.regression.AbstractRegressionTest$JavacTestOptions$Excuse@1f5a1ad4 for compiler org.eclipse.jdt.core.tests.compiler.regression.AbstractRegressionTest$JavacCompiler@7866ffa
02:16:44   JavadocBugsTest>TestCase.runTest:964->testBug73352c:3238->AbstractRegressionTest.runConformTest:3339->AbstractRegressionTest.runTest:2920->AbstractRegressionTest.runTest:3195->AbstractRegressionTest.runJavac:2350->AbstractRegressionTest.handleMismatch:2454 testBug73352c: unused excuse org.eclipse.jdt.core.tests.compiler.regression.AbstractRegressionTest$JavacTestOptions$Excuse@1f5a1ad4 for compiler org.eclipse.jdt.core.tests.compiler.regression.AbstractRegressionTest$JavacCompiler@7866ffa
02:16:44   JavadocTestForClass>TestCase.runTest:964->test055:1066->AbstractRegressionTest.runNegativeTest:2474->AbstractRegressionTest.runNegativeTest:2485->AbstractRegressionTest.runTest:2920->AbstractRegressionTest.runTest:3195->AbstractRegressionTest.runJavac:2350->AbstractRegressionTest.handleMismatch:2407->TestCase.assertEquals:242->TestCase.assertStringEquals:266 test055 - Eclipse found error(s) but Javac only found warning(s).
02:16:44 ----------- Expected ------------
02:16:44 ----------\n
02:16:44 1. ERROR in X.java (at line 5)\n
02:16:44 	* <li> {@link Entry} </li>\n
02:16:44 	              ^^^^^\n
02:16:44 Javadoc: Invalid member type qualification\n
02:16:44 ----------\n
02:16:44 
02:16:44 ------------ but was ------------
02:16:44 X.java:8: warning: [rawtypes] found raw type: Map\n
02:16:44 public interface X extends Map {\n
02:16:44                            ^\n
02:16:44   missing type arguments for generic class Map<K,V>\n
02:16:44   where K,V are type-variables:\n
02:16:44     K extends Object declared in interface Map\n
02:16:44     V extends Object declared in interface Map\n
02:16:44 X.java:9: warning: [rawtypes] found raw type: Entry\n
02:16:44 	Entry e = null;\n
02:16:44 	^\n
02:16:44   missing type arguments for generic class Entry<K,V>\n
02:16:44   where K,V are type-variables:\n
02:16:44     K extends Object declared in interface Entry\n
02:16:44     V extends Object declared in interface Entry\n
02:16:44 2 warnings\n
02:16:44 
02:16:44 --------- Difference is ----------
02:16:44  expected:<[----------\n
02:16:44 1. ERROR in X.java (at line 5)\n
02:16:44 	* <li> {@link Entry} </li>\n
02:16:44 	              ^^^^^\n
02:16:44 Javadoc: Invalid member type qualification\n
02:16:44 ----------]\n
02:16:44 > but was:<[X.java:8: warning: [rawtypes] found raw type: Map\n
02:16:44 public interface X extends Map {\n
02:16:44                            ^\n
02:16:44   missing type arguments for generic class Map<K,V>\n
02:16:44   where K,V are type-variables:\n
02:16:44     K extends Object declared in interface Map\n
02:16:44     V extends Object declared in interface Map\n
02:16:44 X.java:9: warning: [rawtypes] found raw type: Entry\n
02:16:44 	Entry e = null;\n
02:16:44 	^\n
02:16:44   missing type arguments for generic class Entry<K,V>\n
02:16:44   where K,V are type-variables:\n
02:16:44     K extends Object declared in interface Entry\n
02:16:44     V extends Object declared in interface Entry\n
02:16:44 2 warnings]\n
02:16:44 >
02:16:44   JavadocTest_1_5>TestCase.runTest:964->testBug247037a:3885->AbstractRegressionTest.runNegativeTest:2474->AbstractRegressionTest.runNegativeTest:2485->AbstractRegressionTest.runTest:2920->AbstractRegressionTest.runTest:3195->AbstractRegressionTest.runJavac:2350->AbstractRegressionTest.handleMismatch:2403->TestCase.assertEquals:242->TestCase.assertStringEquals:266 testBug247037a - Eclipse found error(s) but Javac did not find any.
02:16:44 ----------- Expected ------------
02:16:44 
02:16:44 ------------ but was ------------
02:16:44 ----------\n
02:16:44 1. ERROR in pack\package-info.java (at line 2)\n
02:16:44 	* {@inheritDoc}\n
02:16:44 	    ^^^^^^^^^^\n
02:16:44 Javadoc: Unexpected tag\n
02:16:44 ----------\n
02:16:44 2. ERROR in pack\package-info.java (at line 3)\n
02:16:44 	* @since {@inheritDoc}\n
02:16:44 	           ^^^^^^^^^^\n
02:16:44 Javadoc: Unexpected tag\n
02:16:44 ----------\n
02:16:44 3. ERROR in pack\package-info.java (at line 4)\n
02:16:44 	* @blah {@inheritDoc}\n
02:16:44 	          ^^^^^^^^^^\n
02:16:44 Javadoc: Unexpected tag\n
02:16:44 ----------\n
02:16:44 
02:16:44 --------- Difference is ----------
02:16:44  expected:<[]> but was:<[----------\n
02:16:44 1. ERROR in pack\package-info.java (at line 2)\n
02:16:44 	* {@inheritDoc}\n
02:16:44 	    ^^^^^^^^^^\n
02:16:44 Javadoc: Unexpected tag\n
02:16:44 ----------\n
02:16:44 2. ERROR in pack\package-info.java (at line 3)\n
02:16:44 	* @since {@inheritDoc}\n
02:16:44 	           ^^^^^^^^^^\n
02:16:44 Javadoc: Unexpected tag\n
02:16:44 ----------\n
02:16:44 3. ERROR in pack\package-info.java (at line 4)\n
02:16:44 	* @blah {@inheritDoc}\n
02:16:44 	          ^^^^^^^^^^\n
02:16:44 Javadoc: Unexpected tag\n
02:16:44 ----------\n
02:16:44 ]>
02:16:44   JavadocTest_1_5>TestCase.runTest:964->testBug247037b:3917->AbstractRegressionTest.runNegativeTest:2474->AbstractRegressionTest.runNegativeTest:2485->AbstractRegressionTest.runTest:2920->AbstractRegressionTest.runTest:3195->AbstractRegressionTest.runJavac:2350->AbstractRegressionTest.handleMismatch:2403->TestCase.assertEquals:242->TestCase.assertStringEquals:266 testBug247037b - Eclipse found error(s) but Javac did not find any.
02:16:44 ----------- Expected ------------
02:16:44 
02:16:44 ------------ but was ------------
02:16:44 ----------\n
02:16:44 1. ERROR in pack\package-info.java (at line 2)\n
02:16:44 	* @return {@inheritDoc}\n
02:16:44 	   ^^^^^^\n
02:16:44 Javadoc: Unexpected tag\n
02:16:44 ----------\n
02:16:44 2. ERROR in pack\package-info.java (at line 2)\n
02:16:44 	* @return {@inheritDoc}\n
02:16:44 	            ^^^^^^^^^^\n
02:16:44 Javadoc: Unexpected tag\n
02:16:44 ----------\n
02:16:44 3. ERROR in pack\package-info.java (at line 3)\n
02:16:44 	* @param blah {@inheritDoc}\n
02:16:44 	   ^^^^^\n
02:16:44 Javadoc: Unexpected tag\n
02:16:44 ----------\n
02:16:44 4. ERROR in pack\package-info.java (at line 3)\n
02:16:44 	* @param blah {@inheritDoc}\n
02:16:44 	                ^^^^^^^^^^\n
02:16:44 Javadoc: Unexpected tag\n
02:16:44 ----------\n
02:16:44 
02:16:44 --------- Difference is ----------
02:16:44  expected:<[]> but was:<[----------\n
02:16:44 1. ERROR in pack\package-info.java (at line 2)\n
02:16:44 	* @return {@inheritDoc}\n
02:16:44 	   ^^^^^^\n
02:16:44 Javadoc: Unexpected tag\n
02:16:44 ----------\n
02:16:44 2. ERROR in pack\package-info.java (at line 2)\n
02:16:44 	* @return {@inheritDoc}\n
02:16:44 	            ^^^^^^^^^^\n
02:16:44 Javadoc: Unexpected tag\n
02:16:44 ----------\n
02:16:44 3. ERROR in pack\package-info.java (at line 3)\n
02:16:44 	* @param blah {@inheritDoc}\n
02:16:44 	   ^^^^^\n
02:16:44 Javadoc: Unexpected tag\n
02:16:44 ----------\n
02:16:44 4. ERROR in pack\package-info.java (at line 3)\n
02:16:44 	* @param blah {@inheritDoc}\n
02:16:44 	                ^^^^^^^^^^\n
02:16:44 Javadoc: Unexpected tag\n
02:16:44 ----------\n
02:16:44 ]>
02:16:44   JavadocTest_1_5>TestCase.runTest:964->testBug284333:3958->AbstractRegressionTest.runNegativeTest:2474->AbstractRegressionTest.runNegativeTest:2485->AbstractRegressionTest.runTest:2920->AbstractRegressionTest.runTest:3195->AbstractRegressionTest.runJavac:2350->AbstractRegressionTest.handleMismatch:2403->TestCase.assertEquals:242->TestCase.assertStringEquals:266 testBug284333 - Eclipse found error(s) but Javac did not find any.
02:16:44 ----------- Expected ------------
02:16:44 
02:16:44 ------------ but was ------------
02:16:44 ----------\n
02:16:44 1. ERROR in foo\bar\package-info.java (at line 2)\n
02:16:44 	* @see ClassInSamePackage#SOME_FIELD\n
02:16:44 	       ^^^^^^^^^^^^^^^^^^\n
02:16:44 Javadoc: Invalid reference\n
02:16:44 ----------\n
02:16:44 2. ERROR in foo\bar\package-info.java (at line 4)\n
02:16:44 	* @see ClassInSamePackage#SOME_FIELD\n
02:16:44 	       ^^^^^^^^^^^^^^^^^^\n
02:16:44 Javadoc: Invalid reference\n
02:16:44 ----------\n
02:16:44 3. ERROR in foo\bar\package-info.java (at line 5)\n
02:16:44 	* @see ClassInSubPackage#foo\n
02:16:44 	       ^^^^^^^^^^^^^^^^^\n
02:16:44 Javadoc: ClassInSubPackage cannot be resolved to a type\n
02:16:44 ----------\n
02:16:44 4. ERROR in foo\bar\package-info.java (at line 7)\n
02:16:44 	* @see ClassInSubPackage#foo\n
02:16:44 	       ^^^^^^^^^^^^^^^^^\n
02:16:44 Javadoc: ClassInSubPackage cannot be resolved to a type\n
02:16:44 ----------\n
02:16:44 5. ERROR in foo\bar\package-info.java (at line 8)\n
02:16:44 	* @see ClassInEnclosingPackage\n
02:16:44 	       ^^^^^^^^^^^^^^^^^^^^^^^\n
02:16:44 Javadoc: ClassInEnclosingPackage cannot be resolved to a type\n
02:16:44 ----------\n
02:16:44 6. ERROR in foo\bar\package-info.java (at line 10)\n
02:16:44 	* @see ClassInEnclosingPackage\n
02:16:44 	       ^^^^^^^^^^^^^^^^^^^^^^^\n
02:16:44 Javadoc: ClassInEnclosingPackage cannot be resolved to a type\n
02:16:44 ----------\n
02:16:44 
02:16:44 --------- Difference is ----------
02:16:44  expected:<[]> but was:<[----------\n
02:16:44 1. ERROR in foo\bar\package-info.java (at line 2)\n
02:16:44 	* @see ClassInSamePackage#SOME_FIELD\n
02:16:44 	       ^^^^^^^^^^^^^^^^^^\n
02:16:44 Javadoc: Invalid reference\n
02:16:44 ----------\n
02:16:44 2. ERROR in foo\bar\package-info.java (at line 4)\n
02:16:44 	* @see ClassInSamePackage#SOME_FIELD\n
02:16:44 	       ^^^^^^^^^^^^^^^^^^\n
02:16:44 Javadoc: Invalid reference\n
02:16:44 ----------\n
02:16:44 3. ERROR in foo\bar\package-info.java (at line 5)\n
02:16:44 	* @see ClassInSubPackage#foo\n
02:16:44 	       ^^^^^^^^^^^^^^^^^\n
02:16:44 Javadoc: ClassInSubPackage cannot be resolved to a type\n
02:16:44 ----------\n
02:16:44 4. ERROR in foo\bar\package-info.java (at line 7)\n
02:16:44 	* @see ClassInSubPackage#foo\n
02:16:44 	       ^^^^^^^^^^^^^^^^^\n
02:16:44 Javadoc: ClassInSubPackage cannot be resolved to a type\n
02:16:44 ----------\n
02:16:44 5. ERROR in foo\bar\package-info.java (at line 8)\n
02:16:44 	* @see ClassInEnclosingPackage\n
02:16:44 	       ^^^^^^^^^^^^^^^^^^^^^^^\n
02:16:44 Javadoc: ClassInEnclosingPackage cannot be resolved to a type\n
02:16:44 ----------\n
02:16:44 6. ERROR in foo\bar\package-info.java (at line 10)\n
02:16:44 	* @see ClassInEnclosingPackage\n
02:16:44 	       ^^^^^^^^^^^^^^^^^^^^^^^\n
02:16:44 Javadoc: ClassInEnclosingPackage cannot be resolved to a type\n
02:16:44 ----------\n
02:16:44 ]>
02:16:44   JavadocTest_1_5>TestCase.runTest:964->testBug284333a:4037->AbstractRegressionTest.runNegativeTest:2474->AbstractRegressionTest.runNegativeTest:2485->AbstractRegressionTest.runTest:2920->AbstractRegressionTest.runTest:3195->AbstractRegressionTest.runJavac:2350->AbstractRegressionTest.handleMismatch:2403->TestCase.assertEquals:242->TestCase.assertStringEquals:266 testBug284333a - Eclipse found error(s) but Javac did not find any.
02:16:44 ----------- Expected ------------
02:16:44 
02:16:44 ------------ but was ------------
02:16:44 ----------\n
02:16:44 1. ERROR in foo\bar\NotAPackageInfo.java (at line 9)\n
02:16:44 	* @see ClassInSubPackage#foo\n
02:16:44 	       ^^^^^^^^^^^^^^^^^\n
02:16:44 Javadoc: ClassInSubPackage cannot be resolved to a type\n
02:16:44 ----------\n
02:16:44 2. ERROR in foo\bar\NotAPackageInfo.java (at line 11)\n
02:16:44 	* @see ClassInSubPackage#foo\n
02:16:44 	       ^^^^^^^^^^^^^^^^^\n
02:16:44 Javadoc: ClassInSubPackage cannot be resolved to a type\n
02:16:44 ----------\n
02:16:44 3. ERROR in foo\bar\NotAPackageInfo.java (at line 15)\n
02:16:44 	* @see ClassInEnclosingPackage\n
02:16:44 	       ^^^^^^^^^^^^^^^^^^^^^^^\n
02:16:44 Javadoc: ClassInEnclosingPackage cannot be resolved to a type\n
02:16:44 ----------\n
02:16:44 4. ERROR in foo\bar\NotAPackageInfo.java (at line 17)\n
02:16:44 	* @see ClassInEnclosingPackage\n
02:16:44 	       ^^^^^^^^^^^^^^^^^^^^^^^\n
02:16:44 Javadoc: ClassInEnclosingPackage cannot be resolved to a type\n
02:16:44 ----------\n
02:16:44 
02:16:44 --------- Difference is ----------
02:16:44  expected:<[]> but was:<[----------\n
02:16:44 1. ERROR in foo\bar\NotAPackageInfo.java (at line 9)\n
02:16:44 	* @see ClassInSubPackage#foo\n
02:16:44 	       ^^^^^^^^^^^^^^^^^\n
02:16:44 Javadoc: ClassInSubPackage cannot be resolved to a type\n
02:16:44 ----------\n
02:16:44 2. ERROR in foo\bar\NotAPackageInfo.java (at line 11)\n
02:16:44 	* @see ClassInSubPackage#foo\n
02:16:44 	       ^^^^^^^^^^^^^^^^^\n
02:16:44 Javadoc: ClassInSubPackage cannot be resolved to a type\n
02:16:44 ----------\n
02:16:44 3. ERROR in foo\bar\NotAPackageInfo.java (at line 15)\n
02:16:44 	* @see ClassInEnclosingPackage\n
02:16:44 	       ^^^^^^^^^^^^^^^^^^^^^^^\n
02:16:44 Javadoc: ClassInEnclosingPackage cannot be resolved to a type\n
02:16:44 ----------\n
02:16:44 4. ERROR in foo\bar\NotAPackageInfo.java (at line 17)\n
02:16:44 	* @see ClassInEnclosingPackage\n
02:16:44 	       ^^^^^^^^^^^^^^^^^^^^^^^\n
02:16:44 Javadoc: ClassInEnclosingPackage cannot be resolved to a type\n
02:16:44 ----------\n
02:16:44 ]>
02:16:44   LookupTest>TestCase.runTest:964->test103:3413->AbstractRegressionTest.runNegativeTest:2474->AbstractRegressionTest.runNegativeTest:2485->AbstractRegressionTest.runTest:2920->AbstractRegressionTest.runTest:3195->AbstractRegressionTest.runJavac:2350->AbstractRegressionTest.handleMismatch:2419->TestCase.assertEquals:242->TestCase.assertStringEquals:266 test103 - Eclipse found warning(s) but Javac did not find any.
02:16:44 ----------- Expected ------------
02:16:44 
02:16:44 ------------ but was ------------
02:16:44 ----------\n
02:16:44 1. WARNING in A.java (at line 2)\n
02:16:44 	private int x;\n
02:16:44 	            ^\n
02:16:44 The value of the field A.x is not used\n
02:16:44 ----------\n
02:16:44 2. WARNING in A.java (at line 4)\n
02:16:44 	private int x;\n
02:16:44 	            ^\n
02:16:44 The value of the field A.B.x is not used\n
02:16:44 ----------\n
02:16:44 3. WARNING in A.java (at line 5)\n
02:16:44 	private C c = new C() {\n
02:16:44 	          ^\n
02:16:44 The value of the field A.B.c is not used\n
02:16:44 ----------\n
02:16:44 4. WARNING in A.java (at line 6)\n
02:16:44 	void foo() {\n
02:16:44 	     ^^^^^\n
02:16:44 The method foo() from the type new A.C(){} is never used locally\n
02:16:44 ----------\n
02:16:44 5. WARNING in A.java (at line 7)\n
02:16:44 	x = 3;\n
02:16:44 	^\n
02:16:44 Write access to enclosing field A.B.x is emulated by a synthetic accessor method\n
02:16:44 ----------\n
02:16:44 6. WARNING in A.java (at line 12)\n
02:16:44 	private int x;\n
02:16:44 	            ^\n
02:16:44 The value of the field A.C.x is not used\n
02:16:44 ----------\n
02:16:44 
02:16:44 --------- Difference is ----------
02:16:44  expected:<[]> but was:<[----------\n
02:16:44 1. WARNING in A.java (at line 2)\n
02:16:44 	private int x;\n
02:16:44 	            ^\n
02:16:44 The value of the field A.x is not used\n
02:16:44 ----------\n
02:16:44 2. WARNING in A.java (at line 4)\n
02:16:44 	private int x;\n
02:16:44 	            ^\n
02:16:44 The value of the field A.B.x is not used\n
02:16:44 ----------\n
02:16:44 3. WARNING in A.java (at line 5)\n
02:16:44 	private C c = new C() {\n
02:16:44 	          ^\n
02:16:44 The value of the field A.B.c is not used\n
02:16:44 ----------\n
02:16:44 4. WARNING in A.java (at line 6)\n
02:16:44 	void foo() {\n
02:16:44 	     ^^^^^\n
02:16:44 The method foo() from the type new A.C(){} is never used locally\n
02:16:44 ----------\n
02:16:44 5. WARNING in A.java (at line 7)\n
02:16:44 	x = 3;\n
02:16:44 	^\n
02:16:44 Write access to enclosing field A.B.x is emulated by a synthetic accessor method\n
02:16:44 ----------\n
02:16:44 6. WARNING in A.java (at line 12)\n
02:16:44 	private int x;\n
02:16:44 	            ^\n
02:16:44 The value of the field A.C.x is not used\n
02:16:44 ----------\n
02:16:44 ]>
02:16:44   LookupTest>TestCase.runTest:964->test105:3537->AbstractRegressionTest.runNegativeTest:2474->AbstractRegressionTest.runNegativeTest:2485->AbstractRegressionTest.runTest:2920->AbstractRegressionTest.runTest:3195->AbstractRegressionTest.runJavac:2350->AbstractRegressionTest.handleMismatch:2419->TestCase.assertEquals:242->TestCase.assertStringEquals:266 test105 - Eclipse found warning(s) but Javac did not find any.
02:16:44 ----------- Expected ------------
02:16:44 
02:16:44 ------------ but was ------------
02:16:44 ----------\n
02:16:44 1. WARNING in A.java (at line 2)\n
02:16:44 	private int x;\n
02:16:44 	            ^\n
02:16:44 The value of the field A.x is not used\n
02:16:44 ----------\n
02:16:44 2. WARNING in A.java (at line 3)\n
02:16:44 	private C c = new C() {\n
02:16:44 	          ^\n
02:16:44 The value of the field A.c is not used\n
02:16:44 ----------\n
02:16:44 3. WARNING in A.java (at line 4)\n
02:16:44 	void foo() {\n
02:16:44 	     ^^^^^\n
02:16:44 The method foo() from the type new A.C(){} is never used locally\n
02:16:44 ----------\n
02:16:44 4. WARNING in A.java (at line 5)\n
02:16:44 	x = 3;\n
02:16:44 	^\n
02:16:44 Write access to enclosing field A.x is emulated by a synthetic accessor method\n
02:16:44 ----------\n
02:16:44 5. WARNING in A.java (at line 9)\n
02:16:44 	private int x;\n
02:16:44 	            ^\n
02:16:44 The value of the field A.C.x is not used\n
02:16:44 ----------\n
02:16:44 
02:16:44 --------- Difference is ----------
02:16:44  expected:<[]> but was:<[----------\n
02:16:44 1. WARNING in A.java (at line 2)\n
02:16:44 	private int x;\n
02:16:44 	            ^\n
02:16:44 The value of the field A.x is not used\n
02:16:44 ----------\n
02:16:44 2. WARNING in A.java (at line 3)\n
02:16:44 	private C c = new C() {\n
02:16:44 	          ^\n
02:16:44 The value of the field A.c is not used\n
02:16:44 ----------\n
02:16:44 3. WARNING in A.java (at line 4)\n
02:16:44 	void foo() {\n
02:16:44 	     ^^^^^\n
02:16:44 The method foo() from the type new A.C(){} is never used locally\n
02:16:44 ----------\n
02:16:44 4. WARNING in A.java (at line 5)\n
02:16:44 	x = 3;\n
02:16:44 	^\n
02:16:44 Write access to enclosing field A.x is emulated by a synthetic accessor method\n
02:16:44 ----------\n
02:16:44 5. WARNING in A.java (at line 9)\n
02:16:44 	private int x;\n
02:16:44 	            ^\n
02:16:44 The value of the field A.C.x is not used\n
02:16:44 ----------\n
02:16:44 ]>
02:16:44   MethodHandleTest>TestCase.runTest:964->test009:279->AbstractRegressionTest.runNegativeTest:3507->AbstractRegressionTest.runTest:2920->AbstractRegressionTest.runTest:3195->AbstractRegressionTest.runJavac:2350->AbstractRegressionTest.handleMismatch:2454 test009: unused excuse org.eclipse.jdt.core.tests.compiler.regression.AbstractRegressionTest$JavacTestOptions$Excuse@58fcb07b for compiler org.eclipse.jdt.core.tests.compiler.regression.AbstractRegressionTest$JavacCompiler@7866ffa
02:16:44   MethodHandleTest>TestCase.runTest:964->test010:315->AbstractRegressionTest.runNegativeTest:3507->AbstractRegressionTest.runTest:2920->AbstractRegressionTest.runTest:3195->AbstractRegressionTest.runJavac:2350->AbstractRegressionTest.handleMismatch:2454 test010: unused excuse org.eclipse.jdt.core.tests.compiler.regression.AbstractRegressionTest$JavacTestOptions$Excuse@58fcb07b for compiler org.eclipse.jdt.core.tests.compiler.regression.AbstractRegressionTest$JavacCompiler@7866ffa
02:16:44   MethodVerifyTest>TestCase.runTest:964->test025e:1713->AbstractRegressionTest.runConformTest:3339->AbstractRegressionTest.runTest:2920->AbstractRegressionTest.runTest:3195->AbstractRegressionTest.runJavac:2350->AbstractRegressionTest.handleMismatch:2454 test025e: unused excuse org.eclipse.jdt.core.tests.compiler.regression.AbstractRegressionTest$JavacTestOptions$Excuse@1f5a1ad4 for compiler org.eclipse.jdt.core.tests.compiler.regression.AbstractRegressionTest$JavacCompiler@7866ffa
02:16:44   MethodVerifyTest>TestCase.runTest:964->test025f:1747->AbstractRegressionTest.runConformTest:3339->AbstractRegressionTest.runTest:2920->AbstractRegressionTest.runTest:3195->AbstractRegressionTest.runJavac:2350->AbstractRegressionTest.handleMismatch:2454 test025f: unused excuse org.eclipse.jdt.core.tests.compiler.regression.AbstractRegressionTest$JavacTestOptions$Excuse@1f5a1ad4 for compiler org.eclipse.jdt.core.tests.compiler.regression.AbstractRegressionTest$JavacCompiler@7866ffa
02:16:44   MethodVerifyTest>TestCase.runTest:964->test041:2861->AbstractRegressionTest.runConformTest:3339->AbstractRegressionTest.runTest:2920->AbstractRegressionTest.runTest:3195->AbstractRegressionTest.runJavac:2350->AbstractRegressionTest.handleMismatch:2454 test041: unused excuse org.eclipse.jdt.core.tests.compiler.regression.AbstractRegressionTest$JavacTestOptions$EclipseJustification$1@68db67d for compiler org.eclipse.jdt.core.tests.compiler.regression.AbstractRegressionTest$JavacCompiler@7866ffa
02:16:44   MethodVerifyTest>TestCase.runTest:964->test041a:2883->AbstractRegressionTest.runConformTest:3339->AbstractRegressionTest.runTest:2920->AbstractRegressionTest.runTest:3195->AbstractRegressionTest.runJavac:2350->AbstractRegressionTest.handleMismatch:2454 test041a: unused excuse org.eclipse.jdt.core.tests.compiler.regression.AbstractRegressionTest$JavacTestOptions$EclipseJustification$1@68db67d for compiler org.eclipse.jdt.core.tests.compiler.regression.AbstractRegressionTest$JavacCompiler@7866ffa
02:16:44   MethodVerifyTest>TestCase.runTest:964->test043:2994->AbstractRegressionTest.runNegativeTest:3448->AbstractRegressionTest.runTest:2920->AbstractRegressionTest.runTest:3195->AbstractRegressionTest.runJavac:2350->AbstractRegressionTest.handleMismatch:2454 test043: unused excuse org.eclipse.jdt.core.tests.compiler.regression.AbstractRegressionTest$JavacTestOptions$EclipseJustification@7cf0c700 for compiler org.eclipse.jdt.core.tests.compiler.regression.AbstractRegressionTest$JavacCompiler@7866ffa
02:16:44   MethodVerifyTest>TestCase.runTest:964->test145:9263->AbstractRegressionTest.runConformTest:1689->AbstractRegressionTest.runConformTest:1692->AbstractRegressionTest.runTest:2920->AbstractRegressionTest.runTest:3195->AbstractRegressionTest.runJavac:2350->AbstractRegressionTest.handleMismatch:2411->TestCase.assertEquals:242->TestCase.assertStringEquals:266 test145 - Javac found error(s) but Eclipse did not find any.
02:16:44 ----------- Expected ------------
02:16:44 
02:16:44 ------------ but was ------------
02:16:44 BaseImpl.java:3: error: name clash: setValue(String) in BaseImpl overrides a method whose erasure is the same as another method, yet neither overrides the other\n
02:16:44 class BaseImpl extends Base<String> { public void setValue(String object) {} }\n
02:16:44                                                   ^\n
02:16:44   first method:  setValue(Object) in Base\n
02:16:44   second method: setValue(Tvalue) in BaseInterface\n
02:16:44   where Tvalue is a type-variable:\n
02:16:44     Tvalue extends Object declared in interface BaseInterface\n
02:16:44 1 error\n
02:16:44 
02:16:44 --------- Difference is ----------
02:16:44  expected:<[]> but was:<[BaseImpl.java:3: error: name clash: setValue(String) in BaseImpl overrides a method whose erasure is the same as another method, yet neither overrides the other\n
02:16:44 class BaseImpl extends Base<String> { public void setValue(String object) {} }\n
02:16:44                                                   ^\n
02:16:44   first method:  setValue(Object) in Base\n
02:16:44   second method: setValue(Tvalue) in BaseInterface\n
02:16:44   where Tvalue is a type-variable:\n
02:16:44     Tvalue extends Object declared in interface BaseInterface\n
02:16:44 1 error\n
02:16:44 ]>
02:16:44   MethodVerifyTest>TestCase.runTest:964->test169:10107->AbstractRegressionTest.runNegativeTest:3507->AbstractRegressionTest.runTest:2920->AbstractRegressionTest.runTest:3195->AbstractRegressionTest.runJavac:2350->AbstractRegressionTest.handleMismatch:2454 test169: unused excuse org.eclipse.jdt.core.tests.compiler.regression.AbstractRegressionTest$JavacTestOptions$Excuse@1f5a1ad4 for compiler org.eclipse.jdt.core.tests.compiler.regression.AbstractRegressionTest$JavacCompiler@7866ffa
02:16:44   MethodVerifyTest>TestCase.runTest:964->test169a:10139->AbstractRegressionTest.runNegativeTest:3507->AbstractRegressionTest.runTest:2920->AbstractRegressionTest.runTest:3195->AbstractRegressionTest.runJavac:2350->AbstractRegressionTest.handleMismatch:2454 test169a: unused excuse org.eclipse.jdt.core.tests.compiler.regression.AbstractRegressionTest$JavacTestOptions$Excuse@1f5a1ad4 for compiler org.eclipse.jdt.core.tests.compiler.regression.AbstractRegressionTest$JavacCompiler@7866ffa
02:16:44   MethodVerifyTest>TestCase.runTest:964->test175:10288->AbstractRegressionTest.runNegativeTest:3507->AbstractRegressionTest.runTest:2920->AbstractRegressionTest.runTest:3195->AbstractRegressionTest.runJavac:2350->AbstractRegressionTest.handleMismatch:2454 test175: unused excuse org.eclipse.jdt.core.tests.compiler.regression.AbstractRegressionTest$JavacTestOptions$Excuse@1f5a1ad4 for compiler org.eclipse.jdt.core.tests.compiler.regression.AbstractRegressionTest$JavacCompiler@7866ffa
02:16:44   MethodVerifyTest>TestCase.runTest:964->test188:10971->AbstractRegressionTest.runNegativeTest:3507->AbstractRegressionTest.runTest:2920->AbstractRegressionTest.runTest:3195->AbstractRegressionTest.runJavac:2350->AbstractRegressionTest.handleMismatch:2454 test188: unused excuse org.eclipse.jdt.core.tests.compiler.regression.AbstractRegressionTest$JavacTestOptions$Excuse@1f5a1ad4 for compiler org.eclipse.jdt.core.tests.compiler.regression.AbstractRegressionTest$JavacCompiler@7866ffa
02:16:44   MethodVerifyTest>TestCase.runTest:964->test201:11429->AbstractRegressionTest.runConformTest:1689->AbstractRegressionTest.runConformTest:1692->AbstractRegressionTest.runTest:2920->AbstractRegressionTest.runTest:3195->AbstractRegressionTest.runJavac:2350->AbstractRegressionTest.handleMismatch:2411->TestCase.assertEquals:242->TestCase.assertStringEquals:266 test201 - Javac found error(s) but Eclipse did not find any.
02:16:44 ----------- Expected ------------
02:16:44 
02:16:44 ------------ but was ------------
02:16:44 A.java:4: error: types J<CAP#1> and K<T3> are incompatible; both define get(), but with unrelated return types\n
02:16:44 interface A<T3 extends K<T3> & J<? extends I>> extends J<I> {}\n
02:16:44             ^\n
02:16:44   where T3 is a type-variable:\n
02:16:44     T3 extends K<T3>,J<? extends I> declared in interface A\n
02:16:44   where CAP#1 is a fresh type-variable:\n
02:16:44     CAP#1 extends I from capture of ? extends I\n
02:16:44 A.java:5: error: types K<T4> and J<CAP#1> are incompatible; both define get(), but with unrelated return types\n
02:16:44 interface B<T4 extends J<? extends I> & K<T4>> extends J<I> {}\n
02:16:44             ^\n
02:16:44   where T4 is a type-variable:\n
02:16:44     T4 extends J<? extends I>,K<T4> declared in interface B\n
02:16:44   where CAP#1 is a fresh type-variable:\n
02:16:44     CAP#1 extends I from capture of ? extends I\n
02:16:44 2 errors\n
02:16:44 
02:16:44 --------- Difference is ----------
02:16:44  expected:<[]> but was:<[A.java:4: error: types J<CAP#1> and K<T3> are incompatible; both define get(), but with unrelated return types\n
02:16:44 interface A<T3 extends K<T3> & J<? extends I>> extends J<I> {}\n
02:16:44             ^\n
02:16:44   where T3 is a type-variable:\n
02:16:44     T3 extends K<T3>,J<? extends I> declared in interface A\n
02:16:44   where CAP#1 is a fresh type-variable:\n
02:16:44     CAP#1 extends I from capture of ? extends I\n
02:16:44 A.java:5: error: types K<T4> and J<CAP#1> are incompatible; both define get(), but with unrelated return types\n
02:16:44 interface B<T4 extends J<? extends I> & K<T4>> extends J<I> {}\n
02:16:44             ^\n
02:16:44   where T4 is a type-variable:\n
02:16:44     T4 extends J<? extends I>,K<T4> declared in interface B\n
02:16:44   where CAP#1 is a fresh type-variable:\n
02:16:44     CAP#1 extends I from capture of ? extends I\n
02:16:44 2 errors\n
02:16:44 ]>
02:16:44   MethodVerifyTest>TestCase.runTest:964->test204:11483->AbstractRegressionTest.runConformTest:1689->AbstractRegressionTest.runConformTest:1692->AbstractRegressionTest.runTest:2920->AbstractRegressionTest.runTest:3195->AbstractRegressionTest.runJavac:2350->AbstractRegressionTest.handleMismatch:2411->TestCase.assertEquals:242->TestCase.assertStringEquals:266 test204 - Javac found error(s) but Eclipse did not find any.
02:16:44 ----------- Expected ------------
02:16:44 
02:16:44 ------------ but was ------------
02:16:44 OverrideBug.java:6: error: name clash: put(K#1,List<V#1>) in OverrideBug overrides a method whose erasure is the same as another method, yet neither overrides the other\n
02:16:44 public List<V> put(final K arg0, final List<V> arg1) {\n
02:16:44                ^\n
02:16:44   first method:  put(K#1,V#1) in OverrideBug\n
02:16:44   second method: put(K#2,V#2) in Map\n
02:16:44   where K#1,V#1,K#2,V#2 are type-variables:\n
02:16:44     K#1 extends Object declared in class OverrideBug\n
02:16:44     V#1 extends Object declared in class OverrideBug\n
02:16:44     K#2 extends Object declared in interface Map\n
02:16:44     V#2 extends Object declared in interface Map\n
02:16:44 OverrideBug.java:9: error: name clash: put(K#1,V#1) in OverrideBug and put(K#2,V#2) in Map have the same erasure, yet neither overrides the other\n
02:16:44 public List<V> put(final K arg0, final V arg1) {\n
02:16:44                ^\n
02:16:44   where K#1,V#1,K#2,V#2 are type-variables:\n
02:16:44     K#1 extends Object declared in class OverrideBug\n
02:16:44     V#1 extends Object declared in class OverrideBug\n
02:16:44     K#2 extends Object declared in interface Map\n
02:16:44     V#2 extends Object declared in interface Map\n
02:16:44 2 errors\n
02:16:44 
02:16:44 --------- Difference is ----------
02:16:44  expected:<[]> but was:<[OverrideBug.java:6: error: name clash: put(K#1,List<V#1>) in OverrideBug overrides a method whose erasure is the same as another method, yet neither overrides the other\n
02:16:44 public List<V> put(final K arg0, final List<V> arg1) {\n
02:16:44                ^\n
02:16:44   first method:  put(K#1,V#1) in OverrideBug\n
02:16:44   second method: put(K#2,V#2) in Map\n
02:16:44   where K#1,V#1,K#2,V#2 are type-variables:\n
02:16:44     K#1 extends Object declared in class OverrideBug\n
02:16:44     V#1 extends Object declared in class OverrideBug\n
02:16:44     K#2 extends Object declared in interface Map\n
02:16:44     V#2 extends Object declared in interface Map\n
02:16:44 OverrideBug.java:9: error: name clash: put(K#1,V#1) in OverrideBug and put(K#2,V#2) in Map have the same erasure, yet neither overrides the other\n
02:16:44 public List<V> put(final K arg0, final V arg1) {\n
02:16:44                ^\n
02:16:44   where K#1,V#1,K#2,V#2 are type-variables:\n
02:16:44     K#1 extends Object declared in class OverrideBug\n
02:16:44     V#1 extends Object declared in class OverrideBug\n
02:16:44     K#2 extends Object declared in interface Map\n
02:16:44     V#2 extends Object declared in interface Map\n
02:16:44 2 errors\n
02:16:44 ]>
02:16:44   MethodVerifyTest>TestCase.runTest:964->test329588:12170->AbstractRegressionTest.runConformTest:1822->AbstractRegressionTest.runTest:2920->AbstractRegressionTest.runTest:3195->AbstractRegressionTest.runJavac:2350->AbstractRegressionTest.handleMismatch:2411->TestCase.assertEquals:242->TestCase.assertStringEquals:266 test329588 - Javac found error(s) but Eclipse did not find any.
02:16:44 ----------- Expected ------------
02:16:44 
02:16:44 ------------ but was ------------
02:16:44 ./A.java:2: error: type O does not take parameters\n
02:16:44 	public O<?> foo() {\n
02:16:44 	        ^\n
02:16:44 X.java:3: warning: [cast] redundant cast to <any>\n
02:16:44 		O o = (O) a.foo();\n
02:16:44 		      ^\n
02:16:44 1 error\n
02:16:44 1 warning\n
02:16:44 
02:16:44 --------- Difference is ----------
02:16:44  expected:<[]> but was:<[./A.java:2: error: type O does not take parameters\n
02:16:44 	public O<?> foo() {\n
02:16:44 	        ^\n
02:16:44 X.java:3: warning: [cast] redundant cast to <any>\n
02:16:44 		O o = (O) a.foo();\n
02:16:44 		      ^\n
02:16:44 1 error\n
02:16:44 1 warning\n
02:16:44 ]>
02:16:44   MethodVerifyTest>TestCase.runTest:964->test330435:12264->AbstractRegressionTest.runNegativeTest:2592->AbstractRegressionTest.runNegativeTest:2601->AbstractRegressionTest.runTest:2920->AbstractRegressionTest.runTest:3195->AbstractRegressionTest.runJavac:2350->AbstractRegressionTest.handleMismatch:2407->TestCase.assertEquals:242->TestCase.assertStringEquals:266 test330435 - Eclipse found error(s) but Javac only found warning(s).
02:16:44 ----------- Expected ------------
02:16:44 ----------\n
02:16:44 1. ERROR in X.java (at line 3)\n
02:16:44 	String[] a = A.asList(args).toArray(new String[0]);\n
02:16:44 	             ^^^^^^^^^^^^^^^^^^^^^^^^^^^^^^^^^^^^^\n
02:16:44 Type mismatch: cannot convert from Object[] to String[]\n
02:16:44 ----------\n
02:16:44 
02:16:44 ------------ but was ------------
02:16:44 ./A.java:2: warning: [unchecked] Possible heap pollution from parameterized vararg type T\n
02:16:44 	public static <T> B<T> asList(T... tab) {\n
02:16:44 	                                   ^\n
02:16:44   where T is a type-variable:\n
02:16:44     T extends Object declared in method <T>asList(T...)\n
02:16:44 1 warning\n
02:16:44 
02:16:44 --------- Difference is ----------
02:16:44  expected:<[----------\n
02:16:44 1. ERROR in X.java (at line 3)\n
02:16:44 	String[] a = A.asList(args).toArray(new String[0]);\n
02:16:44 	             ^^^^^^^^^^^^^^^^^^^^^^^^^^^^^^^^^^^^^\n
02:16:44 Type mismatch: cannot convert from Object[] to String[]\n
02:16:44 ----------]\n
02:16:44 > but was:<[./A.java:2: warning: [unchecked] Possible heap pollution from parameterized vararg type T\n
02:16:44 	public static <T> B<T> asList(T... tab) {\n
02:16:44 	                                   ^\n
02:16:44   where T is a type-variable:\n
02:16:44     T extends Object declared in method <T>asList(T...)\n
02:16:44 1 warning]\n
02:16:44 >
02:16:44   MethodVerifyTest>TestCase.runTest:964->test330445:12216->AbstractRegressionTest.runConformTest:1822->AbstractRegressionTest.runTest:2920->AbstractRegressionTest.runTest:3195->AbstractRegressionTest.runJavac:2350->AbstractRegressionTest.handleMismatch:2411->TestCase.assertEquals:242->TestCase.assertStringEquals:266 test330445 - Javac found error(s) but Eclipse did not find any.
02:16:44 ----------- Expected ------------
02:16:44 
02:16:44 ------------ but was ------------
02:16:44 X.java:4: error: incompatible types: Properties cannot be converted to Map<String,String>\n
02:16:44         Y.foo(new Properties());\n
02:16:44               ^\n
02:16:44 Note: Some messages have been simplified; recompile with -Xdiags:verbose to get full output\n
02:16:44 1 error\n
02:16:44 
02:16:44 --------- Difference is ----------
02:16:44  expected:<[]> but was:<[X.java:4: error: incompatible types: Properties cannot be converted to Map<String,String>\n
02:16:44         Y.foo(new Properties());\n
02:16:44               ^\n
02:16:44 Note: Some messages have been simplified; recompile with -Xdiags:verbose to get full output\n
02:16:44 1 error\n
02:16:44 ]>
02:16:44   MethodVerifyTest>TestCase.runTest:964->test331446:12374->AbstractRegressionTest.runConformTest:1822->AbstractRegressionTest.runTest:2920->AbstractRegressionTest.runTest:3195->AbstractRegressionTest.runJavac:2350->AbstractRegressionTest.handleMismatch:2411->TestCase.assertEquals:242->TestCase.assertStringEquals:266 test331446 - Javac found error(s) but Eclipse did not find any.
02:16:44 ----------- Expected ------------
02:16:44 
02:16:44 ------------ but was ------------
02:16:44 X.java:6: warning: [rawtypes] found raw type: Comparator\n
02:16:44 		Comparator comparator = new Comparator() {\n
02:16:44 		^\n
02:16:44   missing type arguments for generic class Comparator<T>\n
02:16:44   where T is a type-variable:\n
02:16:44     T extends Object declared in interface Comparator\n
02:16:44 X.java:6: warning: [rawtypes] found raw type: Comparator\n
02:16:44 		Comparator comparator = new Comparator() {\n
02:16:44 		                            ^\n
02:16:44   missing type arguments for generic class Comparator<T>\n
02:16:44   where T is a type-variable:\n
02:16:44     T extends Object declared in interface Comparator\n
02:16:44 X.java:12: warning: [rawtypes] found raw type: ArrayList\n
02:16:44 		Test.assertEquals("Test", comparator, new ArrayList(), new ArrayList());\n
02:16:44 		                                          ^\n
02:16:44   missing type arguments for generic class ArrayList<E>\n
02:16:44   where E is a type-variable:\n
02:16:44     E extends Object declared in class ArrayList\n
02:16:44 X.java:12: warning: [rawtypes] found raw type: ArrayList\n
02:16:44 		Test.assertEquals("Test", comparator, new ArrayList(), new ArrayList());\n
02:16:44 		                                                           ^\n
02:16:44   missing type arguments for generic class ArrayList<E>\n
02:16:44   where E is a type-variable:\n
02:16:44     E extends Object declared in class ArrayList\n
02:16:44 X.java:12: error: reference to assertEquals is ambiguous\n
02:16:44 		Test.assertEquals("Test", comparator, new ArrayList(), new ArrayList());\n
02:16:44 		    ^\n
02:16:44   both method <T#1>assertEquals(String,Comparator<T#1>,List<T#1>,List<T#1>) in Test and method <T#2>assertEquals(String,Comparator<T#2>,T#2,T#2) in Test match\n
02:16:44   where T#1,T#2 are type-variables:\n
02:16:44     T#1 extends Object declared in method <T#1>assertEquals(String,Comparator<T#1>,List<T#1>,List<T#1>)\n
02:16:44     T#2 extends Object declared in method <T#2>assertEquals(String,Comparator<T#2>,T#2,T#2)\n
02:16:44 X.java:12: warning: [unchecked] unchecked method invocation: method assertEquals in class Test is applied to given types\n
02:16:44 		Test.assertEquals("Test", comparator, new ArrayList(), new ArrayList());\n
02:16:44 		                 ^\n
02:16:44   required: String,Comparator<T>,List<T>,List<T>\n
02:16:44   found: String,Comparator,ArrayList,ArrayList\n
02:16:44   where T is a type-variable:\n
02:16:44     T extends Object declared in method <T>assertEquals(String,Comparator<T>,List<T>,List<T>)\n
02:16:44 X.java:12: warning: [unchecked] unchecked conversion\n
02:16:44 		Test.assertEquals("Test", comparator, new ArrayList(), new ArrayList());\n
02:16:44 		                          ^\n
02:16:44   required: Comparator<T>\n
02:16:44   found:    Comparator\n
02:16:44   where T is a type-variable:\n
02:16:44     T extends Object declared in method <T>assertEquals(String,Comparator<T>,List<T>,List<T>)\n
02:16:44 X.java:12: warning: [unchecked] unchecked conversion\n
02:16:44 		Test.assertEquals("Test", comparator, new ArrayList(), new ArrayList());\n
02:16:44 		                                      ^\n
02:16:44   required: List<T>\n
02:16:44   found:    ArrayList\n
02:16:44   where T is a type-variable:\n
02:16:44     T extends Object declared in method <T>assertEquals(String,Comparator<T>,List<T>,List<T>)\n
02:16:44 X.java:12: warning: [unchecked] unchecked conversion\n
02:16:44 		Test.assertEquals("Test", comparator, new ArrayList(), new ArrayList());\n
02:16:44 		                                                       ^\n
02:16:44   required: List<T>\n
02:16:44   found:    ArrayList\n
02:16:44   where T is a type-variable:\n
02:16:44     T extends Object declared in method <T>assertEquals(String,Comparator<T>,List<T>,List<T>)\n
02:16:44 1 error\n
02:16:44 8 warnings\n
02:16:44 
02:16:44 --------- Difference is ----------
02:16:44  expected:<[]> but was:<[X.java:6: warning: [rawtypes] found raw type: Comparator\n
02:16:44 		Comparator comparator = new Comparator() {\n
02:16:44 		^\n
02:16:44   missing type arguments for generic class Comparator<T>\n
02:16:44   where T is a type-variable:\n
02:16:44     T extends Object declared in interface Comparator\n
02:16:44 X.java:6: warning: [rawtypes] found raw type: Comparator\n
02:16:44 		Comparator comparator = new Comparator() {\n
02:16:44 		                            ^\n
02:16:44   missing type arguments for generic class Comparator<T>\n
02:16:44   where T is a type-variable:\n
02:16:44     T extends Object declared in interface Comparator\n
02:16:44 X.java:12: warning: [rawtypes] found raw type: ArrayList\n
02:16:44 		Test.assertEquals("Test", comparator, new ArrayList(), new ArrayList());\n
02:16:44 		                                          ^\n
02:16:44   missing type arguments for generic class ArrayList<E>\n
02:16:44   where E is a type-variable:\n
02:16:44     E extends Object declared in class ArrayList\n
02:16:44 X.java:12: warning: [rawtypes] found raw type: ArrayList\n
02:16:44 		Test.assertEquals("Test", comparator, new ArrayList(), new ArrayList());\n
02:16:44 		                                                           ^\n
02:16:44   missing type arguments for generic class ArrayList<E>\n
02:16:44   where E is a type-variable:\n
02:16:44     E extends Object declared in class ArrayList\n
02:16:44 X.java:12: error: reference to assertEquals is ambiguous\n
02:16:44 		Test.assertEquals("Test", comparator, new ArrayList(), new ArrayList());\n
02:16:44 		    ^\n
02:16:44   both method <T#1>assertEquals(String,Comparator<T#1>,List<T#1>,List<T#1>) in Test and method <T#2>assertEquals(String,Comparator<T#2>,T#2,T#2) in Test match\n
02:16:44   where T#1,T#2 are type-variables:\n
02:16:44     T#1 extends Object declared in method <T#1>assertEquals(String,Comparator<T#1>,List<T#1>,List<T#1>)\n
02:16:44     T#2 extends Object declared in method <T#2>assertEquals(String,Comparator<T#2>,T#2,T#2)\n
02:16:44 X.java:12: warning: [unchecked] unchecked method invocation: method assertEquals in class Test is applied to given types\n
02:16:44 		Test.assertEquals("Test", comparator, new ArrayList(), new ArrayList());\n
02:16:44 		                 ^\n
02:16:44   required: String,Comparator<T>,List<T>,List<T>\n
02:16:44   found: String,Comparator,ArrayList,ArrayList\n
02:16:44   where T is a type-variable:\n
02:16:44     T extends Object declared in method <T>assertEquals(String,Comparator<T>,List<T>,List<T>)\n
02:16:44 X.java:12: warning: [unchecked] unchecked conversion\n
02:16:44 		Test.assertEquals("Test", comparator, new ArrayList(), new ArrayList());\n
02:16:44 		                          ^\n
02:16:44   required: Comparator<T>\n
02:16:44   found:    Comparator\n
02:16:44   where T is a type-variable:\n
02:16:44     T extends Object declared in method <T>assertEquals(String,Comparator<T>,List<T>,List<T>)\n
02:16:44 X.java:12: warning: [unchecked] unchecked conversion\n
02:16:44 		Test.assertEquals("Test", comparator, new ArrayList(), new ArrayList());\n
02:16:44 		                                      ^\n
02:16:44   required: List<T>\n
02:16:44   found:    ArrayList\n
02:16:44   where T is a type-variable:\n
02:16:44     T extends Object declared in method <T>assertEquals(String,Comparator<T>,List<T>,List<T>)\n
02:16:44 X.java:12: warning: [unchecked] unchecked conversion\n
02:16:44 		Test.assertEquals("Test", comparator, new ArrayList(), new ArrayList());\n
02:16:44 		                                                       ^\n
02:16:44   required: List<T>\n
02:16:44   found:    ArrayList\n
02:16:44   where T is a type-variable:\n
02:16:44     T extends Object declared in method <T>assertEquals(String,Comparator<T>,List<T>,List<T>)\n
02:16:44 1 error\n
02:16:44 8 warnings\n
02:16:44 ]>
02:16:44   MethodVerifyTest>TestCase.runTest:964->testBug536978_comment2:14394->AbstractRegressionTest.runNegativeTest:2474->AbstractRegressionTest.runNegativeTest:2485->AbstractRegressionTest.runTest:2920->AbstractRegressionTest.runTest:3195->AbstractRegressionTest.runJavac:2350->AbstractRegressionTest.handleMismatch:2407->TestCase.assertEquals:242->TestCase.assertStringEquals:266 testBug536978_comment2 - Eclipse found error(s) but Javac only found warning(s).
02:16:44 ----------- Expected ------------
02:16:44 ----------\n
02:16:44 1. ERROR in SimpleDemo.java (at line 22)\n
02:16:44 	protected SimpleResult test(AbstractResult request) {\n
02:16:44 	          ^^^^^^^^^^^^\n
02:16:44 The return type is incompatible with AbstractDemo<Request,Response>.test(Request)\n
02:16:44 ----------\n
02:16:44 
02:16:44 ------------ but was ------------
02:16:44 SimpleDemo.java:22: warning: [unchecked] test(AbstractResult) in SimpleDemo overrides test(Request) in AbstractDemo\n
02:16:44     protected SimpleResult test(AbstractResult request) {\n
02:16:44                            ^\n
02:16:44   return type requires unchecked conversion from SimpleResult to Response#2\n
02:16:44   where Request,Response#1,Response#2 are type-variables:\n
02:16:44     Request extends AbstractResult declared in class AbstractDemo\n
02:16:44     Response#1 extends AbstractResult declared in class AbstractDemo\n
02:16:44     Response#2 extends AbstractResult declared in class SimpleDemo\n
02:16:44 1 warning\n
02:16:44 
02:16:44 --------- Difference is ----------
02:16:44  expected:<[----------\n
02:16:44 1. ERROR in SimpleDemo.java (at line 22)\n
02:16:44 	protected SimpleResult test(AbstractResult request) {\n
02:16:44 	          ^^^^^^^^^^^^\n
02:16:44 The return type is incompatible with AbstractDemo<Request,Response>.test(Request)\n
02:16:44 ----------]\n
02:16:44 > but was:<[SimpleDemo.java:22: warning: [unchecked] test(AbstractResult) in SimpleDemo overrides test(Request) in AbstractDemo\n
02:16:44     protected SimpleResult test(AbstractResult request) {\n
02:16:44                            ^\n
02:16:44   return type requires unchecked conversion from SimpleResult to Response#2\n
02:16:44   where Request,Response#1,Response#2 are type-variables:\n
02:16:44     Request extends AbstractResult declared in class AbstractDemo\n
02:16:44     Response#1 extends AbstractResult declared in class AbstractDemo\n
02:16:44     Response#2 extends AbstractResult declared in class SimpleDemo\n
02:16:44 1 warning]\n
02:16:44 >
02:16:44   NegativeTypeAnnotationTest>TestCase.runTest:964->test420038:4167->AbstractRegressionTest.runNegativeTest:2474->AbstractRegressionTest.runNegativeTest:2485->AbstractRegressionTest.runTest:2920->AbstractRegressionTest.runTest:3195->AbstractRegressionTest.runJavac:2350->AbstractRegressionTest.handleMismatch:2403->TestCase.assertEquals:242->TestCase.assertStringEquals:266 test420038 - Eclipse found error(s) but Javac did not find any.
02:16:44 ----------- Expected ------------
02:16:44 
02:16:44 ------------ but was ------------
02:16:44 ----------\n
02:16:44 1. ERROR in X.java (at line 8)\n
02:16:44 	Class<?> c = int @T [].class; \n
02:16:44 	                 ^^\n
02:16:44 Syntax error, type annotations are illegal here\n
02:16:44 ----------\n
02:16:44 
02:16:44 --------- Difference is ----------
02:16:44  expected:<[]> but was:<[----------\n
02:16:44 1. ERROR in X.java (at line 8)\n
02:16:44 	Class<?> c = int @T [].class; \n
02:16:44 	                 ^^\n
02:16:44 Syntax error, type annotations are illegal here\n
02:16:44 ----------\n
02:16:44 ]>
02:16:44   NullAnnotationTest>TestCase.runTest:964->testBug452780:7989->AbstractNullAnnotationTest.runConformTestWithLibs:181->AbstractNullAnnotationTest.runConformTestWithLibs:199->AbstractRegressionTest.runConformTest:3409->AbstractRegressionTest.runTest:2920->AbstractRegressionTest.runTest:3195->AbstractRegressionTest.runJavac:2350->AbstractRegressionTest.handleMismatch:2423->TestCase.assertEquals:242->TestCase.assertStringEquals:266 testBug452780 - Javac found warning(s) but Eclipse did not find any.
02:16:44 ----------- Expected ------------
02:16:44 
02:16:44 ------------ but was ------------
02:16:44 Tools2.java:12: warning: [varargs] Varargs method could cause heap pollution from non-reifiable varargs parameter ts\n
02:16:44 		List<@NonNull T> res = Arrays.asList(ts);\n
02:16:44 		                                     ^\n
02:16:44 1 warning\n
02:16:44 
02:16:44 --------- Difference is ----------
02:16:44  expected:<[]> but was:<[Tools2.java:12: warning: [varargs] Varargs method could cause heap pollution from non-reifiable varargs parameter ts\n
02:16:44 		List<@NonNull T> res = Arrays.asList(ts);\n
02:16:44 		                                     ^\n
02:16:44 1 warning\n
02:16:44 ]>
02:16:44   NullAnnotationTest>TestCase.runTest:964->test_default_nullness_002_custom:2354->AbstractRegressionTest.access$0:3038->AbstractRegressionTest.runTest:3195->AbstractRegressionTest.runJavac:2350->AbstractRegressionTest.handleMismatch:2403->TestCase.assertEquals:242->TestCase.assertStringEquals:266 test_default_nullness_002_custom - Eclipse found error(s) but Javac did not find any.
02:16:44 ----------- Expected ------------
02:16:44 
02:16:44 ------------ but was ------------
02:16:44 ----------\n
02:16:44 1. ERROR in Y.java (at line 5)\n
02:16:44 	@Nullable Object getObject(Object o) {\n
02:16:44 	^^^^^^^^^^^^^^^^\n
02:16:44 The return type is incompatible with '@NonNull Object' returned from X.getObject(Object) (mismatching null constraints)\n
02:16:44 ----------\n
02:16:44 2. ERROR in Y.java (at line 5)\n
02:16:44 	@Nullable Object getObject(Object o) {\n
02:16:44 	                           ^^^^^^\n
02:16:44 Illegal redefinition of parameter o, inherited method from X declares this parameter as @Nullable\n
02:16:44 ----------\n
02:16:44 
02:16:44 --------- Difference is ----------
02:16:44  expected:<[]> but was:<[----------\n
02:16:44 1. ERROR in Y.java (at line 5)\n
02:16:44 	@Nullable Object getObject(Object o) {\n
02:16:44 	^^^^^^^^^^^^^^^^\n
02:16:44 The return type is incompatible with '@NonNull Object' returned from X.getObject(Object) (mismatching null constraints)\n
02:16:44 ----------\n
02:16:44 2. ERROR in Y.java (at line 5)\n
02:16:44 	@Nullable Object getObject(Object o) {\n
02:16:44 	                           ^^^^^^\n
02:16:44 Illegal redefinition of parameter o, inherited method from X declares this parameter as @Nullable\n
02:16:44 ----------\n
02:16:44 ]>
02:16:44   NullAnnotationTest>TestCase.runTest:964->test_nullable_field_17:5450->AbstractNullAnnotationTest.runNegativeTestWithLibs:175->AbstractNullAnnotationTest.runNegativeTestWithLibs:153->AbstractNullAnnotationTest.runNegativeTestWithLibs:164->AbstractRegressionTest.runNegativeTest:3507->AbstractRegressionTest.runTest:2920->AbstractRegressionTest.runTest:3195->AbstractRegressionTest.runJavac:2350->AbstractRegressionTest.handleMismatch:2419->TestCase.assertEquals:242->TestCase.assertStringEquals:266 test_nullable_field_17 - Eclipse found warning(s) but Javac did not find any.
02:16:44 ----------- Expected ------------
02:16:44 
02:16:44 ------------ but was ------------
02:16:44 ----------\n
02:16:44 1. INFO in X.java (at line 5)\n
02:16:44 	return this.o.toString();\n
02:16:44 	            ^\n
02:16:44 Potential null pointer access: this expression has a '@Nullable' type\n
02:16:44 ----------\n
02:16:44 
02:16:44 --------- Difference is ----------
02:16:44  expected:<[]> but was:<[----------\n
02:16:44 1. INFO in X.java (at line 5)\n
02:16:44 	return this.o.toString();\n
02:16:44 	            ^\n
02:16:44 Potential null pointer access: this expression has a '@Nullable' type\n
02:16:44 ----------\n
02:16:44 ]>
02:16:44   NullTypeAnnotationTest>TestCase.runTest:964->testBug446442_4:7444->AbstractNullAnnotationTest.runConformTestWithLibs:181->AbstractNullAnnotationTest.runConformTestWithLibs:199->AbstractRegressionTest.runConformTest:3409->AbstractRegressionTest.runTest:2920->AbstractRegressionTest.runTest:3195->AbstractRegressionTest.runJavac:2350->AbstractRegressionTest.handleMismatch:2411->TestCase.assertEquals:242->TestCase.assertStringEquals:266 testBug446442_4 - Javac found error(s) but Eclipse did not find any.
02:16:44 ----------- Expected ------------
02:16:44 
02:16:44 ------------ but was ------------
02:16:44 Test.java:8: error: interface Baz inherits abstract and default for m(Integer) from types Foo and Foo\n
02:16:44 interface Baz extends Foo<Integer, Integer> {}\n
02:16:44 ^\n
02:16:44 1 error\n
02:16:44 
02:16:44 --------- Difference is ----------
02:16:44  expected:<[]> but was:<[Test.java:8: error: interface Baz inherits abstract and default for m(Integer) from types Foo and Foo\n
02:16:44 interface Baz extends Foo<Integer, Integer> {}\n
02:16:44 ^\n
02:16:44 1 error\n
02:16:44 ]>
02:16:44   NullTypeAnnotationTest>TestCase.runTest:964->testBug540264:17720->AbstractNullAnnotationTest.runNegativeTestWithLibs:175->AbstractNullAnnotationTest.runNegativeTestWithLibs:153->AbstractNullAnnotationTest.runNegativeTestWithLibs:164->AbstractRegressionTest.runNegativeTest:3507->AbstractRegressionTest.runTest:2920->AbstractRegressionTest.runTest:3195->AbstractRegressionTest.runJavac:2350->AbstractRegressionTest.handleMismatch:2454 testBug540264: unused excuse org.eclipse.jdt.core.tests.compiler.regression.AbstractRegressionTest$JavacTestOptions$Excuse@58fcb07b for compiler org.eclipse.jdt.core.tests.compiler.regression.AbstractRegressionTest$JavacCompiler@7866ffa
02:16:44   NullTypeAnnotationTest>TestCase.runTest:964->testDefault04_bin:5292->AbstractRegressionTest.access$0:3038->AbstractRegressionTest.runTest:3195->AbstractRegressionTest.runJavac:2350->AbstractRegressionTest.handleMismatch:2403->TestCase.assertEquals:242->TestCase.assertStringEquals:266 testDefault04_bin - Eclipse found error(s) but Javac did not find any.
02:16:44 ----------- Expected ------------
02:16:44 
02:16:44 ------------ but was ------------
02:16:44 ----------\n
02:16:44 1. ERROR in Y.java (at line 3)\n
02:16:44 	x.field = null; // ERR\n
02:16:44 	          ^^^^\n
02:16:44 Null type mismatch: required '@NonNull Number' but the provided value is null\n
02:16:44 ----------\n
02:16:44 
02:16:44 --------- Difference is ----------
02:16:44  expected:<[]> but was:<[----------\n
02:16:44 1. ERROR in Y.java (at line 3)\n
02:16:44 	x.field = null; // ERR\n
02:16:44 	          ^^^^\n
02:16:44 Null type mismatch: required '@NonNull Number' but the provided value is null\n
02:16:44 ----------\n
02:16:44 ]>
02:16:44   NullTypeAnnotationTest>TestCase.runTest:964->testDefault05_custom:4971->AbstractRegressionTest.access$0:3038->AbstractRegressionTest.runTest:3195->AbstractRegressionTest.runJavac:2350->AbstractRegressionTest.handleMismatch:2403->TestCase.assertEquals:242->TestCase.assertStringEquals:266 testDefault05_custom - Eclipse found error(s) but Javac did not find any.
02:16:44 ----------- Expected ------------
02:16:44 
02:16:44 ------------ but was ------------
02:16:44 ----------\n
02:16:44 1. ERROR in test\X.java (at line 3)\n
02:16:44 	Number field; // ERR since uninitialized\n
02:16:44 	       ^^^^^\n
02:16:44 The @NonNull field field may not have been initialized\n
02:16:44 ----------\n
02:16:44 
02:16:44 --------- Difference is ----------
02:16:44  expected:<[]> but was:<[----------\n
02:16:44 1. ERROR in test\X.java (at line 3)\n
02:16:44 	Number field; // ERR since uninitialized\n
02:16:44 	       ^^^^^\n
02:16:44 The @NonNull field field may not have been initialized\n
02:16:44 ----------\n
02:16:44 ]>
02:16:44   NullTypeAnnotationTest>TestCase.runTest:964->testDefault05_custom2:5016->AbstractRegressionTest.access$0:3038->AbstractRegressionTest.runTest:3195->AbstractRegressionTest.runJavac:2350->AbstractRegressionTest.handleMismatch:2403->TestCase.assertEquals:242->TestCase.assertStringEquals:266 testDefault05_custom2 - Eclipse found error(s) but Javac did not find any.
02:16:44 ----------- Expected ------------
02:16:44 
02:16:44 ------------ but was ------------
02:16:44 ----------\n
02:16:44 1. ERROR in test\X.java (at line 3)\n
02:16:44 	Number field; // ERR since uninitialized\n
02:16:44 	       ^^^^^\n
02:16:44 The @NonNull field field may not have been initialized\n
02:16:44 ----------\n
02:16:44 
02:16:44 --------- Difference is ----------
02:16:44  expected:<[]> but was:<[----------\n
02:16:44 1. ERROR in test\X.java (at line 3)\n
02:16:44 	Number field; // ERR since uninitialized\n
02:16:44 	       ^^^^^\n
02:16:44 The @NonNull field field may not have been initialized\n
02:16:44 ----------\n
02:16:44 ]>
02:16:44   PolymorphicSignatureTest>TestCase.runTest:964->testBug475996:91->AbstractRegressionTest.runConformTest:1636->AbstractRegressionTest.runTest:2920->AbstractRegressionTest.runTest:3195->AbstractRegressionTest.runJavac:2350->AbstractRegressionTest.handleMismatch:2411->TestCase.assertEquals:242->TestCase.assertStringEquals:266 testBug475996 - Javac found error(s) but Eclipse did not find any.
02:16:44 ----------- Expected ------------
02:16:44 
02:16:44 ------------ but was ------------
02:16:44 X.java:1: error: cannot find symbol\n
02:16:44 import java.lang.invoke.VarHandle;\n
02:16:44                        ^\n
02:16:44   symbol:   class VarHandle\n
02:16:44   location: package java.lang.invoke\n
02:16:44 X.java:5: error: cannot find symbol\n
02:16:44 	VarHandle RESULT;\n
02:16:44 	^\n
02:16:44   symbol:   class VarHandle\n
02:16:44   location: class X<T>\n
02:16:44   where T is a type-variable:\n
02:16:44     T extends Object declared in class X\n
02:16:44 2 errors\n
02:16:44 
02:16:44 --------- Difference is ----------
02:16:44  expected:<[]> but was:<[X.java:1: error: cannot find symbol\n
02:16:44 import java.lang.invoke.VarHandle;\n
02:16:44                        ^\n
02:16:44   symbol:   class VarHandle\n
02:16:44   location: package java.lang.invoke\n
02:16:44 X.java:5: error: cannot find symbol\n
02:16:44 	VarHandle RESULT;\n
02:16:44 	^\n
02:16:44   symbol:   class VarHandle\n
02:16:44   location: class X<T>\n
02:16:44   where T is a type-variable:\n
02:16:44     T extends Object declared in class X\n
02:16:44 2 errors\n
02:16:44 ]>
02:16:44   ProblemConstructorTest>TestCase.runTest:964->test004:151->AbstractRegressionTest.runNegativeTest:2474->AbstractRegressionTest.runNegativeTest:2485->AbstractRegressionTest.runTest:2920->AbstractRegressionTest.runTest:3195->AbstractRegressionTest.runJavac:2350->AbstractRegressionTest.handleMismatch:2419->TestCase.assertEquals:242->TestCase.assertStringEquals:266 test004 - Eclipse found warning(s) but Javac did not find any.
02:16:44 ----------- Expected ------------
02:16:44 
02:16:44 ------------ but was ------------
02:16:44 ----------\n
02:16:44 1. WARNING in X.java (at line 4)\n
02:16:44 	public int unusedMethod() { return this.state; }\n
02:16:44 	           ^^^^^^^^^^^^^^\n
02:16:44 The method unusedMethod() from the type X.M is never used locally\n
02:16:44 ----------\n
02:16:44 2. WARNING in X.java (at line 5)\n
02:16:44 	public M (int state) { this.state = state;} \n
02:16:44 	       ^^^^^^^^^^^^^\n
02:16:44 The constructor X.M(int) is never used locally\n
02:16:44 ----------\n
02:16:44 3. WARNING in X.java (at line 6)\n
02:16:44 	public int unusedField = 0;\n
02:16:44 	           ^^^^^^^^^^^\n
02:16:44 The value of the field X.M.unusedField is not used\n
02:16:44 ----------\n
02:16:44 4. WARNING in X.java (at line 7)\n
02:16:44 	public class N {}\n
02:16:44 	             ^\n
02:16:44 The type X.M.N is never used locally\n
02:16:44 ----------\n
02:16:44 
02:16:44 --------- Difference is ----------
02:16:44  expected:<[]> but was:<[----------\n
02:16:44 1. WARNING in X.java (at line 4)\n
02:16:44 	public int unusedMethod() { return this.state; }\n
02:16:44 	           ^^^^^^^^^^^^^^\n
02:16:44 The method unusedMethod() from the type X.M is never used locally\n
02:16:44 ----------\n
02:16:44 2. WARNING in X.java (at line 5)\n
02:16:44 	public M (int state) { this.state = state;} \n
02:16:44 	       ^^^^^^^^^^^^^\n
02:16:44 The constructor X.M(int) is never used locally\n
02:16:44 ----------\n
02:16:44 3. WARNING in X.java (at line 6)\n
02:16:44 	public int unusedField = 0;\n
02:16:44 	           ^^^^^^^^^^^\n
02:16:44 The value of the field X.M.unusedField is not used\n
02:16:44 ----------\n
02:16:44 4. WARNING in X.java (at line 7)\n
02:16:44 	public class N {}\n
02:16:44 	             ^\n
02:16:44 The type X.M.N is never used locally\n
02:16:44 ----------\n
02:16:44 ]>
02:16:44   ProblemConstructorTest>TestCase.runTest:964->test005:223->AbstractRegressionTest.runNegativeTest:2474->AbstractRegressionTest.runNegativeTest:2485->AbstractRegressionTest.runTest:2920->AbstractRegressionTest.runTest:3195->AbstractRegressionTest.runJavac:2350->AbstractRegressionTest.handleMismatch:2419->TestCase.assertEquals:242->TestCase.assertStringEquals:266 test005 - Eclipse found warning(s) but Javac did not find any.
02:16:44 ----------- Expected ------------
02:16:44 
02:16:44 ------------ but was ------------
02:16:44 ----------\n
02:16:44 1. WARNING in A.java (at line 3)\n
02:16:44 	B.test();\n
02:16:44 	^^^^^^^^\n
02:16:44 Access to enclosing method test() from the type A.B is emulated by a synthetic accessor method\n
02:16:44 ----------\n
02:16:44 
02:16:44 --------- Difference is ----------
02:16:44  expected:<[]> but was:<[----------\n
02:16:44 1. WARNING in A.java (at line 3)\n
02:16:44 	B.test();\n
02:16:44 	^^^^^^^^\n
02:16:44 Access to enclosing method test() from the type A.B is emulated by a synthetic accessor method\n
02:16:44 ----------\n
02:16:44 ]>
02:16:44   ProblemConstructorTest>TestCase.runTest:964->test006:256->AbstractRegressionTest.runNegativeTest:2474->AbstractRegressionTest.runNegativeTest:2485->AbstractRegressionTest.runTest:2920->AbstractRegressionTest.runTest:3195->AbstractRegressionTest.runJavac:2350->AbstractRegressionTest.handleMismatch:2419->TestCase.assertEquals:242->TestCase.assertStringEquals:266 test006 - Eclipse found warning(s) but Javac did not find any.
02:16:44 ----------- Expected ------------
02:16:44 
02:16:44 ------------ but was ------------
02:16:44 ----------\n
02:16:44 1. WARNING in A.java (at line 3)\n
02:16:44 	B.test();\n
02:16:44 	^^^^^^^^\n
02:16:44 Access to enclosing method test() from the type A.B is emulated by a synthetic accessor method\n
02:16:44 ----------\n
02:16:44 2. WARNING in A.java (at line 8)\n
02:16:44 	public B () { super(""); }\n
02:16:44 	       ^^^^\n
02:16:44 The constructor A.B() is never used locally\n
02:16:44 ----------\n
02:16:44 
02:16:44 --------- Difference is ----------
02:16:44  expected:<[]> but was:<[----------\n
02:16:44 1. WARNING in A.java (at line 3)\n
02:16:44 	B.test();\n
02:16:44 	^^^^^^^^\n
02:16:44 Access to enclosing method test() from the type A.B is emulated by a synthetic accessor method\n
02:16:44 ----------\n
02:16:44 2. WARNING in A.java (at line 8)\n
02:16:44 	public B () { super(""); }\n
02:16:44 	       ^^^^\n
02:16:44 The constructor A.B() is never used locally\n
02:16:44 ----------\n
02:16:44 ]>
02:16:44   ProblemConstructorTest>TestCase.runTest:964->test009:316->AbstractRegressionTest.runNegativeTest:2474->AbstractRegressionTest.runNegativeTest:2485->AbstractRegressionTest.runTest:2920->AbstractRegressionTest.runTest:3195->AbstractRegressionTest.runJavac:2350->AbstractRegressionTest.handleMismatch:2419->TestCase.assertEquals:242->TestCase.assertStringEquals:266 test009 - Eclipse found warning(s) but Javac did not find any.
02:16:44 ----------- Expected ------------
02:16:44 
02:16:44 ------------ but was ------------
02:16:44 ----------\n
02:16:44 1. WARNING in A.java (at line 7)\n
02:16:44 	public B () { super(""); }\n
02:16:44 	       ^^^^\n
02:16:44 The constructor C.B() is never used locally\n
02:16:44 ----------\n
02:16:44 
02:16:44 --------- Difference is ----------
02:16:44  expected:<[]> but was:<[----------\n
02:16:44 1. WARNING in A.java (at line 7)\n
02:16:44 	public B () { super(""); }\n
02:16:44 	       ^^^^\n
02:16:44 The constructor C.B() is never used locally\n
02:16:44 ----------\n
02:16:44 ]>
02:16:44   ProblemConstructorTest>TestCase.runTest:964->test408038a:344->AbstractRegressionTest.runNegativeTest:2592->AbstractRegressionTest.runNegativeTest:2601->AbstractRegressionTest.runTest:2920->AbstractRegressionTest.runTest:3195->AbstractRegressionTest.runJavac:2350->AbstractRegressionTest.handleMismatch:2419->TestCase.assertEquals:242->TestCase.assertStringEquals:266 test408038a - Eclipse found warning(s) but Javac did not find any.
02:16:44 ----------- Expected ------------
02:16:44 
02:16:44 ------------ but was ------------
02:16:44 ----------\n
02:16:44 1. WARNING in X.java (at line 4)\n
02:16:44 	public Y() {}\n
02:16:44 	       ^^^\n
02:16:44 The constructor X.Y() is never used locally\n
02:16:44 ----------\n
02:16:44 
02:16:44 --------- Difference is ----------
02:16:44  expected:<[]> but was:<[----------\n
02:16:44 1. WARNING in X.java (at line 4)\n
02:16:44 	public Y() {}\n
02:16:44 	       ^^^\n
02:16:44 The constructor X.Y() is never used locally\n
02:16:44 ----------\n
02:16:44 ]>
02:16:44   ProblemConstructorTest>TestCase.runTest:964->test408038b:376->AbstractRegressionTest.runNegativeTest:2592->AbstractRegressionTest.runNegativeTest:2601->AbstractRegressionTest.runTest:2920->AbstractRegressionTest.runTest:3195->AbstractRegressionTest.runJavac:2350->AbstractRegressionTest.handleMismatch:2419->TestCase.assertEquals:242->TestCase.assertStringEquals:266 test408038b - Eclipse found warning(s) but Javac did not find any.
02:16:44 ----------- Expected ------------
02:16:44 
02:16:44 ------------ but was ------------
02:16:44 ----------\n
02:16:44 1. WARNING in X.java (at line 4)\n
02:16:44 	public Y() {}\n
02:16:44 	       ^^^\n
02:16:44 The constructor X.Y() is never used locally\n
02:16:44 ----------\n
02:16:44 
02:16:44 --------- Difference is ----------
02:16:44  expected:<[]> but was:<[----------\n
02:16:44 1. WARNING in X.java (at line 4)\n
02:16:44 	public Y() {}\n
02:16:44 	       ^^^\n
02:16:44 The constructor X.Y() is never used locally\n
02:16:44 ----------\n
02:16:44 ]>
02:16:44   ProblemConstructorTest>TestCase.runTest:964->test408038c:408->AbstractRegressionTest.runNegativeTest:2592->AbstractRegressionTest.runNegativeTest:2601->AbstractRegressionTest.runTest:2920->AbstractRegressionTest.runTest:3195->AbstractRegressionTest.runJavac:2350->AbstractRegressionTest.handleMismatch:2423->TestCase.assertEquals:242->TestCase.assertStringEquals:266 test408038c - Javac found warning(s) but Eclipse did not find any.
02:16:44 ----------- Expected ------------
02:16:44 
02:16:44 ------------ but was ------------
02:16:44 X.java:6: warning: [serial] serializable class Y has no definition of serialVersionUID\n
02:16:44 	private static class Y implements Externalizable {\n
02:16:44 	               ^\n
02:16:44 1 warning\n
02:16:44 
02:16:44 --------- Difference is ----------
02:16:44  expected:<[]> but was:<[X.java:6: warning: [serial] serializable class Y has no definition of serialVersionUID\n
02:16:44 	private static class Y implements Externalizable {\n
02:16:44 	               ^\n
02:16:44 1 warning\n
02:16:44 ]>
02:16:44   ProblemConstructorTest>TestCase.runTest:964->test408038e:492->AbstractRegressionTest.runNegativeTest:2474->AbstractRegressionTest.runNegativeTest:2485->AbstractRegressionTest.runTest:2920->AbstractRegressionTest.runTest:3195->AbstractRegressionTest.runJavac:2350->AbstractRegressionTest.handleMismatch:2419->TestCase.assertEquals:242->TestCase.assertStringEquals:266 test408038e - Eclipse found warning(s) but Javac did not find any.
02:16:44 ----------- Expected ------------
02:16:44 
02:16:44 ------------ but was ------------
02:16:44 ----------\n
02:16:44 1. WARNING in X.java (at line 3)\n
02:16:44 	private X(int x) {i = x;}\n
02:16:44 	        ^^^^^^^^\n
02:16:44 The constructor X(int) is never used locally\n
02:16:44 ----------\n
02:16:44 
02:16:44 --------- Difference is ----------
02:16:44  expected:<[]> but was:<[----------\n
02:16:44 1. WARNING in X.java (at line 3)\n
02:16:44 	private X(int x) {i = x;}\n
02:16:44 	        ^^^^^^^^\n
02:16:44 The constructor X(int) is never used locally\n
02:16:44 ----------\n
02:16:44 ]>
02:16:44   ProblemTypeAndMethodTest>TestCase.runTest:964->test376550_11:8188->AbstractRegressionTest.access$0:3038->AbstractRegressionTest.runTest:3195->AbstractRegressionTest.runJavac:2350->AbstractRegressionTest.handleMismatch:2454 test376550_11: unused excuse org.eclipse.jdt.core.tests.compiler.regression.AbstractRegressionTest$JavacTestOptions$Excuse@1f5a1ad4 for compiler org.eclipse.jdt.core.tests.compiler.regression.AbstractRegressionTest$JavacCompiler@7866ffa
02:16:44   ProblemTypeAndMethodTest>TestCase.runTest:964->testBug542829:8789->AbstractRegressionTest.access$0:3038->AbstractRegressionTest.runTest:3195->AbstractRegressionTest.runJavac:2350->AbstractRegressionTest.handleMismatch:2411->TestCase.assertEquals:242->TestCase.assertStringEquals:266 testBug542829 - Javac found error(s) but Eclipse did not find any.
02:16:44 ----------- Expected ------------
02:16:44 
02:16:44 ------------ but was ------------
02:16:44 ./b/Roken.java:4: error: getGood() is not public in Issing; cannot be accessed from outside package\n
02:16:44 		return provider.getGood();\n
02:16:44 		               ^\n
02:16:44 1 error\n
02:16:44 
02:16:44 --------- Difference is ----------
02:16:44  expected:<[]> but was:<[./b/Roken.java:4: error: getGood() is not public in Issing; cannot be accessed from outside package\n
02:16:44 		return provider.getGood();\n
02:16:44 		               ^\n
02:16:44 1 error\n
02:16:44 ]>
02:16:44   ProgrammingProblemsTest>TestCase.runTest:964->test0041:1578->AbstractRegressionTest.runNegativeTest:2474->AbstractRegressionTest.runNegativeTest:2485->AbstractRegressionTest.runTest:2920->AbstractRegressionTest.runTest:3195->AbstractRegressionTest.runJavac:2350->AbstractRegressionTest.handleMismatch:2419->TestCase.assertEquals:242->TestCase.assertStringEquals:266 test0041 - Eclipse found warning(s) but Javac did not find any.
02:16:44 ----------- Expected ------------
02:16:44 
02:16:44 ------------ but was ------------
02:16:44 ----------\n
02:16:44 1. WARNING in X.java (at line 3)\n
02:16:44 	System.out.println(1.0 == 1.0);\n
02:16:44 	                   ^^^^^^^^^^\n
02:16:44 Comparing identical expressions\n
02:16:44 ----------\n
02:16:44 2. WARNING in X.java (at line 4)\n
02:16:44 	System.out.println(1.0f == 1.0f);\n
02:16:44 	                   ^^^^^^^^^^^^\n
02:16:44 Comparing identical expressions\n
02:16:44 ----------\n
02:16:44 
02:16:44 --------- Difference is ----------
02:16:44  expected:<[]> but was:<[----------\n
02:16:44 1. WARNING in X.java (at line 3)\n
02:16:44 	System.out.println(1.0 == 1.0);\n
02:16:44 	                   ^^^^^^^^^^\n
02:16:44 Comparing identical expressions\n
02:16:44 ----------\n
02:16:44 2. WARNING in X.java (at line 4)\n
02:16:44 	System.out.println(1.0f == 1.0f);\n
02:16:44 	                   ^^^^^^^^^^^^\n
02:16:44 Comparing identical expressions\n
02:16:44 ----------\n
02:16:44 ]>
02:16:44   ProgrammingProblemsTest>TestCase.runTest:964->test0044:1657->AbstractRegressionTest.runNegativeTest:2474->AbstractRegressionTest.runNegativeTest:2485->AbstractRegressionTest.runTest:2920->AbstractRegressionTest.runTest:3195->AbstractRegressionTest.runJavac:2350->AbstractRegressionTest.handleMismatch:2419->TestCase.assertEquals:242->TestCase.assertStringEquals:266 test0044 - Eclipse found warning(s) but Javac did not find any.
02:16:44 ----------- Expected ------------
02:16:44 
02:16:44 ------------ but was ------------
02:16:44 ----------\n
02:16:44 1. WARNING in X.java (at line 6)\n
02:16:44 	nvx = nvx;\n
02:16:44 	^^^^^^^^^\n
02:16:44 The assignment to variable nvx has no effect\n
02:16:44 ----------\n
02:16:44 
02:16:44 --------- Difference is ----------
02:16:44  expected:<[]> but was:<[----------\n
02:16:44 1. WARNING in X.java (at line 6)\n
02:16:44 	nvx = nvx;\n
02:16:44 	^^^^^^^^^\n
02:16:44 The assignment to variable nvx has no effect\n
02:16:44 ----------\n
02:16:44 ]>
02:16:44   ProgrammingProblemsTest>TestCase.runTest:964->test0045:1678->AbstractRegressionTest.runNegativeTest:2474->AbstractRegressionTest.runNegativeTest:2485->AbstractRegressionTest.runTest:2920->AbstractRegressionTest.runTest:3195->AbstractRegressionTest.runJavac:2350->AbstractRegressionTest.handleMismatch:2419->TestCase.assertEquals:242->TestCase.assertStringEquals:266 test0045 - Eclipse found warning(s) but Javac did not find any.
02:16:44 ----------- Expected ------------
02:16:44 
02:16:44 ------------ but was ------------
02:16:44 ----------\n
02:16:44 1. WARNING in X.java (at line 2)\n
02:16:44 	volatile int x = this.x;\n
02:16:44 	             ^^^^^^^^^^\n
02:16:44 The assignment to variable x has no effect\n
02:16:44 ----------\n
02:16:44 2. WARNING in X.java (at line 3)\n
02:16:44 	int nvx = this.nvx;\n
02:16:44 	    ^^^^^^^^^^^^^^\n
02:16:44 The assignment to variable nvx has no effect\n
02:16:44 ----------\n
02:16:44 
02:16:44 --------- Difference is ----------
02:16:44  expected:<[]> but was:<[----------\n
02:16:44 1. WARNING in X.java (at line 2)\n
02:16:44 	volatile int x = this.x;\n
02:16:44 	             ^^^^^^^^^^\n
02:16:44 The assignment to variable x has no effect\n
02:16:44 ----------\n
02:16:44 2. WARNING in X.java (at line 3)\n
02:16:44 	int nvx = this.nvx;\n
02:16:44 	    ^^^^^^^^^^^^^^\n
02:16:44 The assignment to variable nvx has no effect\n
02:16:44 ----------\n
02:16:44 ]>
02:16:44   ProgrammingProblemsTest>TestCase.runTest:964->test0046:1706->AbstractRegressionTest.runNegativeTest:2592->AbstractRegressionTest.runNegativeTest:2601->AbstractRegressionTest.runTest:2920->AbstractRegressionTest.runTest:3195->AbstractRegressionTest.runJavac:2350->AbstractRegressionTest.handleMismatch:2419->TestCase.assertEquals:242->TestCase.assertStringEquals:266 test0046 - Eclipse found warning(s) but Javac did not find any.
02:16:44 ----------- Expected ------------
02:16:44 
02:16:44 ------------ but was ------------
02:16:44 ----------\n
02:16:44 1. WARNING in X.java (at line 4)\n
02:16:44 	boolean b=false;\n
02:16:44 	        ^\n
02:16:44 The value of the local variable b is not used\n
02:16:44 ----------\n
02:16:44 2. WARNING in X.java (at line 6)\n
02:16:44 	int k = 2;\n
02:16:44 	    ^\n
02:16:44 The value of the local variable k is not used\n
02:16:44 ----------\n
02:16:44 
02:16:44 --------- Difference is ----------
02:16:44  expected:<[]> but was:<[----------\n
02:16:44 1. WARNING in X.java (at line 4)\n
02:16:44 	boolean b=false;\n
02:16:44 	        ^\n
02:16:44 The value of the local variable b is not used\n
02:16:44 ----------\n
02:16:44 2. WARNING in X.java (at line 6)\n
02:16:44 	int k = 2;\n
02:16:44 	    ^\n
02:16:44 The value of the local variable k is not used\n
02:16:44 ----------\n
02:16:44 ]>
02:16:44   ProgrammingProblemsTest>TestCase.runTest:964->test0046_field:1746->AbstractRegressionTest.runNegativeTest:2592->AbstractRegressionTest.runNegativeTest:2601->AbstractRegressionTest.runTest:2920->AbstractRegressionTest.runTest:3195->AbstractRegressionTest.runJavac:2350->AbstractRegressionTest.handleMismatch:2419->TestCase.assertEquals:242->TestCase.assertStringEquals:266 test0046_field - Eclipse found warning(s) but Javac did not find any.
02:16:44 ----------- Expected ------------
02:16:44 
02:16:44 ------------ but was ------------
02:16:44 ----------\n
02:16:44 1. WARNING in X.java (at line 3)\n
02:16:44 	private boolean b=false;\n
02:16:44 	                ^\n
02:16:44 The value of the field X.b is not used\n
02:16:44 ----------\n
02:16:44 2. WARNING in X.java (at line 4)\n
02:16:44 	private int k = 2;\n
02:16:44 	            ^\n
02:16:44 The value of the field X.k is not used\n
02:16:44 ----------\n
02:16:44 
02:16:44 --------- Difference is ----------
02:16:44  expected:<[]> but was:<[----------\n
02:16:44 1. WARNING in X.java (at line 3)\n
02:16:44 	private boolean b=false;\n
02:16:44 	                ^\n
02:16:44 The value of the field X.b is not used\n
02:16:44 ----------\n
02:16:44 2. WARNING in X.java (at line 4)\n
02:16:44 	private int k = 2;\n
02:16:44 	            ^\n
02:16:44 The value of the field X.k is not used\n
02:16:44 ----------\n
02:16:44 ]>
02:16:44   ProgrammingProblemsTest>TestCase.runTest:964->test0046_field_in_private_type:1865->AbstractRegressionTest.runNegativeTest:2592->AbstractRegressionTest.runNegativeTest:2601->AbstractRegressionTest.runTest:2920->AbstractRegressionTest.runTest:3195->AbstractRegressionTest.runJavac:2350->AbstractRegressionTest.handleMismatch:2419->TestCase.assertEquals:242->TestCase.assertStringEquals:266 test0046_field_in_private_type - Eclipse found warning(s) but Javac did not find any.
02:16:44 ----------- Expected ------------
02:16:44 
02:16:44 ------------ but was ------------
02:16:44 ----------\n
02:16:44 1. WARNING in X.java (at line 4)\n
02:16:44 	public boolean b=false;\n
02:16:44 	               ^\n
02:16:44 The value of the field X.Y.b is not used\n
02:16:44 ----------\n
02:16:44 2. WARNING in X.java (at line 5)\n
02:16:44 	protected int k = 2;\n
02:16:44 	              ^\n
02:16:44 The value of the field X.Y.k is not used\n
02:16:44 ----------\n
02:16:44 
02:16:44 --------- Difference is ----------
02:16:44  expected:<[]> but was:<[----------\n
02:16:44 1. WARNING in X.java (at line 4)\n
02:16:44 	public boolean b=false;\n
02:16:44 	               ^\n
02:16:44 The value of the field X.Y.b is not used\n
02:16:44 ----------\n
02:16:44 2. WARNING in X.java (at line 5)\n
02:16:44 	protected int k = 2;\n
02:16:44 	              ^\n
02:16:44 The value of the field X.Y.k is not used\n
02:16:44 ----------\n
02:16:44 ]>
02:16:44   ProgrammingProblemsTest>TestCase.runTest:964->test0046_field_qualified:1825->AbstractRegressionTest.runNegativeTest:2592->AbstractRegressionTest.runNegativeTest:2601->AbstractRegressionTest.runTest:2920->AbstractRegressionTest.runTest:3195->AbstractRegressionTest.runJavac:2350->AbstractRegressionTest.handleMismatch:2419->TestCase.assertEquals:242->TestCase.assertStringEquals:266 test0046_field_qualified - Eclipse found warning(s) but Javac did not find any.
02:16:44 ----------- Expected ------------
02:16:44 
02:16:44 ------------ but was ------------
02:16:44 ----------\n
02:16:44 1. WARNING in X.java (at line 3)\n
02:16:44 	private boolean b=false;\n
02:16:44 	                ^\n
02:16:44 The value of the field X.b is not used\n
02:16:44 ----------\n
02:16:44 2. WARNING in X.java (at line 4)\n
02:16:44 	private int k = 2;\n
02:16:44 	            ^\n
02:16:44 The value of the field X.k is not used\n
02:16:44 ----------\n
02:16:44 
02:16:44 --------- Difference is ----------
02:16:44  expected:<[]> but was:<[----------\n
02:16:44 1. WARNING in X.java (at line 3)\n
02:16:44 	private boolean b=false;\n
02:16:44 	                ^\n
02:16:44 The value of the field X.b is not used\n
02:16:44 ----------\n
02:16:44 2. WARNING in X.java (at line 4)\n
02:16:44 	private int k = 2;\n
02:16:44 	            ^\n
02:16:44 The value of the field X.k is not used\n
02:16:44 ----------\n
02:16:44 ]>
02:16:44   ProgrammingProblemsTest>TestCase.runTest:964->test0046_field_this_qualified:1785->AbstractRegressionTest.runNegativeTest:2592->AbstractRegressionTest.runNegativeTest:2601->AbstractRegressionTest.runTest:2920->AbstractRegressionTest.runTest:3195->AbstractRegressionTest.runJavac:2350->AbstractRegressionTest.handleMismatch:2419->TestCase.assertEquals:242->TestCase.assertStringEquals:266 test0046_field_this_qualified - Eclipse found warning(s) but Javac did not find any.
02:16:44 ----------- Expected ------------
02:16:44 
02:16:44 ------------ but was ------------
02:16:44 ----------\n
02:16:44 1. WARNING in X.java (at line 3)\n
02:16:44 	private boolean b=false;\n
02:16:44 	                ^\n
02:16:44 The value of the field X.b is not used\n
02:16:44 ----------\n
02:16:44 2. WARNING in X.java (at line 4)\n
02:16:44 	private int k = 2;\n
02:16:44 	            ^\n
02:16:44 The value of the field X.k is not used\n
02:16:44 ----------\n
02:16:44 
02:16:44 --------- Difference is ----------
02:16:44  expected:<[]> but was:<[----------\n
02:16:44 1. WARNING in X.java (at line 3)\n
02:16:44 	private boolean b=false;\n
02:16:44 	                ^\n
02:16:44 The value of the field X.b is not used\n
02:16:44 ----------\n
02:16:44 2. WARNING in X.java (at line 4)\n
02:16:44 	private int k = 2;\n
02:16:44 	            ^\n
02:16:44 The value of the field X.k is not used\n
02:16:44 ----------\n
02:16:44 ]>
02:16:44   ProgrammingProblemsTest>TestCase.runTest:964->test0047:1908->AbstractRegressionTest.runNegativeTest:2592->AbstractRegressionTest.runNegativeTest:2601->AbstractRegressionTest.runTest:2920->AbstractRegressionTest.runTest:3195->AbstractRegressionTest.runJavac:2350->AbstractRegressionTest.handleMismatch:2419->TestCase.assertEquals:242->TestCase.assertStringEquals:266 test0047 - Eclipse found warning(s) but Javac did not find any.
02:16:44 ----------- Expected ------------
02:16:44 
02:16:44 ------------ but was ------------
02:16:44 ----------\n
02:16:44 1. WARNING in X.java (at line 2)\n
02:16:44 	void foo(int param1, int param2, Integer param3) {\n
02:16:44 	             ^^^^^^\n
02:16:44 The value of the parameter param1 is not used\n
02:16:44 ----------\n
02:16:44 2. WARNING in X.java (at line 2)\n
02:16:44 	void foo(int param1, int param2, Integer param3) {\n
02:16:44 	                         ^^^^^^\n
02:16:44 The value of the parameter param2 is not used\n
02:16:44 ----------\n
02:16:44 3. WARNING in X.java (at line 3)\n
02:16:44 	boolean b=false;\n
02:16:44 	        ^\n
02:16:44 The value of the local variable b is not used\n
02:16:44 ----------\n
02:16:44 
02:16:44 --------- Difference is ----------
02:16:44  expected:<[]> but was:<[----------\n
02:16:44 1. WARNING in X.java (at line 2)\n
02:16:44 	void foo(int param1, int param2, Integer param3) {\n
02:16:44 	             ^^^^^^\n
02:16:44 The value of the parameter param1 is not used\n
02:16:44 ----------\n
02:16:44 2. WARNING in X.java (at line 2)\n
02:16:44 	void foo(int param1, int param2, Integer param3) {\n
02:16:44 	                         ^^^^^^\n
02:16:44 The value of the parameter param2 is not used\n
02:16:44 ----------\n
02:16:44 3. WARNING in X.java (at line 3)\n
02:16:44 	boolean b=false;\n
02:16:44 	        ^\n
02:16:44 The value of the local variable b is not used\n
02:16:44 ----------\n
02:16:44 ]>
02:16:44   ProgrammingProblemsTest>TestCase.runTest:964->test0048:1954->AbstractRegressionTest.runNegativeTest:2592->AbstractRegressionTest.runNegativeTest:2601->AbstractRegressionTest.runTest:2920->AbstractRegressionTest.runTest:3195->AbstractRegressionTest.runJavac:2350->AbstractRegressionTest.handleMismatch:2419->TestCase.assertEquals:242->TestCase.assertStringEquals:266 test0048 - Eclipse found warning(s) but Javac did not find any.
02:16:44 ----------- Expected ------------
02:16:44 
02:16:44 ------------ but was ------------
02:16:44 ----------\n
02:16:44 1. WARNING in X.java (at line 3)\n
02:16:44 	boolean b=false;\n
02:16:44 	        ^\n
02:16:44 The value of the local variable b is not used\n
02:16:44 ----------\n
02:16:44 2. WARNING in X.java (at line 9)\n
02:16:44 	public void foo(int param1, int param2) {\n
02:16:44 	                    ^^^^^^\n
02:16:44 The value of the parameter param1 is not used\n
02:16:44 ----------\n
02:16:44 3. WARNING in X.java (at line 9)\n
02:16:44 	public void foo(int param1, int param2) {\n
02:16:44 	                                ^^^^^^\n
02:16:44 The value of the parameter param2 is not used\n
02:16:44 ----------\n
02:16:44 4. WARNING in X.java (at line 10)\n
02:16:44 	boolean b=false;\n
02:16:44 	        ^\n
02:16:44 The value of the local variable b is not used\n
02:16:44 ----------\n
02:16:44 
02:16:44 --------- Difference is ----------
02:16:44  expected:<[]> but was:<[----------\n
02:16:44 1. WARNING in X.java (at line 3)\n
02:16:44 	boolean b=false;\n
02:16:44 	        ^\n
02:16:44 The value of the local variable b is not used\n
02:16:44 ----------\n
02:16:44 2. WARNING in X.java (at line 9)\n
02:16:44 	public void foo(int param1, int param2) {\n
02:16:44 	                    ^^^^^^\n
02:16:44 The value of the parameter param1 is not used\n
02:16:44 ----------\n
02:16:44 3. WARNING in X.java (at line 9)\n
02:16:44 	public void foo(int param1, int param2) {\n
02:16:44 	                                ^^^^^^\n
02:16:44 The value of the parameter param2 is not used\n
02:16:44 ----------\n
02:16:44 4. WARNING in X.java (at line 10)\n
02:16:44 	boolean b=false;\n
02:16:44 	        ^\n
02:16:44 The value of the local variable b is not used\n
02:16:44 ----------\n
02:16:44 ]>
02:16:44   ProgrammingProblemsTest>TestCase.runTest:964->test0049:2019->AbstractRegressionTest.runNegativeTest:2592->AbstractRegressionTest.runNegativeTest:2601->AbstractRegressionTest.runTest:2920->AbstractRegressionTest.runTest:3195->AbstractRegressionTest.runJavac:2350->AbstractRegressionTest.handleMismatch:2419->TestCase.assertEquals:242->TestCase.assertStringEquals:266 test0049 - Eclipse found warning(s) but Javac did not find any.
02:16:44 ----------- Expected ------------
02:16:44 
02:16:44 ------------ but was ------------
02:16:44 ----------\n
02:16:44 1. WARNING in X.java (at line 3)\n
02:16:44 	boolean b=false;\n
02:16:44 	        ^\n
02:16:44 The value of the local variable b is not used\n
02:16:44 ----------\n
02:16:44 2. WARNING in X.java (at line 9)\n
02:16:44 	public void foo(int param1, Integer param3) {\n
02:16:44 	                    ^^^^^^\n
02:16:44 The value of the parameter param1 is not used\n
02:16:44 ----------\n
02:16:44 3. WARNING in X.java (at line 15)\n
02:16:44 	public void foo(int param1, int param2, Integer param3) {\n
02:16:44 	                    ^^^^^^\n
02:16:44 The value of the parameter param1 is not used\n
02:16:44 ----------\n
02:16:44 4. WARNING in X.java (at line 15)\n
02:16:44 	public void foo(int param1, int param2, Integer param3) {\n
02:16:44 	                                ^^^^^^\n
02:16:44 The value of the parameter param2 is not used\n
02:16:44 ----------\n
02:16:44 
02:16:44 --------- Difference is ----------
02:16:44  expected:<[]> but was:<[----------\n
02:16:44 1. WARNING in X.java (at line 3)\n
02:16:44 	boolean b=false;\n
02:16:44 	        ^\n
02:16:44 The value of the local variable b is not used\n
02:16:44 ----------\n
02:16:44 2. WARNING in X.java (at line 9)\n
02:16:44 	public void foo(int param1, Integer param3) {\n
02:16:44 	                    ^^^^^^\n
02:16:44 The value of the parameter param1 is not used\n
02:16:44 ----------\n
02:16:44 3. WARNING in X.java (at line 15)\n
02:16:44 	public void foo(int param1, int param2, Integer param3) {\n
02:16:44 	                    ^^^^^^\n
02:16:44 The value of the parameter param1 is not used\n
02:16:44 ----------\n
02:16:44 4. WARNING in X.java (at line 15)\n
02:16:44 	public void foo(int param1, int param2, Integer param3) {\n
02:16:44 	                                ^^^^^^\n
02:16:44 The value of the parameter param2 is not used\n
02:16:44 ----------\n
02:16:44 ]>
02:16:44   ProgrammingProblemsTest>TestCase.runTest:964->test0050:2075->AbstractRegressionTest.runNegativeTest:2592->AbstractRegressionTest.runNegativeTest:2601->AbstractRegressionTest.runTest:2920->AbstractRegressionTest.runTest:3195->AbstractRegressionTest.runJavac:2350->AbstractRegressionTest.handleMismatch:2419->TestCase.assertEquals:242->TestCase.assertStringEquals:266 test0050 - Eclipse found warning(s) but Javac did not find any.
02:16:44 ----------- Expected ------------
02:16:44 
02:16:44 ------------ but was ------------
02:16:44 ----------\n
02:16:44 1. WARNING in X.java (at line 4)\n
02:16:44 	if (false) {\n
02:16:44         	boolean b=false;\n
02:16:44         	b|=true;\n
02:16:44 		 }\n
02:16:44 	           ^^^^^^^^^^^^^^^^^^^^^^^^^^^^^^^^^^^^^^^^^^^^^^^^^^\n
02:16:44 Dead code\n
02:16:44 ----------\n
02:16:44 2. WARNING in X.java (at line 8)\n
02:16:44 	int k = 2;\n
02:16:44 	    ^\n
02:16:44 The value of the local variable k is not used\n
02:16:44 ----------\n
02:16:44 
02:16:44 --------- Difference is ----------
02:16:44  expected:<[]> but was:<[----------\n
02:16:44 1. WARNING in X.java (at line 4)\n
02:16:44 	if (false) {\n
02:16:44         	boolean b=false;\n
02:16:44         	b|=true;\n
02:16:44 		 }\n
02:16:44 	           ^^^^^^^^^^^^^^^^^^^^^^^^^^^^^^^^^^^^^^^^^^^^^^^^^^\n
02:16:44 Dead code\n
02:16:44 ----------\n
02:16:44 2. WARNING in X.java (at line 8)\n
02:16:44 	int k = 2;\n
02:16:44 	    ^\n
02:16:44 The value of the local variable k is not used\n
02:16:44 ----------\n
02:16:44 ]>
02:16:44   ProgrammingProblemsTest>TestCase.runTest:964->test0051:2117->AbstractRegressionTest.runNegativeTest:2592->AbstractRegressionTest.runNegativeTest:2601->AbstractRegressionTest.runTest:2920->AbstractRegressionTest.runTest:3195->AbstractRegressionTest.runJavac:2350->AbstractRegressionTest.handleMismatch:2419->TestCase.assertEquals:242->TestCase.assertStringEquals:266 test0051 - Eclipse found warning(s) but Javac did not find any.
02:16:44 ----------- Expected ------------
02:16:44 
02:16:44 ------------ but was ------------
02:16:44 ----------\n
02:16:44 1. WARNING in X.java (at line 2)\n
02:16:44 	X(int abc) {\n
02:16:44 	      ^^^\n
02:16:44 The value of the parameter abc is not used\n
02:16:44 ----------\n
02:16:44 
02:16:44 --------- Difference is ----------
02:16:44  expected:<[]> but was:<[----------\n
02:16:44 1. WARNING in X.java (at line 2)\n
02:16:44 	X(int abc) {\n
02:16:44 	      ^^^\n
02:16:44 The value of the parameter abc is not used\n
02:16:44 ----------\n
02:16:44 ]>
02:16:44   ProgrammingProblemsTest>TestCase.runTest:964->test0055:2287->AbstractRegressionTest.runNegativeTest:2592->AbstractRegressionTest.runNegativeTest:2601->AbstractRegressionTest.runTest:2920->AbstractRegressionTest.runTest:3195->AbstractRegressionTest.runJavac:2350->AbstractRegressionTest.handleMismatch:2419->TestCase.assertEquals:242->TestCase.assertStringEquals:266 test0055 - Eclipse found warning(s) but Javac did not find any.
02:16:44 ----------- Expected ------------
02:16:44 
02:16:44 ------------ but was ------------
02:16:44 ----------\n
02:16:44 1. WARNING in test1\E.java (at line 4)\n
02:16:44 	int a= 10;\n
02:16:44 	    ^\n
02:16:44 The value of the local variable a is not used\n
02:16:44 ----------\n
02:16:44 
02:16:44 --------- Difference is ----------
02:16:44  expected:<[]> but was:<[----------\n
02:16:44 1. WARNING in test1\E.java (at line 4)\n
02:16:44 	int a= 10;\n
02:16:44 	    ^\n
02:16:44 The value of the local variable a is not used\n
02:16:44 ----------\n
02:16:44 ]>
02:16:44   ProgrammingProblemsTest>TestCase.runTest:964->test0059:2399->AbstractRegressionTest.runNegativeTest:2592->AbstractRegressionTest.runNegativeTest:2601->AbstractRegressionTest.runTest:2920->AbstractRegressionTest.runTest:3195->AbstractRegressionTest.runJavac:2350->AbstractRegressionTest.handleMismatch:2419->TestCase.assertEquals:242->TestCase.assertStringEquals:266 test0059 - Eclipse found warning(s) but Javac did not find any.
02:16:44 ----------- Expected ------------
02:16:44 
02:16:44 ------------ but was ------------
02:16:44 ----------\n
02:16:44 1. WARNING in X.java (at line 4)\n
02:16:44 	if (a != null){\n
02:16:44         	int j = 3;\n
02:16:44         	j++;\n
02:16:44     	}\n
02:16:44 	              ^^^^^^^^^^^^^^^^^^^^^^^^^^^^^^^^^^^^^^^^^^\n
02:16:44 Dead code\n
02:16:44 ----------\n
02:16:44 2. WARNING in X.java (at line 5)\n
02:16:44 	int j = 3;\n
02:16:44 	    ^\n
02:16:44 The value of the local variable j is not used\n
02:16:44 ----------\n
02:16:44 
02:16:44 --------- Difference is ----------
02:16:44  expected:<[]> but was:<[----------\n
02:16:44 1. WARNING in X.java (at line 4)\n
02:16:44 	if (a != null){\n
02:16:44         	int j = 3;\n
02:16:44         	j++;\n
02:16:44     	}\n
02:16:44 	              ^^^^^^^^^^^^^^^^^^^^^^^^^^^^^^^^^^^^^^^^^^\n
02:16:44 Dead code\n
02:16:44 ----------\n
02:16:44 2. WARNING in X.java (at line 5)\n
02:16:44 	int j = 3;\n
02:16:44 	    ^\n
02:16:44 The value of the local variable j is not used\n
02:16:44 ----------\n
02:16:44 ]>
02:16:44   ProgrammingProblemsTest>TestCase.runTest:964->test0060:2435->AbstractRegressionTest.runNegativeTest:2592->AbstractRegressionTest.runNegativeTest:2601->AbstractRegressionTest.runTest:2920->AbstractRegressionTest.runTest:3195->AbstractRegressionTest.runJavac:2350->AbstractRegressionTest.handleMismatch:2403->TestCase.assertEquals:242->TestCase.assertStringEquals:266 test0060 - Eclipse found error(s) but Javac did not find any.
02:16:44 ----------- Expected ------------
02:16:44 
02:16:44 ------------ but was ------------
02:16:44 ----------\n
02:16:44 1. ERROR in org\eclipse\jdt\internal\compiler\lookup\X.java (at line 7)\n
02:16:44 	if (t1 == t2) { \n
02:16:44 	    ^^^^^^^^\n
02:16:44 The uninterned types TypeBinding and TypeBinding should not be compared using ==/!= operators.\n
02:16:44 ----------\n
02:16:44 2. ERROR in org\eclipse\jdt\internal\compiler\lookup\X.java (at line 9)\n
02:16:44 	if (t1 == t2) {\n
02:16:44 	    ^^^^^^^^\n
02:16:44 The uninterned types TypeBinding and TypeBinding should not be compared using ==/!= operators.\n
02:16:44 ----------\n
02:16:44 3. ERROR in org\eclipse\jdt\internal\compiler\lookup\X.java (at line 16)\n
02:16:44 	if (t1 == t2) { \n
02:16:44 	    ^^^^^^^^\n
02:16:44 The uninterned types TypeBinding and TypeBinding should not be compared using ==/!= operators.\n
02:16:44 ----------\n
02:16:44 4. ERROR in org\eclipse\jdt\internal\compiler\lookup\X.java (at line 18)\n
02:16:44 	if (t1 == t2) {\n
02:16:44 	    ^^^^^^^^\n
02:16:44 The uninterned types TypeBinding and TypeBinding should not be compared using ==/!= operators.\n
02:16:44 ----------\n
02:16:44 5. ERROR in org\eclipse\jdt\internal\compiler\lookup\X.java (at line 28)\n
02:16:44 	if (t1 == t2) { \n
02:16:44 	    ^^^^^^^^\n
02:16:44 The uninterned types TypeBinding and TypeBinding should not be compared using ==/!= operators.\n
02:16:44 ----------\n
02:16:44 
02:16:44 --------- Difference is ----------
02:16:44  expected:<[]> but was:<[----------\n
02:16:44 1. ERROR in org\eclipse\jdt\internal\compiler\lookup\X.java (at line 7)\n
02:16:44 	if (t1 == t2) { \n
02:16:44 	    ^^^^^^^^\n
02:16:44 The uninterned types TypeBinding and TypeBinding should not be compared using ==/!= operators.\n
02:16:44 ----------\n
02:16:44 2. ERROR in org\eclipse\jdt\internal\compiler\lookup\X.java (at line 9)\n
02:16:44 	if (t1 == t2) {\n
02:16:44 	    ^^^^^^^^\n
02:16:44 The uninterned types TypeBinding and TypeBinding should not be compared using ==/!= operators.\n
02:16:44 ----------\n
02:16:44 3. ERROR in org\eclipse\jdt\internal\compiler\lookup\X.java (at line 16)\n
02:16:44 	if (t1 == t2) { \n
02:16:44 	    ^^^^^^^^\n
02:16:44 The uninterned types TypeBinding and TypeBinding should not be compared using ==/!= operators.\n
02:16:44 ----------\n
02:16:44 4. ERROR in org\eclipse\jdt\internal\compiler\lookup\X.java (at line 18)\n
02:16:44 	if (t1 == t2) {\n
02:16:44 	    ^^^^^^^^\n
02:16:44 The uninterned types TypeBinding and TypeBinding should not be compared using ==/!= operators.\n
02:16:44 ----------\n
02:16:44 5. ERROR in org\eclipse\jdt\internal\compiler\lookup\X.java (at line 28)\n
02:16:44 	if (t1 == t2) { \n
02:16:44 	    ^^^^^^^^\n
02:16:44 The uninterned types TypeBinding and TypeBinding should not be compared using ==/!= operators.\n
02:16:44 ----------\n
02:16:44 ]>
02:16:44   ProgrammingProblemsTest>TestCase.runTest:964->test0063:2630->AbstractRegressionTest.runNegativeTest:2592->AbstractRegressionTest.runNegativeTest:2601->AbstractRegressionTest.runTest:2920->AbstractRegressionTest.runTest:3195->AbstractRegressionTest.runJavac:2350->AbstractRegressionTest.handleMismatch:2403->TestCase.assertEquals:242->TestCase.assertStringEquals:266 test0063 - Eclipse found error(s) but Javac did not find any.
02:16:44 ----------- Expected ------------
02:16:44 
02:16:44 ------------ but was ------------
02:16:44 ----------\n
02:16:44 1. ERROR in org\eclipse\jdt\core\dom\X.java (at line 9)\n
02:16:44 	if (t1 == t2) { \n
02:16:44 	    ^^^^^^^^\n
02:16:44 The uninterned types TypeBinding and TypeBinding should not be compared using ==/!= operators.\n
02:16:44 ----------\n
02:16:44 2. ERROR in org\eclipse\jdt\core\dom\X.java (at line 11)\n
02:16:44 	if (t1 == t2) {\n
02:16:44 	    ^^^^^^^^\n
02:16:44 The uninterned types TypeBinding and TypeBinding should not be compared using ==/!= operators.\n
02:16:44 ----------\n
02:16:44 3. ERROR in org\eclipse\jdt\core\dom\X.java (at line 18)\n
02:16:44 	if (t1 == t2) { \n
02:16:44 	    ^^^^^^^^\n
02:16:44 The uninterned types TypeBinding and TypeBinding should not be compared using ==/!= operators.\n
02:16:44 ----------\n
02:16:44 4. ERROR in org\eclipse\jdt\core\dom\X.java (at line 20)\n
02:16:44 	if (t1 == t2) {\n
02:16:44 	    ^^^^^^^^\n
02:16:44 The uninterned types TypeBinding and TypeBinding should not be compared using ==/!= operators.\n
02:16:44 ----------\n
02:16:44 5. ERROR in org\eclipse\jdt\core\dom\X.java (at line 30)\n
02:16:44 	if (t1 == t2) { \n
02:16:44 	    ^^^^^^^^\n
02:16:44 The uninterned types TypeBinding and TypeBinding should not be compared using ==/!= operators.\n
02:16:44 ----------\n
02:16:44 
02:16:44 --------- Difference is ----------
02:16:44  expected:<[]> but was:<[----------\n
02:16:44 1. ERROR in org\eclipse\jdt\core\dom\X.java (at line 9)\n
02:16:44 	if (t1 == t2) { \n
02:16:44 	    ^^^^^^^^\n
02:16:44 The uninterned types TypeBinding and TypeBinding should not be compared using ==/!= operators.\n
02:16:44 ----------\n
02:16:44 2. ERROR in org\eclipse\jdt\core\dom\X.java (at line 11)\n
02:16:44 	if (t1 == t2) {\n
02:16:44 	    ^^^^^^^^\n
02:16:44 The uninterned types TypeBinding and TypeBinding should not be compared using ==/!= operators.\n
02:16:44 ----------\n
02:16:44 3. ERROR in org\eclipse\jdt\core\dom\X.java (at line 18)\n
02:16:44 	if (t1 == t2) { \n
02:16:44 	    ^^^^^^^^\n
02:16:44 The uninterned types TypeBinding and TypeBinding should not be compared using ==/!= operators.\n
02:16:44 ----------\n
02:16:44 4. ERROR in org\eclipse\jdt\core\dom\X.java (at line 20)\n
02:16:44 	if (t1 == t2) {\n
02:16:44 	    ^^^^^^^^\n
02:16:44 The uninterned types TypeBinding and TypeBinding should not be compared using ==/!= operators.\n
02:16:44 ----------\n
02:16:44 5. ERROR in org\eclipse\jdt\core\dom\X.java (at line 30)\n
02:16:44 	if (t1 == t2) { \n
02:16:44 	    ^^^^^^^^\n
02:16:44 The uninterned types TypeBinding and TypeBinding should not be compared using ==/!= operators.\n
02:16:44 ----------\n
02:16:44 ]>
02:16:44   ProgrammingProblemsTest>TestCase.runTest:964->testBug410218a:2714->AbstractRegressionTest.runNegativeTest:2474->AbstractRegressionTest.runNegativeTest:2485->AbstractRegressionTest.runTest:2920->AbstractRegressionTest.runTest:3195->AbstractRegressionTest.runJavac:2350->AbstractRegressionTest.handleMismatch:2419->TestCase.assertEquals:242->TestCase.assertStringEquals:266 testBug410218a - Eclipse found warning(s) but Javac did not find any.
02:16:44 ----------- Expected ------------
02:16:44 
02:16:44 ------------ but was ------------
02:16:44 ----------\n
02:16:44 1. WARNING in X.java (at line 8)\n
02:16:44 	if (set.contains("ONE")) // bad\n
02:16:44 	                 ^^^^^\n
02:16:44 Unlikely argument type String for contains(Object) on a Collection<Short>\n
02:16:44 ----------\n
02:16:44 2. WARNING in X.java (at line 9)\n
02:16:44 	set.remove("ONE"); // bad\n
02:16:44 	           ^^^^^\n
02:16:44 Unlikely argument type String for remove(Object) on a Collection<Short>\n
02:16:44 ----------\n
02:16:44 3. WARNING in X.java (at line 10)\n
02:16:44 	if (set.contains(1)) // bad\n
02:16:44 	                 ^\n
02:16:44 Unlikely argument type int for contains(Object) on a Collection<Short>\n
02:16:44 ----------\n
02:16:44 4. WARNING in X.java (at line 11)\n
02:16:44 	set.remove(1); // bad (tries to remove "Integer 1")\n
02:16:44 	           ^\n
02:16:44 Unlikely argument type int for remove(Object) on a Collection<Short>\n
02:16:44 ----------\n
02:16:44 
02:16:44 --------- Difference is ----------
02:16:44  expected:<[]> but was:<[----------\n
02:16:44 1. WARNING in X.java (at line 8)\n
02:16:44 	if (set.contains("ONE")) // bad\n
02:16:44 	                 ^^^^^\n
02:16:44 Unlikely argument type String for contains(Object) on a Collection<Short>\n
02:16:44 ----------\n
02:16:44 2. WARNING in X.java (at line 9)\n
02:16:44 	set.remove("ONE"); // bad\n
02:16:44 	           ^^^^^\n
02:16:44 Unlikely argument type String for remove(Object) on a Collection<Short>\n
02:16:44 ----------\n
02:16:44 3. WARNING in X.java (at line 10)\n
02:16:44 	if (set.contains(1)) // bad\n
02:16:44 	                 ^\n
02:16:44 Unlikely argument type int for contains(Object) on a Collection<Short>\n
02:16:44 ----------\n
02:16:44 4. WARNING in X.java (at line 11)\n
02:16:44 	set.remove(1); // bad (tries to remove "Integer 1")\n
02:16:44 	           ^\n
02:16:44 Unlikely argument type int for remove(Object) on a Collection<Short>\n
02:16:44 ----------\n
02:16:44 ]>
02:16:44   ProgrammingProblemsTest>TestCase.runTest:964->testBug410218b:2764->AbstractRegressionTest.runNegativeTest:2474->AbstractRegressionTest.runNegativeTest:2485->AbstractRegressionTest.runTest:2920->AbstractRegressionTest.runTest:3195->AbstractRegressionTest.runJavac:2350->AbstractRegressionTest.handleMismatch:2419->TestCase.assertEquals:242->TestCase.assertStringEquals:266 testBug410218b - Eclipse found warning(s) but Javac did not find any.
02:16:44 ----------- Expected ------------
02:16:44 
02:16:44 ------------ but was ------------
02:16:44 ----------\n
02:16:44 1. WARNING in X.java (at line 4)\n
02:16:44 	if (hss.contains(ts)) // bad\n
02:16:44 	                 ^^\n
02:16:44 Unlikely argument type TreeSet<T> for contains(Object) on a Collection<HashSet<T>>\n
02:16:44 ----------\n
02:16:44 2. WARNING in X.java (at line 5)\n
02:16:44 	hss.remove(ts); // bad\n
02:16:44 	           ^^\n
02:16:44 Unlikely argument type TreeSet<T> for remove(Object) on a Collection<HashSet<T>>\n
02:16:44 ----------\n
02:16:44 
02:16:44 --------- Difference is ----------
02:16:44  expected:<[]> but was:<[----------\n
02:16:44 1. WARNING in X.java (at line 4)\n
02:16:44 	if (hss.contains(ts)) // bad\n
02:16:44 	                 ^^\n
02:16:44 Unlikely argument type TreeSet<T> for contains(Object) on a Collection<HashSet<T>>\n
02:16:44 ----------\n
02:16:44 2. WARNING in X.java (at line 5)\n
02:16:44 	hss.remove(ts); // bad\n
02:16:44 	           ^^\n
02:16:44 Unlikely argument type TreeSet<T> for remove(Object) on a Collection<HashSet<T>>\n
02:16:44 ----------\n
02:16:44 ]>
02:16:44   ProgrammingProblemsTest>TestCase.runTest:964->testBug410218b2:2797->AbstractRegressionTest.runNegativeTest:2592->AbstractRegressionTest.runNegativeTest:2601->AbstractRegressionTest.runTest:2920->AbstractRegressionTest.runTest:3195->AbstractRegressionTest.runJavac:2350->AbstractRegressionTest.handleMismatch:2419->TestCase.assertEquals:242->TestCase.assertStringEquals:266 testBug410218b2 - Eclipse found warning(s) but Javac did not find any.
02:16:44 ----------- Expected ------------
02:16:44 
02:16:44 ------------ but was ------------
02:16:44 ----------\n
02:16:44 1. WARNING in X.java (at line 4)\n
02:16:44 	if (hss.contains(ts)) // bad\n
02:16:44 	                 ^^\n
02:16:44 Unlikely argument type TreeSet<T> for contains(Object) on a Collection<HashSet<T>>\n
02:16:44 ----------\n
02:16:44 2. WARNING in X.java (at line 5)\n
02:16:44 	hss.remove(ts); // bad\n
02:16:44 	           ^^\n
02:16:44 Unlikely argument type TreeSet<T> for remove(Object) on a Collection<HashSet<T>>\n
02:16:44 ----------\n
02:16:44 3. WARNING in X.java (at line 6)\n
02:16:44 	if (hss.contains((Set<T>)ts)) // bad (because of strict check)\n
02:16:44 	                 ^^^^^^^^^^\n
02:16:44 Unlikely argument type Set<T> for contains(Object) on a Collection<HashSet<T>>\n
02:16:44 ----------\n
02:16:44 4. WARNING in X.java (at line 7)\n
02:16:44 	hss.remove((Set<T>)ts); // bad (because of strict check)\n
02:16:44 	           ^^^^^^^^^^\n
02:16:44 Unlikely argument type Set<T> for remove(Object) on a Collection<HashSet<T>>\n
02:16:44 ----------\n
02:16:44 
02:16:44 --------- Difference is ----------
02:16:44  expected:<[]> but was:<[----------\n
02:16:44 1. WARNING in X.java (at line 4)\n
02:16:44 	if (hss.contains(ts)) // bad\n
02:16:44 	                 ^^\n
02:16:44 Unlikely argument type TreeSet<T> for contains(Object) on a Collection<HashSet<T>>\n
02:16:44 ----------\n
02:16:44 2. WARNING in X.java (at line 5)\n
02:16:44 	hss.remove(ts); // bad\n
02:16:44 	           ^^\n
02:16:44 Unlikely argument type TreeSet<T> for remove(Object) on a Collection<HashSet<T>>\n
02:16:44 ----------\n
02:16:44 3. WARNING in X.java (at line 6)\n
02:16:44 	if (hss.contains((Set<T>)ts)) // bad (because of strict check)\n
02:16:44 	                 ^^^^^^^^^^\n
02:16:44 Unlikely argument type Set<T> for contains(Object) on a Collection<HashSet<T>>\n
02:16:44 ----------\n
02:16:44 4. WARNING in X.java (at line 7)\n
02:16:44 	hss.remove((Set<T>)ts); // bad (because of strict check)\n
02:16:44 	           ^^^^^^^^^^\n
02:16:44 Unlikely argument type Set<T> for remove(Object) on a Collection<HashSet<T>>\n
02:16:44 ----------\n
02:16:44 ]>
02:16:44   ProgrammingProblemsTest>TestCase.runTest:964->testBug410218c:2841->AbstractRegressionTest.runNegativeTest:2474->AbstractRegressionTest.runNegativeTest:2485->AbstractRegressionTest.runTest:2920->AbstractRegressionTest.runTest:3195->AbstractRegressionTest.runJavac:2350->AbstractRegressionTest.handleMismatch:2419->TestCase.assertEquals:242->TestCase.assertStringEquals:266 testBug410218c - Eclipse found warning(s) but Javac did not find any.
02:16:44 ----------- Expected ------------
02:16:44 
02:16:44 ------------ but was ------------
02:16:44 ----------\n
02:16:44 1. WARNING in X.java (at line 4)\n
02:16:44 	if (m.containsKey("ONE")) // bad\n
02:16:44 	                  ^^^^^\n
02:16:44 Unlikely argument type String for containsKey(Object) on a Map<capture#1-of ? extends Number,Number>\n
02:16:44 ----------\n
02:16:44 2. WARNING in X.java (at line 5)\n
02:16:44 	m.remove("ONE"); // bad\n
02:16:44 	         ^^^^^\n
02:16:44 Unlikely argument type String for remove(Object) on a Map<capture#2-of ? extends Number,Number>\n
02:16:44 ----------\n
02:16:44 3. WARNING in X.java (at line 6)\n
02:16:44 	if (m.containsValue("ONE")) // bad\n
02:16:44 	                    ^^^^^\n
02:16:44 Unlikely argument type String for containsValue(Object) on a Map<capture#3-of ? extends Number,Number>\n
02:16:44 ----------\n
02:16:44 4. WARNING in X.java (at line 7)\n
02:16:44 	m.remove("ONE"); // bad\n
02:16:44 	         ^^^^^\n
02:16:44 Unlikely argument type String for remove(Object) on a Map<capture#4-of ? extends Number,Number>\n
02:16:44 ----------\n
02:16:44 5. WARNING in X.java (at line 14)\n
02:16:44 	return m.get("ONE"); // bad\n
02:16:44 	             ^^^^^\n
02:16:44 Unlikely argument type String for get(Object) on a Map<capture#9-of ? extends Number,Number>\n
02:16:44 ----------\n
02:16:44 
02:16:44 --------- Difference is ----------
02:16:44  expected:<[]> but was:<[----------\n
02:16:44 1. WARNING in X.java (at line 4)\n
02:16:44 	if (m.containsKey("ONE")) // bad\n
02:16:44 	                  ^^^^^\n
02:16:44 Unlikely argument type String for containsKey(Object) on a Map<capture#1-of ? extends Number,Number>\n
02:16:44 ----------\n
02:16:44 2. WARNING in X.java (at line 5)\n
02:16:44 	m.remove("ONE"); // bad\n
02:16:44 	         ^^^^^\n
02:16:44 Unlikely argument type String for remove(Object) on a Map<capture#2-of ? extends Number,Number>\n
02:16:44 ----------\n
02:16:44 3. WARNING in X.java (at line 6)\n
02:16:44 	if (m.containsValue("ONE")) // bad\n
02:16:44 	                    ^^^^^\n
02:16:44 Unlikely argument type String for containsValue(Object) on a Map<capture#3-of ? extends Number,Number>\n
02:16:44 ----------\n
02:16:44 4. WARNING in X.java (at line 7)\n
02:16:44 	m.remove("ONE"); // bad\n
02:16:44 	         ^^^^^\n
02:16:44 Unlikely argument type String for remove(Object) on a Map<capture#4-of ? extends Number,Number>\n
02:16:44 ----------\n
02:16:44 5. WARNING in X.java (at line 14)\n
02:16:44 	return m.get("ONE"); // bad\n
02:16:44 	             ^^^^^\n
02:16:44 Unlikely argument type String for get(Object) on a Map<capture#9-of ? extends Number,Number>\n
02:16:44 ----------\n
02:16:44 ]>
02:16:44   ProgrammingProblemsTest>TestCase.runTest:964->testBug410218d:2895->AbstractRegressionTest.runNegativeTest:2592->AbstractRegressionTest.runNegativeTest:2601->AbstractRegressionTest.runTest:2920->AbstractRegressionTest.runTest:3195->AbstractRegressionTest.runJavac:2350->AbstractRegressionTest.handleMismatch:2403->TestCase.assertEquals:242->TestCase.assertStringEquals:266 testBug410218d - Eclipse found error(s) but Javac did not find any.
02:16:44 ----------- Expected ------------
02:16:44 
02:16:44 ------------ but was ------------
02:16:44 ----------\n
02:16:44 1. ERROR in X.java (at line 10)\n
02:16:44 	numbers.removeAll(stringSet); // bad\n
02:16:44 	                  ^^^^^^^^^\n
02:16:44 Unlikely argument type Set<String> for removeAll(Collection<?>) on a Collection<Number>\n
02:16:44 ----------\n
02:16:44 
02:16:44 --------- Difference is ----------
02:16:44  expected:<[]> but was:<[----------\n
02:16:44 1. ERROR in X.java (at line 10)\n
02:16:44 	numbers.removeAll(stringSet); // bad\n
02:16:44 	                  ^^^^^^^^^\n
02:16:44 Unlikely argument type Set<String> for removeAll(Collection<?>) on a Collection<Number>\n
02:16:44 ----------\n
02:16:44 ]>
02:16:44   ProgrammingProblemsTest>TestCase.runTest:964->testBug410218e:2927->AbstractRegressionTest.runNegativeTest:2592->AbstractRegressionTest.runNegativeTest:2601->AbstractRegressionTest.runTest:2920->AbstractRegressionTest.runTest:3195->AbstractRegressionTest.runJavac:2350->AbstractRegressionTest.handleMismatch:2419->TestCase.assertEquals:242->TestCase.assertStringEquals:266 testBug410218e - Eclipse found warning(s) but Javac did not find any.
02:16:44 ----------- Expected ------------
02:16:44 
02:16:44 ------------ but was ------------
02:16:44 ----------\n
02:16:44 1. WARNING in X.java (at line 4)\n
02:16:44 	return ints.indexOf("ONE"); // bad\n
02:16:44 	                    ^^^^^\n
02:16:44 Unlikely argument type String for indexOf(Object) on a List<Integer>\n
02:16:44 ----------\n
02:16:44 
02:16:44 --------- Difference is ----------
02:16:44  expected:<[]> but was:<[----------\n
02:16:44 1. WARNING in X.java (at line 4)\n
02:16:44 	return ints.indexOf("ONE"); // bad\n
02:16:44 	                    ^^^^^\n
02:16:44 Unlikely argument type String for indexOf(Object) on a List<Integer>\n
02:16:44 ----------\n
02:16:44 ]>
02:16:44   ProgrammingProblemsTest>TestCase.runTest:964->testBug410218f:2961->AbstractRegressionTest.runNegativeTest:2592->AbstractRegressionTest.runNegativeTest:2601->AbstractRegressionTest.runTest:2920->AbstractRegressionTest.runTest:3195->AbstractRegressionTest.runJavac:2350->AbstractRegressionTest.handleMismatch:2419->TestCase.assertEquals:242->TestCase.assertStringEquals:266 testBug410218f - Eclipse found warning(s) but Javac did not find any.
02:16:44 ----------- Expected ------------
02:16:44 
02:16:44 ------------ but was ------------
02:16:44 ----------\n
02:16:44 1. WARNING in test\TestUnlikely.java (at line 30)\n
02:16:44 	c.remove(o); // warning: unrelated interface\n
02:16:44 	         ^\n
02:16:44 Unlikely argument type TestUnlikely.OtherInterface for remove(Object) on a Collection<TestUnlikely.Interface>\n
02:16:44 ----------\n
02:16:44 2. WARNING in test\TestUnlikely.java (at line 37)\n
02:16:44 	c.remove(i); // warning: unrelated interface\n
02:16:44 	         ^\n
02:16:44 Unlikely argument type TestUnlikely.Interface for remove(Object) on a Collection<TestUnlikely.OtherInterface>\n
02:16:44 ----------\n
02:16:44 3. WARNING in test\TestUnlikely.java (at line 39)\n
02:16:44 	c.remove(f); // warning: impossible\n
02:16:44 	         ^\n
02:16:44 Unlikely argument type TestUnlikely.Final for remove(Object) on a Collection<TestUnlikely.OtherInterface>\n
02:16:44 ----------\n
02:16:44 4. WARNING in test\TestUnlikely.java (at line 40)\n
02:16:44 	c.remove(nf); // warning: castable, but not supertype\n
02:16:44 	         ^^\n
02:16:44 Unlikely argument type TestUnlikely.NonFinal for remove(Object) on a Collection<TestUnlikely.OtherInterface>\n
02:16:44 ----------\n
02:16:44 5. WARNING in test\TestUnlikely.java (at line 46)\n
02:16:44 	c.remove(o); // warning: impossible\n
02:16:44 	         ^\n
02:16:44 Unlikely argument type TestUnlikely.OtherInterface for remove(Object) on a Collection<TestUnlikely.Final>\n
02:16:44 ----------\n
02:16:44 6. WARNING in test\TestUnlikely.java (at line 48)\n
02:16:44 	c.remove(nf); // warning: impossible\n
02:16:44 	         ^^\n
02:16:44 Unlikely argument type TestUnlikely.NonFinal for remove(Object) on a Collection<TestUnlikely.Final>\n
02:16:44 ----------\n
02:16:44 7. WARNING in test\TestUnlikely.java (at line 49)\n
02:16:44 	c.remove(s); // warning: impossible\n
02:16:44 	         ^\n
02:16:44 Unlikely argument type TestUnlikely.Sub for remove(Object) on a Collection<TestUnlikely.Final>\n
02:16:44 ----------\n
02:16:44 8. WARNING in test\TestUnlikely.java (at line 54)\n
02:16:44 	c.remove(o); // warning: unrelated interface\n
02:16:44 	         ^\n
02:16:44 Unlikely argument type TestUnlikely.OtherInterface for remove(Object) on a Collection<TestUnlikely.NonFinal>\n
02:16:44 ----------\n
02:16:44 9. WARNING in test\TestUnlikely.java (at line 55)\n
02:16:44 	c.remove(f); // warning: impossible\n
02:16:44 	         ^\n
02:16:44 Unlikely argument type TestUnlikely.Final for remove(Object) on a Collection<TestUnlikely.NonFinal>\n
02:16:44 ----------\n
02:16:44 10. WARNING in test\TestUnlikely.java (at line 63)\n
02:16:44 	c.remove(f); // warning: impossible\n
02:16:44 	         ^\n
02:16:44 Unlikely argument type TestUnlikely.Final for remove(Object) on a Collection<TestUnlikely.Sub>\n
02:16:44 ----------\n
02:16:44 11. WARNING in test\TestUnlikely.java (at line 70)\n
02:16:44 	map.containsKey(value); // warning\n
02:16:44 	                ^^^^^\n
02:16:44 Unlikely argument type V for containsKey(Object) on a Map<K,V>\n
02:16:44 ----------\n
02:16:44 12. WARNING in test\TestUnlikely.java (at line 71)\n
02:16:44 	map.containsValue(key); // warning\n
02:16:44 	                  ^^^\n
02:16:44 Unlikely argument type K for containsValue(Object) on a Map<K,V>\n
02:16:44 ----------\n
02:16:44 13. WARNING in test\TestUnlikely.java (at line 95)\n
02:16:44 	if (c.contains(iterator.next())) { // warning\n
02:16:44 	               ^^^^^^^^^^^^^^^\n
02:16:44 Unlikely argument type U for contains(Object) on a Collection<T>\n
02:16:44 ----------\n
02:16:44 14. WARNING in test\TestUnlikely.java (at line 105)\n
02:16:44 	c.removeAll(other); // warning\n
02:16:44 	            ^^^^^\n
02:16:44 Unlikely argument type Set<TestUnlikely.Final> for removeAll(Collection<?>) on a Collection<TestUnlikely.NonFinal>\n
02:16:44 ----------\n
02:16:44 15. WARNING in test\TestUnlikely.java (at line 111)\n
02:16:44 	Predicate<OtherInterface> p2 = c::contains; // warning\n
02:16:44 	                               ^^^^^^^^^^^\n
02:16:44 Unlikely argument type TestUnlikely.OtherInterface for contains(Object) on a Collection<TestUnlikely.Interface>\n
02:16:44 ----------\n
02:16:44 16. WARNING in test\TestUnlikely.java (at line 112)\n
02:16:44 	BiPredicate<Collection<Interface>, OtherInterface> bp2 = Collection<Interface>::contains; // warning\n
02:16:44 	                                                         ^^^^^^^^^^^^^^^^^^^^^^^^^^^^^^^\n
02:16:44 Unlikely argument type TestUnlikely.OtherInterface for contains(Object) on a Collection<TestUnlikely.Interface>\n
02:16:44 ----------\n
02:16:44 17. INFO in test\TestUnlikely.java (at line 120)\n
02:16:44 	s.equals(i); // info\n
02:16:44 	         ^\n
02:16:44 Unlikely argument type for equals(): Integer seems to be unrelated to String\n
02:16:44 ----------\n
02:16:44 18. INFO in test\TestUnlikely.java (at line 121)\n
02:16:44 	i.equals(s); // info\n
02:16:44 	         ^\n
02:16:44 Unlikely argument type for equals(): String seems to be unrelated to Integer\n
02:16:44 ----------\n
02:16:44 19. INFO in test\TestUnlikely.java (at line 125)\n
02:16:44 	Predicate<String> p1 = i::equals; // info\n
02:16:44 	                       ^^^^^^^^^\n
02:16:44 Unlikely argument type for equals(): String seems to be unrelated to Integer\n
02:16:44 ----------\n
02:16:44 20. INFO in test\TestUnlikely.java (at line 128)\n
02:16:44 	BiPredicate<String, Integer> bp2 = Object::equals; // info\n
02:16:44 	                                   ^^^^^^^^^^^^^^\n
02:16:44 Unlikely argument type for equals(): Integer seems to be unrelated to String\n
02:16:44 ----------\n
02:16:44 21. INFO in test\TestUnlikely.java (at line 131)\n
02:16:44 	Objects.equals(s, i); // info\n
02:16:44 	                  ^\n
02:16:44 Unlikely argument type for equals(): Integer seems to be unrelated to String\n
02:16:44 ----------\n
02:16:44 22. INFO in test\TestUnlikely.java (at line 132)\n
02:16:44 	Objects.equals(i, s); // info\n
02:16:44 	                  ^\n
02:16:44 Unlikely argument type for equals(): String seems to be unrelated to Integer\n
02:16:44 ----------\n
02:16:44 23. INFO in test\TestUnlikely.java (at line 136)\n
02:16:44 	BiPredicate<String, Integer> bp3 = Objects::equals; // info\n
02:16:44 	                                   ^^^^^^^^^^^^^^^\n
02:16:44 Unlikely argument type for equals(): Integer seems to be unrelated to String\n
02:16:44 ----------\n
02:16:44 
02:16:44 --------- Difference is ----------
02:16:44  expected:<[]> but was:<[----------\n
02:16:44 1. WARNING in test\TestUnlikely.java (at line 30)\n
02:16:44 	c.remove(o); // warning: unrelated interface\n
02:16:44 	         ^\n
02:16:44 Unlikely argument type TestUnlikely.OtherInterface for remove(Object) on a Collection<TestUnlikely.Interface>\n
02:16:44 ----------\n
02:16:44 2. WARNING in test\TestUnlikely.java (at line 37)\n
02:16:44 	c.remove(i); // warning: unrelated interface\n
02:16:44 	         ^\n
02:16:44 Unlikely argument type TestUnlikely.Interface for remove(Object) on a Collection<TestUnlikely.OtherInterface>\n
02:16:44 ----------\n
02:16:44 3. WARNING in test\TestUnlikely.java (at line 39)\n
02:16:44 	c.remove(f); // warning: impossible\n
02:16:44 	         ^\n
02:16:44 Unlikely argument type TestUnlikely.Final for remove(Object) on a Collection<TestUnlikely.OtherInterface>\n
02:16:44 ----------\n
02:16:44 4. WARNING in test\TestUnlikely.java (at line 40)\n
02:16:44 	c.remove(nf); // warning: castable, but not supertype\n
02:16:44 	         ^^\n
02:16:44 Unlikely argument type TestUnlikely.NonFinal for remove(Object) on a Collection<TestUnlikely.OtherInterface>\n
02:16:44 ----------\n
02:16:44 5. WARNING in test\TestUnlikely.java (at line 46)\n
02:16:44 	c.remove(o); // warning: impossible\n
02:16:44 	         ^\n
02:16:44 Unlikely argument type TestUnlikely.OtherInterface for remove(Object) on a Collection<TestUnlikely.Final>\n
02:16:44 ----------\n
02:16:44 6. WARNING in test\TestUnlikely.java (at line 48)\n
02:16:44 	c.remove(nf); // warning: impossible\n
02:16:44 	         ^^\n
02:16:44 Unlikely argument type TestUnlikely.NonFinal for remove(Object) on a Collection<TestUnlikely.Final>\n
02:16:44 ----------\n
02:16:44 7. WARNING in test\TestUnlikely.java (at line 49)\n
02:16:44 	c.remove(s); // warning: impossible\n
02:16:44 	         ^\n
02:16:44 Unlikely argument type TestUnlikely.Sub for remove(Object) on a Collection<TestUnlikely.Final>\n
02:16:44 ----------\n
02:16:44 8. WARNING in test\TestUnlikely.java (at line 54)\n
02:16:44 	c.remove(o); // warning: unrelated interface\n
02:16:44 	         ^\n
02:16:44 Unlikely argument type TestUnlikely.OtherInterface for remove(Object) on a Collection<TestUnlikely.NonFinal>\n
02:16:44 ----------\n
02:16:44 9. WARNING in test\TestUnlikely.java (at line 55)\n
02:16:44 	c.remove(f); // warning: impossible\n
02:16:44 	         ^\n
02:16:44 Unlikely argument type TestUnlikely.Final for remove(Object) on a Collection<TestUnlikely.NonFinal>\n
02:16:44 ----------\n
02:16:44 10. WARNING in test\TestUnlikely.java (at line 63)\n
02:16:44 	c.remove(f); // warning: impossible\n
02:16:44 	         ^\n
02:16:44 Unlikely argument type TestUnlikely.Final for remove(Object) on a Collection<TestUnlikely.Sub>\n
02:16:44 ----------\n
02:16:44 11. WARNING in test\TestUnlikely.java (at line 70)\n
02:16:44 	map.containsKey(value); // warning\n
02:16:44 	                ^^^^^\n
02:16:44 Unlikely argument type V for containsKey(Object) on a Map<K,V>\n
02:16:44 ----------\n
02:16:44 12. WARNING in test\TestUnlikely.java (at line 71)\n
02:16:44 	map.containsValue(key); // warning\n
02:16:44 	                  ^^^\n
02:16:44 Unlikely argument type K for containsValue(Object) on a Map<K,V>\n
02:16:44 ----------\n
02:16:44 13. WARNING in test\TestUnlikely.java (at line 95)\n
02:16:44 	if (c.contains(iterator.next())) { // warning\n
02:16:44 	               ^^^^^^^^^^^^^^^\n
02:16:44 Unlikely argument type U for contains(Object) on a Collection<T>\n
02:16:44 ----------\n
02:16:44 14. WARNING in test\TestUnlikely.java (at line 105)\n
02:16:44 	c.removeAll(other); // warning\n
02:16:44 	            ^^^^^\n
02:16:44 Unlikely argument type Set<TestUnlikely.Final> for removeAll(Collection<?>) on a Collection<TestUnlikely.NonFinal>\n
02:16:44 ----------\n
02:16:44 15. WARNING in test\TestUnlikely.java (at line 111)\n
02:16:44 	Predicate<OtherInterface> p2 = c::contains; // warning\n
02:16:44 	                               ^^^^^^^^^^^\n
02:16:44 Unlikely argument type TestUnlikely.OtherInterface for contains(Object) on a Collection<TestUnlikely.Interface>\n
02:16:44 ----------\n
02:16:44 16. WARNING in test\TestUnlikely.java (at line 112)\n
02:16:44 	BiPredicate<Collection<Interface>, OtherInterface> bp2 = Collection<Interface>::contains; // warning\n
02:16:44 	                                                         ^^^^^^^^^^^^^^^^^^^^^^^^^^^^^^^\n
02:16:44 Unlikely argument type TestUnlikely.OtherInterface for contains(Object) on a Collection<TestUnlikely.Interface>\n
02:16:44 ----------\n
02:16:44 17. INFO in test\TestUnlikely.java (at line 120)\n
02:16:44 	s.equals(i); // info\n
02:16:44 	         ^\n
02:16:44 Unlikely argument type for equals(): Integer seems to be unrelated to String\n
02:16:44 ----------\n
02:16:44 18. INFO in test\TestUnlikely.java (at line 121)\n
02:16:44 	i.equals(s); // info\n
02:16:44 	         ^\n
02:16:44 Unlikely argument type for equals(): String seems to be unrelated to Integer\n
02:16:44 ----------\n
02:16:44 19. INFO in test\TestUnlikely.java (at line 125)\n
02:16:44 	Predicate<String> p1 = i::equals; // info\n
02:16:44 	                       ^^^^^^^^^\n
02:16:44 Unlikely argument type for equals(): String seems to be unrelated to Integer\n
02:16:44 ----------\n
02:16:44 20. INFO in test\TestUnlikely.java (at line 128)\n
02:16:44 	BiPredicate<String, Integer> bp2 = Object::equals; // info\n
02:16:44 	                                   ^^^^^^^^^^^^^^\n
02:16:44 Unlikely argument type for equals(): Integer seems to be unrelated to String\n
02:16:44 ----------\n
02:16:44 21. INFO in test\TestUnlikely.java (at line 131)\n
02:16:44 	Objects.equals(s, i); // info\n
02:16:44 	                  ^\n
02:16:44 Unlikely argument type for equals(): Integer seems to be unrelated to String\n
02:16:44 ----------\n
02:16:44 22. INFO in test\TestUnlikely.java (at line 132)\n
02:16:44 	Objects.equals(i, s); // info\n
02:16:44 	                  ^\n
02:16:44 Unlikely argument type for equals(): String seems to be unrelated to Integer\n
02:16:44 ----------\n
02:16:44 23. INFO in test\TestUnlikely.java (at line 136)\n
02:16:44 	BiPredicate<String, Integer> bp3 = Objects::equals; // info\n
02:16:44 	                                   ^^^^^^^^^^^^^^^\n
02:16:44 Unlikely argument type for equals(): Integer seems to be unrelated to String\n
02:16:44 ----------\n
02:16:44 ]>
02:16:44   ProgrammingProblemsTest>TestCase.runTest:964->testBug514956c:3268->AbstractRegressionTest.runNegativeTest:2592->AbstractRegressionTest.runNegativeTest:2601->AbstractRegressionTest.runTest:2920->AbstractRegressionTest.runTest:3195->AbstractRegressionTest.runJavac:2350->AbstractRegressionTest.handleMismatch:2403->TestCase.assertEquals:242->TestCase.assertStringEquals:266 testBug514956c - Eclipse found error(s) but Javac did not find any.
02:16:44 ----------- Expected ------------
02:16:44 
02:16:44 ------------ but was ------------
02:16:44 ----------\n
02:16:44 1. ERROR in Unlikely.java (at line 6)\n
02:16:44 	return i1.equals((I1)this);\n
02:16:44 	                 ^^^^^^^^\n
02:16:44 Unnecessary cast from Unlikely to I1\n
02:16:44 ----------\n
02:16:44 2. ERROR in Unlikely.java (at line 9)\n
02:16:44 	return i1.equals((I3)i2);\n
02:16:44 	                 ^^^^^^\n
02:16:44 Unnecessary cast from I2 to I3\n
02:16:44 ----------\n
02:16:44 3. WARNING in Unlikely.java (at line 9)\n
02:16:44 	return i1.equals((I3)i2);\n
02:16:44 	                 ^^^^^^\n
02:16:44 Unlikely argument type for equals(): I3 seems to be unrelated to I1\n
02:16:44 ----------\n
02:16:44 
02:16:44 --------- Difference is ----------
02:16:44  expected:<[]> but was:<[----------\n
02:16:44 1. ERROR in Unlikely.java (at line 6)\n
02:16:44 	return i1.equals((I1)this);\n
02:16:44 	                 ^^^^^^^^\n
02:16:44 Unnecessary cast from Unlikely to I1\n
02:16:44 ----------\n
02:16:44 2. ERROR in Unlikely.java (at line 9)\n
02:16:44 	return i1.equals((I3)i2);\n
02:16:44 	                 ^^^^^^\n
02:16:44 Unnecessary cast from I2 to I3\n
02:16:44 ----------\n
02:16:44 3. WARNING in Unlikely.java (at line 9)\n
02:16:44 	return i1.equals((I3)i2);\n
02:16:44 	                 ^^^^^^\n
02:16:44 Unlikely argument type for equals(): I3 seems to be unrelated to I1\n
02:16:44 ----------\n
02:16:44 ]>
02:16:44   ResourceLeakTests>TestCase.runTest:964->testBug473317:5362->runLeakTest:75->AbstractRegressionTest.runNegativeTest:2682->AbstractRegressionTest.runTest:2920->AbstractRegressionTest.runTest:3195->AbstractRegressionTest.runJavac:2350->AbstractRegressionTest.handleMismatch:2454 testBug473317: unused excuse org.eclipse.jdt.core.tests.compiler.regression.AbstractRegressionTest$JavacTestOptions$Excuse@58fcb07b for compiler org.eclipse.jdt.core.tests.compiler.regression.AbstractRegressionTest$JavacCompiler@7866ffa
02:16:44   RuntimeTests>TestCase.runTest:964->test0600_reflection:148->AbstractRegressionTest.runConformTest:3339->AbstractRegressionTest.runTest:2920->AbstractRegressionTest.runTest:3195->AbstractRegressionTest.runJavac:2350->AbstractRegressionTest.handleMismatch:2454 test0600_reflection: unused excuse org.eclipse.jdt.core.tests.compiler.regression.AbstractRegressionTest$JavacTestOptions$EclipseJustification$3@5a88ecb9 for compiler org.eclipse.jdt.core.tests.compiler.regression.AbstractRegressionTest$JavacCompiler@7866ffa
02:16:44   RuntimeTests>TestCase.runTest:964->test1002_partial_rebuild:382->AbstractRegressionTest.runConformTest:3339->AbstractRegressionTest.runTest:2920->AbstractRegressionTest.runTest:3195->AbstractRegressionTest.runJavac:2350->AbstractRegressionTest.handleMismatch:2411->TestCase.assertEquals:242->TestCase.assertStringEquals:266 test1002_partial_rebuild - Javac found error(s) but Eclipse did not find any.
02:16:44 ----------- Expected ------------
02:16:44 
02:16:44 ------------ but was ------------
02:16:44 ./Z.java:8: error: cannot find symbol\n
02:16:44     new ZInner().foo();\n
02:16:44                 ^\n
02:16:44   symbol:   method foo()\n
02:16:44   location: class Z.ZInner\n
02:16:44 1 error\n
02:16:44 
02:16:44 --------- Difference is ----------
02:16:44  expected:<[]> but was:<[./Z.java:8: error: cannot find symbol\n
02:16:44     new ZInner().foo();\n
02:16:44                 ^\n
02:16:44   symbol:   method foo()\n
02:16:44   location: class Z.ZInner\n
02:16:44 1 error\n
02:16:44 ]>
02:16:44   ScannerTest>TestCase.runTest:964->test045:961->AbstractRegressionTest.runConformTest:1689->AbstractRegressionTest.runConformTest:1692->AbstractRegressionTest.runTest:2920->AbstractRegressionTest.runTest:3195->AbstractRegressionTest.runJavac:2350->AbstractRegressionTest.handleMismatch:2411->TestCase.assertEquals:242->TestCase.assertStringEquals:266 test045 - Javac found error(s) but Eclipse did not find any.
02:16:44 ----------- Expected ------------
02:16:44 
02:16:44 ------------ but was ------------
02:16:44 _X.java:5: error: variable i is already defined in method main(String[])\n
02:16:44 		String i\u0001;\n
02:16:44 		       ^\n
02:16:44 _X.java:6: error: variable i is already defined in method main(String[])\n
02:16:44 		String i\u0002;\n
02:16:44 		       ^\n
02:16:44 _X.java:7: error: variable i is already defined in method main(String[])\n
02:16:44 		String i\u0003;\n
02:16:44 		       ^\n
02:16:44 _X.java:8: error: variable i is already defined in method main(String[])\n
02:16:44 		String i\u0004;\n
02:16:44 		       ^\n
02:16:44 _X.java:9: error: variable i is already defined in method main(String[])\n
02:16:44 		String i\u0005;\n
02:16:44 		       ^\n
02:16:44 _X.java:10: error: variable i is already defined in method main(String[])\n
02:16:44 		String i\u0006;\n
02:16:44 		       ^\n
02:16:44 _X.java:11: error: variable i is already defined in method main(String[])\n
02:16:44 		String i\u0007;\n
02:16:44 		       ^\n
02:16:44 _X.java:12: error: variable i is already defined in method main(String[])\n
02:16:44 		String i\u0008;\n
02:16:44 		       ^\n
02:16:44 _X.java:13: error: variable i is already defined in method main(String[])\n
02:16:44 		String i\u000e;\n
02:16:44 		       ^\n
02:16:44 _X.java:14: error: variable i is already defined in method main(String[])\n
02:16:44 		String i\u000f;\n
02:16:44 		       ^\n
02:16:44 _X.java:15: error: variable i is already defined in method main(String[])\n
02:16:44 		String i\u0010;\n
02:16:44 		       ^\n
02:16:44 _X.java:16: error: variable i is already defined in method main(String[])\n
02:16:44 		String i\u0011;\n
02:16:44 		       ^\n
02:16:44 _X.java:17: error: variable i is already defined in method main(String[])\n
02:16:44 		String i\u0012;\n
02:16:44 		       ^\n
02:16:44 _X.java:18: error: variable i is already defined in method main(String[])\n
02:16:44 		String i\u0013;\n
02:16:44 		       ^\n
02:16:44 _X.java:19: error: variable i is already defined in method main(String[])\n
02:16:44 		String i\u0014;\n
02:16:44 		       ^\n
02:16:44 _X.java:20: error: variable i is already defined in method main(String[])\n
02:16:44 		String i\u0015;\n
02:16:44 		       ^\n
02:16:44 _X.java:21: error: variable i is already defined in method main(String[])\n
02:16:44 		String i\u0016;\n
02:16:44 		       ^\n
02:16:44 _X.java:22: error: variable i is already defined in method main(String[])\n
02:16:44 		String i\u0017;\n
02:16:44 		       ^\n
02:16:44 _X.java:23: error: variable i is already defined in method main(String[])\n
02:16:44 		String i\u0018;\n
02:16:44 		       ^\n
02:16:44 _X.java:24: error: variable i is already defined in method main(String[])\n
02:16:44 		String i\u0019;\n
02:16:44 		       ^\n
02:16:44 _X.java:25: error: variable i is already defined in method main(String[])\n
02:16:44 		String i\u001a;\n
02:16:44 		       ^\n
02:16:44 _X.java:26: error: variable i is already defined in method main(String[])\n
02:16:44 		String i\u001b;\n
02:16:44 		       ^\n
02:16:44 _X.java:27: error: variable i is already defined in method main(String[])\n
02:16:44 		String i\u007f;\n
02:16:44 		       ^\n
02:16:44 23 errors\n
02:16:44 
02:16:44 --------- Difference is ----------
02:16:44  expected:<[]> but was:<[_X.java:5: error: variable i is already defined in method main(String[])\n
02:16:44 		String i\u0001;\n
02:16:44 		       ^\n
02:16:44 _X.java:6: error: variable i is already defined in method main(String[])\n
02:16:44 		String i\u0002;\n
02:16:44 		       ^\n
02:16:44 _X.java:7: error: variable i is already defined in method main(String[])\n
02:16:44 		String i\u0003;\n
02:16:44 		       ^\n
02:16:44 _X.java:8: error: variable i is already defined in method main(String[])\n
02:16:44 		String i\u0004;\n
02:16:44 		       ^\n
02:16:44 _X.java:9: error: variable i is already defined in method main(String[])\n
02:16:44 		String i\u0005;\n
02:16:44 		       ^\n
02:16:44 _X.java:10: error: variable i is already defined in method main(String[])\n
02:16:44 		String i\u0006;\n
02:16:44 		       ^\n
02:16:44 _X.java:11: error: variable i is already defined in method main(String[])\n
02:16:44 		String i\u0007;\n
02:16:44 		       ^\n
02:16:44 _X.java:12: error: variable i is already defined in method main(String[])\n
02:16:44 		String i\u0008;\n
02:16:44 		       ^\n
02:16:44 _X.java:13: error: variable i is already defined in method main(String[])\n
02:16:44 		String i\u000e;\n
02:16:44 		       ^\n
02:16:44 _X.java:14: error: variable i is already defined in method main(String[])\n
02:16:44 		String i\u000f;\n
02:16:44 		       ^\n
02:16:44 _X.java:15: error: variable i is already defined in method main(String[])\n
02:16:44 		String i\u0010;\n
02:16:44 		       ^\n
02:16:44 _X.java:16: error: variable i is already defined in method main(String[])\n
02:16:44 		String i\u0011;\n
02:16:44 		       ^\n
02:16:44 _X.java:17: error: variable i is already defined in method main(String[])\n
02:16:44 		String i\u0012;\n
02:16:44 		       ^\n
02:16:44 _X.java:18: error: variable i is already defined in method main(String[])\n
02:16:44 		String i\u0013;\n
02:16:44 		       ^\n
02:16:44 _X.java:19: error: variable i is already defined in method main(String[])\n
02:16:44 		String i\u0014;\n
02:16:44 		       ^\n
02:16:44 _X.java:20: error: variable i is already defined in method main(String[])\n
02:16:44 		String i\u0015;\n
02:16:44 		       ^\n
02:16:44 _X.java:21: error: variable i is already defined in method main(String[])\n
02:16:44 		String i\u0016;\n
02:16:44 		       ^\n
02:16:44 _X.java:22: error: variable i is already defined in method main(String[])\n
02:16:44 		String i\u0017;\n
02:16:44 		       ^\n
02:16:44 _X.java:23: error: variable i is already defined in method main(String[])\n
02:16:44 		String i\u0018;\n
02:16:44 		       ^\n
02:16:44 _X.java:24: error: variable i is already defined in method main(String[])\n
02:16:44 		String i\u0019;\n
02:16:44 		       ^\n
02:16:44 _X.java:25: error: variable i is already defined in method main(String[])\n
02:16:44 		String i\u001a;\n
02:16:44 		       ^\n
02:16:44 _X.java:26: error: variable i is already defined in method main(String[])\n
02:16:44 		String i\u001b;\n
02:16:44 		       ^\n
02:16:44 _X.java:27: error: variable i is already defined in method main(String[])\n
02:16:44 		String i\u007f;\n
02:16:44 		       ^\n
02:16:44 23 errors\n
02:16:44 ]>
02:16:44   SerialVersionUIDTests>TestCase.runTest:964->test011:220->AbstractRegressionTest.runNegativeTest:2592->AbstractRegressionTest.runNegativeTest:2601->AbstractRegressionTest.runTest:2920->AbstractRegressionTest.runTest:3195->AbstractRegressionTest.runJavac:2350->AbstractRegressionTest.handleMismatch:2403->TestCase.assertEquals:242->TestCase.assertStringEquals:266 test011 - Eclipse found error(s) but Javac did not find any.
02:16:44 ----------- Expected ------------
02:16:44 
02:16:44 ------------ but was ------------
02:16:44 ----------\n
02:16:44 1. ERROR in X.java (at line 2)\n
02:16:44 	private static final long serialVersionUID = 1L;\n
02:16:44 	                          ^^^^^^^^^^^^^^^^\n
02:16:44 The value of the field X.serialVersionUID is not used\n
02:16:44 ----------\n
02:16:44 
02:16:44 --------- Difference is ----------
02:16:44  expected:<[]> but was:<[----------\n
02:16:44 1. ERROR in X.java (at line 2)\n
02:16:44 	private static final long serialVersionUID = 1L;\n
02:16:44 	                          ^^^^^^^^^^^^^^^^\n
02:16:44 The value of the field X.serialVersionUID is not used\n
02:16:44 ----------\n
02:16:44 ]>
02:16:44   SerialVersionUIDTests>TestCase.runTest:964->test012:243->AbstractRegressionTest.runNegativeTest:2592->AbstractRegressionTest.runNegativeTest:2601->AbstractRegressionTest.runTest:2920->AbstractRegressionTest.runTest:3195->AbstractRegressionTest.runJavac:2350->AbstractRegressionTest.handleMismatch:2403->TestCase.assertEquals:242->TestCase.assertStringEquals:266 test012 - Eclipse found error(s) but Javac did not find any.
02:16:44 ----------- Expected ------------
02:16:44 
02:16:44 ------------ but was ------------
02:16:44 ----------\n
02:16:44 1. ERROR in X.java (at line 2)\n
02:16:44 	private static final long serialVersionUID = 1L;\n
02:16:44 	                          ^^^^^^^^^^^^^^^^\n
02:16:44 The value of the field X<T>.serialVersionUID is not used\n
02:16:44 ----------\n
02:16:44 
02:16:44 --------- Difference is ----------
02:16:44  expected:<[]> but was:<[----------\n
02:16:44 1. ERROR in X.java (at line 2)\n
02:16:44 	private static final long serialVersionUID = 1L;\n
02:16:44 	                          ^^^^^^^^^^^^^^^^\n
02:16:44 The value of the field X<T>.serialVersionUID is not used\n
02:16:44 ----------\n
02:16:44 ]>
02:16:44   SerialVersionUIDTests>TestCase.runTest:964->test013:266->AbstractRegressionTest.runNegativeTest:2592->AbstractRegressionTest.runNegativeTest:2601->AbstractRegressionTest.runTest:2920->AbstractRegressionTest.runTest:3195->AbstractRegressionTest.runJavac:2350->AbstractRegressionTest.handleMismatch:2403->TestCase.assertEquals:242->TestCase.assertStringEquals:266 test013 - Eclipse found error(s) but Javac did not find any.
02:16:44 ----------- Expected ------------
02:16:44 
02:16:44 ------------ but was ------------
02:16:44 ----------\n
02:16:44 1. ERROR in X.java (at line 2)\n
02:16:44 	private static final long serialPersistentFields = 1L;\n
02:16:44 	                          ^^^^^^^^^^^^^^^^^^^^^^\n
02:16:44 The value of the field X<T>.serialPersistentFields is not used\n
02:16:44 ----------\n
02:16:44 
02:16:44 --------- Difference is ----------
02:16:44  expected:<[]> but was:<[----------\n
02:16:44 1. ERROR in X.java (at line 2)\n
02:16:44 	private static final long serialPersistentFields = 1L;\n
02:16:44 	                          ^^^^^^^^^^^^^^^^^^^^^^\n
02:16:44 The value of the field X<T>.serialPersistentFields is not used\n
02:16:44 ----------\n
02:16:44 ]>
02:16:44   SerialVersionUIDTests>TestCase.runTest:964->test014:288->AbstractRegressionTest.runNegativeTest:2592->AbstractRegressionTest.runNegativeTest:2601->AbstractRegressionTest.runTest:2920->AbstractRegressionTest.runTest:3195->AbstractRegressionTest.runJavac:2350->AbstractRegressionTest.handleMismatch:2403->TestCase.assertEquals:242->TestCase.assertStringEquals:266 test014 - Eclipse found error(s) but Javac did not find any.
02:16:44 ----------- Expected ------------
02:16:44 
02:16:44 ------------ but was ------------
02:16:44 ----------\n
02:16:44 1. ERROR in X.java (at line 2)\n
02:16:44 	private static final long serialPersistentFields = 1L;\n
02:16:44 	                          ^^^^^^^^^^^^^^^^^^^^^^\n
02:16:44 The value of the field X.serialPersistentFields is not used\n
02:16:44 ----------\n
02:16:44 
02:16:44 --------- Difference is ----------
02:16:44  expected:<[]> but was:<[----------\n
02:16:44 1. ERROR in X.java (at line 2)\n
02:16:44 	private static final long serialPersistentFields = 1L;\n
02:16:44 	                          ^^^^^^^^^^^^^^^^^^^^^^\n
02:16:44 The value of the field X.serialPersistentFields is not used\n
02:16:44 ----------\n
02:16:44 ]>
02:16:44   SerialVersionUIDTests>TestCase.runTest:964->test015:311->AbstractRegressionTest.runNegativeTest:2592->AbstractRegressionTest.runNegativeTest:2601->AbstractRegressionTest.runTest:2920->AbstractRegressionTest.runTest:3195->AbstractRegressionTest.runJavac:2350->AbstractRegressionTest.handleMismatch:2403->TestCase.assertEquals:242->TestCase.assertStringEquals:266 test015 - Eclipse found error(s) but Javac did not find any.
02:16:44 ----------- Expected ------------
02:16:44 
02:16:44 ------------ but was ------------
02:16:44 ----------\n
02:16:44 1. ERROR in X.java (at line 5)\n
02:16:44 	private int i;\n
02:16:44 	            ^\n
02:16:44 The value of the field X<T>.i is not used\n
02:16:44 ----------\n
02:16:44 
02:16:44 --------- Difference is ----------
02:16:44  expected:<[]> but was:<[----------\n
02:16:44 1. ERROR in X.java (at line 5)\n
02:16:44 	private int i;\n
02:16:44 	            ^\n
02:16:44 The value of the field X<T>.i is not used\n
02:16:44 ----------\n
02:16:44 ]>
02:16:44   SerialVersionUIDTests>TestCase.runTest:964->test016:336->AbstractRegressionTest.runNegativeTest:2592->AbstractRegressionTest.runNegativeTest:2601->AbstractRegressionTest.runTest:2920->AbstractRegressionTest.runTest:3195->AbstractRegressionTest.runJavac:2350->AbstractRegressionTest.handleMismatch:2403->TestCase.assertEquals:242->TestCase.assertStringEquals:266 test016 - Eclipse found error(s) but Javac did not find any.
02:16:44 ----------- Expected ------------
02:16:44 
02:16:44 ------------ but was ------------
02:16:44 ----------\n
02:16:44 1. ERROR in X.java (at line 5)\n
02:16:44 	private int i;\n
02:16:44 	            ^\n
02:16:44 The value of the field X.i is not used\n
02:16:44 ----------\n
02:16:44 
02:16:44 --------- Difference is ----------
02:16:44  expected:<[]> but was:<[----------\n
02:16:44 1. ERROR in X.java (at line 5)\n
02:16:44 	private int i;\n
02:16:44 	            ^\n
02:16:44 The value of the field X.i is not used\n
02:16:44 ----------\n
02:16:44 ]>
02:16:44   StaticImportTest>TestCase.runTest:964->test074:2538->AbstractRegressionTest.runConformTest:1689->AbstractRegressionTest.runConformTest:1692->AbstractRegressionTest.runTest:2920->AbstractRegressionTest.runTest:3195->AbstractRegressionTest.runJavac:2350->AbstractRegressionTest.handleMismatch:2411->TestCase.assertEquals:242->TestCase.assertStringEquals:266 test074 - Javac found error(s) but Eclipse did not find any.
02:16:44 ----------- Expected ------------
02:16:44 
02:16:44 ------------ but was ------------
02:16:44 test/Outer.java:4: error: cannot find symbol\n
02:16:44     int i = VALUE;\n
02:16:44             ^\n
02:16:44   symbol:   variable VALUE\n
02:16:44   location: class Outer\n
02:16:44 1 error\n
02:16:44 
02:16:44 --------- Difference is ----------
02:16:44  expected:<[]> but was:<[test/Outer.java:4: error: cannot find symbol\n
02:16:44     int i = VALUE;\n
02:16:44             ^\n
02:16:44   symbol:   variable VALUE\n
02:16:44   location: class Outer\n
02:16:44 1 error\n
02:16:44 ]>
02:16:44   StaticImportTest>TestCase.runTest:964->test078:2648->AbstractRegressionTest.runNegativeTest:2474->AbstractRegressionTest.runNegativeTest:2485->AbstractRegressionTest.runTest:2920->AbstractRegressionTest.runTest:3195->AbstractRegressionTest.runJavac:2350->AbstractRegressionTest.handleMismatch:2403->TestCase.assertEquals:242->TestCase.assertStringEquals:266 test078 - Eclipse found error(s) but Javac did not find any.
02:16:44 ----------- Expected ------------
02:16:44 
02:16:44 ------------ but was ------------
02:16:44 ----------\n
02:16:44 1. ERROR in A\A.java (at line 3)\n
02:16:44 	import B.B.C1;\n
02:16:44 	       ^^^^^^\n
02:16:44 The import B.B.C1 collides with another import statement\n
02:16:44 ----------\n
02:16:44 
02:16:44 --------- Difference is ----------
02:16:44  expected:<[]> but was:<[----------\n
02:16:44 1. ERROR in A\A.java (at line 3)\n
02:16:44 	import B.B.C1;\n
02:16:44 	       ^^^^^^\n
02:16:44 The import B.B.C1 collides with another import statement\n
02:16:44 ----------\n
02:16:44 ]>
02:16:44   StaticImportTest>TestCase.runTest:964->test079:2682->AbstractRegressionTest.runNegativeTest:2474->AbstractRegressionTest.runNegativeTest:2485->AbstractRegressionTest.runTest:2920->AbstractRegressionTest.runTest:3195->AbstractRegressionTest.runJavac:2350->AbstractRegressionTest.handleMismatch:2419->TestCase.assertEquals:242->TestCase.assertStringEquals:266 test079 - Eclipse found warning(s) but Javac did not find any.
02:16:44 ----------- Expected ------------
02:16:44 
02:16:44 ------------ but was ------------
02:16:44 ----------\n
02:16:44 1. WARNING in A\A.java (at line 2)\n
02:16:44 	import static B.B.C1;\n
02:16:44 	              ^^^^^^\n
02:16:44 The import B.B.C1 is never used\n
02:16:44 ----------\n
02:16:44 
02:16:44 --------- Difference is ----------
02:16:44  expected:<[]> but was:<[----------\n
02:16:44 1. WARNING in A\A.java (at line 2)\n
02:16:44 	import static B.B.C1;\n
02:16:44 	              ^^^^^^\n
02:16:44 The import B.B.C1 is never used\n
02:16:44 ----------\n
02:16:44 ]>
02:16:44   SwitchTest>TestCase.runTest:964->test014:610->AbstractRegressionTest.runNegativeTest:2592->AbstractRegressionTest.runNegativeTest:2601->AbstractRegressionTest.runTest:2920->AbstractRegressionTest.runTest:3195->AbstractRegressionTest.runJavac:2350->AbstractRegressionTest.handleMismatch:2407->TestCase.assertEquals:242->TestCase.assertStringEquals:266 test014 - Eclipse found error(s) but Javac only found warning(s).
02:16:44 ----------- Expected ------------
02:16:44 ----------\n
02:16:44 1. ERROR in X.java (at line 18)\n
02:16:44 	case 6://WRONG\n
02:16:44 	^^^^^^\n
02:16:44 Switch case may be entered by falling through previous case. If intended, add a new comment //$FALL-THROUGH$ on the line above\n
02:16:44 ----------\n
02:16:44 
02:16:44 ------------ but was ------------
02:16:44 X.java:8: warning: [fallthrough] possible fall-through into case\n
02:16:44 			case 2://OK\n
02:16:44 			^\n
02:16:44 X.java:10: warning: [fallthrough] possible fall-through into case\n
02:16:44 			case 3://OK\n
02:16:44 			^\n
02:16:44 X.java:13: warning: [fallthrough] possible fall-through into case\n
02:16:44 			case 4://OK\n
02:16:44 			^\n
02:16:44 X.java:18: warning: [fallthrough] possible fall-through into case\n
02:16:44 			case 6://WRONG\n
02:16:44 			^\n
02:16:44 X.java:22: warning: [fallthrough] possible fall-through into case\n
02:16:44 			case 7://OK\n
02:16:44 			^\n
02:16:44 5 warnings\n
02:16:44 
02:16:44 --------- Difference is ----------
02:16:44  expected:<[----------\n
02:16:44 1. ERROR in X.java (at line 18)\n
02:16:44 	case 6://WRONG\n
02:16:44 	^^^^^^\n
02:16:44 Switch case may be entered by falling through previous case. If intended, add a new comment //$FALL-THROUGH$ on the line above\n
02:16:44 ----------]\n
02:16:44 > but was:<[X.java:8: warning: [fallthrough] possible fall-through into case\n
02:16:44 			case 2://OK\n
02:16:44 			^\n
02:16:44 X.java:10: warning: [fallthrough] possible fall-through into case\n
02:16:44 			case 3://OK\n
02:16:44 			^\n
02:16:44 X.java:13: warning: [fallthrough] possible fall-through into case\n
02:16:44 			case 4://OK\n
02:16:44 			^\n
02:16:44 X.java:18: warning: [fallthrough] possible fall-through into case\n
02:16:44 			case 6://WRONG\n
02:16:44 			^\n
02:16:44 X.java:22: warning: [fallthrough] possible fall-through into case\n
02:16:44 			case 7://OK\n
02:16:44 			^\n
02:16:44 5 warnings]\n
02:16:44 >
02:16:44   SwitchTest>TestCase.runTest:964->test015:653->AbstractRegressionTest.runNegativeTest:2592->AbstractRegressionTest.runNegativeTest:2601->AbstractRegressionTest.runTest:2920->AbstractRegressionTest.runTest:3195->AbstractRegressionTest.runJavac:2350->AbstractRegressionTest.handleMismatch:2407->TestCase.assertEquals:242->TestCase.assertStringEquals:266 test015 - Eclipse found error(s) but Javac only found warning(s).
02:16:44 ----------- Expected ------------
02:16:44 ----------\n
02:16:44 1. ERROR in X.java (at line 18)\n
02:16:44 	case 6://WRONG\n
02:16:44 	^^^^^^\n
02:16:44 Switch case may be entered by falling through previous case. If intended, add a new comment //$FALL-THROUGH$ on the line above\n
02:16:44 ----------\n
02:16:44 
02:16:44 ------------ but was ------------
02:16:44 X.java:8: warning: [fallthrough] possible fall-through into case\n
02:16:44 			case 2://OK\n
02:16:44 			^\n
02:16:44 X.java:10: warning: [fallthrough] possible fall-through into case\n
02:16:44 			case 3://OK\n
02:16:44 			^\n
02:16:44 X.java:13: warning: [fallthrough] possible fall-through into case\n
02:16:44 			case 4://OK\n
02:16:44 			^\n
02:16:44 X.java:18: warning: [fallthrough] possible fall-through into case\n
02:16:44 			case 6://WRONG\n
02:16:44 			^\n
02:16:44 X.java:22: warning: [fallthrough] possible fall-through into case\n
02:16:44 			case 7://OK\n
02:16:44 			^\n
02:16:44 5 warnings\n
02:16:44 
02:16:44 --------- Difference is ----------
02:16:44  expected:<[----------\n
02:16:44 1. ERROR in X.java (at line 18)\n
02:16:44 	case 6://WRONG\n
02:16:44 	^^^^^^\n
02:16:44 Switch case may be entered by falling through previous case. If intended, add a new comment //$FALL-THROUGH$ on the line above\n
02:16:44 ----------]\n
02:16:44 > but was:<[X.java:8: warning: [fallthrough] possible fall-through into case\n
02:16:44 			case 2://OK\n
02:16:44 			^\n
02:16:44 X.java:10: warning: [fallthrough] possible fall-through into case\n
02:16:44 			case 3://OK\n
02:16:44 			^\n
02:16:44 X.java:13: warning: [fallthrough] possible fall-through into case\n
02:16:44 			case 4://OK\n
02:16:44 			^\n
02:16:44 X.java:18: warning: [fallthrough] possible fall-through into case\n
02:16:44 			case 6://WRONG\n
02:16:44 			^\n
02:16:44 X.java:22: warning: [fallthrough] possible fall-through into case\n
02:16:44 			case 7://OK\n
02:16:44 			^\n
02:16:44 5 warnings]\n
02:16:44 >
02:16:44   SwitchTest>TestCase.runTest:964->test016:696->AbstractRegressionTest.runNegativeTest:2592->AbstractRegressionTest.runNegativeTest:2601->AbstractRegressionTest.runTest:2920->AbstractRegressionTest.runTest:3195->AbstractRegressionTest.runJavac:2350->AbstractRegressionTest.handleMismatch:2407->TestCase.assertEquals:242->TestCase.assertStringEquals:266 test016 - Eclipse found error(s) but Javac only found warning(s).
02:16:44 ----------- Expected ------------
02:16:44 ----------\n
02:16:44 1. ERROR in X.java (at line 8)\n
02:16:44 	case 2://WRONG\n
02:16:44 	^^^^^^\n
02:16:44 Switch case may be entered by falling through previous case. If intended, add a new comment //$FALL-THROUGH$ on the line above\n
02:16:44 ----------\n
02:16:44 
02:16:44 ------------ but was ------------
02:16:44 X.java:8: warning: [fallthrough] possible fall-through into case\n
02:16:44 			case 2://WRONG\n
02:16:44 			^\n
02:16:44 1 warning\n
02:16:44 
02:16:44 --------- Difference is ----------
02:16:44  expected:<[----------\n
02:16:44 1. ERROR in X.java (at line 8)\n
02:16:44 	case 2://WRONG\n
02:16:44 	^^^^^^\n
02:16:44 Switch case may be entered by falling through previous case. If intended, add a new comment //$FALL-THROUGH$ on the line above\n
02:16:44 ----------]\n
02:16:44 > but was:<[X.java:8: warning: [fallthrough] possible fall-through into case\n
02:16:44 			case 2://WRONG\n
02:16:44 			^\n
02:16:44 1 warning]\n
02:16:44 >
02:16:44   SwitchTest>TestCase.runTest:964->test017:725->AbstractRegressionTest.runNegativeTest:2592->AbstractRegressionTest.runNegativeTest:2601->AbstractRegressionTest.runTest:2920->AbstractRegressionTest.runTest:3195->AbstractRegressionTest.runJavac:2350->AbstractRegressionTest.handleMismatch:2407->TestCase.assertEquals:242->TestCase.assertStringEquals:266 test017 - Eclipse found error(s) but Javac only found warning(s).
02:16:44 ----------- Expected ------------
02:16:44 ----------\n
02:16:44 1. ERROR in X.java (at line 10)\n
02:16:44 	default :\n
02:16:44 	^^^^^^^\n
02:16:44 Switch case may be entered by falling through previous case. If intended, add a new comment //$FALL-THROUGH$ on the line above\n
02:16:44 ----------\n
02:16:44 
02:16:44 ------------ but was ------------
02:16:44 X.java:10: warning: [fallthrough] possible fall-through into case\n
02:16:44 			default :\n
02:16:44 			^\n
02:16:44 1 warning\n
02:16:44 
02:16:44 --------- Difference is ----------
02:16:44  expected:<[----------\n
02:16:44 1. ERROR in X.java (at line 10)\n
02:16:44 	default :\n
02:16:44 	^^^^^^^\n
02:16:44 Switch case may be entered by falling through previous case. If intended, add a new comment //$FALL-THROUGH$ on the line above\n
02:16:44 ----------]\n
02:16:44 > but was:<[X.java:10: warning: [fallthrough] possible fall-through into case\n
02:16:44 			default :\n
02:16:44 			^\n
02:16:44 1 warning]\n
02:16:44 >
02:16:44   SwitchTest>TestCase.runTest:964->test387146a:2572->AbstractRegressionTest.runNegativeTest:2592->AbstractRegressionTest.runNegativeTest:2601->AbstractRegressionTest.runTest:2920->AbstractRegressionTest.runTest:3195->AbstractRegressionTest.runJavac:2350->AbstractRegressionTest.handleMismatch:2423->TestCase.assertEquals:242->TestCase.assertStringEquals:266 test387146a - Javac found warning(s) but Eclipse did not find any.
02:16:44 ----------- Expected ------------
02:16:44 
02:16:44 ------------ but was ------------
02:16:44 X.java:10: warning: [fallthrough] possible fall-through into case\n
02:16:44 		case 2:\n
02:16:44 		^\n
02:16:44 1 warning\n
02:16:44 
02:16:44 --------- Difference is ----------
02:16:44  expected:<[]> but was:<[X.java:10: warning: [fallthrough] possible fall-through into case\n
02:16:44 		case 2:\n
02:16:44 		^\n
02:16:44 1 warning\n
02:16:44 ]>
02:16:44   SwitchTest>TestCase.runTest:964->test387146b:2601->AbstractRegressionTest.runNegativeTest:2592->AbstractRegressionTest.runNegativeTest:2601->AbstractRegressionTest.runTest:2920->AbstractRegressionTest.runTest:3195->AbstractRegressionTest.runJavac:2350->AbstractRegressionTest.handleMismatch:2423->TestCase.assertEquals:242->TestCase.assertStringEquals:266 test387146b - Javac found warning(s) but Eclipse did not find any.
02:16:44 ----------- Expected ------------
02:16:44 
02:16:44 ------------ but was ------------
02:16:44 X.java:10: warning: [fallthrough] possible fall-through into case\n
02:16:44 		case 2:\n
02:16:44 		^\n
02:16:44 1 warning\n
02:16:44 
02:16:44 --------- Difference is ----------
02:16:44  expected:<[]> but was:<[X.java:10: warning: [fallthrough] possible fall-through into case\n
02:16:44 		case 2:\n
02:16:44 		^\n
02:16:44 1 warning\n
02:16:44 ]>
02:16:44   SwitchTest>TestCase.runTest:964->test410892_4:2782->AbstractRegressionTest.runNegativeTest:2592->AbstractRegressionTest.runNegativeTest:2601->AbstractRegressionTest.runTest:2920->AbstractRegressionTest.runTest:3195->AbstractRegressionTest.runJavac:2350->AbstractRegressionTest.handleMismatch:2419->TestCase.assertEquals:242->TestCase.assertStringEquals:266 test410892_4 - Eclipse found warning(s) but Javac did not find any.
02:16:44 ----------- Expected ------------
02:16:44 
02:16:44 ------------ but was ------------
02:16:44 ----------\n
02:16:44 1. WARNING in X.java (at line 4)\n
02:16:44 	int var2 = 0;\n
02:16:44 	    ^^^^\n
02:16:44 The value of the local variable var2 is not used\n
02:16:44 ----------\n
02:16:44 
02:16:44 --------- Difference is ----------
02:16:44  expected:<[]> but was:<[----------\n
02:16:44 1. WARNING in X.java (at line 4)\n
02:16:44 	int var2 = 0;\n
02:16:44 	    ^^^^\n
02:16:44 The value of the local variable var2 is not used\n
02:16:44 ----------\n
02:16:44 ]>
02:16:44   SwitchTest>TestCase.runTest:964->test410892_5:2817->AbstractRegressionTest.runNegativeTest:2592->AbstractRegressionTest.runNegativeTest:2601->AbstractRegressionTest.runTest:2920->AbstractRegressionTest.runTest:3195->AbstractRegressionTest.runJavac:2350->AbstractRegressionTest.handleMismatch:2419->TestCase.assertEquals:242->TestCase.assertStringEquals:266 test410892_5 - Eclipse found warning(s) but Javac did not find any.
02:16:44 ----------- Expected ------------
02:16:44 
02:16:44 ------------ but was ------------
02:16:44 ----------\n
02:16:44 1. WARNING in X.java (at line 4)\n
02:16:44 	int var2 = 0;\n
02:16:44 	    ^^^^\n
02:16:44 The value of the local variable var2 is not used\n
02:16:44 ----------\n
02:16:44 
02:16:44 --------- Difference is ----------
02:16:44  expected:<[]> but was:<[----------\n
02:16:44 1. WARNING in X.java (at line 4)\n
02:16:44 	int var2 = 0;\n
02:16:44 	    ^^^^\n
02:16:44 The value of the local variable var2 is not used\n
02:16:44 ----------\n
02:16:44 ]>
02:16:44   SwitchTest>TestCase.runTest:964->test410892_6:2853->AbstractRegressionTest.runNegativeTest:2592->AbstractRegressionTest.runNegativeTest:2601->AbstractRegressionTest.runTest:2920->AbstractRegressionTest.runTest:3195->AbstractRegressionTest.runJavac:2350->AbstractRegressionTest.handleMismatch:2419->TestCase.assertEquals:242->TestCase.assertStringEquals:266 test410892_6 - Eclipse found warning(s) but Javac did not find any.
02:16:44 ----------- Expected ------------
02:16:44 
02:16:44 ------------ but was ------------
02:16:44 ----------\n
02:16:44 1. WARNING in X.java (at line 4)\n
02:16:44 	int var2 = 0;\n
02:16:44 	    ^^^^\n
02:16:44 The value of the local variable var2 is not used\n
02:16:44 ----------\n
02:16:44 
02:16:44 --------- Difference is ----------
02:16:44  expected:<[]> but was:<[----------\n
02:16:44 1. WARNING in X.java (at line 4)\n
02:16:44 	int var2 = 0;\n
02:16:44 	    ^^^^\n
02:16:44 The value of the local variable var2 is not used\n
02:16:44 ----------\n
02:16:44 ]>
02:16:44   SwitchTest>TestCase.runTest:964->testBug374605:2144->AbstractRegressionTest.runNegativeTest:2592->AbstractRegressionTest.runNegativeTest:2601->AbstractRegressionTest.runTest:2920->AbstractRegressionTest.runTest:3195->AbstractRegressionTest.runJavac:2350->AbstractRegressionTest.handleMismatch:2419->TestCase.assertEquals:242->TestCase.assertStringEquals:266 testBug374605 - Eclipse found warning(s) but Javac did not find any.
02:16:44 ----------- Expected ------------
02:16:44 
02:16:44 ------------ but was ------------
02:16:44 ----------\n
02:16:44 1. WARNING in p\X.java (at line 4)\n
02:16:44 	switch (i) {\n
02:16:44 	        ^\n
02:16:44 The switch statement should have a default case\n
02:16:44 ----------\n
02:16:44 
02:16:44 --------- Difference is ----------
02:16:44  expected:<[]> but was:<[----------\n
02:16:44 1. WARNING in p\X.java (at line 4)\n
02:16:44 	switch (i) {\n
02:16:44 	        ^\n
02:16:44 The switch statement should have a default case\n
02:16:44 ----------\n
02:16:44 ]>
02:16:44   XLargeTest>TestCase.runTest:964->test0016:14523->AbstractRegressionTest.runConformTest:1689->AbstractRegressionTest.runConformTest:1692->AbstractRegressionTest.runTest:2920->AbstractRegressionTest.runTest:3195->AbstractRegressionTest.runJavac:2350->AbstractRegressionTest.handleMismatch:2411->TestCase.assertEquals:242->TestCase.assertStringEquals:266 test0016 - Javac found error(s) but Eclipse did not find any.
02:16:44 ----------- Expected ------------
02:16:44 
02:16:44 ------------ but was ------------
02:16:44 X.java:2: error: code too large\n
02:16:44 	X0(0),\n
02:16:44 	^\n
02:16:44 1 error\n
02:16:44 
02:16:44 --------- Difference is ----------
02:16:44  expected:<[]> but was:<[X.java:2: error: code too large\n
02:16:44 	X0(0),\n
02:16:44 	^\n
02:16:44 1 error\n
02:16:44 ]>
02:16:44 
02:16:44 Tests run: 12526, Failures: 197, Errors: 0, Skipped: 0
02:16:44 
02:16:45 [INFO] ------------------------------------------------------------------------
02:16:45 [INFO] Reactor Summary:
02:16:45 [INFO] 
02:16:45 [INFO] org.eclipse.jdt.core 3.18.0-SNAPSHOT ............... SUCCESS [01:05 min]
02:16:45 [INFO] org.eclipse.jdt.core.tests.compiler 3.12.900-SNAPSHOT FAILURE [  02:12 h]
02:16:45 [INFO] ------------------------------------------------------------------------
02:16:45 [INFO] BUILD FAILURE
02:16:45 [INFO] ------------------------------------------------------------------------
02:16:45 [INFO] Total time:  02:15 h
02:16:45 [INFO] Finished at: 2019-06-01T02:16:45-04:00
02:16:45 [INFO] ------------------------------------------------------------------------
02:16:45 [ERROR] Failed to execute goal org.eclipse.tycho:tycho-surefire-plugin:1.4.0:test (default-test) on project org.eclipse.jdt.core.tests.compiler: There are test failures.
02:16:45 [ERROR] 
02:16:45 [ERROR] Please refer to /jobs/genie.jdt/eclipse.jdt.core-run.javac-1.8/workspace/org.eclipse.jdt.core.tests.compiler/target/surefire-reports for the individual test results.
02:16:45 [ERROR] -> [Help 1]
02:16:45 [ERROR] 
02:16:45 [ERROR] To see the full stack trace of the errors, re-run Maven with the -e switch.
02:16:45 [ERROR] Re-run Maven using the -X switch to enable full debug logging.
02:16:45 [ERROR] 
02:16:45 [ERROR] For more information about the errors and possible solutions, please read the following articles:
02:16:45 [ERROR] [Help 1] http://cwiki.apache.org/confluence/display/MAVEN/MojoFailureException
02:16:45 [ERROR] 
02:16:45 [ERROR] After correcting the problems, you can resume the build with the command
02:16:45 [ERROR]   mvn <goals> -rf :org.eclipse.jdt.core.tests.compiler
02:16:47 Build step 'Invoke top-level Maven targets' marked build as failure
02:16:47 Recording test results
02:16:48 Sending e-mails to: stephan.herrmann@berlin.de
02:16:48 Started calculate disk usage of build
02:16:48 Finished Calculation of disk usage of build in 0 seconds
02:16:53 Started calculate disk usage of workspace
02:16:54 Finished Calculation of disk usage of workspace in 0 seconds
02:16:58 Finished: FAILURE