FailedConsole Output

Skipping 5,652 KB.. Full Log
Test)  Time elapsed: 0.143 s
test057 - 1.8(org.eclipse.jdt.core.tests.eval.DebugEvaluationTest)  Time elapsed: 0.15 s
test058 - 1.8(org.eclipse.jdt.core.tests.eval.DebugEvaluationTest)  Time elapsed: 0.144 s
test059 - 1.8(org.eclipse.jdt.core.tests.eval.DebugEvaluationTest)  Time elapsed: 0.147 s
test060 - 1.8(org.eclipse.jdt.core.tests.eval.DebugEvaluationTest)  Time elapsed: 0.147 s
test061 - 1.8(org.eclipse.jdt.core.tests.eval.DebugEvaluationTest)  Time elapsed: 0.144 s
test062 - 1.8(org.eclipse.jdt.core.tests.eval.DebugEvaluationTest)  Time elapsed: 0.139 s
test063 - 1.8(org.eclipse.jdt.core.tests.eval.DebugEvaluationTest)  Time elapsed: 0.14 s
test065 - 1.8(org.eclipse.jdt.core.tests.eval.DebugEvaluationTest)  Time elapsed: 0.15 s
test066 - 1.8(org.eclipse.jdt.core.tests.eval.DebugEvaluationTest)  Time elapsed: 0.145 s
test067 - 1.8(org.eclipse.jdt.core.tests.eval.DebugEvaluationTest)  Time elapsed: 0.158 s
test068 - 1.8(org.eclipse.jdt.core.tests.eval.DebugEvaluationTest)  Time elapsed: 0.039 s
test069 - 1.8(org.eclipse.jdt.core.tests.eval.DebugEvaluationTest)  Time elapsed: 0.043 s
testNegative001 - 1.8(org.eclipse.jdt.core.tests.eval.DebugEvaluationTest)  Time elapsed: 0.034 s
testNegative002 - 1.8(org.eclipse.jdt.core.tests.eval.DebugEvaluationTest)  Time elapsed: 0.029 s
testNegative003 - 1.8(org.eclipse.jdt.core.tests.eval.DebugEvaluationTest)  Time elapsed: 0.032 s
testNegative004 - 1.8(org.eclipse.jdt.core.tests.eval.DebugEvaluationTest)  Time elapsed: 0.016 s
testNegative005 - 1.8(org.eclipse.jdt.core.tests.eval.DebugEvaluationTest)  Time elapsed: 0.014 s
testAllVariables - 11(org.eclipse.jdt.core.tests.eval.SanityTestEvaluationContext)  Time elapsed: 0 s
testEvaluate - 11(org.eclipse.jdt.core.tests.eval.SanityTestEvaluationContext)  Time elapsed: 0.077 s
testEvaluateImports - 11(org.eclipse.jdt.core.tests.eval.SanityTestEvaluationContext)  Time elapsed: 0 s
testEvaluateVariable - 11(org.eclipse.jdt.core.tests.eval.SanityTestEvaluationContext)  Time elapsed: 0.011 s
testEvaluateVariables - 11(org.eclipse.jdt.core.tests.eval.SanityTestEvaluationContext)  Time elapsed: 0.004 s
testGetSetImports - 11(org.eclipse.jdt.core.tests.eval.SanityTestEvaluationContext)  Time elapsed: 0 s
testGetSetPackageName - 11(org.eclipse.jdt.core.tests.eval.SanityTestEvaluationContext)  Time elapsed: 0 s
testNewDeleteVariable - 11(org.eclipse.jdt.core.tests.eval.SanityTestEvaluationContext)  Time elapsed: 0 s
testGetEvaluationType - 11(org.eclipse.jdt.core.tests.eval.SanityTestEvaluationResult)  Time elapsed: 0.008 s
testGetProblems - 11(org.eclipse.jdt.core.tests.eval.SanityTestEvaluationResult)  Time elapsed: 0.005 s
testGetValue - 11(org.eclipse.jdt.core.tests.eval.SanityTestEvaluationResult)  Time elapsed: 0.005 s
testGetValueDisplayString - 11(org.eclipse.jdt.core.tests.eval.SanityTestEvaluationResult)  Time elapsed: 0.004 s
testGetValueTypeName - 11(org.eclipse.jdt.core.tests.eval.SanityTestEvaluationResult)  Time elapsed: 0.005 s
testHasErrors - 11(org.eclipse.jdt.core.tests.eval.SanityTestEvaluationResult)  Time elapsed: 0.004 s
testHasProblems - 11(org.eclipse.jdt.core.tests.eval.SanityTestEvaluationResult)  Time elapsed: 0.004 s
testHasValue - 11(org.eclipse.jdt.core.tests.eval.SanityTestEvaluationResult)  Time elapsed: 0.005 s
testHasWarnings - 11(org.eclipse.jdt.core.tests.eval.SanityTestEvaluationResult)  Time elapsed: 0.006 s
testAllKindOfValues - 11(org.eclipse.jdt.core.tests.eval.VariableTest)  Time elapsed: 1.144 s
testCodeSnippetVarAssign - 11(org.eclipse.jdt.core.tests.eval.VariableTest)  Time elapsed: 0.104 s
testCodeSnippetVarRetrieval - 11(org.eclipse.jdt.core.tests.eval.VariableTest)  Time elapsed: 0.049 s
testImports - 11(org.eclipse.jdt.core.tests.eval.VariableTest)  Time elapsed: 0.046 s
testSeveralVariableInstallations - 11(org.eclipse.jdt.core.tests.eval.VariableTest)  Time elapsed: 0.152 s
testBug345334 - 11(org.eclipse.jdt.core.tests.eval.CodeSnippetTest)  Time elapsed: 0.009 s
testBug464656 - 11(org.eclipse.jdt.core.tests.eval.CodeSnippetTest)  Time elapsed: 0.042 s
testCheckedException - 11(org.eclipse.jdt.core.tests.eval.CodeSnippetTest)  Time elapsed: 0.007 s
testDiamond - 11(org.eclipse.jdt.core.tests.eval.CodeSnippetTest)  Time elapsed: 0.034 s
testEmptyStatement - 11(org.eclipse.jdt.core.tests.eval.CodeSnippetTest)  Time elapsed: 0.009 s
testEvaluateEmptyImport - 11(org.eclipse.jdt.core.tests.eval.CodeSnippetTest)  Time elapsed: 0 s
testEvaluateExistingPackageAndNonExistingTypeImports - 11(org.eclipse.jdt.core.tests.eval.CodeSnippetTest)  Time elapsed: 0 s
testEvaluateNonExistingPackageAndExistingTypeImports - 11(org.eclipse.jdt.core.tests.eval.CodeSnippetTest)  Time elapsed: 0 s
testEvaluateNonExistingPackageImport - 11(org.eclipse.jdt.core.tests.eval.CodeSnippetTest)  Time elapsed: 0 s
testEvaluateNonExistingTypeImport - 11(org.eclipse.jdt.core.tests.eval.CodeSnippetTest)  Time elapsed: 0 s
testEvaluateValidPackageAndTypeImports - 11(org.eclipse.jdt.core.tests.eval.CodeSnippetTest)  Time elapsed: 0 s
testEvaluateValidPackageImport - 11(org.eclipse.jdt.core.tests.eval.CodeSnippetTest)  Time elapsed: 0 s
testEvaluateValidTypeImport - 11(org.eclipse.jdt.core.tests.eval.CodeSnippetTest)  Time elapsed: 0 s
testFinallyError - 11(org.eclipse.jdt.core.tests.eval.CodeSnippetTest)  Time elapsed: 0.008 s
testFinallyOneBlock - 11(org.eclipse.jdt.core.tests.eval.CodeSnippetTest)  Time elapsed: 0.007 s
testFinallyTwoBlock - 11(org.eclipse.jdt.core.tests.eval.CodeSnippetTest)  Time elapsed: 0.005 s
testFor89632 - 11(org.eclipse.jdt.core.tests.eval.CodeSnippetTest)  Time elapsed: 0.012 s
testFreeReturnAnonymous - 11(org.eclipse.jdt.core.tests.eval.CodeSnippetTest)  Time elapsed: 0.008 s
testFreeReturnClassDeclaration - 11(org.eclipse.jdt.core.tests.eval.CodeSnippetTest)  Time elapsed: 0.006 s
testFreeReturnExpression - 11(org.eclipse.jdt.core.tests.eval.CodeSnippetTest)  Time elapsed: 0.005 s
testFreeReturnInteger - 11(org.eclipse.jdt.core.tests.eval.CodeSnippetTest)  Time elapsed: 0.004 s
testFreeReturnLocalVar - 11(org.eclipse.jdt.core.tests.eval.CodeSnippetTest)  Time elapsed: 0.005 s
testFreeReturnStatement - 11(org.eclipse.jdt.core.tests.eval.CodeSnippetTest)  Time elapsed: 0.006 s
testImportPackage - 11(org.eclipse.jdt.core.tests.eval.CodeSnippetTest)  Time elapsed: 0.007 s
testImportType - 11(org.eclipse.jdt.core.tests.eval.CodeSnippetTest)  Time elapsed: 0.008 s
testImportTypeAndPackage - 11(org.eclipse.jdt.core.tests.eval.CodeSnippetTest)  Time elapsed: 0.012 s
testInnerClassAnonymous - 11(org.eclipse.jdt.core.tests.eval.CodeSnippetTest)  Time elapsed: 0.009 s
testInnerClassNamed - 11(org.eclipse.jdt.core.tests.eval.CodeSnippetTest)  Time elapsed: 0.007 s
testReturnDisplayStringBoolean - 11(org.eclipse.jdt.core.tests.eval.CodeSnippetTest)  Time elapsed: 0.005 s
testReturnDisplayStringCharacter - 11(org.eclipse.jdt.core.tests.eval.CodeSnippetTest)  Time elapsed: 0.005 s
testReturnDisplayStringDouble - 11(org.eclipse.jdt.core.tests.eval.CodeSnippetTest)  Time elapsed: 0.005 s
testReturnDisplayStringEmptyCodeSnippet - 11(org.eclipse.jdt.core.tests.eval.CodeSnippetTest)  Time elapsed: 0.004 s
testReturnDisplayStringFloat - 11(org.eclipse.jdt.core.tests.eval.CodeSnippetTest)  Time elapsed: 0.005 s
testReturnDisplayStringInteger - 11(org.eclipse.jdt.core.tests.eval.CodeSnippetTest)  Time elapsed: 0.004 s
testReturnDisplayStringLong - 11(org.eclipse.jdt.core.tests.eval.CodeSnippetTest)  Time elapsed: 0.004 s
testReturnDisplayStringNoExplicitReturnedValue - 11(org.eclipse.jdt.core.tests.eval.CodeSnippetTest)  Time elapsed: 0.004 s
testReturnDisplayStringObject - 11(org.eclipse.jdt.core.tests.eval.CodeSnippetTest)  Time elapsed: 0.005 s
testReturnDisplayStringShort - 11(org.eclipse.jdt.core.tests.eval.CodeSnippetTest)  Time elapsed: 0.004 s
testReturnDisplayStringString - 11(org.eclipse.jdt.core.tests.eval.CodeSnippetTest)  Time elapsed: 0.004 s
testReturnDisplayStringVoid - 11(org.eclipse.jdt.core.tests.eval.CodeSnippetTest)  Time elapsed: 0.005 s
testReturnTypeBoolean - 11(org.eclipse.jdt.core.tests.eval.CodeSnippetTest)  Time elapsed: 0.003 s
testReturnTypeBooleanArray - 11(org.eclipse.jdt.core.tests.eval.CodeSnippetTest)  Time elapsed: 0.004 s
testReturnTypeBooleanObject - 11(org.eclipse.jdt.core.tests.eval.CodeSnippetTest)  Time elapsed: 0.004 s
testReturnTypeChar - 11(org.eclipse.jdt.core.tests.eval.CodeSnippetTest)  Time elapsed: 0.004 s
testReturnTypeCharArray - 11(org.eclipse.jdt.core.tests.eval.CodeSnippetTest)  Time elapsed: 0.006 s
testReturnTypeCharacterObject - 11(org.eclipse.jdt.core.tests.eval.CodeSnippetTest)  Time elapsed: 0.006 s
testReturnTypeDouble - 11(org.eclipse.jdt.core.tests.eval.CodeSnippetTest)  Time elapsed: 0.005 s
testReturnTypeDoubleArray - 11(org.eclipse.jdt.core.tests.eval.CodeSnippetTest)  Time elapsed: 0.004 s
testReturnTypeDoubleObject - 11(org.eclipse.jdt.core.tests.eval.CodeSnippetTest)  Time elapsed: 0.005 s
testReturnTypeEmptyCodeSnippet - 11(org.eclipse.jdt.core.tests.eval.CodeSnippetTest)  Time elapsed: 0.003 s
testReturnTypeFloat - 11(org.eclipse.jdt.core.tests.eval.CodeSnippetTest)  Time elapsed: 0.003 s
testReturnTypeFloatArray - 11(org.eclipse.jdt.core.tests.eval.CodeSnippetTest)  Time elapsed: 0.004 s
testReturnTypeFloatObject - 11(org.eclipse.jdt.core.tests.eval.CodeSnippetTest)  Time elapsed: 0.005 s
testReturnTypeInt - 11(org.eclipse.jdt.core.tests.eval.CodeSnippetTest)  Time elapsed: 0.003 s
testReturnTypeIntegerObject - 11(org.eclipse.jdt.core.tests.eval.CodeSnippetTest)  Time elapsed: 0.004 s
testReturnTypeLong - 11(org.eclipse.jdt.core.tests.eval.CodeSnippetTest)  Time elapsed: 0.004 s
testReturnTypeLongArray - 11(org.eclipse.jdt.core.tests.eval.CodeSnippetTest)  Time elapsed: 0.004 s
testReturnTypeLongObject - 11(org.eclipse.jdt.core.tests.eval.CodeSnippetTest)  Time elapsed: 0.005 s
testReturnTypeNoExplicitReturnedValue - 11(org.eclipse.jdt.core.tests.eval.CodeSnippetTest)  Time elapsed: 0.004 s
testReturnTypeObject - 11(org.eclipse.jdt.core.tests.eval.CodeSnippetTest)  Time elapsed: 0.004 s
testReturnTypeObjectArray - 11(org.eclipse.jdt.core.tests.eval.CodeSnippetTest)  Time elapsed: 0.004 s
testReturnTypeShort - 11(org.eclipse.jdt.core.tests.eval.CodeSnippetTest)  Time elapsed: 0.003 s
testReturnTypeShortArray - 11(org.eclipse.jdt.core.tests.eval.CodeSnippetTest)  Time elapsed: 0.004 s
testReturnTypeShortObject - 11(org.eclipse.jdt.core.tests.eval.CodeSnippetTest)  Time elapsed: 0.005 s
testReturnTypeString - 11(org.eclipse.jdt.core.tests.eval.CodeSnippetTest)  Time elapsed: 0.004 s
testReturnTypeStringArray - 11(org.eclipse.jdt.core.tests.eval.CodeSnippetTest)  Time elapsed: 0.026 s
testReturnTypeVoid - 11(org.eclipse.jdt.core.tests.eval.CodeSnippetTest)  Time elapsed: 0.007 s
testReturnTypesIntArray - 11(org.eclipse.jdt.core.tests.eval.CodeSnippetTest)  Time elapsed: 0.004 s
testRunMethodInAnonymous - 11(org.eclipse.jdt.core.tests.eval.CodeSnippetTest)  Time elapsed: 0.211 s
testRunMethodInAnonymous2 - 11(org.eclipse.jdt.core.tests.eval.CodeSnippetTest)  Time elapsed: 0.212 s
testRunMethodInAnonymous3 - 11(org.eclipse.jdt.core.tests.eval.CodeSnippetTest)  Time elapsed: 0.212 s
testRunMethodInAnonymous4 - 11(org.eclipse.jdt.core.tests.eval.CodeSnippetTest)  Time elapsed: 0.21 s
testRunMethodInAnonymous5 - 11(org.eclipse.jdt.core.tests.eval.CodeSnippetTest)  Time elapsed: 0.214 s
testRunMethodInAnonymous6 - 11(org.eclipse.jdt.core.tests.eval.CodeSnippetTest)  Time elapsed: 0.211 s
testRunMethodInAnonymous7 - 11(org.eclipse.jdt.core.tests.eval.CodeSnippetTest)  Time elapsed: 0.21 s
testRunMethodInAnonymous8 - 11(org.eclipse.jdt.core.tests.eval.CodeSnippetTest)  Time elapsed: 0.212 s
testExpressionInInnerClass - 11(org.eclipse.jdt.core.tests.eval.NegativeCodeSnippetTest)  Time elapsed: 0.003 s
testExtraClosingCurlyBracket - 11(org.eclipse.jdt.core.tests.eval.NegativeCodeSnippetTest)  Time elapsed: 0.005 s
testExtraOpenRoundBracket - 11(org.eclipse.jdt.core.tests.eval.NegativeCodeSnippetTest)  Time elapsed: 0.003 s
testExtraSemiColonInExpression - 11(org.eclipse.jdt.core.tests.eval.NegativeCodeSnippetTest)  Time elapsed: 0.002 s
testInvalidField - 11(org.eclipse.jdt.core.tests.eval.NegativeCodeSnippetTest)  Time elapsed: 0.004 s
testInvalidImport - 11(org.eclipse.jdt.core.tests.eval.NegativeCodeSnippetTest)  Time elapsed: 0.008 s
testInvalidUseOfThisInSnippet - 11(org.eclipse.jdt.core.tests.eval.NegativeCodeSnippetTest)  Time elapsed: 0.006 s
testInvalidUseOfThisInSnippet2 - 11(org.eclipse.jdt.core.tests.eval.NegativeCodeSnippetTest)  Time elapsed: 0.003 s
testMissingClosingRoundBracket - 11(org.eclipse.jdt.core.tests.eval.NegativeCodeSnippetTest)  Time elapsed: 0.003 s
testMissingDoubleQuote - 11(org.eclipse.jdt.core.tests.eval.NegativeCodeSnippetTest)  Time elapsed: 0.002 s
testNonLastExpressionStatement - 11(org.eclipse.jdt.core.tests.eval.NegativeCodeSnippetTest)  Time elapsed: 0.002 s
testProblemInExpression - 11(org.eclipse.jdt.core.tests.eval.NegativeCodeSnippetTest)  Time elapsed: 0.002 s
testProblemInExpression2 - 11(org.eclipse.jdt.core.tests.eval.NegativeCodeSnippetTest)  Time elapsed: 0.002 s
testProblemInInnerClass - 11(org.eclipse.jdt.core.tests.eval.NegativeCodeSnippetTest)  Time elapsed: 0.011 s
testProblemInPreviousStatement - 11(org.eclipse.jdt.core.tests.eval.NegativeCodeSnippetTest)  Time elapsed: 0.002 s
testProblemInReturnStatement - 11(org.eclipse.jdt.core.tests.eval.NegativeCodeSnippetTest)  Time elapsed: 0.002 s
testRemoveImport - 11(org.eclipse.jdt.core.tests.eval.NegativeCodeSnippetTest)  Time elapsed: 0.013 s
testRemoveVariable - 11(org.eclipse.jdt.core.tests.eval.NegativeCodeSnippetTest)  Time elapsed: 0.011 s
testUnreachableExpression - 11(org.eclipse.jdt.core.tests.eval.NegativeCodeSnippetTest)  Time elapsed: 0.002 s
testUnusedImport - 11(org.eclipse.jdt.core.tests.eval.NegativeCodeSnippetTest)  Time elapsed: 0.05 s
testWarning - 11(org.eclipse.jdt.core.tests.eval.NegativeCodeSnippetTest)  Time elapsed: 0.006 s
testInitializerProblem - 11(org.eclipse.jdt.core.tests.eval.NegativeVariableTest)  Time elapsed: 0.005 s
testUnknownType - 11(org.eclipse.jdt.core.tests.eval.NegativeVariableTest)  Time elapsed: 0.004 s
test001 - 11(org.eclipse.jdt.core.tests.eval.DebugEvaluationTest)  Time elapsed: 0.15 s
test002 - 11(org.eclipse.jdt.core.tests.eval.DebugEvaluationTest)  Time elapsed: 0.156 s
test003 - 11(org.eclipse.jdt.core.tests.eval.DebugEvaluationTest)  Time elapsed: 0.036 s
test004 - 11(org.eclipse.jdt.core.tests.eval.DebugEvaluationTest)  Time elapsed: 0.139 s
test005 - 11(org.eclipse.jdt.core.tests.eval.DebugEvaluationTest)  Time elapsed: 0.147 s
test006 - 11(org.eclipse.jdt.core.tests.eval.DebugEvaluationTest)  Time elapsed: 0.146 s
test007 - 11(org.eclipse.jdt.core.tests.eval.DebugEvaluationTest)  Time elapsed: 0.145 s
test008 - 11(org.eclipse.jdt.core.tests.eval.DebugEvaluationTest)  Time elapsed: 0.149 s
test009 - 11(org.eclipse.jdt.core.tests.eval.DebugEvaluationTest)  Time elapsed: 0.129 s
test010 - 11(org.eclipse.jdt.core.tests.eval.DebugEvaluationTest)  Time elapsed: 0.145 s
test011 - 11(org.eclipse.jdt.core.tests.eval.DebugEvaluationTest)  Time elapsed: 0.135 s
test016 - 11(org.eclipse.jdt.core.tests.eval.DebugEvaluationTest)  Time elapsed: 0.236 s
test017 - 11(org.eclipse.jdt.core.tests.eval.DebugEvaluationTest)  Time elapsed: 0.123 s
test018 - 11(org.eclipse.jdt.core.tests.eval.DebugEvaluationTest)  Time elapsed: 0.263 s
test019 - 11(org.eclipse.jdt.core.tests.eval.DebugEvaluationTest)  Time elapsed: 0.036 s
test020 - 11(org.eclipse.jdt.core.tests.eval.DebugEvaluationTest)  Time elapsed: 0.154 s
test021 - 11(org.eclipse.jdt.core.tests.eval.DebugEvaluationTest)  Time elapsed: 0.275 s
test022 - 11(org.eclipse.jdt.core.tests.eval.DebugEvaluationTest)  Time elapsed: 0.27 s
test023 - 11(org.eclipse.jdt.core.tests.eval.DebugEvaluationTest)  Time elapsed: 0.296 s
test024 - 11(org.eclipse.jdt.core.tests.eval.DebugEvaluationTest)  Time elapsed: 0.285 s
test025 - 11(org.eclipse.jdt.core.tests.eval.DebugEvaluationTest)  Time elapsed: 0.266 s
test026 - 11(org.eclipse.jdt.core.tests.eval.DebugEvaluationTest)  Time elapsed: 0.143 s
test027 - 11(org.eclipse.jdt.core.tests.eval.DebugEvaluationTest)  Time elapsed: 0.146 s
test028 - 11(org.eclipse.jdt.core.tests.eval.DebugEvaluationTest)  Time elapsed: 0.144 s
test029 - 11(org.eclipse.jdt.core.tests.eval.DebugEvaluationTest)  Time elapsed: 0.146 s
test030 - 11(org.eclipse.jdt.core.tests.eval.DebugEvaluationTest)  Time elapsed: 0.148 s
test031 - 11(org.eclipse.jdt.core.tests.eval.DebugEvaluationTest)  Time elapsed: 0.151 s
test032 - 11(org.eclipse.jdt.core.tests.eval.DebugEvaluationTest)  Time elapsed: 0.037 s
test033 - 11(org.eclipse.jdt.core.tests.eval.DebugEvaluationTest)  Time elapsed: 0.149 s
test034 - 11(org.eclipse.jdt.core.tests.eval.DebugEvaluationTest)  Time elapsed: 0.147 s
test035 - 11(org.eclipse.jdt.core.tests.eval.DebugEvaluationTest)  Time elapsed: 0.15 s
test036 - 11(org.eclipse.jdt.core.tests.eval.DebugEvaluationTest)  Time elapsed: 0.149 s
test037 - 11(org.eclipse.jdt.core.tests.eval.DebugEvaluationTest)  Time elapsed: 0.146 s
test038 - 11(org.eclipse.jdt.core.tests.eval.DebugEvaluationTest)  Time elapsed: 0.143 s
test039 - 11(org.eclipse.jdt.core.tests.eval.DebugEvaluationTest)  Time elapsed: 0.145 s
test040 - 11(org.eclipse.jdt.core.tests.eval.DebugEvaluationTest)  Time elapsed: 0.149 s
test041 - 11(org.eclipse.jdt.core.tests.eval.DebugEvaluationTest)  Time elapsed: 0.146 s
test042 - 11(org.eclipse.jdt.core.tests.eval.DebugEvaluationTest)  Time elapsed: 0.145 s
test043 - 11(org.eclipse.jdt.core.tests.eval.DebugEvaluationTest)  Time elapsed: 0.147 s
test044 - 11(org.eclipse.jdt.core.tests.eval.DebugEvaluationTest)  Time elapsed: 0.15 s
test045 - 11(org.eclipse.jdt.core.tests.eval.DebugEvaluationTest)  Time elapsed: 0.149 s
test046 - 11(org.eclipse.jdt.core.tests.eval.DebugEvaluationTest)  Time elapsed: 0.148 s
test047 - 11(org.eclipse.jdt.core.tests.eval.DebugEvaluationTest)  Time elapsed: 0.148 s
test048 - 11(org.eclipse.jdt.core.tests.eval.DebugEvaluationTest)  Time elapsed: 0.146 s
test049 - 11(org.eclipse.jdt.core.tests.eval.DebugEvaluationTest)  Time elapsed: 0.147 s
test050 - 11(org.eclipse.jdt.core.tests.eval.DebugEvaluationTest)  Time elapsed: 0.142 s
test051 - 11(org.eclipse.jdt.core.tests.eval.DebugEvaluationTest)  Time elapsed: 0.145 s
test052 - 11(org.eclipse.jdt.core.tests.eval.DebugEvaluationTest)  Time elapsed: 0.189 s
test053 - 11(org.eclipse.jdt.core.tests.eval.DebugEvaluationTest)  Time elapsed: 0.15 s
test054 - 11(org.eclipse.jdt.core.tests.eval.DebugEvaluationTest)  Time elapsed: 0.151 s
test055 - 11(org.eclipse.jdt.core.tests.eval.DebugEvaluationTest)  Time elapsed: 0.156 s
test056 - 11(org.eclipse.jdt.core.tests.eval.DebugEvaluationTest)  Time elapsed: 0.157 s
test057 - 11(org.eclipse.jdt.core.tests.eval.DebugEvaluationTest)  Time elapsed: 0.15 s
test058 - 11(org.eclipse.jdt.core.tests.eval.DebugEvaluationTest)  Time elapsed: 0.156 s
test059 - 11(org.eclipse.jdt.core.tests.eval.DebugEvaluationTest)  Time elapsed: 0.154 s
test060 - 11(org.eclipse.jdt.core.tests.eval.DebugEvaluationTest)  Time elapsed: 0.154 s
test061 - 11(org.eclipse.jdt.core.tests.eval.DebugEvaluationTest)  Time elapsed: 0.149 s
test062 - 11(org.eclipse.jdt.core.tests.eval.DebugEvaluationTest)  Time elapsed: 0.143 s
test063 - 11(org.eclipse.jdt.core.tests.eval.DebugEvaluationTest)  Time elapsed: 0.143 s
test065 - 11(org.eclipse.jdt.core.tests.eval.DebugEvaluationTest)  Time elapsed: 0.156 s
test066 - 11(org.eclipse.jdt.core.tests.eval.DebugEvaluationTest)  Time elapsed: 0.148 s
test067 - 11(org.eclipse.jdt.core.tests.eval.DebugEvaluationTest)  Time elapsed: 0.166 s
test068 - 11(org.eclipse.jdt.core.tests.eval.DebugEvaluationTest)  Time elapsed: 0.041 s
test069 - 11(org.eclipse.jdt.core.tests.eval.DebugEvaluationTest)  Time elapsed: 0.043 s
testNegative001 - 11(org.eclipse.jdt.core.tests.eval.DebugEvaluationTest)  Time elapsed: 0.035 s
testNegative002 - 11(org.eclipse.jdt.core.tests.eval.DebugEvaluationTest)  Time elapsed: 0.034 s
testNegative003 - 11(org.eclipse.jdt.core.tests.eval.DebugEvaluationTest)  Time elapsed: 0.042 s
testNegative004 - 11(org.eclipse.jdt.core.tests.eval.DebugEvaluationTest)  Time elapsed: 0.017 s
testNegative005 - 11(org.eclipse.jdt.core.tests.eval.DebugEvaluationTest)  Time elapsed: 0.023 s

Results:

Tests run: 40813, Failures: 0, Errors: 0, Skipped: 0

[INFO] All tests passed!
[INFO] 
[INFO] --- tycho-p2-extras-plugin:1.5.1:compare-version-with-baselines (compare-attached-artifacts-with-release) @ org.eclipse.jdt.core.tests.compiler ---
[INFO] Skipped
[INFO] 
[INFO] --------< org.eclipse.jdt:org.eclipse.jdt.compiler.tool.tests >---------
[INFO] Building org.eclipse.jdt.compiler.tool.tests 1.2.550-SNAPSHOT     [8/17]
[INFO] ------------------------[ eclipse-test-plugin ]-------------------------
[INFO] 
[INFO] --- maven-clean-plugin:3.1.0:clean (default-clean) @ org.eclipse.jdt.compiler.tool.tests ---
[INFO] 
[INFO] --- tycho-packaging-plugin:1.5.1:build-qualifier (default-build-qualifier) @ org.eclipse.jdt.compiler.tool.tests ---
[INFO] The project's OSGi version is 1.2.550.v20190919-0948
[INFO] 
[INFO] --- tycho-packaging-plugin:1.5.1:validate-id (default-validate-id) @ org.eclipse.jdt.compiler.tool.tests ---
[INFO] 
[INFO] --- tycho-packaging-plugin:1.5.1:validate-version (default-validate-version) @ org.eclipse.jdt.compiler.tool.tests ---
[INFO] 
[INFO] --- maven-resources-plugin:3.1.0:copy-resources (saveproperties) @ org.eclipse.jdt.compiler.tool.tests ---
[INFO] Using 'UTF-8' encoding to copy filtered resources.
[INFO] skip non existing resourceDirectory /home/jenkins/agent/workspace/eclipse.jdt.core-SonarQube/org.eclipse.jdt.compiler.tool.tests/saveproperties
[INFO] 
[INFO] --- maven-enforcer-plugin:3.0.0-M2:enforce (enforce-maven) @ org.eclipse.jdt.compiler.tool.tests ---
[INFO] 
[INFO] --- jacoco-maven-plugin:0.8.5:prepare-agent (jacoco-agent) @ org.eclipse.jdt.compiler.tool.tests ---
[INFO] tycho.testArgLine set to -javaagent:/home/jenkins/agent/workspace/eclipse.jdt.core-SonarQube/.repository/org/jacoco/org.jacoco.agent/0.8.5/org.jacoco.agent-0.8.5-runtime.jar=destfile=/home/jenkins/agent/workspace/eclipse.jdt.core-SonarQube/jacoco.exec,append=true
[INFO] 
[INFO] --- eclipse-cbi-plugin:1.1.8-SNAPSHOT:generate-api-build-xml (default) @ org.eclipse.jdt.compiler.tool.tests ---
[INFO] 
[INFO] --- maven-resources-plugin:3.1.0:resources (default-resources) @ org.eclipse.jdt.compiler.tool.tests ---
[INFO] Using 'UTF-8' encoding to copy filtered resources.
[INFO] skip non existing resourceDirectory /home/jenkins/agent/workspace/eclipse.jdt.core-SonarQube/org.eclipse.jdt.compiler.tool.tests/src/main/resources
[INFO] 
[INFO] --- maven-resources-plugin:3.1.0:resources (filter-resources) @ org.eclipse.jdt.compiler.tool.tests ---
[INFO] Using 'UTF-8' encoding to copy filtered resources.
[INFO] skip non existing resourceDirectory /home/jenkins/agent/workspace/eclipse.jdt.core-SonarQube/org.eclipse.jdt.compiler.tool.tests/src/main/resources
[INFO] 
[INFO] --- tycho-compiler-plugin:1.5.1:compile (default-compile) @ org.eclipse.jdt.compiler.tool.tests ---
[INFO] Compiling 6 source files to /home/jenkins/agent/workspace/eclipse.jdt.core-SonarQube/org.eclipse.jdt.compiler.tool.tests/target/classes
[WARNING] /home/jenkins/agent/workspace/eclipse.jdt.core-SonarQube/org.eclipse.jdt.compiler.tool.tests/src/org/eclipse/jdt/compiler/tool/tests/CompilerToolTests.java:[52] 
	import org.eclipse.jdt.internal.compiler.classfmt.ClassFileConstants;
	       ^^^^^^^^^^^^^^^^^^^^^^^^^^^^^^^^^^^^^^^^^^^^^^^^^^^^^^^^^^^^^
Discouraged access: The type 'ClassFileConstants' is not API (restriction on classpath entry '/home/jenkins/agent/workspace/eclipse.jdt.core-SonarQube/org.eclipse.jdt.core/target/classes')
[WARNING] /home/jenkins/agent/workspace/eclipse.jdt.core-SonarQube/org.eclipse.jdt.compiler.tool.tests/src/org/eclipse/jdt/compiler/tool/tests/CompilerToolTests.java:[53] 
	import org.eclipse.jdt.internal.compiler.classfmt.ClassFileReader;
	       ^^^^^^^^^^^^^^^^^^^^^^^^^^^^^^^^^^^^^^^^^^^^^^^^^^^^^^^^^^
Discouraged access: The type 'ClassFileReader' is not API (restriction on classpath entry '/home/jenkins/agent/workspace/eclipse.jdt.core-SonarQube/org.eclipse.jdt.core/target/classes')
[WARNING] /home/jenkins/agent/workspace/eclipse.jdt.core-SonarQube/org.eclipse.jdt.compiler.tool.tests/src/org/eclipse/jdt/compiler/tool/tests/CompilerToolTests.java:[54] 
	import org.eclipse.jdt.internal.compiler.classfmt.ClassFormatException;
	       ^^^^^^^^^^^^^^^^^^^^^^^^^^^^^^^^^^^^^^^^^^^^^^^^^^^^^^^^^^^^^^^
Discouraged access: The type 'ClassFormatException' is not API (restriction on classpath entry '/home/jenkins/agent/workspace/eclipse.jdt.core-SonarQube/org.eclipse.jdt.core/target/classes')
[WARNING] /home/jenkins/agent/workspace/eclipse.jdt.core-SonarQube/org.eclipse.jdt.compiler.tool.tests/src/org/eclipse/jdt/compiler/tool/tests/CompilerToolTests.java:[55] 
	import org.eclipse.jdt.internal.compiler.tool.EclipseCompiler;
	       ^^^^^^^^^^^^^^^^^^^^^^^^^^^^^^^^^^^^^^^^^^^^^^^^^^^^^^
Discouraged access: The type 'EclipseCompiler' is not API (restriction on classpath entry '/home/jenkins/agent/workspace/eclipse.jdt.core-SonarQube/org.eclipse.jdt.compiler.tool/target/classes')
[WARNING] /home/jenkins/agent/workspace/eclipse.jdt.core-SonarQube/org.eclipse.jdt.compiler.tool.tests/src/org/eclipse/jdt/compiler/tool/tests/CompilerToolTests.java:[153] 
	ServiceLoader<JavaCompiler> javaCompilerLoader = ServiceLoader.load(JavaCompiler.class, EclipseCompiler.class.getClassLoader());
	                                                                                        ^^^^^^^^^^^^^^^
Discouraged access: The type 'EclipseCompiler' is not API (restriction on classpath entry '/home/jenkins/agent/workspace/eclipse.jdt.core-SonarQube/org.eclipse.jdt.compiler.tool/target/classes')
[WARNING] /home/jenkins/agent/workspace/eclipse.jdt.core-SonarQube/org.eclipse.jdt.compiler.tool.tests/src/org/eclipse/jdt/compiler/tool/tests/CompilerToolTests.java:[157] 
	if (javaCompiler instanceof EclipseCompiler) {
	                            ^^^^^^^^^^^^^^^
Discouraged access: The type 'EclipseCompiler' is not API (restriction on classpath entry '/home/jenkins/agent/workspace/eclipse.jdt.core-SonarQube/org.eclipse.jdt.compiler.tool/target/classes')
[WARNING] /home/jenkins/agent/workspace/eclipse.jdt.core-SonarQube/org.eclipse.jdt.compiler.tool.tests/src/org/eclipse/jdt/compiler/tool/tests/CompilerToolTests.java:[461] 
	ClassFileReader reader = null;
	^^^^^^^^^^^^^^^
Discouraged access: The type 'ClassFileReader' is not API (restriction on classpath entry '/home/jenkins/agent/workspace/eclipse.jdt.core-SonarQube/org.eclipse.jdt.core/target/classes')
[WARNING] /home/jenkins/agent/workspace/eclipse.jdt.core-SonarQube/org.eclipse.jdt.compiler.tool.tests/src/org/eclipse/jdt/compiler/tool/tests/CompilerToolTests.java:[463] 
	reader = ClassFileReader.read(new File(tmpFolder, "p/X.class"), true);
	         ^^^^^^^^^^^^^^^
Discouraged access: The type 'ClassFileReader' is not API (restriction on classpath entry '/home/jenkins/agent/workspace/eclipse.jdt.core-SonarQube/org.eclipse.jdt.core/target/classes')
[WARNING] /home/jenkins/agent/workspace/eclipse.jdt.core-SonarQube/org.eclipse.jdt.compiler.tool.tests/src/org/eclipse/jdt/compiler/tool/tests/CompilerToolTests.java:[463] 
	reader = ClassFileReader.read(new File(tmpFolder, "p/X.class"), true);
	                         ^^^^
Discouraged access: The method 'ClassFileReader.read(File, boolean)' is not API (restriction on classpath entry '/home/jenkins/agent/workspace/eclipse.jdt.core-SonarQube/org.eclipse.jdt.core/target/classes')
[WARNING] /home/jenkins/agent/workspace/eclipse.jdt.core-SonarQube/org.eclipse.jdt.compiler.tool.tests/src/org/eclipse/jdt/compiler/tool/tests/CompilerToolTests.java:[464] 
	} catch (ClassFormatException e) {
	         ^^^^^^^^^^^^^^^^^^^^
Discouraged access: The type 'ClassFormatException' is not API (restriction on classpath entry '/home/jenkins/agent/workspace/eclipse.jdt.core-SonarQube/org.eclipse.jdt.core/target/classes')
[WARNING] /home/jenkins/agent/workspace/eclipse.jdt.core-SonarQube/org.eclipse.jdt.compiler.tool.tests/src/org/eclipse/jdt/compiler/tool/tests/CompilerToolTests.java:[471] 
	assertEquals("Wrong value", ClassFileConstants.getLatestJDKLevel(), reader.getVersion()); // TODO: Fix this for JDK11
	                            ^^^^^^^^^^^^^^^^^^
Discouraged access: The type 'ClassFileConstants' is not API (restriction on classpath entry '/home/jenkins/agent/workspace/eclipse.jdt.core-SonarQube/org.eclipse.jdt.core/target/classes')
[WARNING] /home/jenkins/agent/workspace/eclipse.jdt.core-SonarQube/org.eclipse.jdt.compiler.tool.tests/src/org/eclipse/jdt/compiler/tool/tests/CompilerToolTests.java:[471] 
	assertEquals("Wrong value", ClassFileConstants.getLatestJDKLevel(), reader.getVersion()); // TODO: Fix this for JDK11
	                                               ^^^^^^^^^^^^^^^^^
Discouraged access: The method 'ClassFileConstants.getLatestJDKLevel()' is not API (restriction on classpath entry '/home/jenkins/agent/workspace/eclipse.jdt.core-SonarQube/org.eclipse.jdt.core/target/classes')
[WARNING] /home/jenkins/agent/workspace/eclipse.jdt.core-SonarQube/org.eclipse.jdt.compiler.tool.tests/src/org/eclipse/jdt/compiler/tool/tests/CompilerToolTests.java:[471] 
	assertEquals("Wrong value", ClassFileConstants.getLatestJDKLevel(), reader.getVersion()); // TODO: Fix this for JDK11
	                                                                           ^^^^^^^^^^
Discouraged access: The method 'ClassFileReader.getVersion()' is not API (restriction on classpath entry '/home/jenkins/agent/workspace/eclipse.jdt.core-SonarQube/org.eclipse.jdt.core/target/classes')
[WARNING] /home/jenkins/agent/workspace/eclipse.jdt.core-SonarQube/org.eclipse.jdt.compiler.tool.tests/src/org/eclipse/jdt/compiler/tool/tests/CompilerToolTests.java:[541] 
	ClassFileReader reader = null;
	^^^^^^^^^^^^^^^
Discouraged access: The type 'ClassFileReader' is not API (restriction on classpath entry '/home/jenkins/agent/workspace/eclipse.jdt.core-SonarQube/org.eclipse.jdt.core/target/classes')
[WARNING] /home/jenkins/agent/workspace/eclipse.jdt.core-SonarQube/org.eclipse.jdt.compiler.tool.tests/src/org/eclipse/jdt/compiler/tool/tests/CompilerToolTests.java:[543] 
	reader = ClassFileReader.read(outputFile);
	         ^^^^^^^^^^^^^^^
Discouraged access: The type 'ClassFileReader' is not API (restriction on classpath entry '/home/jenkins/agent/workspace/eclipse.jdt.core-SonarQube/org.eclipse.jdt.core/target/classes')
[WARNING] /home/jenkins/agent/workspace/eclipse.jdt.core-SonarQube/org.eclipse.jdt.compiler.tool.tests/src/org/eclipse/jdt/compiler/tool/tests/CompilerToolTests.java:[543] 
	reader = ClassFileReader.read(outputFile);
	                         ^^^^
Discouraged access: The method 'ClassFileReader.read(File)' is not API (restriction on classpath entry '/home/jenkins/agent/workspace/eclipse.jdt.core-SonarQube/org.eclipse.jdt.core/target/classes')
[WARNING] /home/jenkins/agent/workspace/eclipse.jdt.core-SonarQube/org.eclipse.jdt.compiler.tool.tests/src/org/eclipse/jdt/compiler/tool/tests/CompilerToolTests.java:[544] 
	} catch (ClassFormatException e) {
	         ^^^^^^^^^^^^^^^^^^^^
Discouraged access: The type 'ClassFormatException' is not API (restriction on classpath entry '/home/jenkins/agent/workspace/eclipse.jdt.core-SonarQube/org.eclipse.jdt.core/target/classes')
[WARNING] /home/jenkins/agent/workspace/eclipse.jdt.core-SonarQube/org.eclipse.jdt.compiler.tool.tests/src/org/eclipse/jdt/compiler/tool/tests/CompilerToolTests.java:[550] 
	assertEquals("Not a 1.5 .class file", ClassFileConstants.JDK1_5, reader.getVersion());
	                                      ^^^^^^^^^^^^^^^^^^^^^^^^^
Discouraged access: The type 'ClassFileConstants' is not API (restriction on classpath entry '/home/jenkins/agent/workspace/eclipse.jdt.core-SonarQube/org.eclipse.jdt.core/target/classes')
[WARNING] /home/jenkins/agent/workspace/eclipse.jdt.core-SonarQube/org.eclipse.jdt.compiler.tool.tests/src/org/eclipse/jdt/compiler/tool/tests/CompilerToolTests.java:[550] 
	assertEquals("Not a 1.5 .class file", ClassFileConstants.JDK1_5, reader.getVersion());
	                                                         ^^^^^^
Discouraged access: The field 'ClassFileConstants.JDK1_5' is not API (restriction on classpath entry '/home/jenkins/agent/workspace/eclipse.jdt.core-SonarQube/org.eclipse.jdt.core/target/classes')
[WARNING] /home/jenkins/agent/workspace/eclipse.jdt.core-SonarQube/org.eclipse.jdt.compiler.tool.tests/src/org/eclipse/jdt/compiler/tool/tests/CompilerToolTests.java:[550] 
	assertEquals("Not a 1.5 .class file", ClassFileConstants.JDK1_5, reader.getVersion());
	                                                                        ^^^^^^^^^^
Discouraged access: The method 'ClassFileReader.getVersion()' is not API (restriction on classpath entry '/home/jenkins/agent/workspace/eclipse.jdt.core-SonarQube/org.eclipse.jdt.core/target/classes')
[WARNING] /home/jenkins/agent/workspace/eclipse.jdt.core-SonarQube/org.eclipse.jdt.compiler.tool.tests/src/org/eclipse/jdt/compiler/tool/tests/AbstractCompilerToolTest.java:[32] 
	import org.eclipse.jdt.internal.compiler.tool.EclipseCompiler;
	       ^^^^^^^^^^^^^^^^^^^^^^^^^^^^^^^^^^^^^^^^^^^^^^^^^^^^^^
Discouraged access: The type 'EclipseCompiler' is not API (restriction on classpath entry '/home/jenkins/agent/workspace/eclipse.jdt.core-SonarQube/org.eclipse.jdt.compiler.tool/target/classes')
[WARNING] /home/jenkins/agent/workspace/eclipse.jdt.core-SonarQube/org.eclipse.jdt.compiler.tool.tests/src/org/eclipse/jdt/compiler/tool/tests/AbstractCompilerToolTest.java:[92] 
	static EclipseCompiler COMPILER = new EclipseCompiler();
	       ^^^^^^^^^^^^^^^
Discouraged access: The type 'EclipseCompiler' is not API (restriction on classpath entry '/home/jenkins/agent/workspace/eclipse.jdt.core-SonarQube/org.eclipse.jdt.compiler.tool/target/classes')
[WARNING] /home/jenkins/agent/workspace/eclipse.jdt.core-SonarQube/org.eclipse.jdt.compiler.tool.tests/src/org/eclipse/jdt/compiler/tool/tests/AbstractCompilerToolTest.java:[92] 
	static EclipseCompiler COMPILER = new EclipseCompiler();
	                                      ^^^^^^^^^^^^^^^
Discouraged access: The type 'EclipseCompiler' is not API (restriction on classpath entry '/home/jenkins/agent/workspace/eclipse.jdt.core-SonarQube/org.eclipse.jdt.compiler.tool/target/classes')
[WARNING] /home/jenkins/agent/workspace/eclipse.jdt.core-SonarQube/org.eclipse.jdt.compiler.tool.tests/src/org/eclipse/jdt/compiler/tool/tests/AbstractCompilerToolTest.java:[92] 
	static EclipseCompiler COMPILER = new EclipseCompiler();
	                                      ^^^^^^^^^^^^^^^
Discouraged access: The constructor 'EclipseCompiler()' is not API (restriction on classpath entry '/home/jenkins/agent/workspace/eclipse.jdt.core-SonarQube/org.eclipse.jdt.compiler.tool/target/classes')
[WARNING] /home/jenkins/agent/workspace/eclipse.jdt.core-SonarQube/org.eclipse.jdt.compiler.tool.tests/src/org/eclipse/jdt/compiler/tool/tests/AbstractCompilerToolTest.java:[104] 
	manager = COMPILER.getStandardFileManager(null, null, null); // will pick defaults up
	                   ^^^^^^^^^^^^^^^^^^^^^^
Discouraged access: The method 'EclipseCompiler.getStandardFileManager(DiagnosticListener<? super JavaFileObject>, Locale, Charset)' is not API (restriction on classpath entry '/home/jenkins/agent/workspace/eclipse.jdt.core-SonarQube/org.eclipse.jdt.compiler.tool/target/classes')
[WARNING] /home/jenkins/agent/workspace/eclipse.jdt.core-SonarQube/org.eclipse.jdt.compiler.tool.tests/src/org/eclipse/jdt/compiler/tool/tests/AbstractCompilerToolTest.java:[117] 
	CompilationTask task = COMPILER.getTask(out, arguments.standardJavaFileManager /* carry the null over */, new CompilerInvocationDiagnosticListener(err), arguments.options, null, manager.getJavaFileObjectsFromFiles(files));
	                                ^^^^^^^
Discouraged access: The method 'EclipseCompiler.getTask(Writer, JavaFileManager, DiagnosticListener<? super JavaFileObject>, Iterable<String>, Iterable<String>, Iterable<? extends JavaFileObject>)' is not API (restriction on classpath entry '/home/jenkins/agent/workspace/eclipse.jdt.core-SonarQube/org.eclipse.jdt.compiler.tool/target/classes')
[WARNING] /home/jenkins/agent/workspace/eclipse.jdt.core-SonarQube/org.eclipse.jdt.compiler.tool.tests/src/org/eclipse/jdt/compiler/tool/tests/CompilerInvocationTests.java:[43] 
	import org.eclipse.jdt.internal.compiler.batch.Main;
	       ^^^^^^^^^^^^^^^^^^^^^^^^^^^^^^^^^^^^^^^^^^^^
Discouraged access: The type 'Main' is not API (restriction on classpath entry '/home/jenkins/agent/workspace/eclipse.jdt.core-SonarQube/org.eclipse.jdt.core/target/classes')
[WARNING] /home/jenkins/agent/workspace/eclipse.jdt.core-SonarQube/org.eclipse.jdt.compiler.tool.tests/src/org/eclipse/jdt/compiler/tool/tests/CompilerInvocationTests.java:[44] 
	import org.eclipse.jdt.internal.compiler.classfmt.ClassFileConstants;
	       ^^^^^^^^^^^^^^^^^^^^^^^^^^^^^^^^^^^^^^^^^^^^^^^^^^^^^^^^^^^^^
Discouraged access: The type 'ClassFileConstants' is not API (restriction on classpath entry '/home/jenkins/agent/workspace/eclipse.jdt.core-SonarQube/org.eclipse.jdt.core/target/classes')
[WARNING] /home/jenkins/agent/workspace/eclipse.jdt.core-SonarQube/org.eclipse.jdt.compiler.tool.tests/src/org/eclipse/jdt/compiler/tool/tests/CompilerInvocationTests.java:[45] 
	import org.eclipse.jdt.internal.compiler.classfmt.ClassFileReader;
	       ^^^^^^^^^^^^^^^^^^^^^^^^^^^^^^^^^^^^^^^^^^^^^^^^^^^^^^^^^^
Discouraged access: The type 'ClassFileReader' is not API (restriction on classpath entry '/home/jenkins/agent/workspace/eclipse.jdt.core-SonarQube/org.eclipse.jdt.core/target/classes')
[WARNING] /home/jenkins/agent/workspace/eclipse.jdt.core-SonarQube/org.eclipse.jdt.compiler.tool.tests/src/org/eclipse/jdt/compiler/tool/tests/CompilerInvocationTests.java:[46] 
	import org.eclipse.jdt.internal.compiler.classfmt.ClassFormatException;
	       ^^^^^^^^^^^^^^^^^^^^^^^^^^^^^^^^^^^^^^^^^^^^^^^^^^^^^^^^^^^^^^^
Discouraged access: The type 'ClassFormatException' is not API (restriction on classpath entry '/home/jenkins/agent/workspace/eclipse.jdt.core-SonarQube/org.eclipse.jdt.core/target/classes')
[WARNING] /home/jenkins/agent/workspace/eclipse.jdt.core-SonarQube/org.eclipse.jdt.compiler.tool.tests/src/org/eclipse/jdt/compiler/tool/tests/CompilerInvocationTests.java:[60] 
	return buildUniqueComplianceTestSuite(CompilerInvocationTests.class, ClassFileConstants.JDK1_6);
	                                                                     ^^^^^^^^^^^^^^^^^^^^^^^^^
Discouraged access: The type 'ClassFileConstants' is not API (restriction on classpath entry '/home/jenkins/agent/workspace/eclipse.jdt.core-SonarQube/org.eclipse.jdt.core/target/classes')
[WARNING] /home/jenkins/agent/workspace/eclipse.jdt.core-SonarQube/org.eclipse.jdt.compiler.tool.tests/src/org/eclipse/jdt/compiler/tool/tests/CompilerInvocationTests.java:[60] 
	return buildUniqueComplianceTestSuite(CompilerInvocationTests.class, ClassFileConstants.JDK1_6);
	                                                                                        ^^^^^^
Discouraged access: The field 'ClassFileConstants.JDK1_6' is not API (restriction on classpath entry '/home/jenkins/agent/workspace/eclipse.jdt.core-SonarQube/org.eclipse.jdt.core/target/classes')
[WARNING] /home/jenkins/agent/workspace/eclipse.jdt.core-SonarQube/org.eclipse.jdt.compiler.tool.tests/src/org/eclipse/jdt/compiler/tool/tests/CompilerInvocationTests.java:[75] 
	ClassFileReader reader = null;
	^^^^^^^^^^^^^^^
Discouraged access: The type 'ClassFileReader' is not API (restriction on classpath entry '/home/jenkins/agent/workspace/eclipse.jdt.core-SonarQube/org.eclipse.jdt.core/target/classes')
[WARNING] /home/jenkins/agent/workspace/eclipse.jdt.core-SonarQube/org.eclipse.jdt.compiler.tool.tests/src/org/eclipse/jdt/compiler/tool/tests/CompilerInvocationTests.java:[77] 
	reader = ClassFileReader.read(new File(OUTPUT_DIR, fileNames[i]), true);
	         ^^^^^^^^^^^^^^^
Discouraged access: The type 'ClassFileReader' is not API (restriction on classpath entry '/home/jenkins/agent/workspace/eclipse.jdt.core-SonarQube/org.eclipse.jdt.core/target/classes')
[WARNING] /home/jenkins/agent/workspace/eclipse.jdt.core-SonarQube/org.eclipse.jdt.compiler.tool.tests/src/org/eclipse/jdt/compiler/tool/tests/CompilerInvocationTests.java:[77] 
	reader = ClassFileReader.read(new File(OUTPUT_DIR, fileNames[i]), true);
	                         ^^^^
Discouraged access: The method 'ClassFileReader.read(File, boolean)' is not API (restriction on classpath entry '/home/jenkins/agent/workspace/eclipse.jdt.core-SonarQube/org.eclipse.jdt.core/target/classes')
[WARNING] /home/jenkins/agent/workspace/eclipse.jdt.core-SonarQube/org.eclipse.jdt.compiler.tool.tests/src/org/eclipse/jdt/compiler/tool/tests/CompilerInvocationTests.java:[78] 
	} catch (ClassFormatException e) {
	         ^^^^^^^^^^^^^^^^^^^^
Discouraged access: The type 'ClassFormatException' is not API (restriction on classpath entry '/home/jenkins/agent/workspace/eclipse.jdt.core-SonarQube/org.eclipse.jdt.core/target/classes')
[WARNING] /home/jenkins/agent/workspace/eclipse.jdt.core-SonarQube/org.eclipse.jdt.compiler.tool.tests/src/org/eclipse/jdt/compiler/tool/tests/CompilerInvocationTests.java:[84] 
	assertEquals("Wrong Java version for " + fileNames[i], ClassFileConstants.JDK1_6, reader.getVersion());
	                                                       ^^^^^^^^^^^^^^^^^^^^^^^^^
Discouraged access: The type 'ClassFileConstants' is not API (restriction on classpath entry '/home/jenkins/agent/workspace/eclipse.jdt.core-SonarQube/org.eclipse.jdt.core/target/classes')
[WARNING] /home/jenkins/agent/workspace/eclipse.jdt.core-SonarQube/org.eclipse.jdt.compiler.tool.tests/src/org/eclipse/jdt/compiler/tool/tests/CompilerInvocationTests.java:[84] 
	assertEquals("Wrong Java version for " + fileNames[i], ClassFileConstants.JDK1_6, reader.getVersion());
	                                                                          ^^^^^^
Discouraged access: The field 'ClassFileConstants.JDK1_6' is not API (restriction on classpath entry '/home/jenkins/agent/workspace/eclipse.jdt.core-SonarQube/org.eclipse.jdt.core/target/classes')
[WARNING] /home/jenkins/agent/workspace/eclipse.jdt.core-SonarQube/org.eclipse.jdt.compiler.tool.tests/src/org/eclipse/jdt/compiler/tool/tests/CompilerInvocationTests.java:[84] 
	assertEquals("Wrong Java version for " + fileNames[i], ClassFileConstants.JDK1_6, reader.getVersion());
	                                                                                         ^^^^^^^^^^
Discouraged access: The method 'ClassFileReader.getVersion()' is not API (restriction on classpath entry '/home/jenkins/agent/workspace/eclipse.jdt.core-SonarQube/org.eclipse.jdt.core/target/classes')
[WARNING] /home/jenkins/agent/workspace/eclipse.jdt.core-SonarQube/org.eclipse.jdt.compiler.tool.tests/src/org/eclipse/jdt/compiler/tool/tests/CompilerInvocationTests.java:[520] 
	COMPILER.getStandardFileManager(null /* diagnosticListener */, null /* locale */, null /* charset */);
	         ^^^^^^^^^^^^^^^^^^^^^^
Discouraged access: The method 'EclipseCompiler.getStandardFileManager(DiagnosticListener<? super JavaFileObject>, Locale, Charset)' is not API (restriction on classpath entry '/home/jenkins/agent/workspace/eclipse.jdt.core-SonarQube/org.eclipse.jdt.compiler.tool/target/classes')
[WARNING] /home/jenkins/agent/workspace/eclipse.jdt.core-SonarQube/org.eclipse.jdt.compiler.tool.tests/src/org/eclipse/jdt/compiler/tool/tests/CompilerInvocationTests.java:[540] 
	COMPILER.getStandardFileManager(null /* diagnosticListener */, null /* locale */, null /* charset */);
	         ^^^^^^^^^^^^^^^^^^^^^^
Discouraged access: The method 'EclipseCompiler.getStandardFileManager(DiagnosticListener<? super JavaFileObject>, Locale, Charset)' is not API (restriction on classpath entry '/home/jenkins/agent/workspace/eclipse.jdt.core-SonarQube/org.eclipse.jdt.compiler.tool/target/classes')
[WARNING] /home/jenkins/agent/workspace/eclipse.jdt.core-SonarQube/org.eclipse.jdt.compiler.tool.tests/src/org/eclipse/jdt/compiler/tool/tests/CompilerInvocationTests.java:[563] 
	COMPILER.getStandardFileManager(null /* diagnosticListener */, null /* locale */, null /* charset */);
	         ^^^^^^^^^^^^^^^^^^^^^^
Discouraged access: The method 'EclipseCompiler.getStandardFileManager(DiagnosticListener<? super JavaFileObject>, Locale, Charset)' is not API (restriction on classpath entry '/home/jenkins/agent/workspace/eclipse.jdt.core-SonarQube/org.eclipse.jdt.compiler.tool/target/classes')
[WARNING] /home/jenkins/agent/workspace/eclipse.jdt.core-SonarQube/org.eclipse.jdt.compiler.tool.tests/src/org/eclipse/jdt/compiler/tool/tests/CompilerInvocationTests.java:[584] 
	passed = COMPILER.getStandardFileManager(null /* diagnosticListener */, null /* locale */, null /* charset */).
	                  ^^^^^^^^^^^^^^^^^^^^^^
Discouraged access: The method 'EclipseCompiler.getStandardFileManager(DiagnosticListener<? super JavaFileObject>, Locale, Charset)' is not API (restriction on classpath entry '/home/jenkins/agent/workspace/eclipse.jdt.core-SonarQube/org.eclipse.jdt.compiler.tool/target/classes')
[WARNING] /home/jenkins/agent/workspace/eclipse.jdt.core-SonarQube/org.eclipse.jdt.compiler.tool.tests/src/org/eclipse/jdt/compiler/tool/tests/CompilerInvocationTests.java:[689] 
	COMPILER.getStandardFileManager(null /* diagnosticListener */, null /* locale */, null /* charset */),
	         ^^^^^^^^^^^^^^^^^^^^^^
Discouraged access: The method 'EclipseCompiler.getStandardFileManager(DiagnosticListener<? super JavaFileObject>, Locale, Charset)' is not API (restriction on classpath entry '/home/jenkins/agent/workspace/eclipse.jdt.core-SonarQube/org.eclipse.jdt.compiler.tool/target/classes')
[WARNING] /home/jenkins/agent/workspace/eclipse.jdt.core-SonarQube/org.eclipse.jdt.compiler.tool.tests/src/org/eclipse/jdt/compiler/tool/tests/CompilerInvocationTests.java:[731] 
	COMPILER.getStandardFileManager(null /* diagnosticListener */, null /* locale */, null /* charset */),
	         ^^^^^^^^^^^^^^^^^^^^^^
Discouraged access: The method 'EclipseCompiler.getStandardFileManager(DiagnosticListener<? super JavaFileObject>, Locale, Charset)' is not API (restriction on classpath entry '/home/jenkins/agent/workspace/eclipse.jdt.core-SonarQube/org.eclipse.jdt.compiler.tool/target/classes')
[WARNING] /home/jenkins/agent/workspace/eclipse.jdt.core-SonarQube/org.eclipse.jdt.compiler.tool.tests/src/org/eclipse/jdt/compiler/tool/tests/CompilerInvocationTests.java:[790] 
	COMPILER.getStandardFileManager(null /* diagnosticListener */, null /* locale */, null /* charset */),
	         ^^^^^^^^^^^^^^^^^^^^^^
Discouraged access: The method 'EclipseCompiler.getStandardFileManager(DiagnosticListener<? super JavaFileObject>, Locale, Charset)' is not API (restriction on classpath entry '/home/jenkins/agent/workspace/eclipse.jdt.core-SonarQube/org.eclipse.jdt.compiler.tool/target/classes')
[WARNING] /home/jenkins/agent/workspace/eclipse.jdt.core-SonarQube/org.eclipse.jdt.compiler.tool.tests/src/org/eclipse/jdt/compiler/tool/tests/CompilerInvocationTests.java:[827] 
	COMPILER.getStandardFileManager(null /* diagnosticListener */, null /* locale */, null /* charset */),
	         ^^^^^^^^^^^^^^^^^^^^^^
Discouraged access: The method 'EclipseCompiler.getStandardFileManager(DiagnosticListener<? super JavaFileObject>, Locale, Charset)' is not API (restriction on classpath entry '/home/jenkins/agent/workspace/eclipse.jdt.core-SonarQube/org.eclipse.jdt.compiler.tool/target/classes')
[WARNING] /home/jenkins/agent/workspace/eclipse.jdt.core-SonarQube/org.eclipse.jdt.compiler.tool.tests/src/org/eclipse/jdt/compiler/tool/tests/CompilerInvocationTests.java:[930] 
	COMPILER.getStandardFileManager(null /* diagnosticListener */, null /* locale */, null /* charset */);
	         ^^^^^^^^^^^^^^^^^^^^^^
Discouraged access: The method 'EclipseCompiler.getStandardFileManager(DiagnosticListener<? super JavaFileObject>, Locale, Charset)' is not API (restriction on classpath entry '/home/jenkins/agent/workspace/eclipse.jdt.core-SonarQube/org.eclipse.jdt.compiler.tool/target/classes')
[WARNING] /home/jenkins/agent/workspace/eclipse.jdt.core-SonarQube/org.eclipse.jdt.compiler.tool.tests/src/org/eclipse/jdt/compiler/tool/tests/CompilerInvocationTests.java:[960] 
	COMPILER.getStandardFileManager(null /* diagnosticListener */, null /* locale */, null /* charset */);
	         ^^^^^^^^^^^^^^^^^^^^^^
Discouraged access: The method 'EclipseCompiler.getStandardFileManager(DiagnosticListener<? super JavaFileObject>, Locale, Charset)' is not API (restriction on classpath entry '/home/jenkins/agent/workspace/eclipse.jdt.core-SonarQube/org.eclipse.jdt.compiler.tool/target/classes')
[WARNING] /home/jenkins/agent/workspace/eclipse.jdt.core-SonarQube/org.eclipse.jdt.compiler.tool.tests/src/org/eclipse/jdt/compiler/tool/tests/CompilerInvocationTests.java:[992] 
	CompilationTask task = COMPILER.getTask(
	                                ^^^^^^^
Discouraged access: The method 'EclipseCompiler.getTask(Writer, JavaFileManager, DiagnosticListener<? super JavaFileObject>, Iterable<String>, Iterable<String>, Iterable<? extends JavaFileObject>)' is not API (restriction on classpath entry '/home/jenkins/agent/workspace/eclipse.jdt.core-SonarQube/org.eclipse.jdt.compiler.tool/target/classes')
[WARNING] /home/jenkins/agent/workspace/eclipse.jdt.core-SonarQube/org.eclipse.jdt.compiler.tool.tests/src/org/eclipse/jdt/compiler/tool/tests/CompilerInvocationTests.java:[994] 
	COMPILER.getStandardFileManager(null /* diagnosticListener */, null /* locale */, null /* charset */), 
	         ^^^^^^^^^^^^^^^^^^^^^^
Discouraged access: The method 'EclipseCompiler.getStandardFileManager(DiagnosticListener<? super JavaFileObject>, Locale, Charset)' is not API (restriction on classpath entry '/home/jenkins/agent/workspace/eclipse.jdt.core-SonarQube/org.eclipse.jdt.compiler.tool/target/classes')
[WARNING] /home/jenkins/agent/workspace/eclipse.jdt.core-SonarQube/org.eclipse.jdt.compiler.tool.tests/src/org/eclipse/jdt/compiler/tool/tests/CompilerInvocationTests.java:[1001] 
	resourceAsStream = Main.class.getResourceAsStream("messages.properties");
	                   ^^^^
Discouraged access: The type 'Main' is not API (restriction on classpath entry '/home/jenkins/agent/workspace/eclipse.jdt.core-SonarQube/org.eclipse.jdt.core/target/classes')
[WARNING] /home/jenkins/agent/workspace/eclipse.jdt.core-SonarQube/org.eclipse.jdt.compiler.tool.tests/src/org/eclipse/jdt/compiler/tool/tests/CompilerInvocationTests.java:[1021] 
	CompilationTask task = COMPILER.getTask(
	                                ^^^^^^^
Discouraged access: The method 'EclipseCompiler.getTask(Writer, JavaFileManager, DiagnosticListener<? super JavaFileObject>, Iterable<String>, Iterable<String>, Iterable<? extends JavaFileObject>)' is not API (restriction on classpath entry '/home/jenkins/agent/workspace/eclipse.jdt.core-SonarQube/org.eclipse.jdt.compiler.tool/target/classes')
[WARNING] /home/jenkins/agent/workspace/eclipse.jdt.core-SonarQube/org.eclipse.jdt.compiler.tool.tests/src/org/eclipse/jdt/compiler/tool/tests/CompilerInvocationTests.java:[1023] 
	COMPILER.getStandardFileManager(null /* diagnosticListener */, null /* locale */, null /* charset */), 
	         ^^^^^^^^^^^^^^^^^^^^^^
Discouraged access: The method 'EclipseCompiler.getStandardFileManager(DiagnosticListener<? super JavaFileObject>, Locale, Charset)' is not API (restriction on classpath entry '/home/jenkins/agent/workspace/eclipse.jdt.core-SonarQube/org.eclipse.jdt.compiler.tool/target/classes')
[WARNING] /home/jenkins/agent/workspace/eclipse.jdt.core-SonarQube/org.eclipse.jdt.compiler.tool.tests/src/org/eclipse/jdt/compiler/tool/tests/CompilerToolJava9Tests.java:[53] 
	import org.eclipse.jdt.internal.compiler.classfmt.ClassFileConstants;
	       ^^^^^^^^^^^^^^^^^^^^^^^^^^^^^^^^^^^^^^^^^^^^^^^^^^^^^^^^^^^^^
Discouraged access: The type 'ClassFileConstants' is not API (restriction on classpath entry '/home/jenkins/agent/workspace/eclipse.jdt.core-SonarQube/org.eclipse.jdt.core/target/classes')
[WARNING] /home/jenkins/agent/workspace/eclipse.jdt.core-SonarQube/org.eclipse.jdt.compiler.tool.tests/src/org/eclipse/jdt/compiler/tool/tests/CompilerToolJava9Tests.java:[54] 
	import org.eclipse.jdt.internal.compiler.classfmt.ClassFileReader;
	       ^^^^^^^^^^^^^^^^^^^^^^^^^^^^^^^^^^^^^^^^^^^^^^^^^^^^^^^^^^
Discouraged access: The type 'ClassFileReader' is not API (restriction on classpath entry '/home/jenkins/agent/workspace/eclipse.jdt.core-SonarQube/org.eclipse.jdt.core/target/classes')
[WARNING] /home/jenkins/agent/workspace/eclipse.jdt.core-SonarQube/org.eclipse.jdt.compiler.tool.tests/src/org/eclipse/jdt/compiler/tool/tests/CompilerToolJava9Tests.java:[55] 
	import org.eclipse.jdt.internal.compiler.classfmt.ClassFormatException;
	       ^^^^^^^^^^^^^^^^^^^^^^^^^^^^^^^^^^^^^^^^^^^^^^^^^^^^^^^^^^^^^^^
Discouraged access: The type 'ClassFormatException' is not API (restriction on classpath entry '/home/jenkins/agent/workspace/eclipse.jdt.core-SonarQube/org.eclipse.jdt.core/target/classes')
[WARNING] /home/jenkins/agent/workspace/eclipse.jdt.core-SonarQube/org.eclipse.jdt.compiler.tool.tests/src/org/eclipse/jdt/compiler/tool/tests/CompilerToolJava9Tests.java:[56] 
	import org.eclipse.jdt.internal.compiler.tool.EclipseCompiler;
	       ^^^^^^^^^^^^^^^^^^^^^^^^^^^^^^^^^^^^^^^^^^^^^^^^^^^^^^
Discouraged access: The type 'EclipseCompiler' is not API (restriction on classpath entry '/home/jenkins/agent/workspace/eclipse.jdt.core-SonarQube/org.eclipse.jdt.compiler.tool/target/classes')
[WARNING] /home/jenkins/agent/workspace/eclipse.jdt.core-SonarQube/org.eclipse.jdt.compiler.tool.tests/src/org/eclipse/jdt/compiler/tool/tests/CompilerToolJava9Tests.java:[88] 
	ServiceLoader<JavaCompiler> javaCompilerLoader = ServiceLoader.load(JavaCompiler.class, EclipseCompiler.class.getClassLoader());
	                                                                                        ^^^^^^^^^^^^^^^
Discouraged access: The type 'EclipseCompiler' is not API (restriction on classpath entry '/home/jenkins/agent/workspace/eclipse.jdt.core-SonarQube/org.eclipse.jdt.compiler.tool/target/classes')
[WARNING] /home/jenkins/agent/workspace/eclipse.jdt.core-SonarQube/org.eclipse.jdt.compiler.tool.tests/src/org/eclipse/jdt/compiler/tool/tests/CompilerToolJava9Tests.java:[90] 
	if (compiler instanceof EclipseCompiler) {
	                        ^^^^^^^^^^^^^^^
Discouraged access: The type 'EclipseCompiler' is not API (restriction on classpath entry '/home/jenkins/agent/workspace/eclipse.jdt.core-SonarQube/org.eclipse.jdt.compiler.tool/target/classes')
[WARNING] /home/jenkins/agent/workspace/eclipse.jdt.core-SonarQube/org.eclipse.jdt.compiler.tool.tests/src/org/eclipse/jdt/compiler/tool/tests/CompilerToolJava9Tests.java:[163] 
	if (!(compiler instanceof EclipseCompiler) &&
	                          ^^^^^^^^^^^^^^^
Discouraged access: The type 'EclipseCompiler' is not API (restriction on classpath entry '/home/jenkins/agent/workspace/eclipse.jdt.core-SonarQube/org.eclipse.jdt.compiler.tool/target/classes')
[WARNING] /home/jenkins/agent/workspace/eclipse.jdt.core-SonarQube/org.eclipse.jdt.compiler.tool.tests/src/org/eclipse/jdt/compiler/tool/tests/CompilerToolJava9Tests.java:[182] 
	if (!(compiler instanceof EclipseCompiler))
	                          ^^^^^^^^^^^^^^^
Discouraged access: The type 'EclipseCompiler' is not API (restriction on classpath entry '/home/jenkins/agent/workspace/eclipse.jdt.core-SonarQube/org.eclipse.jdt.compiler.tool/target/classes')
[WARNING] /home/jenkins/agent/workspace/eclipse.jdt.core-SonarQube/org.eclipse.jdt.compiler.tool.tests/src/org/eclipse/jdt/compiler/tool/tests/CompilerToolJava9Tests.java:[203] 
	if (!(compiler instanceof EclipseCompiler))
	                          ^^^^^^^^^^^^^^^
Discouraged access: The type 'EclipseCompiler' is not API (restriction on classpath entry '/home/jenkins/agent/workspace/eclipse.jdt.core-SonarQube/org.eclipse.jdt.compiler.tool/target/classes')
[WARNING] /home/jenkins/agent/workspace/eclipse.jdt.core-SonarQube/org.eclipse.jdt.compiler.tool.tests/src/org/eclipse/jdt/compiler/tool/tests/CompilerToolJava9Tests.java:[295] 
	ClassFileReader reader = null;
	^^^^^^^^^^^^^^^
Discouraged access: The type 'ClassFileReader' is not API (restriction on classpath entry '/home/jenkins/agent/workspace/eclipse.jdt.core-SonarQube/org.eclipse.jdt.core/target/classes')
[WARNING] /home/jenkins/agent/workspace/eclipse.jdt.core-SonarQube/org.eclipse.jdt.compiler.tool.tests/src/org/eclipse/jdt/compiler/tool/tests/CompilerToolJava9Tests.java:[297] 
	reader = ClassFileReader.read(new File(tmpFolder, "p/X.class"), true);
	         ^^^^^^^^^^^^^^^
Discouraged access: The type 'ClassFileReader' is not API (restriction on classpath entry '/home/jenkins/agent/workspace/eclipse.jdt.core-SonarQube/org.eclipse.jdt.core/target/classes')
[WARNING] /home/jenkins/agent/workspace/eclipse.jdt.core-SonarQube/org.eclipse.jdt.compiler.tool.tests/src/org/eclipse/jdt/compiler/tool/tests/CompilerToolJava9Tests.java:[297] 
	reader = ClassFileReader.read(new File(tmpFolder, "p/X.class"), true);
	                         ^^^^
Discouraged access: The method 'ClassFileReader.read(File, boolean)' is not API (restriction on classpath entry '/home/jenkins/agent/workspace/eclipse.jdt.core-SonarQube/org.eclipse.jdt.core/target/classes')
[WARNING] /home/jenkins/agent/workspace/eclipse.jdt.core-SonarQube/org.eclipse.jdt.compiler.tool.tests/src/org/eclipse/jdt/compiler/tool/tests/CompilerToolJava9Tests.java:[298] 
	} catch (ClassFormatException e) {
	         ^^^^^^^^^^^^^^^^^^^^
Discouraged access: The type 'ClassFormatException' is not API (restriction on classpath entry '/home/jenkins/agent/workspace/eclipse.jdt.core-SonarQube/org.eclipse.jdt.core/target/classes')
[WARNING] /home/jenkins/agent/workspace/eclipse.jdt.core-SonarQube/org.eclipse.jdt.compiler.tool.tests/src/org/eclipse/jdt/compiler/tool/tests/CompilerToolJava9Tests.java:[305] 
	assertEquals("Wrong value", ClassFileConstants.JDK1_8, reader.getVersion());
	                            ^^^^^^^^^^^^^^^^^^^^^^^^^
Discouraged access: The type 'ClassFileConstants' is not API (restriction on classpath entry '/home/jenkins/agent/workspace/eclipse.jdt.core-SonarQube/org.eclipse.jdt.core/target/classes')
[WARNING] /home/jenkins/agent/workspace/eclipse.jdt.core-SonarQube/org.eclipse.jdt.compiler.tool.tests/src/org/eclipse/jdt/compiler/tool/tests/CompilerToolJava9Tests.java:[305] 
	assertEquals("Wrong value", ClassFileConstants.JDK1_8, reader.getVersion());
	                                               ^^^^^^
Discouraged access: The field 'ClassFileConstants.JDK1_8' is not API (restriction on classpath entry '/home/jenkins/agent/workspace/eclipse.jdt.core-SonarQube/org.eclipse.jdt.core/target/classes')
[WARNING] /home/jenkins/agent/workspace/eclipse.jdt.core-SonarQube/org.eclipse.jdt.compiler.tool.tests/src/org/eclipse/jdt/compiler/tool/tests/CompilerToolJava9Tests.java:[305] 
	assertEquals("Wrong value", ClassFileConstants.JDK1_8, reader.getVersion());
	                                                              ^^^^^^^^^^
Discouraged access: The method 'ClassFileReader.getVersion()' is not API (restriction on classpath entry '/home/jenkins/agent/workspace/eclipse.jdt.core-SonarQube/org.eclipse.jdt.core/target/classes')
[WARNING] /home/jenkins/agent/workspace/eclipse.jdt.core-SonarQube/org.eclipse.jdt.compiler.tool.tests/src/org/eclipse/jdt/compiler/tool/tests/CompilerToolJava9Tests.java:[386] 
	ClassFileReader reader = null;
	^^^^^^^^^^^^^^^
Discouraged access: The type 'ClassFileReader' is not API (restriction on classpath entry '/home/jenkins/agent/workspace/eclipse.jdt.core-SonarQube/org.eclipse.jdt.core/target/classes')
[WARNING] /home/jenkins/agent/workspace/eclipse.jdt.core-SonarQube/org.eclipse.jdt.compiler.tool.tests/src/org/eclipse/jdt/compiler/tool/tests/CompilerToolJava9Tests.java:[388] 
	reader = ClassFileReader.read(new File(tmpFolder, "p/X.class"), true);
	         ^^^^^^^^^^^^^^^
Discouraged access: The type 'ClassFileReader' is not API (restriction on classpath entry '/home/jenkins/agent/workspace/eclipse.jdt.core-SonarQube/org.eclipse.jdt.core/target/classes')
[WARNING] /home/jenkins/agent/workspace/eclipse.jdt.core-SonarQube/org.eclipse.jdt.compiler.tool.tests/src/org/eclipse/jdt/compiler/tool/tests/CompilerToolJava9Tests.java:[388] 
	reader = ClassFileReader.read(new File(tmpFolder, "p/X.class"), true);
	                         ^^^^
Discouraged access: The method 'ClassFileReader.read(File, boolean)' is not API (restriction on classpath entry '/home/jenkins/agent/workspace/eclipse.jdt.core-SonarQube/org.eclipse.jdt.core/target/classes')
[WARNING] /home/jenkins/agent/workspace/eclipse.jdt.core-SonarQube/org.eclipse.jdt.compiler.tool.tests/src/org/eclipse/jdt/compiler/tool/tests/CompilerToolJava9Tests.java:[389] 
	} catch (ClassFormatException e) {
	         ^^^^^^^^^^^^^^^^^^^^
Discouraged access: The type 'ClassFormatException' is not API (restriction on classpath entry '/home/jenkins/agent/workspace/eclipse.jdt.core-SonarQube/org.eclipse.jdt.core/target/classes')
[WARNING] /home/jenkins/agent/workspace/eclipse.jdt.core-SonarQube/org.eclipse.jdt.compiler.tool.tests/src/org/eclipse/jdt/compiler/tool/tests/CompilerToolJava9Tests.java:[396] 
	assertEquals("Wrong value", ClassFileConstants.JDK1_8, reader.getVersion());
	                            ^^^^^^^^^^^^^^^^^^^^^^^^^
Discouraged access: The type 'ClassFileConstants' is not API (restriction on classpath entry '/home/jenkins/agent/workspace/eclipse.jdt.core-SonarQube/org.eclipse.jdt.core/target/classes')
[WARNING] /home/jenkins/agent/workspace/eclipse.jdt.core-SonarQube/org.eclipse.jdt.compiler.tool.tests/src/org/eclipse/jdt/compiler/tool/tests/CompilerToolJava9Tests.java:[396] 
	assertEquals("Wrong value", ClassFileConstants.JDK1_8, reader.getVersion());
	                                               ^^^^^^
Discouraged access: The field 'ClassFileConstants.JDK1_8' is not API (restriction on classpath entry '/home/jenkins/agent/workspace/eclipse.jdt.core-SonarQube/org.eclipse.jdt.core/target/classes')
[WARNING] /home/jenkins/agent/workspace/eclipse.jdt.core-SonarQube/org.eclipse.jdt.compiler.tool.tests/src/org/eclipse/jdt/compiler/tool/tests/CompilerToolJava9Tests.java:[396] 
	assertEquals("Wrong value", ClassFileConstants.JDK1_8, reader.getVersion());
	                                                              ^^^^^^^^^^
Discouraged access: The method 'ClassFileReader.getVersion()' is not API (restriction on classpath entry '/home/jenkins/agent/workspace/eclipse.jdt.core-SonarQube/org.eclipse.jdt.core/target/classes')
[WARNING] /home/jenkins/agent/workspace/eclipse.jdt.core-SonarQube/org.eclipse.jdt.compiler.tool.tests/src/org/eclipse/jdt/compiler/tool/tests/CompilerToolJava9Tests.java:[482] 
	if (!(compiler instanceof EclipseCompiler))
	                          ^^^^^^^^^^^^^^^
Discouraged access: The type 'EclipseCompiler' is not API (restriction on classpath entry '/home/jenkins/agent/workspace/eclipse.jdt.core-SonarQube/org.eclipse.jdt.compiler.tool/target/classes')
[WARNING] /home/jenkins/agent/workspace/eclipse.jdt.core-SonarQube/org.eclipse.jdt.compiler.tool.tests/src/org/eclipse/jdt/compiler/tool/tests/CompilerToolJava9Tests.java:[502] 
	if (!(compiler instanceof EclipseCompiler))
	                          ^^^^^^^^^^^^^^^
Discouraged access: The type 'EclipseCompiler' is not API (restriction on classpath entry '/home/jenkins/agent/workspace/eclipse.jdt.core-SonarQube/org.eclipse.jdt.compiler.tool/target/classes')
79 problems (79 warnings)
[INFO] 
[INFO] --- tycho-eclipserun-plugin:1.5.1:eclipse-run (default) @ org.eclipse.jdt.compiler.tool.tests ---
[INFO] 
[INFO] --- maven-resources-plugin:3.1.0:testResources (default-testResources) @ org.eclipse.jdt.compiler.tool.tests ---
[INFO] Using 'UTF-8' encoding to copy filtered resources.
[INFO] skip non existing resourceDirectory /home/jenkins/agent/workspace/eclipse.jdt.core-SonarQube/org.eclipse.jdt.compiler.tool.tests/src/test/resources
[INFO] 
[INFO] --- tycho-source-plugin:1.5.1:plugin-source (plugin-source) @ org.eclipse.jdt.compiler.tool.tests ---
[INFO] Building jar: /home/jenkins/agent/workspace/eclipse.jdt.core-SonarQube/org.eclipse.jdt.compiler.tool.tests/target/org.eclipse.jdt.compiler.tool.tests-1.2.550-SNAPSHOT-sources.jar
[INFO] 
[INFO] --- target-platform-configuration:1.5.1:target-platform (default-target-platform) @ org.eclipse.jdt.compiler.tool.tests ---
[INFO] 
[INFO] --- tycho-packaging-plugin:1.5.1:package-plugin (default-package-plugin) @ org.eclipse.jdt.compiler.tool.tests ---
[INFO] Building jar: /home/jenkins/agent/workspace/eclipse.jdt.core-SonarQube/org.eclipse.jdt.compiler.tool.tests/target/org.eclipse.jdt.compiler.tool.tests-1.2.550-SNAPSHOT.jar
[INFO] 
[INFO] --- tycho-p2-plugin:1.5.1:p2-metadata-default (default-p2-metadata-default) @ org.eclipse.jdt.compiler.tool.tests ---
[WARNING] No repository found at file:/noThanks.
org.eclipse.equinox.p2.core.ProvisionException: No repository found at file:/noThanks.
    at org.eclipse.equinox.internal.p2.repository.helpers.AbstractRepositoryManager.fail (AbstractRepositoryManager.java:396)
    at org.eclipse.equinox.internal.p2.repository.helpers.AbstractRepositoryManager.loadRepository (AbstractRepositoryManager.java:661)
    at org.eclipse.equinox.internal.p2.metadata.repository.MetadataRepositoryManager.loadRepository (MetadataRepositoryManager.java:110)
    at org.eclipse.tycho.p2.remote.RemoteMetadataRepositoryManager.loadRepository (RemoteMetadataRepositoryManager.java:61)
    at org.eclipse.tycho.p2.remote.RemoteMetadataRepositoryManager.loadRepository (RemoteMetadataRepositoryManager.java:53)
    at org.eclipse.tycho.p2.tools.baseline.BaselineServiceImpl.getProjectBaseline (BaselineServiceImpl.java:95)
    at org.eclipse.tycho.plugins.p2.BaselineValidator.validateAndReplace (BaselineValidator.java:88)
    at org.eclipse.tycho.plugins.p2.P2MetadataMojo.attachP2Metadata (P2MetadataMojo.java:180)
    at org.eclipse.tycho.plugins.p2.P2MetadataMojo.execute (P2MetadataMojo.java:135)
    at org.eclipse.tycho.plugins.p2.P2MetadataDefaultMojo.execute (P2MetadataDefaultMojo.java:33)
    at org.apache.maven.plugin.DefaultBuildPluginManager.executeMojo (DefaultBuildPluginManager.java:137)
    at org.apache.maven.lifecycle.internal.MojoExecutor.execute (MojoExecutor.java:210)
    at org.apache.maven.lifecycle.internal.MojoExecutor.execute (MojoExecutor.java:156)
    at org.apache.maven.lifecycle.internal.MojoExecutor.execute (MojoExecutor.java:148)
    at org.apache.maven.lifecycle.internal.LifecycleModuleBuilder.buildProject (LifecycleModuleBuilder.java:117)
    at org.apache.maven.lifecycle.internal.LifecycleModuleBuilder.buildProject (LifecycleModuleBuilder.java:81)
    at org.apache.maven.lifecycle.internal.builder.singlethreaded.SingleThreadedBuilder.build (SingleThreadedBuilder.java:56)
    at org.apache.maven.lifecycle.internal.LifecycleStarter.execute (LifecycleStarter.java:128)
    at org.apache.maven.DefaultMaven.doExecute (DefaultMaven.java:305)
    at org.apache.maven.DefaultMaven.doExecute (DefaultMaven.java:192)
    at org.apache.maven.DefaultMaven.execute (DefaultMaven.java:105)
    at org.apache.maven.cli.MavenCli.execute (MavenCli.java:956)
    at org.apache.maven.cli.MavenCli.doMain (MavenCli.java:288)
    at org.apache.maven.cli.MavenCli.main (MavenCli.java:192)
    at sun.reflect.NativeMethodAccessorImpl.invoke0 (Native Method)
    at sun.reflect.NativeMethodAccessorImpl.invoke (NativeMethodAccessorImpl.java:62)
    at sun.reflect.DelegatingMethodAccessorImpl.invoke (DelegatingMethodAccessorImpl.java:43)
    at java.lang.reflect.Method.invoke (Method.java:498)
    at org.codehaus.plexus.classworlds.launcher.Launcher.launchEnhanced (Launcher.java:289)
    at org.codehaus.plexus.classworlds.launcher.Launcher.launch (Launcher.java:229)
    at org.codehaus.plexus.classworlds.launcher.Launcher.mainWithExitCode (Launcher.java:415)
    at org.codehaus.plexus.classworlds.launcher.Launcher.main (Launcher.java:356)
[INFO] No baseline version MavenProject: org.eclipse.jdt:org.eclipse.jdt.compiler.tool.tests:1.2.550-SNAPSHOT @ /home/jenkins/agent/workspace/eclipse.jdt.core-SonarQube/org.eclipse.jdt.compiler.tool.tests/pom.xml
[INFO] 
[INFO] --- tycho-surefire-plugin:1.5.1:test (default-test) @ org.eclipse.jdt.compiler.tool.tests ---
[INFO] Expected eclipse log file: /home/jenkins/agent/workspace/eclipse.jdt.core-SonarQube/org.eclipse.jdt.compiler.tool.tests/target/work/data/.metadata/.log
[INFO] Command line:
	[/opt/tools/java/oracle/jdk-8/1.8.0_202/jre/bin/java, -Dosgi.noShutdown=false, -Dosgi.os=linux, -Dosgi.ws=gtk, -Dosgi.arch=x86_64, -javaagent:/home/jenkins/agent/workspace/eclipse.jdt.core-SonarQube/.repository/org/jacoco/org.jacoco.agent/0.8.5/org.jacoco.agent-0.8.5-runtime.jar=destfile=/home/jenkins/agent/workspace/eclipse.jdt.core-SonarQube/jacoco.exec,append=true, -Dosgi.clean=true, -ea, -jar, /home/jenkins/agent/workspace/eclipse.jdt.core-SonarQube/.repository/p2/osgi/bundle/org.eclipse.equinox.launcher/1.5.600.v20191014-2022/org.eclipse.equinox.launcher-1.5.600.v20191014-2022.jar, -data, /home/jenkins/agent/workspace/eclipse.jdt.core-SonarQube/org.eclipse.jdt.compiler.tool.tests/target/work/data, -install, /home/jenkins/agent/workspace/eclipse.jdt.core-SonarQube/org.eclipse.jdt.compiler.tool.tests/target/work, -configuration, /home/jenkins/agent/workspace/eclipse.jdt.core-SonarQube/org.eclipse.jdt.compiler.tool.tests/target/work/configuration, -application, org.eclipse.tycho.surefire.osgibooter.headlesstest, -testproperties, /home/jenkins/agent/workspace/eclipse.jdt.core-SonarQube/org.eclipse.jdt.compiler.tool.tests/target/surefire.properties]
Running org.eclipse.jdt.compiler.tool.tests.AllTests
reflectNestedClassUseDollar=true based on version=1.8.0_202
CLASS_PATH
/home/jenkins/agent/workspace/eclipse.jdt.core-SonarQube/.repository/p2/osgi/bundle/org.eclipse.equinox.launcher/1.5.600.v20191014-2022/org.eclipse.equinox.launcher-1.5.600.v20191014-2022.jar
/home/jenkins/agent/workspace/eclipse.jdt.core-SonarQube/.repository/org/jacoco/org.jacoco.agent/0.8.5/org.jacoco.agent-0.8.5-runtime.jar
PLATFORM_CLASS_PATH
/opt/tools/java/oracle/jdk-8/1.8.0_202/jre/lib/sunrsasign.jar
/opt/tools/java/oracle/jdk-8/1.8.0_202/jre/lib/rt.jar
/opt/tools/java/oracle/jdk-8/1.8.0_202/jre/lib/resources.jar
/opt/tools/java/oracle/jdk-8/1.8.0_202/jre/lib/jfr.jar
/opt/tools/java/oracle/jdk-8/1.8.0_202/jre/lib/jce.jar
/opt/tools/java/oracle/jdk-8/1.8.0_202/jre/lib/charsets.jar
/opt/tools/java/oracle/jdk-8/1.8.0_202/jre/lib/jsse.jar
----------
1. ERROR in /tmp/X.java (at line 2)
	public class X extends File {}
	                       ^^^^
File cannot be resolved to a type
----------
1 problem (1 error)
----------
1. ERROR in /tmp/X.java (at line 2)
	public class X extends File {}
	                       ^^^^
File cannot be resolved to a type
----------
1 problem (1 error)
Tests run: 53, Failures: 0, Errors: 0, Skipped: 0, Time elapsed: 5.586 s - in org.eclipse.jdt.compiler.tool.tests.AllTests
testCompilerUnusedVariable(org.eclipse.jdt.compiler.tool.tests.CompilerToolTests)  Time elapsed: 0.885 s
testCompilerOneClassWithSystemCompiler2(org.eclipse.jdt.compiler.tool.tests.CompilerToolTests)  Time elapsed: 0.9 s
testCompilerOneClassWithSystemCompiler(org.eclipse.jdt.compiler.tool.tests.CompilerToolTests)  Time elapsed: 0.171 s
testCompilerOneClassWithEclipseCompiler(org.eclipse.jdt.compiler.tool.tests.CompilerToolTests)  Time elapsed: 0.062 s
testCheckOptions(org.eclipse.jdt.compiler.tool.tests.CompilerToolTests)  Time elapsed: 0.003 s
testSupportedCompilerVersions(org.eclipse.jdt.compiler.tool.tests.CompilerToolTests)  Time elapsed: 0 s
testFileManager2(org.eclipse.jdt.compiler.tool.tests.CompilerToolTests)  Time elapsed: 0.002 s
testCompilerOneClassWithEclipseCompiler2(org.eclipse.jdt.compiler.tool.tests.CompilerToolTests)  Time elapsed: 0.101 s
testCompilerOneClassWithEclipseCompiler3(org.eclipse.jdt.compiler.tool.tests.CompilerToolTests)  Time elapsed: 0.051 s
testCompilerOneClassWithEclipseCompiler4(org.eclipse.jdt.compiler.tool.tests.CompilerToolTests)  Time elapsed: 0.031 s
testCompilerOneClassWithEclipseCompiler5(org.eclipse.jdt.compiler.tool.tests.CompilerToolTests)  Time elapsed: 0.054 s
testCompilerOneClassWithEclipseCompiler6(org.eclipse.jdt.compiler.tool.tests.CompilerToolTests)  Time elapsed: 0 s
testCompilerOneClassWithEclipseCompiler7(org.eclipse.jdt.compiler.tool.tests.CompilerToolTests)  Time elapsed: 0.038 s
testCleanUp(org.eclipse.jdt.compiler.tool.tests.CompilerToolTests)  Time elapsed: 0.001 s
testCompilerUnusedVariable2(org.eclipse.jdt.compiler.tool.tests.CompilerToolTests)  Time elapsed: 0.064 s
testFileManager(org.eclipse.jdt.compiler.tool.tests.CompilerToolTests)  Time elapsed: 0.003 s
testInferBinaryName(org.eclipse.jdt.compiler.tool.tests.CompilerToolTests)  Time elapsed: 0.002 s
testAsPath(org.eclipse.jdt.compiler.tool.tests.CompilerToolJava9Tests)  Time elapsed: 0 s
testBug533830_1(org.eclipse.jdt.compiler.tool.tests.CompilerToolJava9Tests)  Time elapsed: 0 s
testClassOutputLocationForModule_1(org.eclipse.jdt.compiler.tool.tests.CompilerToolJava9Tests)  Time elapsed: 0 s
testClassOutputLocationForModule_2(org.eclipse.jdt.compiler.tool.tests.CompilerToolJava9Tests)  Time elapsed: 0 s
testContains(org.eclipse.jdt.compiler.tool.tests.CompilerToolJava9Tests)  Time elapsed: 0.001 s
testGetJavaFileObjects(org.eclipse.jdt.compiler.tool.tests.CompilerToolJava9Tests)  Time elapsed: 0 s
testGetJavaFileObjects2(org.eclipse.jdt.compiler.tool.tests.CompilerToolJava9Tests)  Time elapsed: 0 s
testGetLocationForModule1(org.eclipse.jdt.compiler.tool.tests.CompilerToolJava9Tests)  Time elapsed: 0 s
testGetLocationForModule2(org.eclipse.jdt.compiler.tool.tests.CompilerToolJava9Tests)  Time elapsed: 0 s
testGetLocationForModule3(org.eclipse.jdt.compiler.tool.tests.CompilerToolJava9Tests)  Time elapsed: 0 s
testGetServiceLoader(org.eclipse.jdt.compiler.tool.tests.CompilerToolJava9Tests)  Time elapsed: 0 s
testInferModuleName(org.eclipse.jdt.compiler.tool.tests.CompilerToolJava9Tests)  Time elapsed: 0 s
testListLocationsForModules(org.eclipse.jdt.compiler.tool.tests.CompilerToolJava9Tests)  Time elapsed: 0 s
testOptionRelease1(org.eclipse.jdt.compiler.tool.tests.CompilerToolJava9Tests)  Time elapsed: 0 s
testOptionRelease2(org.eclipse.jdt.compiler.tool.tests.CompilerToolJava9Tests)  Time elapsed: 0 s
testOptionRelease3(org.eclipse.jdt.compiler.tool.tests.CompilerToolJava9Tests)  Time elapsed: 0.001 s
testSetLocationAsPaths(org.eclipse.jdt.compiler.tool.tests.CompilerToolJava9Tests)  Time elapsed: 0 s
testSupportedCompilerVersions(org.eclipse.jdt.compiler.tool.tests.CompilerToolJava9Tests)  Time elapsed: 0 s
test001_basic - 1.6(org.eclipse.jdt.compiler.tool.tests.CompilerInvocationTests)  Time elapsed: 0.196 s
test002_dash_d_option - 1.6(org.eclipse.jdt.compiler.tool.tests.CompilerInvocationTests)  Time elapsed: 0.098 s
test003_dash_d_option - 1.6(org.eclipse.jdt.compiler.tool.tests.CompilerInvocationTests)  Time elapsed: 0.055 s
test004_no_dash_d_option - 1.6(org.eclipse.jdt.compiler.tool.tests.CompilerInvocationTests)  Time elapsed: 0.06 s
test005_dash_d_option_custom_file_manager - 1.6(org.eclipse.jdt.compiler.tool.tests.CompilerInvocationTests)  Time elapsed: 0.059 s
test006_no_dash_d_option_custom_file_manager - 1.6(org.eclipse.jdt.compiler.tool.tests.CompilerInvocationTests)  Time elapsed: 0.052 s
test007_options_consumption - 1.6(org.eclipse.jdt.compiler.tool.tests.CompilerInvocationTests)  Time elapsed: 0.001 s
test008_options_consumption - 1.6(org.eclipse.jdt.compiler.tool.tests.CompilerInvocationTests)  Time elapsed: 0.001 s
test009_options_consumption - 1.6(org.eclipse.jdt.compiler.tool.tests.CompilerInvocationTests)  Time elapsed: 0.001 s
test010_inappropriate_encoding_diagnosis - 1.6(org.eclipse.jdt.compiler.tool.tests.CompilerInvocationTests)  Time elapsed: 0.01 s
test011_inappropriate_encoding_diagnosis - 1.6(org.eclipse.jdt.compiler.tool.tests.CompilerInvocationTests)  Time elapsed: 0.002 s
test012_files_access_read - 1.6(org.eclipse.jdt.compiler.tool.tests.CompilerInvocationTests)  Time elapsed: 0.079 s
test015_files_access_write - 1.6(org.eclipse.jdt.compiler.tool.tests.CompilerInvocationTests)  Time elapsed: 0.033 s
test016_files_access_write - 1.6(org.eclipse.jdt.compiler.tool.tests.CompilerInvocationTests)  Time elapsed: 0.136 s
test017_sourcepath_without_destination - 1.6(org.eclipse.jdt.compiler.tool.tests.CompilerInvocationTests)  Time elapsed: 0.144 s
test019_sourcepath_without_destination - 1.6(org.eclipse.jdt.compiler.tool.tests.CompilerInvocationTests)  Time elapsed: 0.132 s
test021_output_streams - 1.6(org.eclipse.jdt.compiler.tool.tests.CompilerInvocationTests)  Time elapsed: 0.003 s
test022_output_streams - 1.6(org.eclipse.jdt.compiler.tool.tests.CompilerInvocationTests)  Time elapsed: 0.002 s

Results:

Tests run: 53, Failures: 0, Errors: 0, Skipped: 0

[INFO] All tests passed!
[INFO] 
[INFO] --- tycho-p2-extras-plugin:1.5.1:compare-version-with-baselines (compare-attached-artifacts-with-release) @ org.eclipse.jdt.compiler.tool.tests ---
[INFO] Skipped
[INFO] 
[INFO] ---------< org.eclipse.jdt:org.eclipse.jdt.core.tests.builder >---------
[INFO] Building org.eclipse.jdt.core.tests.builder 3.10.750-SNAPSHOT     [9/17]
[INFO] ------------------------[ eclipse-test-plugin ]-------------------------
[INFO] 
[INFO] --- maven-clean-plugin:3.1.0:clean (default-clean) @ org.eclipse.jdt.core.tests.builder ---
[INFO] 
[INFO] --- tycho-packaging-plugin:1.5.1:build-qualifier (default-build-qualifier) @ org.eclipse.jdt.core.tests.builder ---
[INFO] The project's OSGi version is 3.10.750.v20190924-1339
[INFO] 
[INFO] --- tycho-packaging-plugin:1.5.1:validate-id (default-validate-id) @ org.eclipse.jdt.core.tests.builder ---
[INFO] 
[INFO] --- tycho-packaging-plugin:1.5.1:validate-version (default-validate-version) @ org.eclipse.jdt.core.tests.builder ---
[INFO] 
[INFO] --- maven-resources-plugin:3.1.0:copy-resources (saveproperties) @ org.eclipse.jdt.core.tests.builder ---
[INFO] Using 'UTF-8' encoding to copy filtered resources.
[INFO] skip non existing resourceDirectory /home/jenkins/agent/workspace/eclipse.jdt.core-SonarQube/org.eclipse.jdt.core.tests.builder/saveproperties
[INFO] 
[INFO] --- maven-enforcer-plugin:3.0.0-M2:enforce (enforce-maven) @ org.eclipse.jdt.core.tests.builder ---
[INFO] 
[INFO] --- maven-toolchains-plugin:1.1:toolchain (default) @ org.eclipse.jdt.core.tests.builder ---
[INFO] Required toolchain: jdk [ id='JavaSE-11' ]
[INFO] Found matching toolchain for type jdk: JDK[/opt/tools/java/openjdk/jdk-11/latest]
[INFO] 
[INFO] --- jacoco-maven-plugin:0.8.5:prepare-agent (jacoco-agent) @ org.eclipse.jdt.core.tests.builder ---
[INFO] tycho.testArgLine set to -javaagent:/home/jenkins/agent/workspace/eclipse.jdt.core-SonarQube/.repository/org/jacoco/org.jacoco.agent/0.8.5/org.jacoco.agent-0.8.5-runtime.jar=destfile=/home/jenkins/agent/workspace/eclipse.jdt.core-SonarQube/jacoco.exec,append=true
[INFO] 
[INFO] --- eclipse-cbi-plugin:1.1.8-SNAPSHOT:generate-api-build-xml (default) @ org.eclipse.jdt.core.tests.builder ---
[INFO] 
[INFO] --- maven-resources-plugin:3.1.0:resources (default-resources) @ org.eclipse.jdt.core.tests.builder ---
[INFO] Using 'UTF-8' encoding to copy filtered resources.
[INFO] skip non existing resourceDirectory /home/jenkins/agent/workspace/eclipse.jdt.core-SonarQube/org.eclipse.jdt.core.tests.builder/src/main/resources
[INFO] 
[INFO] --- maven-resources-plugin:3.1.0:resources (filter-resources) @ org.eclipse.jdt.core.tests.builder ---
[INFO] Using 'UTF-8' encoding to copy filtered resources.
[INFO] skip non existing resourceDirectory /home/jenkins/agent/workspace/eclipse.jdt.core-SonarQube/org.eclipse.jdt.core.tests.builder/src/main/resources
[INFO] 
[INFO] --- tycho-compiler-plugin:1.5.1:compile (default-compile) @ org.eclipse.jdt.core.tests.builder ---
[INFO] Compiling 37 source files to /home/jenkins/agent/workspace/eclipse.jdt.core-SonarQube/org.eclipse.jdt.core.tests.builder/target/classes
[INFO] 
[INFO] --- tycho-eclipserun-plugin:1.5.1:eclipse-run (default) @ org.eclipse.jdt.core.tests.builder ---
[INFO] 
[INFO] --- maven-resources-plugin:3.1.0:testResources (default-testResources) @ org.eclipse.jdt.core.tests.builder ---
[INFO] Using 'UTF-8' encoding to copy filtered resources.
[INFO] skip non existing resourceDirectory /home/jenkins/agent/workspace/eclipse.jdt.core-SonarQube/org.eclipse.jdt.core.tests.builder/src/test/resources
[INFO] 
[INFO] --- tycho-source-plugin:1.5.1:plugin-source (plugin-source) @ org.eclipse.jdt.core.tests.builder ---
[INFO] Building jar: /home/jenkins/agent/workspace/eclipse.jdt.core-SonarQube/org.eclipse.jdt.core.tests.builder/target/org.eclipse.jdt.core.tests.builder-3.10.750-SNAPSHOT-sources.jar
[INFO] 
[INFO] --- target-platform-configuration:1.5.1:target-platform (default-target-platform) @ org.eclipse.jdt.core.tests.builder ---
[INFO] 
[INFO] --- tycho-packaging-plugin:1.5.1:package-plugin (default-package-plugin) @ org.eclipse.jdt.core.tests.builder ---
[INFO] Building jar: /home/jenkins/agent/workspace/eclipse.jdt.core-SonarQube/org.eclipse.jdt.core.tests.builder/target/org.eclipse.jdt.core.tests.builder-3.10.750-SNAPSHOT.jar
[INFO] 
[INFO] --- tycho-p2-plugin:1.5.1:p2-metadata-default (default-p2-metadata-default) @ org.eclipse.jdt.core.tests.builder ---
[WARNING] No repository found at file:/noThanks.
org.eclipse.equinox.p2.core.ProvisionException: No repository found at file:/noThanks.
    at org.eclipse.equinox.internal.p2.repository.helpers.AbstractRepositoryManager.fail (AbstractRepositoryManager.java:396)
    at org.eclipse.equinox.internal.p2.repository.helpers.AbstractRepositoryManager.loadRepository (AbstractRepositoryManager.java:661)
    at org.eclipse.equinox.internal.p2.metadata.repository.MetadataRepositoryManager.loadRepository (MetadataRepositoryManager.java:110)
    at org.eclipse.tycho.p2.remote.RemoteMetadataRepositoryManager.loadRepository (RemoteMetadataRepositoryManager.java:61)
    at org.eclipse.tycho.p2.remote.RemoteMetadataRepositoryManager.loadRepository (RemoteMetadataRepositoryManager.java:53)
    at org.eclipse.tycho.p2.tools.baseline.BaselineServiceImpl.getProjectBaseline (BaselineServiceImpl.java:95)
    at org.eclipse.tycho.plugins.p2.BaselineValidator.validateAndReplace (BaselineValidator.java:88)
    at org.eclipse.tycho.plugins.p2.P2MetadataMojo.attachP2Metadata (P2MetadataMojo.java:180)
    at org.eclipse.tycho.plugins.p2.P2MetadataMojo.execute (P2MetadataMojo.java:135)
    at org.eclipse.tycho.plugins.p2.P2MetadataDefaultMojo.execute (P2MetadataDefaultMojo.java:33)
    at org.apache.maven.plugin.DefaultBuildPluginManager.executeMojo (DefaultBuildPluginManager.java:137)
    at org.apache.maven.lifecycle.internal.MojoExecutor.execute (MojoExecutor.java:210)
    at org.apache.maven.lifecycle.internal.MojoExecutor.execute (MojoExecutor.java:156)
    at org.apache.maven.lifecycle.internal.MojoExecutor.execute (MojoExecutor.java:148)
    at org.apache.maven.lifecycle.internal.LifecycleModuleBuilder.buildProject (LifecycleModuleBuilder.java:117)
    at org.apache.maven.lifecycle.internal.LifecycleModuleBuilder.buildProject (LifecycleModuleBuilder.java:81)
    at org.apache.maven.lifecycle.internal.builder.singlethreaded.SingleThreadedBuilder.build (SingleThreadedBuilder.java:56)
    at org.apache.maven.lifecycle.internal.LifecycleStarter.execute (LifecycleStarter.java:128)
    at org.apache.maven.DefaultMaven.doExecute (DefaultMaven.java:305)
    at org.apache.maven.DefaultMaven.doExecute (DefaultMaven.java:192)
    at org.apache.maven.DefaultMaven.execute (DefaultMaven.java:105)
    at org.apache.maven.cli.MavenCli.execute (MavenCli.java:956)
    at org.apache.maven.cli.MavenCli.doMain (MavenCli.java:288)
    at org.apache.maven.cli.MavenCli.main (MavenCli.java:192)
    at sun.reflect.NativeMethodAccessorImpl.invoke0 (Native Method)
    at sun.reflect.NativeMethodAccessorImpl.invoke (NativeMethodAccessorImpl.java:62)
    at sun.reflect.DelegatingMethodAccessorImpl.invoke (DelegatingMethodAccessorImpl.java:43)
    at java.lang.reflect.Method.invoke (Method.java:498)
    at org.codehaus.plexus.classworlds.launcher.Launcher.launchEnhanced (Launcher.java:289)
    at org.codehaus.plexus.classworlds.launcher.Launcher.launch (Launcher.java:229)
    at org.codehaus.plexus.classworlds.launcher.Launcher.mainWithExitCode (Launcher.java:415)
    at org.codehaus.plexus.classworlds.launcher.Launcher.main (Launcher.java:356)
[INFO] No baseline version MavenProject: org.eclipse.jdt:org.eclipse.jdt.core.tests.builder:3.10.750-SNAPSHOT @ /home/jenkins/agent/workspace/eclipse.jdt.core-SonarQube/org.eclipse.jdt.core.tests.builder/pom.xml
[INFO] 
[INFO] --- tycho-surefire-plugin:1.5.1:test (default-test) @ org.eclipse.jdt.core.tests.builder ---
[INFO] Toolchain in tycho-surefire-plugin: JDK[/opt/tools/java/openjdk/jdk-11/latest]
[INFO] Expected eclipse log file: /home/jenkins/agent/workspace/eclipse.jdt.core-SonarQube/org.eclipse.jdt.core.tests.builder/target/work/data/.metadata/.log
[INFO] Command line:
	[/opt/tools/java/openjdk/jdk-11/latest/bin/java, -Dosgi.noShutdown=false, -Dosgi.os=linux, -Dosgi.ws=gtk, -Dosgi.arch=x86_64, --add-modules, ALL-SYSTEM, -Dcompliance=1.4,1.7,1.8,11, -Dosgi.clean=true, -ea, -jar, /home/jenkins/agent/workspace/eclipse.jdt.core-SonarQube/.repository/p2/osgi/bundle/org.eclipse.equinox.launcher/1.5.600.v20191014-2022/org.eclipse.equinox.launcher-1.5.600.v20191014-2022.jar, -data, /home/jenkins/agent/workspace/eclipse.jdt.core-SonarQube/org.eclipse.jdt.core.tests.builder/target/work/data, -install, /home/jenkins/agent/workspace/eclipse.jdt.core-SonarQube/org.eclipse.jdt.core.tests.builder/target/work, -configuration, /home/jenkins/agent/workspace/eclipse.jdt.core-SonarQube/org.eclipse.jdt.core.tests.builder/target/work/configuration, -application, org.eclipse.tycho.surefire.osgibooter.headlesstest, -testproperties, /home/jenkins/agent/workspace/eclipse.jdt.core-SonarQube/org.eclipse.jdt.core.tests.builder/target/surefire.properties]
Running org.eclipse.jdt.core.tests.builder.BuilderTests
reflectNestedClassUseDollar=true due to isJRE9Plus
Problem : One or more cycles were detected in the build path of project 'P1'. The paths towards the cycle and cycle are:
->{P1, P2} [ resource : </P1> range : <-1,-1> category : <10> severity : <2>]
Problem : One or more cycles were detected in the build path of project 'P2'. The paths towards the cycle and cycle are:
->{P1, P2} [ resource : </P2> range : <-1,-1> category : <10> severity : <2>]
Problem : The project cannot be built until build path errors are resolved [ resource : </P1> range : <-1,-1> category : <10> severity : <2>]
Problem : The project cannot be built until build path errors are resolved [ resource : </P2> range : <-1,-1> category : <10> severity : <2>]

Tests run: 339, Failures: 0, Errors: 6, Skipped: 0, Time elapsed: 252.119 s <<< FAILURE! - in org.eclipse.jdt.core.tests.builder.BuilderTests
test001(org.eclipse.jdt.core.tests.builder.AbstractMethodTests)  Time elapsed: 2.853 s
test002(org.eclipse.jdt.core.tests.builder.AbstractMethodTests)  Time elapsed: 1.388 s
test003(org.eclipse.jdt.core.tests.builder.AbstractMethodTests)  Time elapsed: 0.535 s
testBuild(org.eclipse.jdt.core.tests.builder.BasicBuildTests)  Time elapsed: 0.593 s
testToDoMarker(org.eclipse.jdt.core.tests.builder.BasicBuildTests)  Time elapsed: 0.605 s
testToDoMarker2(org.eclipse.jdt.core.tests.builder.BasicBuildTests)  Time elapsed: 0.589 s
testTags(org.eclipse.jdt.core.tests.builder.BasicBuildTests)  Time elapsed: 0.513 s
testTags2(org.eclipse.jdt.core.tests.builder.BasicBuildTests)  Time elapsed: 0.464 s
testTags3(org.eclipse.jdt.core.tests.builder.BasicBuildTests)  Time elapsed: 0.526 s
testUnusedImport(org.eclipse.jdt.core.tests.builder.BasicBuildTests)  Time elapsed: 0.668 s
test98667(org.eclipse.jdt.core.tests.builder.BasicBuildTests)  Time elapsed: 0.523 s
testBug164707(org.eclipse.jdt.core.tests.builder.BasicBuildTests)  Time elapsed: 0.32 s
testTags4(org.eclipse.jdt.core.tests.builder.BasicBuildTests)  Time elapsed: 0.619 s
testBug392727(org.eclipse.jdt.core.tests.builder.BasicBuildTests)  Time elapsed: 0.509 s
testbBug386901(org.eclipse.jdt.core.tests.builder.BasicBuildTests)  Time elapsed: 0.822 s
testBug425420(org.eclipse.jdt.core.tests.builder.BasicBuildTests)  Time elapsed: 0.488 s
testBug549942(org.eclipse.jdt.core.tests.builder.BasicBuildTests)  Time elapsed: 1.312 s
testClasspathFileChange(org.eclipse.jdt.core.tests.builder.BuildpathTests)  Time elapsed: 1.662 s
testClosedProject(org.eclipse.jdt.core.tests.builder.BuildpathTests)  Time elapsed: 1.048 s
testCorruptBuilder(org.eclipse.jdt.core.tests.builder.BuildpathTests)  Time elapsed: 0.925 s
testCorruptBuilder2(org.eclipse.jdt.core.tests.builder.BuildpathTests)  Time elapsed: 2.998 s
testChangeExternalFolder(org.eclipse.jdt.core.tests.builder.BuildpathTests)  Time elapsed: 4.729 s
testChangeZIPArchive1(org.eclipse.jdt.core.tests.builder.BuildpathTests)  Time elapsed: 1.574 s
testChangeZIPArchive2(org.eclipse.jdt.core.tests.builder.BuildpathTests)  Time elapsed: 1.681 s
testExternalJarChange(org.eclipse.jdt.core.tests.builder.BuildpathTests)  Time elapsed: 1.668 s
testMissingBuilder(org.eclipse.jdt.core.tests.builder.BuildpathTests)  Time elapsed: 0.824 s
testMissingFieldType(org.eclipse.jdt.core.tests.builder.BuildpathTests)  Time elapsed: 0.494 s
testMissingLibrary1(org.eclipse.jdt.core.tests.builder.BuildpathTests)  Time elapsed: 0.141 s
testMissingLibrary2(org.eclipse.jdt.core.tests.builder.BuildpathTests)  Time elapsed: 1.972 s
testMissingLibrary3(org.eclipse.jdt.core.tests.builder.BuildpathTests)  Time elapsed: 1.959 s
testMissingLibrary4(org.eclipse.jdt.core.tests.builder.BuildpathTests)  Time elapsed: 1.301 s
testIncompatibleJdkLEvelOnProject(org.eclipse.jdt.core.tests.builder.BuildpathTests)  Time elapsed: 1.933 s
testIncompatibleJdkLEvelOnWksp(org.eclipse.jdt.core.tests.builder.BuildpathTests)  Time elapsed: 3.08 s
testMissingProject(org.eclipse.jdt.core.tests.builder.BuildpathTests)  Time elapsed: 7.645 s
testMissingOptionalProject(org.eclipse.jdt.core.tests.builder.BuildpathTests)  Time elapsed: 2.546 s
test0100(org.eclipse.jdt.core.tests.builder.BuildpathTests)  Time elapsed: 0.003 s
testMissingOutputFolder(org.eclipse.jdt.core.tests.builder.BuildpathTests)  Time elapsed: 0.091 s
testFilteredResources(org.eclipse.jdt.core.tests.builder.CopyResourceTests)  Time elapsed: 0.417 s
testSimpleProject(org.eclipse.jdt.core.tests.builder.CopyResourceTests)  Time elapsed: 0.231 s
testProjectWithBin(org.eclipse.jdt.core.tests.builder.CopyResourceTests)  Time elapsed: 0.382 s
testProjectWithSrcBin(org.eclipse.jdt.core.tests.builder.CopyResourceTests)  Time elapsed: 0.189 s
testProjectWith2SrcBin(org.eclipse.jdt.core.tests.builder.CopyResourceTests)  Time elapsed: 0.282 s
testProjectWith2SrcAsBin(org.eclipse.jdt.core.tests.builder.CopyResourceTests)  Time elapsed: 0.136 s
testProjectWith2Src2Bin(org.eclipse.jdt.core.tests.builder.CopyResourceTests)  Time elapsed: 4.101 s
test2ProjectWith1Bin(org.eclipse.jdt.core.tests.builder.CopyResourceTests)  Time elapsed: 0.582 s
testBug154693(org.eclipse.jdt.core.tests.builder.CopyResourceTests)  Time elapsed: 0.286 s
testBug194420(org.eclipse.jdt.core.tests.builder.CopyResourceTests)  Time elapsed: 0.302 s
testAbstractMethod(org.eclipse.jdt.core.tests.builder.DependencyTests)  Time elapsed: 0.501 s
testCaseInvariantType(org.eclipse.jdt.core.tests.builder.DependencyTests)  Time elapsed: 0.986 s
testExactMethodDeleting(org.eclipse.jdt.core.tests.builder.DependencyTests)  Time elapsed: 0.633 s
testExactMethodVisibility(org.eclipse.jdt.core.tests.builder.DependencyTests)  Time elapsed: 0.516 s
testExternalJarChanged(org.eclipse.jdt.core.tests.builder.DependencyTests)  Time elapsed: 2.351 s
testFieldDeleting(org.eclipse.jdt.core.tests.builder.DependencyTests)  Time elapsed: 0.278 s
testFieldVisibility(org.eclipse.jdt.core.tests.builder.DependencyTests)  Time elapsed: 0.406 s
testInterfaceDeleting(org.eclipse.jdt.core.tests.builder.DependencyTests)  Time elapsed: 0.23 s
testMemberTypeDeleting(org.eclipse.jdt.core.tests.builder.DependencyTests)  Time elapsed: 0.235 s
testMemberTypeVisibility(org.eclipse.jdt.core.tests.builder.DependencyTests)  Time elapsed: 0.285 s
testMethodDeleting(org.eclipse.jdt.core.tests.builder.DependencyTests)  Time elapsed: 0.214 s
testMethodVisibility(org.eclipse.jdt.core.tests.builder.DependencyTests)  Time elapsed: 0.383 s
testMissingClassFile(org.eclipse.jdt.core.tests.builder.DependencyTests)  Time elapsed: 0.738 s
testSecondaryTypeDeleting(org.eclipse.jdt.core.tests.builder.DependencyTests)  Time elapsed: 0.206 s
testTypeDeleting(org.eclipse.jdt.core.tests.builder.DependencyTests)  Time elapsed: 0.266 s
testTypeVisibility(org.eclipse.jdt.core.tests.builder.DependencyTests)  Time elapsed: 0.398 s
testTypeVisibility2(org.eclipse.jdt.core.tests.builder.DependencyTests)  Time elapsed: 0.211 s
testTypeVariable(org.eclipse.jdt.core.tests.builder.DependencyTests)  Time elapsed: 0.004 s
test0100(org.eclipse.jdt.core.tests.builder.DependencyTests)  Time elapsed: 0.131 s
testErrors(org.eclipse.jdt.core.tests.builder.ErrorsTests)  Time elapsed: 0.376 s
testRenameToNonJava(org.eclipse.jdt.core.tests.builder.ErrorsTests)  Time elapsed: 0.173 s
test0100(org.eclipse.jdt.core.tests.builder.ErrorsTests)  Time elapsed: 0.188 s
test0101(org.eclipse.jdt.core.tests.builder.ErrorsTests)  Time elapsed: 0.291 s
test0102(org.eclipse.jdt.core.tests.builder.ErrorsTests)  Time elapsed: 0.321 s
test0103(org.eclipse.jdt.core.tests.builder.ErrorsTests)  Time elapsed: 0.425 s
test0104(org.eclipse.jdt.core.tests.builder.ErrorsTests)  Time elapsed: 0.035 s
test0106(org.eclipse.jdt.core.tests.builder.ErrorsTests)  Time elapsed: 0.221 s
test0107(org.eclipse.jdt.core.tests.builder.ErrorsTests)  Time elapsed: 0.194 s
test0108(org.eclipse.jdt.core.tests.builder.ErrorsTests)  Time elapsed: 0.444 s
test0109(org.eclipse.jdt.core.tests.builder.ErrorsTests)  Time elapsed: 0.277 s
test0110(org.eclipse.jdt.core.tests.builder.ErrorsTests)  Time elapsed: 0.383 s
test0111(org.eclipse.jdt.core.tests.builder.ErrorsTests)  Time elapsed: 0.197 s
test0112(org.eclipse.jdt.core.tests.builder.ErrorsTests)  Time elapsed: 0.21 s
testProjectAsClassFolder(org.eclipse.jdt.core.tests.builder.EfficiencyTests)  Time elapsed: 0.344 s
testEfficiency(org.eclipse.jdt.core.tests.builder.EfficiencyTests)  Time elapsed: 0.25 s
testMethodAddition(org.eclipse.jdt.core.tests.builder.EfficiencyTests)  Time elapsed: 0.199 s
testLocalTypeAddition(org.eclipse.jdt.core.tests.builder.EfficiencyTests)  Time elapsed: 0.272 s
testLocalTypeAddition2(org.eclipse.jdt.core.tests.builder.EfficiencyTests)  Time elapsed: 0.244 s
testLocalTypeRemoval(org.eclipse.jdt.core.tests.builder.EfficiencyTests)  Time elapsed: 0.334 s
testLocalTypeRemoval2(org.eclipse.jdt.core.tests.builder.EfficiencyTests)  Time elapsed: 0.188 s
testMissingType001(org.eclipse.jdt.core.tests.builder.EfficiencyTests)  Time elapsed: 0.189 s
testSuccess(org.eclipse.jdt.core.tests.builder.ExecutionTests)  Time elapsed: 0.402 s
testFailure(org.eclipse.jdt.core.tests.builder.ExecutionTests)  Time elapsed: 0.902 s
testAddDuplicateSecondaryType(org.eclipse.jdt.core.tests.builder.IncrementalTests)  Time elapsed: 0.356 s
testDefaultPackage(org.eclipse.jdt.core.tests.builder.IncrementalTests)  Time elapsed: 0.144 s
testDefaultPackage2(org.eclipse.jdt.core.tests.builder.IncrementalTests)  Time elapsed: 0.243 s
testNewJCL(org.eclipse.jdt.core.tests.builder.IncrementalTests)  Time elapsed: 0.051 s
testRenameMainType(org.eclipse.jdt.core.tests.builder.IncrementalTests)  Time elapsed: 0.292 s
testRemoveSecondaryType(org.eclipse.jdt.core.tests.builder.IncrementalTests)  Time elapsed: 0.349 s
testRemoveSecondaryType2(org.eclipse.jdt.core.tests.builder.IncrementalTests)  Time elapsed: 0.324 s
testMoveSecondaryType(org.eclipse.jdt.core.tests.builder.IncrementalTests)  Time elapsed: 0.517 s
testMoveMemberType(org.eclipse.jdt.core.tests.builder.IncrementalTests)  Time elapsed: 0.231 s
testMovePackage(org.eclipse.jdt.core.tests.builder.IncrementalTests)  Time elapsed: 0.578 s
testMovePackage2(org.eclipse.jdt.core.tests.builder.IncrementalTests)  Time elapsed: 0.223 s
testMemberTypeFromClassFile(org.eclipse.jdt.core.tests.builder.IncrementalTests)  Time elapsed: 0.328 s
testMemberTypeOfOtherProject(org.eclipse.jdt.core.tests.builder.IncrementalTests)  Time elapsed: 0.424 s
test$InTypeName(org.eclipse.jdt.core.tests.builder.IncrementalTests)  Time elapsed: 0.5 s
testObjectWithSuperInterfaces(org.eclipse.jdt.core.tests.builder.IncrementalTests)  Time elapsed: 0.248 s
testMemberTypeCollisionWithBinary(org.eclipse.jdt.core.tests.builder.IncrementalTests)  Time elapsed: 0.305 s
testMemberTypeCollisionWithBinary2(org.eclipse.jdt.core.tests.builder.IncrementalTests)  Time elapsed: 0.61 s
test129316(org.eclipse.jdt.core.tests.builder.IncrementalTests)  Time elapsed: 0.24 s
testSecondaryType(org.eclipse.jdt.core.tests.builder.IncrementalTests)  Time elapsed: 0.224 s
testMissingType001(org.eclipse.jdt.core.tests.builder.IncrementalTests)  Time elapsed: 0.508 s
testMissingType002(org.eclipse.jdt.core.tests.builder.IncrementalTests)  Time elapsed: 0.561 s
testMissingType003(org.eclipse.jdt.core.tests.builder.IncrementalTests)  Time elapsed: 0.315 s
testBug334377(org.eclipse.jdt.core.tests.builder.IncrementalTests)  Time elapsed: 0.389 s
testBug364450(org.eclipse.jdt.core.tests.builder.IncrementalTests)  Time elapsed: 3.615 s
testRemovePackageInDependencyProject(org.eclipse.jdt.core.tests.builder.IncrementalTests)  Time elapsed: 0.487 s
testBug526376(org.eclipse.jdt.core.tests.builder.IncrementalTests)  Time elapsed: 0.271 s
test423122(org.eclipse.jdt.core.tests.builder.IncrementalTests18)  Time elapsed: 0.254 s
test423122a(org.eclipse.jdt.core.tests.builder.IncrementalTests18)  Time elapsed: 0.196 s
test427105(org.eclipse.jdt.core.tests.builder.IncrementalTests18)  Time elapsed: 0.263 s
test427105a(org.eclipse.jdt.core.tests.builder.IncrementalTests18)  Time elapsed: 0.335 s
test428071(org.eclipse.jdt.core.tests.builder.IncrementalTests18)  Time elapsed: 0.268 s
test430425(org.eclipse.jdt.core.tests.builder.IncrementalTests18)  Time elapsed: 0.11 s
test435544(org.eclipse.jdt.core.tests.builder.IncrementalTests18)  Time elapsed: 0.441 s
test445049(org.eclipse.jdt.core.tests.builder.IncrementalTests18)  Time elapsed: 0.263 s
testBug442452(org.eclipse.jdt.core.tests.builder.IncrementalTests18)  Time elapsed: 0.233 s
testBug442755(org.eclipse.jdt.core.tests.builder.IncrementalTests18)  Time elapsed: 0.307 s
testBug442755a(org.eclipse.jdt.core.tests.builder.IncrementalTests18)  Time elapsed: 0.099 s
testBug481276a(org.eclipse.jdt.core.tests.builder.IncrementalTests18)  Time elapsed: 0.361 s
testBug481276b(org.eclipse.jdt.core.tests.builder.IncrementalTests18)  Time elapsed: 0.302 s
testBug481276c(org.eclipse.jdt.core.tests.builder.IncrementalTests18)  Time elapsed: 0.405 s
testBug483744_remove(org.eclipse.jdt.core.tests.builder.IncrementalTests18)  Time elapsed: 0.327 s
testCompileOnlyDependent(org.eclipse.jdt.core.tests.builder.MultiProjectTests)  Time elapsed: 1.476 s
testCompileOnlyStructuralDependent(org.eclipse.jdt.core.tests.builder.MultiProjectTests)  Time elapsed: 2.114 s
testRemoveField(org.eclipse.jdt.core.tests.builder.MultiProjectTests)  Time elapsed: 1.964 s
testCompileOrder(org.eclipse.jdt.core.tests.builder.MultiProjectTests)  Time elapsed: 1.086 s
testCyclesCleared(org.eclipse.jdt.core.tests.builder.MultiProjectTests)  Time elapsed: 1.999 s
testCycle1(org.eclipse.jdt.core.tests.builder.MultiProjectTests)  Time elapsed: 2.454 s
testCycle2(org.eclipse.jdt.core.tests.builder.MultiProjectTests)  Time elapsed: 1.681 s
testCycle3(org.eclipse.jdt.core.tests.builder.MultiProjectTests)  Time elapsed: 4.339 s
testCycle4(org.eclipse.jdt.core.tests.builder.MultiProjectTests)  Time elapsed: 2.76 s
testCycle5(org.eclipse.jdt.core.tests.builder.MultiProjectTests)  Time elapsed: 2.717 s
testCycle6(org.eclipse.jdt.core.tests.builder.MultiProjectTests)  Time elapsed: 18.579 s
testCycle7(org.eclipse.jdt.core.tests.builder.MultiProjectTests)  Time elapsed: 1.748 s
testCycle8(org.eclipse.jdt.core.tests.builder.MultiProjectTests)  Time elapsed: 2.116 s
testExcludePartOfAnotherProject1(org.eclipse.jdt.core.tests.builder.MultiProjectTests)  Time elapsed: 1.214 s
testExcludePartOfAnotherProject2(org.eclipse.jdt.core.tests.builder.MultiProjectTests)  Time elapsed: 6.096 s
testExcludePartOfAnotherProject3(org.eclipse.jdt.core.tests.builder.MultiProjectTests)  Time elapsed: 4.007 s
testIncludePartOfAnotherProject1(org.eclipse.jdt.core.tests.builder.MultiProjectTests)  Time elapsed: 0.593 s
testIncludePartOfAnotherProject2(org.eclipse.jdt.core.tests.builder.MultiProjectTests)  Time elapsed: 2.074 s
testIncludePartOfAnotherProject3(org.eclipse.jdt.core.tests.builder.MultiProjectTests)  Time elapsed: 6.757 s
testIgnoreIfBetterNonAccessibleRule1(org.eclipse.jdt.core.tests.builder.MultiProjectTests)  Time elapsed: 2.848 s
testIgnoreIfBetterNonAccessibleRule2(org.eclipse.jdt.core.tests.builder.MultiProjectTests)  Time elapsed: 0.935 s
testMissingRequiredBinaries(org.eclipse.jdt.core.tests.builder.MultiProjectTests)  Time elapsed: 1.018 s
test100_class_folder_exported(org.eclipse.jdt.core.tests.builder.MultiProjectTests)  Time elapsed: 1.951 s
test101_class_folder_non_exported(org.eclipse.jdt.core.tests.builder.MultiProjectTests)  Time elapsed: 2.151 s
test102_missing_required_binaries(org.eclipse.jdt.core.tests.builder.MultiProjectTests)  Time elapsed: 1.086 s
test103_missing_required_binaries(org.eclipse.jdt.core.tests.builder.MultiProjectTests)  Time elapsed: 2.024 s
test104_missing_required_binaries(org.eclipse.jdt.core.tests.builder.MultiProjectTests)  Time elapsed: 3.164 s
test438923(org.eclipse.jdt.core.tests.builder.MultiProjectTests)  Time elapsed: 2.125 s
test461074(org.eclipse.jdt.core.tests.builder.MultiProjectTests)  Time elapsed: 4.644 s
test461074_error(org.eclipse.jdt.core.tests.builder.MultiProjectTests)  Time elapsed: 1.051 s
test0001(org.eclipse.jdt.core.tests.builder.MultiSourceFolderAndOutputFolderTests)  Time elapsed: 0.274 s
test0002(org.eclipse.jdt.core.tests.builder.MultiSourceFolderAndOutputFolderTests)  Time elapsed: 0.274 s
test0003(org.eclipse.jdt.core.tests.builder.MultiSourceFolderAndOutputFolderTests)  Time elapsed: 0.02 s
test0004(org.eclipse.jdt.core.tests.builder.MultiSourceFolderAndOutputFolderTests)  Time elapsed: 0.306 s
test0005(org.eclipse.jdt.core.tests.builder.MultiSourceFolderAndOutputFolderTests)  Time elapsed: 0.209 s
test0006(org.eclipse.jdt.core.tests.builder.MultiSourceFolderAndOutputFolderTests)  Time elapsed: 0.168 s
test0007(org.eclipse.jdt.core.tests.builder.MultiSourceFolderAndOutputFolderTests)  Time elapsed: 0.11 s
test0008(org.eclipse.jdt.core.tests.builder.MultiSourceFolderAndOutputFolderTests)  Time elapsed: 0.14 s
test0009(org.eclipse.jdt.core.tests.builder.MultiSourceFolderAndOutputFolderTests)  Time elapsed: 0.139 s
test0010(org.eclipse.jdt.core.tests.builder.MultiSourceFolderAndOutputFolderTests)  Time elapsed: 0.252 s
test0011(org.eclipse.jdt.core.tests.builder.MultiSourceFolderAndOutputFolderTests)  Time elapsed: 0.196 s
test0012(org.eclipse.jdt.core.tests.builder.MultiSourceFolderAndOutputFolderTests)  Time elapsed: 0.137 s
testChangeOutputFolder(org.eclipse.jdt.core.tests.builder.OutputFolderTests)  Time elapsed: 0.338 s
testDeleteOutputFolder(org.eclipse.jdt.core.tests.builder.OutputFolderTests)  Time elapsed: 0.194 s
testInvalidOutput(org.eclipse.jdt.core.tests.builder.OutputFolderTests)  Time elapsed: 2.302 s
testSimpleProject(org.eclipse.jdt.core.tests.builder.OutputFolderTests)  Time elapsed: 0.228 s
testProjectWithBin(org.eclipse.jdt.core.tests.builder.OutputFolderTests)  Time elapsed: 0.205 s
testProjectWithSrcBin(org.eclipse.jdt.core.tests.builder.OutputFolderTests)  Time elapsed: 0.16 s
testProjectWith2SrcBin(org.eclipse.jdt.core.tests.builder.OutputFolderTests)  Time elapsed: 0.304 s
testProjectWith2SrcAsBin(org.eclipse.jdt.core.tests.builder.OutputFolderTests)  Time elapsed: 0.163 s
testProjectWith2Src2Bin(org.eclipse.jdt.core.tests.builder.OutputFolderTests)  Time elapsed: 0.099 s
testProjectWith3Src2Bin(org.eclipse.jdt.core.tests.builder.OutputFolderTests)  Time elapsed: 0.117 s
test2ProjectWith1Bin(org.eclipse.jdt.core.tests.builder.OutputFolderTests)  Time elapsed: 0.299 s
testPackageProblem(org.eclipse.jdt.core.tests.builder.PackageTests)  Time elapsed: 0.2 s
testNoPackageProblem(org.eclipse.jdt.core.tests.builder.PackageTests)  Time elapsed: 0.167 s
test001(org.eclipse.jdt.core.tests.builder.PackageTests)  Time elapsed: 0.181 s
test002(org.eclipse.jdt.core.tests.builder.PackageTests)  Time elapsed: 0.237 s
testBoolean(org.eclipse.jdt.core.tests.builder.StaticFinalTests)  Time elapsed: 0.525 s
testByte(org.eclipse.jdt.core.tests.builder.StaticFinalTests)  Time elapsed: 0.716 s
testChar(org.eclipse.jdt.core.tests.builder.StaticFinalTests)  Time elapsed: 0.529 s
testDouble(org.eclipse.jdt.core.tests.builder.StaticFinalTests)  Time elapsed: 1.994 s
testFloat(org.eclipse.jdt.core.tests.builder.StaticFinalTests)  Time elapsed: 0.6 s
testInt(org.eclipse.jdt.core.tests.builder.StaticFinalTests)  Time elapsed: 0.614 s
testLong(org.eclipse.jdt.core.tests.builder.StaticFinalTests)  Time elapsed: 0.578 s
testShort(org.eclipse.jdt.core.tests.builder.StaticFinalTests)  Time elapsed: 0.554 s
testString(org.eclipse.jdt.core.tests.builder.StaticFinalTests)  Time elapsed: 0.54 s
test001(org.eclipse.jdt.core.tests.builder.GetResourcesTests)  Time elapsed: 0.232 s
test002(org.eclipse.jdt.core.tests.builder.GetResourcesTests)  Time elapsed: 0.17 s
test003(org.eclipse.jdt.core.tests.builder.GetResourcesTests)  Time elapsed: 0.151 s
test004(org.eclipse.jdt.core.tests.builder.GetResourcesTests)  Time elapsed: 0.711 s
test005(org.eclipse.jdt.core.tests.builder.GetResourcesTests)  Time elapsed: 0.218 s
test006(org.eclipse.jdt.core.tests.builder.GetResourcesTests)  Time elapsed: 0.3 s
test007(org.eclipse.jdt.core.tests.builder.GetResourcesTests)  Time elapsed: 0.181 s
test008(org.eclipse.jdt.core.tests.builder.GetResourcesTests)  Time elapsed: 0.18 s
test009(org.eclipse.jdt.core.tests.builder.GetResourcesTests)  Time elapsed: 0.095 s
test010(org.eclipse.jdt.core.tests.builder.GetResourcesTests)  Time elapsed: 0.196 s
test011(org.eclipse.jdt.core.tests.builder.GetResourcesTests)  Time elapsed: 0.168 s
test012(org.eclipse.jdt.core.tests.builder.GetResourcesTests)  Time elapsed: 0.299 s
test013(org.eclipse.jdt.core.tests.builder.GetResourcesTests)  Time elapsed: 0.313 s
test014(org.eclipse.jdt.core.tests.builder.GetResourcesTests)  Time elapsed: 0.159 s
test015(org.eclipse.jdt.core.tests.builder.GetResourcesTests)  Time elapsed: 0.241 s
test016(org.eclipse.jdt.core.tests.builder.GetResourcesTests)  Time elapsed: 0.003 s
testIncludes(org.eclipse.jdt.core.tests.builder.FriendDependencyTests)  Time elapsed: 0.002 s
testInternSimpleNames(org.eclipse.jdt.core.tests.builder.FriendDependencyTests)  Time elapsed: 0.003 s
testInternQualifiedNames(org.eclipse.jdt.core.tests.builder.FriendDependencyTests)  Time elapsed: 0.003 s
testGetReferences(org.eclipse.jdt.core.tests.builder.FriendDependencyTests)  Time elapsed: 0.003 s
testStringSetAdd(org.eclipse.jdt.core.tests.builder.FriendDependencyTests)  Time elapsed: 0.003 s
testStringSetclear(org.eclipse.jdt.core.tests.builder.FriendDependencyTests)  Time elapsed: 0.002 s
testStringSetNew(org.eclipse.jdt.core.tests.builder.FriendDependencyTests)  Time elapsed: 0.003 s
testStringSetElementSize(org.eclipse.jdt.core.tests.builder.FriendDependencyTests)  Time elapsed: 0.003 s
testSimpleLookupTableKeyTable(org.eclipse.jdt.core.tests.builder.FriendDependencyTests)  Time elapsed: 0.002 s
testSimpleLookupTableValueTable(org.eclipse.jdt.core.tests.builder.FriendDependencyTests)  Time elapsed: 0.002 s
testJavaModelManagerGetJavaModelManager(org.eclipse.jdt.core.tests.builder.FriendDependencyTests)  Time elapsed: 0.007 s
testJavaModelManagerGetLastBuiltState(org.eclipse.jdt.core.tests.builder.FriendDependencyTests)  Time elapsed: 0.003 s
testInternQualifiedNamesSorts_01(org.eclipse.jdt.core.tests.builder.ReferenceCollectionTest)  Time elapsed: 0.008 s
testInternQualifiedNamesSorts_02(org.eclipse.jdt.core.tests.builder.ReferenceCollectionTest)  Time elapsed: 0.003 s
testInternSimpleNamesSorts_01(org.eclipse.jdt.core.tests.builder.ReferenceCollectionTest)  Time elapsed: 0.003 s
testInternSimpleNamesSorts_02(org.eclipse.jdt.core.tests.builder.ReferenceCollectionTest)  Time elapsed: 0.003 s
testIncludesWithBinarySearch(org.eclipse.jdt.core.tests.builder.ReferenceCollectionTest)  Time elapsed: 0.003 s
testIncludesWithLinearSearch(org.eclipse.jdt.core.tests.builder.ReferenceCollectionTest)  Time elapsed: 0.002 s
testIncludes01(org.eclipse.jdt.core.tests.builder.ReferenceCollectionTest)  Time elapsed: 0.003 s
testIncludes02(org.eclipse.jdt.core.tests.builder.ReferenceCollectionTest)  Time elapsed: 0.003 s
testIncludes03(org.eclipse.jdt.core.tests.builder.ReferenceCollectionTest)  Time elapsed: 0.002 s
testIncludes04(org.eclipse.jdt.core.tests.builder.ReferenceCollectionTest)  Time elapsed: 0.003 s
testIncludesNot(org.eclipse.jdt.core.tests.builder.ReferenceCollectionTest)  Time elapsed: 0.002 s
testAddDependencies(org.eclipse.jdt.core.tests.builder.ReferenceCollectionTest)  Time elapsed: 0.003 s
testRegression01(org.eclipse.jdt.core.tests.builder.ReferenceCollectionTest)  Time elapsed: 0.003 s
testRegression02(org.eclipse.jdt.core.tests.builder.ReferenceCollectionTest)  Time elapsed: 0.002 s
testWriteAndReadState(org.eclipse.jdt.core.tests.builder.StateTest)  Time elapsed: 0.364 s
testWithProjectAsMainDependency(org.eclipse.jdt.core.tests.builder.TestAttributeBuilderTests)  Time elapsed: 0.17 s
testWithProjectAsTestDependency(org.eclipse.jdt.core.tests.builder.TestAttributeBuilderTests)  Time elapsed: 0.161 s
testWithProjectAsMainDependencyWithoutTestCode(org.eclipse.jdt.core.tests.builder.TestAttributeBuilderTests)  Time elapsed: 0.447 s
testWithProjectAsTestDependencyWithoutTestCode(org.eclipse.jdt.core.tests.builder.TestAttributeBuilderTests)  Time elapsed: 0.249 s
testIncrementalBuildMainChange(org.eclipse.jdt.core.tests.builder.TestAttributeBuilderTests)  Time elapsed: 0.49 s
testIncrementalBuildTestChange(org.eclipse.jdt.core.tests.builder.TestAttributeBuilderTests)  Time elapsed: 0.662 s
testIncrementalBuildTestOnlyProject(org.eclipse.jdt.core.tests.builder.TestAttributeBuilderTests)  Time elapsed: 0.277 s
testClasspathEntryTestAttributeChanges(org.eclipse.jdt.core.tests.builder.TestAttributeBuilderTests)  Time elapsed: 1.018 s
testExternalTestJarChanged(org.eclipse.jdt.core.tests.builder.TestAttributeBuilderTests)  Time elapsed: 2.264 s
testBug536868(org.eclipse.jdt.core.tests.builder.TestAttributeBuilderTests)  Time elapsed: 0.358 s
testBug530366(org.eclipse.jdt.core.tests.builder.Bug530366Test)  Time elapsed: 0.261 s
testBug531382(org.eclipse.jdt.core.tests.builder.Bug531382Test)  Time elapsed: 2.62 s
testBug549457(org.eclipse.jdt.core.tests.builder.Bug549457Test)  Time elapsed: 4.558 s
testLeaksOnCleanBuild(org.eclipse.jdt.core.tests.builder.LeakTestsBefore9)  Time elapsed: 0.142 s  <<< ERROR!
java.io.IOException: Cannot run program "lsof": error=2, No such file or directory
	at org.eclipse.jdt.core.tests.builder.LeakTestsBefore9.testLeaksOnCleanBuild(LeakTestsBefore9.java:36)
Caused by: java.io.IOException: error=2, No such file or directory
	at org.eclipse.jdt.core.tests.builder.LeakTestsBefore9.testLeaksOnCleanBuild(LeakTestsBefore9.java:36)

testLeaksOnFullBuild(org.eclipse.jdt.core.tests.builder.LeakTestsBefore9)  Time elapsed: 0.6 s  <<< ERROR!
java.io.IOException: Cannot run program "lsof": error=2, No such file or directory
	at org.eclipse.jdt.core.tests.builder.LeakTestsBefore9.testLeaksOnFullBuild(LeakTestsBefore9.java:41)
Caused by: java.io.IOException: error=2, No such file or directory
	at org.eclipse.jdt.core.tests.builder.LeakTestsBefore9.testLeaksOnFullBuild(LeakTestsBefore9.java:41)

testLeaksOnIncrementalBuild(org.eclipse.jdt.core.tests.builder.LeakTestsBefore9)  Time elapsed: 0.209 s  <<< ERROR!
java.io.IOException: Cannot run program "lsof": error=2, No such file or directory
	at org.eclipse.jdt.core.tests.builder.LeakTestsBefore9.testLeaksOnIncrementalBuild(LeakTestsBefore9.java:46)
Caused by: java.io.IOException: error=2, No such file or directory
	at org.eclipse.jdt.core.tests.builder.LeakTestsBefore9.testLeaksOnIncrementalBuild(LeakTestsBefore9.java:46)

testAnnotation(org.eclipse.jdt.core.tests.builder.Java50Tests)  Time elapsed: 0.271 s
testHierarchyCycle(org.eclipse.jdt.core.tests.builder.Java50Tests)  Time elapsed: 0.297 s
testHierarchyCycleInstanceof(org.eclipse.jdt.core.tests.builder.Java50Tests)  Time elapsed: 0.177 s
testMissingRequiredBinaries(org.eclipse.jdt.core.tests.builder.Java50Tests)  Time elapsed: 0.427 s
testParameterizedMemberType(org.eclipse.jdt.core.tests.builder.Java50Tests)  Time elapsed: 0.357 s
testParameterizedType1(org.eclipse.jdt.core.tests.builder.Java50Tests)  Time elapsed: 0.31 s
testParameterizedType2(org.eclipse.jdt.core.tests.builder.Java50Tests)  Time elapsed: 0.413 s
testHierarchyNonCycle(org.eclipse.jdt.core.tests.builder.Java50Tests)  Time elapsed: 0.16 s
testHierarchyNonCycle2(org.eclipse.jdt.core.tests.builder.Java50Tests)  Time elapsed: 0.214 s
test001(org.eclipse.jdt.core.tests.builder.PackageInfoTest)  Time elapsed: 0.39 s
test002(org.eclipse.jdt.core.tests.builder.PackageInfoTest)  Time elapsed: 0.947 s
test003(org.eclipse.jdt.core.tests.builder.PackageInfoTest)  Time elapsed: 1.32 s
test004(org.eclipse.jdt.core.tests.builder.PackageInfoTest)  Time elapsed: 0.352 s
test258145(org.eclipse.jdt.core.tests.builder.PackageInfoTest)  Time elapsed: 0.45 s
test323785(org.eclipse.jdt.core.tests.builder.PackageInfoTest)  Time elapsed: 0.189 s
test323785a(org.eclipse.jdt.core.tests.builder.PackageInfoTest)  Time elapsed: 0.368 s
testBug372012(org.eclipse.jdt.core.tests.builder.PackageInfoTest)  Time elapsed: 0.312 s
testBug372012a(org.eclipse.jdt.core.tests.builder.PackageInfoTest)  Time elapsed: 0.292 s
testBug372012b(org.eclipse.jdt.core.tests.builder.PackageInfoTest)  Time elapsed: 0.303 s
testBug372012c(org.eclipse.jdt.core.tests.builder.PackageInfoTest)  Time elapsed: 0.529 s
testBug367836(org.eclipse.jdt.core.tests.builder.PackageInfoTest)  Time elapsed: 0.909 s
testBug374063(org.eclipse.jdt.core.tests.builder.PackageInfoTest)  Time elapsed: 0.367 s
testBug382960(org.eclipse.jdt.core.tests.builder.PackageInfoTest)  Time elapsed: 0.24 s
testBug525469(org.eclipse.jdt.core.tests.builder.PackageInfoTest)  Time elapsed: 0.289 s
testBuildStarting(org.eclipse.jdt.core.tests.builder.ParticipantBuildTests)  Time elapsed: 0.186 s
testDefaultValue(org.eclipse.jdt.core.tests.builder.ParticipantBuildTests)  Time elapsed: 0.507 s
testParticipantProblems(org.eclipse.jdt.core.tests.builder.ParticipantBuildTests)  Time elapsed: 0.219 s
testProcessAnnotationDeclarations(org.eclipse.jdt.core.tests.builder.ParticipantBuildTests)  Time elapsed: 0.214 s
testProcessAnnotationQualifiedReferences(org.eclipse.jdt.core.tests.builder.ParticipantBuildTests)  Time elapsed: 0.211 s
testProcessAnnotationReferences(org.eclipse.jdt.core.tests.builder.ParticipantBuildTests)  Time elapsed: 0.17 s
testResolvedMethod(org.eclipse.jdt.core.tests.builder.ParticipantBuildTests)  Time elapsed: 0.277 s
test1001(org.eclipse.jdt.core.tests.builder.ParticipantBuildTests)  Time elapsed: 0.169 s
test1002(org.eclipse.jdt.core.tests.builder.ParticipantBuildTests)  Time elapsed: 0.154 s
testTypeAnnotationDependency(org.eclipse.jdt.core.tests.builder.AnnotationDependencyTests)  Time elapsed: 0.236 s
testFieldAnnotationDependency(org.eclipse.jdt.core.tests.builder.AnnotationDependencyTests)  Time elapsed: 0.388 s
testMethodAnnotationDependency(org.eclipse.jdt.core.tests.builder.AnnotationDependencyTests)  Time elapsed: 0.301 s
testInnerTypeAnnotationDependency(org.eclipse.jdt.core.tests.builder.AnnotationDependencyTests)  Time elapsed: 0.248 s
testUnrelatedTypeAnnotationDependency(org.eclipse.jdt.core.tests.builder.AnnotationDependencyTests)  Time elapsed: 0.271 s
testPackageInfoDependency(org.eclipse.jdt.core.tests.builder.AnnotationDependencyTests)  Time elapsed: 0.189 s
testTypeAnnotationDependency2(org.eclipse.jdt.core.tests.builder.AnnotationDependencyTests)  Time elapsed: 0.263 s
testTypeAnnotationDependency3(org.eclipse.jdt.core.tests.builder.AnnotationDependencyTests)  Time elapsed: 0.261 s
testTypeAnnotationDependency4(org.eclipse.jdt.core.tests.builder.AnnotationDependencyTests)  Time elapsed: 0.184 s
testTypeAnnotationDependency5(org.eclipse.jdt.core.tests.builder.AnnotationDependencyTests)  Time elapsed: 0.386 s
testTypeAnnotationDependency6(org.eclipse.jdt.core.tests.builder.AnnotationDependencyTests)  Time elapsed: 0.198 s
testTypeAnnotationDependency7(org.eclipse.jdt.core.tests.builder.AnnotationDependencyTests)  Time elapsed: 0.24 s
testTypeAnnotationDependency8(org.eclipse.jdt.core.tests.builder.AnnotationDependencyTests)  Time elapsed: 0.172 s
testTypeAnnotationDependency9(org.eclipse.jdt.core.tests.builder.AnnotationDependencyTests)  Time elapsed: 0.206 s
testTypeAnnotationDependency10(org.eclipse.jdt.core.tests.builder.AnnotationDependencyTests)  Time elapsed: 0.251 s
testTypeAnnotationDependency11(org.eclipse.jdt.core.tests.builder.AnnotationDependencyTests)  Time elapsed: 0.231 s
testTypeAnnotationDependency12(org.eclipse.jdt.core.tests.builder.AnnotationDependencyTests)  Time elapsed: 0.248 s
testTypeAnnotationDependency13(org.eclipse.jdt.core.tests.builder.AnnotationDependencyTests)  Time elapsed: 0.262 s
testTypeAnnotationDependency14(org.eclipse.jdt.core.tests.builder.AnnotationDependencyTests)  Time elapsed: 0.206 s
testTypeAnnotationDependency15(org.eclipse.jdt.core.tests.builder.AnnotationDependencyTests)  Time elapsed: 0.19 s
testTypeAnnotationDependency16(org.eclipse.jdt.core.tests.builder.AnnotationDependencyTests)  Time elapsed: 0.192 s
testTypeAnnotationDependency17(org.eclipse.jdt.core.tests.builder.AnnotationDependencyTests)  Time elapsed: 0.293 s
testTypeAnnotationDependency18(org.eclipse.jdt.core.tests.builder.AnnotationDependencyTests)  Time elapsed: 0.254 s
testTypeAnnotationDependency19(org.eclipse.jdt.core.tests.builder.AnnotationDependencyTests)  Time elapsed: 0.178 s
testTypeAnnotationDependency20(org.eclipse.jdt.core.tests.builder.AnnotationDependencyTests)  Time elapsed: 0.169 s
testTypeAnnotationDependency21(org.eclipse.jdt.core.tests.builder.AnnotationDependencyTests)  Time elapsed: 0.177 s
testTypeAnnotationDependency22(org.eclipse.jdt.core.tests.builder.AnnotationDependencyTests)  Time elapsed: 0.279 s
testTypeAnnotationDependency23(org.eclipse.jdt.core.tests.builder.AnnotationDependencyTests)  Time elapsed: 0.193 s
testTypeAnnotationDependency24(org.eclipse.jdt.core.tests.builder.AnnotationDependencyTests)  Time elapsed: 0.212 s
testTypeAnnotationDependency25(org.eclipse.jdt.core.tests.builder.AnnotationDependencyTests)  Time elapsed: 0.215 s
testTypeAnnotationDependency26(org.eclipse.jdt.core.tests.builder.AnnotationDependencyTests)  Time elapsed: 0.241 s
testTypeAnnotationDependency27(org.eclipse.jdt.core.tests.builder.AnnotationDependencyTests)  Time elapsed: 0.31 s
testParameterAnnotationDependency01(org.eclipse.jdt.core.tests.builder.AnnotationDependencyTests)  Time elapsed: 0.307 s
testReturnAnnotationDependency01(org.eclipse.jdt.core.tests.builder.AnnotationDependencyTests)  Time elapsed: 0.266 s
testReturnAnnotationDependency02(org.eclipse.jdt.core.tests.builder.AnnotationDependencyTests)  Time elapsed: 0.22 s
test411771a(org.eclipse.jdt.core.tests.builder.AnnotationDependencyTests)  Time elapsed: 0.222 s
test411771b(org.eclipse.jdt.core.tests.builder.AnnotationDependencyTests)  Time elapsed: 0.238 s
test411771c(org.eclipse.jdt.core.tests.builder.AnnotationDependencyTests)  Time elapsed: 0.231 s
testCompilerRegression(org.eclipse.jdt.core.tests.builder.Bug544921Test)  Time elapsed: 0.119 s
testBuildLargeFile_01(org.eclipse.jdt.core.tests.builder.Bug544921Test)  Time elapsed: 0.409 s
testBuildLargeFile_02(org.eclipse.jdt.core.tests.builder.Bug544921Test)  Time elapsed: 8.597 s
testBuildLargeFile_03(org.eclipse.jdt.core.tests.builder.Bug544921Test)  Time elapsed: 7.5 s
testBuildLargeFile_04(org.eclipse.jdt.core.tests.builder.Bug544921Test)  Time elapsed: 0.003 s
testBuildLargeFile_05(org.eclipse.jdt.core.tests.builder.Bug544921Test)  Time elapsed: 0.003 s
testBuildLargeFile_08(org.eclipse.jdt.core.tests.builder.Bug544921Test)  Time elapsed: 0.003 s
testBuildLargeFile_10(org.eclipse.jdt.core.tests.builder.Bug544921Test)  Time elapsed: 0.003 s
testLeaksOnCleanBuild(org.eclipse.jdt.core.tests.builder.LeakTestsAfter9)  Time elapsed: 0.226 s  <<< ERROR!
java.io.IOException: Cannot run program "lsof": error=2, No such file or directory
	at org.eclipse.jdt.core.tests.builder.LeakTestsAfter9.testLeaksOnCleanBuild(LeakTestsAfter9.java:36)
Caused by: java.io.IOException: error=2, No such file or directory
	at org.eclipse.jdt.core.tests.builder.LeakTestsAfter9.testLeaksOnCleanBuild(LeakTestsAfter9.java:36)

testLeaksOnFullBuild(org.eclipse.jdt.core.tests.builder.LeakTestsAfter9)  Time elapsed: 0.211 s  <<< ERROR!
java.io.IOException: Cannot run program "lsof": error=2, No such file or directory
	at org.eclipse.jdt.core.tests.builder.LeakTestsAfter9.testLeaksOnFullBuild(LeakTestsAfter9.java:41)
Caused by: java.io.IOException: error=2, No such file or directory
	at org.eclipse.jdt.core.tests.builder.LeakTestsAfter9.testLeaksOnFullBuild(LeakTestsAfter9.java:41)

testLeaksOnIncrementalBuild(org.eclipse.jdt.core.tests.builder.LeakTestsAfter9)  Time elapsed: 0.242 s  <<< ERROR!
java.io.IOException: Cannot run program "lsof": error=2, No such file or directory
	at org.eclipse.jdt.core.tests.builder.LeakTestsAfter9.testLeaksOnIncrementalBuild(LeakTestsAfter9.java:46)
Caused by: java.io.IOException: error=2, No such file or directory
	at org.eclipse.jdt.core.tests.builder.LeakTestsAfter9.testLeaksOnIncrementalBuild(LeakTestsAfter9.java:46)

testCompilerRegression(org.eclipse.jdt.core.tests.builder.Bug549646Test)  Time elapsed: 0.401 s

Results:

Errors: 
  LeakTestsAfter9>TestCase.runTest:957->testLeaksOnCleanBuild:36->AbstractLeakTest.testLeaksOnCleanBuild:63->AbstractLeakTest.internalTestUsedLibraryLeaks:85->AbstractLeakTest.assertNotLeaked:137->AbstractLeakTest.checkOpenDescriptors:162->AbstractLeakTest.getOpenDescriptors:176->AbstractLeakTest.readLsofLines:190 » IO
  LeakTestsAfter9>TestCase.runTest:957->testLeaksOnFullBuild:41->AbstractLeakTest.testLeaksOnFullBuild:70->AbstractLeakTest.internalTestUsedLibraryLeaks:89->AbstractLeakTest.assertNotLeaked:137->AbstractLeakTest.checkOpenDescriptors:162->AbstractLeakTest.getOpenDescriptors:176->AbstractLeakTest.readLsofLines:190 » IO
  LeakTestsAfter9>TestCase.runTest:957->testLeaksOnIncrementalBuild:46->AbstractLeakTest.testLeaksOnIncrementalBuild:56->AbstractLeakTest.internalTestUsedLibraryLeaks:95->AbstractLeakTest.assertNotLeaked:137->AbstractLeakTest.checkOpenDescriptors:162->AbstractLeakTest.getOpenDescriptors:176->AbstractLeakTest.readLsofLines:190 » IO
  LeakTestsBefore9>TestCase.runTest:957->testLeaksOnCleanBuild:36->AbstractLeakTest.testLeaksOnCleanBuild:63->AbstractLeakTest.internalTestUsedLibraryLeaks:85->AbstractLeakTest.assertNotLeaked:137->AbstractLeakTest.checkOpenDescriptors:162->AbstractLeakTest.getOpenDescriptors:176->AbstractLeakTest.readLsofLines:190 » IO
  LeakTestsBefore9>TestCase.runTest:957->testLeaksOnFullBuild:41->AbstractLeakTest.testLeaksOnFullBuild:70->AbstractLeakTest.internalTestUsedLibraryLeaks:89->AbstractLeakTest.assertNotLeaked:137->AbstractLeakTest.checkOpenDescriptors:162->AbstractLeakTest.getOpenDescriptors:176->AbstractLeakTest.readLsofLines:190 » IO
  LeakTestsBefore9>TestCase.runTest:957->testLeaksOnIncrementalBuild:46->AbstractLeakTest.testLeaksOnIncrementalBuild:56->AbstractLeakTest.internalTestUsedLibraryLeaks:95->AbstractLeakTest.assertNotLeaked:137->AbstractLeakTest.checkOpenDescriptors:162->AbstractLeakTest.getOpenDescriptors:176->AbstractLeakTest.readLsofLines:190 » IO

Tests run: 339, Failures: 0, Errors: 6, Skipped: 0

[INFO] ------------------------------------------------------------------------
[INFO] Reactor Summary:
[INFO] 
[INFO] eclipse.jdt.core 4.15.0-SNAPSHOT ................... SUCCESS [ 44.509 s]
[INFO] org.eclipse.jdt.annotation 2.2.400-SNAPSHOT ........ SUCCESS [ 14.109 s]
[INFO] org.eclipse.jdt.annotation 1.1.400-SNAPSHOT ........ SUCCESS [  6.075 s]
[INFO] org.eclipse.jdt.core 3.20.0-SNAPSHOT ............... SUCCESS [ 56.058 s]
[INFO] org.eclipse.jdt.compiler.tool 1.2.700-SNAPSHOT ..... SUCCESS [ 15.872 s]
[INFO] org.eclipse.jdt.compiler.apt 1.3.800-SNAPSHOT ...... SUCCESS [  9.574 s]
[INFO] org.eclipse.jdt.core.tests.compiler 3.12.1000-SNAPSHOT SUCCESS [10:11 min]
[INFO] org.eclipse.jdt.compiler.tool.tests 1.2.550-SNAPSHOT SUCCESS [ 15.523 s]
[INFO] org.eclipse.jdt.core.tests.builder 3.10.750-SNAPSHOT FAILURE [04:20 min]
[INFO] org.eclipse.jdt.compiler.apt.tests 1.1.1000-SNAPSHOT SKIPPED
[INFO] org.eclipse.jdt.core.tests.model 3.10.1000-SNAPSHOT  SKIPPED
[INFO] org.eclipse.jdt.core.tests.performance 3.10.650-SNAPSHOT SKIPPED
[INFO] org.eclipse.jdt.apt.core 3.6.550-SNAPSHOT .......... SKIPPED
[INFO] org.eclipse.jdt.apt.pluggable.core 1.2.400-SNAPSHOT  SKIPPED
[INFO] org.eclipse.jdt.apt.ui 3.6.300-SNAPSHOT ............ SKIPPED
[INFO] org.eclipse.jdt.apt.pluggable.tests 3.4.600-SNAPSHOT SKIPPED
[INFO] org.eclipse.jdt.apt.tests 3.4.550-SNAPSHOT ......... SKIPPED
[INFO] ------------------------------------------------------------------------
[INFO] BUILD FAILURE
[INFO] ------------------------------------------------------------------------
[INFO] Total time:  19:42 min
[INFO] Finished at: 2019-12-09T20:14:07Z
[INFO] ------------------------------------------------------------------------
[ERROR] Failed to execute goal org.eclipse.tycho:tycho-surefire-plugin:1.5.1:test (default-test) on project org.eclipse.jdt.core.tests.builder: There are test failures.
[ERROR] 
[ERROR] Please refer to /home/jenkins/agent/workspace/eclipse.jdt.core-SonarQube/org.eclipse.jdt.core.tests.builder/target/surefire-reports for the individual test results.
[ERROR] -> [Help 1]
[ERROR] 
[ERROR] To see the full stack trace of the errors, re-run Maven with the -e switch.
[ERROR] Re-run Maven using the -X switch to enable full debug logging.
[ERROR] 
[ERROR] For more information about the errors and possible solutions, please read the following articles:
[ERROR] [Help 1] http://cwiki.apache.org/confluence/display/MAVEN/MojoFailureException
[ERROR] 
[ERROR] After correcting the problems, you can resume the build with the command
[ERROR]   mvn <goals> -rf :org.eclipse.jdt.core.tests.builder
Build step 'Invoke top-level Maven targets' marked build as failure
Terminating xvnc.
Skipping sonar analysis due to bad build status FAILURE
Archiving artifacts
Finished: FAILURE