FailedConsole Output

Skipping 5,616 KB.. Full Log
jdt.core.tests.compiler.parser.TypeAnnotationSyntaxTest)  Time elapsed: 0.001 s
test0052 - 11(org.eclipse.jdt.core.tests.compiler.parser.TypeAnnotationSyntaxTest)  Time elapsed: 0.001 s
test0053 - 11(org.eclipse.jdt.core.tests.compiler.parser.TypeAnnotationSyntaxTest)  Time elapsed: 0.001 s
test0054 - 11(org.eclipse.jdt.core.tests.compiler.parser.TypeAnnotationSyntaxTest)  Time elapsed: 0.006 s
test0055 - 11(org.eclipse.jdt.core.tests.compiler.parser.TypeAnnotationSyntaxTest)  Time elapsed: 0.001 s
test0056 - 11(org.eclipse.jdt.core.tests.compiler.parser.TypeAnnotationSyntaxTest)  Time elapsed: 0.001 s
test0057 - 11(org.eclipse.jdt.core.tests.compiler.parser.TypeAnnotationSyntaxTest)  Time elapsed: 0.001 s
test0058 - 11(org.eclipse.jdt.core.tests.compiler.parser.TypeAnnotationSyntaxTest)  Time elapsed: 0.001 s
test0059 - 11(org.eclipse.jdt.core.tests.compiler.parser.TypeAnnotationSyntaxTest)  Time elapsed: 0.001 s
test0060 - 11(org.eclipse.jdt.core.tests.compiler.parser.TypeAnnotationSyntaxTest)  Time elapsed: 0.004 s
test0061 - 11(org.eclipse.jdt.core.tests.compiler.parser.TypeAnnotationSyntaxTest)  Time elapsed: 0.003 s
test0062 - 11(org.eclipse.jdt.core.tests.compiler.parser.TypeAnnotationSyntaxTest)  Time elapsed: 0.002 s
test0063 - 11(org.eclipse.jdt.core.tests.compiler.parser.TypeAnnotationSyntaxTest)  Time elapsed: 0.003 s
test0064 - 11(org.eclipse.jdt.core.tests.compiler.parser.TypeAnnotationSyntaxTest)  Time elapsed: 0.001 s
test0066 - 11(org.eclipse.jdt.core.tests.compiler.parser.TypeAnnotationSyntaxTest)  Time elapsed: 0.001 s
test0067 - 11(org.eclipse.jdt.core.tests.compiler.parser.TypeAnnotationSyntaxTest)  Time elapsed: 0.001 s
test0068 - 11(org.eclipse.jdt.core.tests.compiler.parser.TypeAnnotationSyntaxTest)  Time elapsed: 0.001 s
test0069 - 11(org.eclipse.jdt.core.tests.compiler.parser.TypeAnnotationSyntaxTest)  Time elapsed: 0.001 s
test007 - 11(org.eclipse.jdt.core.tests.compiler.parser.TypeAnnotationSyntaxTest)  Time elapsed: 0.001 s
test0070 - 11(org.eclipse.jdt.core.tests.compiler.parser.TypeAnnotationSyntaxTest)  Time elapsed: 0.001 s
test0071 - 11(org.eclipse.jdt.core.tests.compiler.parser.TypeAnnotationSyntaxTest)  Time elapsed: 0.001 s
test0072 - 11(org.eclipse.jdt.core.tests.compiler.parser.TypeAnnotationSyntaxTest)  Time elapsed: 0.001 s
test0073 - 11(org.eclipse.jdt.core.tests.compiler.parser.TypeAnnotationSyntaxTest)  Time elapsed: 0.001 s
test0074 - 11(org.eclipse.jdt.core.tests.compiler.parser.TypeAnnotationSyntaxTest)  Time elapsed: 0.002 s
test0075 - 11(org.eclipse.jdt.core.tests.compiler.parser.TypeAnnotationSyntaxTest)  Time elapsed: 0.001 s
test0076 - 11(org.eclipse.jdt.core.tests.compiler.parser.TypeAnnotationSyntaxTest)  Time elapsed: 0 s
test0077 - 11(org.eclipse.jdt.core.tests.compiler.parser.TypeAnnotationSyntaxTest)  Time elapsed: 0.001 s
test0078 - 11(org.eclipse.jdt.core.tests.compiler.parser.TypeAnnotationSyntaxTest)  Time elapsed: 0.001 s
test0079 - 11(org.eclipse.jdt.core.tests.compiler.parser.TypeAnnotationSyntaxTest)  Time elapsed: 0.001 s
test0080 - 11(org.eclipse.jdt.core.tests.compiler.parser.TypeAnnotationSyntaxTest)  Time elapsed: 0.001 s
test0081 - 11(org.eclipse.jdt.core.tests.compiler.parser.TypeAnnotationSyntaxTest)  Time elapsed: 0.003 s
test0082 - 11(org.eclipse.jdt.core.tests.compiler.parser.TypeAnnotationSyntaxTest)  Time elapsed: 0.001 s
test0083 - 11(org.eclipse.jdt.core.tests.compiler.parser.TypeAnnotationSyntaxTest)  Time elapsed: 0.001 s
test0084 - 11(org.eclipse.jdt.core.tests.compiler.parser.TypeAnnotationSyntaxTest)  Time elapsed: 0.002 s
test0085 - 11(org.eclipse.jdt.core.tests.compiler.parser.TypeAnnotationSyntaxTest)  Time elapsed: 0.002 s
test0086 - 11(org.eclipse.jdt.core.tests.compiler.parser.TypeAnnotationSyntaxTest)  Time elapsed: 0.001 s
test0087 - 11(org.eclipse.jdt.core.tests.compiler.parser.TypeAnnotationSyntaxTest)  Time elapsed: 0.001 s
test0088 - 11(org.eclipse.jdt.core.tests.compiler.parser.TypeAnnotationSyntaxTest)  Time elapsed: 0.001 s
test0089 - 11(org.eclipse.jdt.core.tests.compiler.parser.TypeAnnotationSyntaxTest)  Time elapsed: 0.001 s
test0090 - 11(org.eclipse.jdt.core.tests.compiler.parser.TypeAnnotationSyntaxTest)  Time elapsed: 0.002 s
test0091 - 11(org.eclipse.jdt.core.tests.compiler.parser.TypeAnnotationSyntaxTest)  Time elapsed: 0.001 s
test0092 - 11(org.eclipse.jdt.core.tests.compiler.parser.TypeAnnotationSyntaxTest)  Time elapsed: 0.001 s
test0093 - 11(org.eclipse.jdt.core.tests.compiler.parser.TypeAnnotationSyntaxTest)  Time elapsed: 0.001 s
test0094 - 11(org.eclipse.jdt.core.tests.compiler.parser.TypeAnnotationSyntaxTest)  Time elapsed: 0.001 s
test0095 - 11(org.eclipse.jdt.core.tests.compiler.parser.TypeAnnotationSyntaxTest)  Time elapsed: 0.001 s
test0096 - 11(org.eclipse.jdt.core.tests.compiler.parser.TypeAnnotationSyntaxTest)  Time elapsed: 0.001 s
test0097 - 11(org.eclipse.jdt.core.tests.compiler.parser.TypeAnnotationSyntaxTest)  Time elapsed: 0.002 s
test0098 - 11(org.eclipse.jdt.core.tests.compiler.parser.TypeAnnotationSyntaxTest)  Time elapsed: 0.001 s
test0099 - 11(org.eclipse.jdt.core.tests.compiler.parser.TypeAnnotationSyntaxTest)  Time elapsed: 0.002 s
test0100 - 11(org.eclipse.jdt.core.tests.compiler.parser.TypeAnnotationSyntaxTest)  Time elapsed: 0.001 s
test0101 - 11(org.eclipse.jdt.core.tests.compiler.parser.TypeAnnotationSyntaxTest)  Time elapsed: 0.002 s
test0102 - 11(org.eclipse.jdt.core.tests.compiler.parser.TypeAnnotationSyntaxTest)  Time elapsed: 0.002 s
test0103 - 11(org.eclipse.jdt.core.tests.compiler.parser.TypeAnnotationSyntaxTest)  Time elapsed: 0.001 s
test0104 - 11(org.eclipse.jdt.core.tests.compiler.parser.TypeAnnotationSyntaxTest)  Time elapsed: 0.002 s
test0105 - 11(org.eclipse.jdt.core.tests.compiler.parser.TypeAnnotationSyntaxTest)  Time elapsed: 0.002 s
test0106 - 11(org.eclipse.jdt.core.tests.compiler.parser.TypeAnnotationSyntaxTest)  Time elapsed: 0.001 s
test0107 - 11(org.eclipse.jdt.core.tests.compiler.parser.TypeAnnotationSyntaxTest)  Time elapsed: 0.002 s
test0108 - 11(org.eclipse.jdt.core.tests.compiler.parser.TypeAnnotationSyntaxTest)  Time elapsed: 0.001 s
test0109 - 11(org.eclipse.jdt.core.tests.compiler.parser.TypeAnnotationSyntaxTest)  Time elapsed: 0.001 s
test0110 - 11(org.eclipse.jdt.core.tests.compiler.parser.TypeAnnotationSyntaxTest)  Time elapsed: 0 s
test0111 - 11(org.eclipse.jdt.core.tests.compiler.parser.TypeAnnotationSyntaxTest)  Time elapsed: 0 s
test0112 - 11(org.eclipse.jdt.core.tests.compiler.parser.TypeAnnotationSyntaxTest)  Time elapsed: 0.001 s
test0113 - 11(org.eclipse.jdt.core.tests.compiler.parser.TypeAnnotationSyntaxTest)  Time elapsed: 0.001 s
test0114 - 11(org.eclipse.jdt.core.tests.compiler.parser.TypeAnnotationSyntaxTest)  Time elapsed: 0.001 s
test0115 - 11(org.eclipse.jdt.core.tests.compiler.parser.TypeAnnotationSyntaxTest)  Time elapsed: 0.002 s
test0116 - 11(org.eclipse.jdt.core.tests.compiler.parser.TypeAnnotationSyntaxTest)  Time elapsed: 0.001 s
test0117 - 11(org.eclipse.jdt.core.tests.compiler.parser.TypeAnnotationSyntaxTest)  Time elapsed: 0.002 s
test0118 - 11(org.eclipse.jdt.core.tests.compiler.parser.TypeAnnotationSyntaxTest)  Time elapsed: 0.002 s
test0119 - 11(org.eclipse.jdt.core.tests.compiler.parser.TypeAnnotationSyntaxTest)  Time elapsed: 0.002 s
test0120 - 11(org.eclipse.jdt.core.tests.compiler.parser.TypeAnnotationSyntaxTest)  Time elapsed: 0.002 s
test0121 - 11(org.eclipse.jdt.core.tests.compiler.parser.TypeAnnotationSyntaxTest)  Time elapsed: 0.001 s
test0122 - 11(org.eclipse.jdt.core.tests.compiler.parser.TypeAnnotationSyntaxTest)  Time elapsed: 0.009 s
test0123 - 11(org.eclipse.jdt.core.tests.compiler.parser.TypeAnnotationSyntaxTest)  Time elapsed: 0.002 s
test0125 - 11(org.eclipse.jdt.core.tests.compiler.parser.TypeAnnotationSyntaxTest)  Time elapsed: 0 s
test0126 - 11(org.eclipse.jdt.core.tests.compiler.parser.TypeAnnotationSyntaxTest)  Time elapsed: 0 s
test0127 - 11(org.eclipse.jdt.core.tests.compiler.parser.TypeAnnotationSyntaxTest)  Time elapsed: 0.001 s
test0128 - 11(org.eclipse.jdt.core.tests.compiler.parser.TypeAnnotationSyntaxTest)  Time elapsed: 0.001 s
test0129 - 11(org.eclipse.jdt.core.tests.compiler.parser.TypeAnnotationSyntaxTest)  Time elapsed: 0.001 s
test0130 - 11(org.eclipse.jdt.core.tests.compiler.parser.TypeAnnotationSyntaxTest)  Time elapsed: 0.001 s
test0131 - 11(org.eclipse.jdt.core.tests.compiler.parser.TypeAnnotationSyntaxTest)  Time elapsed: 0 s
test0132 - 11(org.eclipse.jdt.core.tests.compiler.parser.TypeAnnotationSyntaxTest)  Time elapsed: 0.001 s
test0133 - 11(org.eclipse.jdt.core.tests.compiler.parser.TypeAnnotationSyntaxTest)  Time elapsed: 0 s
test0134 - 11(org.eclipse.jdt.core.tests.compiler.parser.TypeAnnotationSyntaxTest)  Time elapsed: 0 s
test0135 - 11(org.eclipse.jdt.core.tests.compiler.parser.TypeAnnotationSyntaxTest)  Time elapsed: 0 s
test0136 - 11(org.eclipse.jdt.core.tests.compiler.parser.TypeAnnotationSyntaxTest)  Time elapsed: 0 s
test0137 - 11(org.eclipse.jdt.core.tests.compiler.parser.TypeAnnotationSyntaxTest)  Time elapsed: 0.001 s
test0138 - 11(org.eclipse.jdt.core.tests.compiler.parser.TypeAnnotationSyntaxTest)  Time elapsed: 0 s
test0139 - 11(org.eclipse.jdt.core.tests.compiler.parser.TypeAnnotationSyntaxTest)  Time elapsed: 0 s
test0001 - 11(org.eclipse.jdt.core.tests.compiler.parser.CompletionParserTest18)  Time elapsed: 0.001 s
test0002 - 11(org.eclipse.jdt.core.tests.compiler.parser.CompletionParserTest18)  Time elapsed: 0 s
test0003 - 11(org.eclipse.jdt.core.tests.compiler.parser.CompletionParserTest18)  Time elapsed: 0.001 s
test0004 - 11(org.eclipse.jdt.core.tests.compiler.parser.CompletionParserTest18)  Time elapsed: 0 s
test0005 - 11(org.eclipse.jdt.core.tests.compiler.parser.CompletionParserTest18)  Time elapsed: 0.001 s
test0006 - 11(org.eclipse.jdt.core.tests.compiler.parser.CompletionParserTest18)  Time elapsed: 0.001 s
test0007 - 11(org.eclipse.jdt.core.tests.compiler.parser.CompletionParserTest18)  Time elapsed: 0 s
test0010 - 11(org.eclipse.jdt.core.tests.compiler.parser.CompletionParserTest18)  Time elapsed: 0 s
test402081 - 11(org.eclipse.jdt.core.tests.compiler.parser.CompletionParserTest18)  Time elapsed: 0.001 s
test405126 - 11(org.eclipse.jdt.core.tests.compiler.parser.CompletionParserTest18)  Time elapsed: 0 s
test417935 - 11(org.eclipse.jdt.core.tests.compiler.parser.CompletionParserTest18)  Time elapsed: 0 s
test422468 - 11(org.eclipse.jdt.core.tests.compiler.parser.CompletionParserTest18)  Time elapsed: 0.001 s
test424080 - 11(org.eclipse.jdt.core.tests.compiler.parser.CompletionParserTest18)  Time elapsed: 0.001 s
test425084 - 11(org.eclipse.jdt.core.tests.compiler.parser.CompletionParserTest18)  Time elapsed: 0 s
test425084b - 11(org.eclipse.jdt.core.tests.compiler.parser.CompletionParserTest18)  Time elapsed: 0.001 s
test427117 - 11(org.eclipse.jdt.core.tests.compiler.parser.CompletionParserTest18)  Time elapsed: 0 s
test427255 - 11(org.eclipse.jdt.core.tests.compiler.parser.CompletionParserTest18)  Time elapsed: 0 s
test427322 - 11(org.eclipse.jdt.core.tests.compiler.parser.CompletionParserTest18)  Time elapsed: 0.001 s
test427322a - 11(org.eclipse.jdt.core.tests.compiler.parser.CompletionParserTest18)  Time elapsed: 0 s
test427463 - 11(org.eclipse.jdt.core.tests.compiler.parser.CompletionParserTest18)  Time elapsed: 0.001 s
test427532 - 11(org.eclipse.jdt.core.tests.compiler.parser.CompletionParserTest18)  Time elapsed: 0 s
test428735 - 11(org.eclipse.jdt.core.tests.compiler.parser.CompletionParserTest18)  Time elapsed: 0 s
test428735a - 11(org.eclipse.jdt.core.tests.compiler.parser.CompletionParserTest18)  Time elapsed: 0.001 s
test428735b - 11(org.eclipse.jdt.core.tests.compiler.parser.CompletionParserTest18)  Time elapsed: 0 s
test428735c - 11(org.eclipse.jdt.core.tests.compiler.parser.CompletionParserTest18)  Time elapsed: 0.001 s
test428735d - 11(org.eclipse.jdt.core.tests.compiler.parser.CompletionParserTest18)  Time elapsed: 0.001 s
test428735e - 11(org.eclipse.jdt.core.tests.compiler.parser.CompletionParserTest18)  Time elapsed: 0 s
test428735f - 11(org.eclipse.jdt.core.tests.compiler.parser.CompletionParserTest18)  Time elapsed: 0 s
test428735g - 11(org.eclipse.jdt.core.tests.compiler.parser.CompletionParserTest18)  Time elapsed: 0.001 s
test428735h - 11(org.eclipse.jdt.core.tests.compiler.parser.CompletionParserTest18)  Time elapsed: 0.001 s
test430656 - 11(org.eclipse.jdt.core.tests.compiler.parser.CompletionParserTest18)  Time elapsed: 0 s
test430667 - 11(org.eclipse.jdt.core.tests.compiler.parser.CompletionParserTest18)  Time elapsed: 0.001 s
test430667a - 11(org.eclipse.jdt.core.tests.compiler.parser.CompletionParserTest18)  Time elapsed: 0.001 s
test430667b - 11(org.eclipse.jdt.core.tests.compiler.parser.CompletionParserTest18)  Time elapsed: 0 s
test430667c - 11(org.eclipse.jdt.core.tests.compiler.parser.CompletionParserTest18)  Time elapsed: 0 s
test430667d - 11(org.eclipse.jdt.core.tests.compiler.parser.CompletionParserTest18)  Time elapsed: 0.001 s
test435219 - 11(org.eclipse.jdt.core.tests.compiler.parser.CompletionParserTest18)  Time elapsed: 0 s
test435682 - 11(org.eclipse.jdt.core.tests.compiler.parser.CompletionParserTest18)  Time elapsed: 0.001 s
test438952 - 11(org.eclipse.jdt.core.tests.compiler.parser.CompletionParserTest18)  Time elapsed: 0 s
test446765 - 11(org.eclipse.jdt.core.tests.compiler.parser.CompletionParserTest18)  Time elapsed: 0.001 s
test473008 - 11(org.eclipse.jdt.core.tests.compiler.parser.CompletionParserTest18)  Time elapsed: 0.001 s
testBrokenMethodCall - 11(org.eclipse.jdt.core.tests.compiler.parser.CompletionParserTest18)  Time elapsed: 0 s
testCompletionLocation - 11(org.eclipse.jdt.core.tests.compiler.parser.CompletionParserTest18)  Time elapsed: 0.001 s
testElidedCompletion - 11(org.eclipse.jdt.core.tests.compiler.parser.CompletionParserTest18)  Time elapsed: 0 s
testElidedCompletion2 - 11(org.eclipse.jdt.core.tests.compiler.parser.CompletionParserTest18)  Time elapsed: 0.001 s
testLocalsPromotion - 11(org.eclipse.jdt.core.tests.compiler.parser.CompletionParserTest18)  Time elapsed: 0 s
testUnspecifiedReference - 11(org.eclipse.jdt.core.tests.compiler.parser.CompletionParserTest18)  Time elapsed: 0.001 s
test424110 - 11(org.eclipse.jdt.core.tests.compiler.parser.SelectionParserTest18)  Time elapsed: 0 s
test424110a - 11(org.eclipse.jdt.core.tests.compiler.parser.SelectionParserTest18)  Time elapsed: 0 s
test430572 - 11(org.eclipse.jdt.core.tests.compiler.parser.SelectionParserTest18)  Time elapsed: 0.001 s
test476693 - 11(org.eclipse.jdt.core.tests.compiler.parser.SelectionParserTest18)  Time elapsed: 0 s
test495912 - 11(org.eclipse.jdt.core.tests.compiler.parser.SelectionParserTest18)  Time elapsed: 0.001 s
test495912a - 11(org.eclipse.jdt.core.tests.compiler.parser.SelectionParserTest18)  Time elapsed: 0.001 s
test495912b - 11(org.eclipse.jdt.core.tests.compiler.parser.SelectionParserTest18)  Time elapsed: 0.001 s
test510339_001_since_9 - 11(org.eclipse.jdt.core.tests.compiler.parser.SelectionParserTest9)  Time elapsed: 0 s
test510339_002_since_9 - 11(org.eclipse.jdt.core.tests.compiler.parser.SelectionParserTest9)  Time elapsed: 0 s
test510339_003_since_9 - 11(org.eclipse.jdt.core.tests.compiler.parser.SelectionParserTest9)  Time elapsed: 0.001 s
test510339_004_since_9 - 11(org.eclipse.jdt.core.tests.compiler.parser.SelectionParserTest9)  Time elapsed: 0 s
test510339_005_since_9 - 11(org.eclipse.jdt.core.tests.compiler.parser.SelectionParserTest9)  Time elapsed: 0 s
test510339_006_since_9 - 11(org.eclipse.jdt.core.tests.compiler.parser.SelectionParserTest9)  Time elapsed: 0 s
test510339_007_since_9 - 11(org.eclipse.jdt.core.tests.compiler.parser.SelectionParserTest9)  Time elapsed: 0 s
test510339_008_since_9 - 11(org.eclipse.jdt.core.tests.compiler.parser.SelectionParserTest9)  Time elapsed: 0.001 s
test510339_009_since_9 - 11(org.eclipse.jdt.core.tests.compiler.parser.SelectionParserTest9)  Time elapsed: 0 s
test510339_010_since_9 - 11(org.eclipse.jdt.core.tests.compiler.parser.SelectionParserTest9)  Time elapsed: 0 s
test510339_011_since_9 - 11(org.eclipse.jdt.core.tests.compiler.parser.SelectionParserTest9)  Time elapsed: 0 s
test001 - 11(org.eclipse.jdt.core.tests.compiler.parser.SelectionParserTest10)  Time elapsed: 0 s
test002 - 11(org.eclipse.jdt.core.tests.compiler.parser.SelectionParserTest10)  Time elapsed: 0.001 s
test0001 - 11(org.eclipse.jdt.core.tests.compiler.parser.ModuleDeclarationSyntaxTest)  Time elapsed: 0 s
test0002 - 11(org.eclipse.jdt.core.tests.compiler.parser.ModuleDeclarationSyntaxTest)  Time elapsed: 0 s
test0003 - 11(org.eclipse.jdt.core.tests.compiler.parser.ModuleDeclarationSyntaxTest)  Time elapsed: 0 s
test0004 - 11(org.eclipse.jdt.core.tests.compiler.parser.ModuleDeclarationSyntaxTest)  Time elapsed: 0 s
test0005 - 11(org.eclipse.jdt.core.tests.compiler.parser.ModuleDeclarationSyntaxTest)  Time elapsed: 0.001 s
test0006 - 11(org.eclipse.jdt.core.tests.compiler.parser.ModuleDeclarationSyntaxTest)  Time elapsed: 0 s
test0007 - 11(org.eclipse.jdt.core.tests.compiler.parser.ModuleDeclarationSyntaxTest)  Time elapsed: 0.002 s
test0008 - 11(org.eclipse.jdt.core.tests.compiler.parser.ModuleDeclarationSyntaxTest)  Time elapsed: 0.001 s
test0009 - 11(org.eclipse.jdt.core.tests.compiler.parser.ModuleDeclarationSyntaxTest)  Time elapsed: 0 s
test0010 - 11(org.eclipse.jdt.core.tests.compiler.parser.ModuleDeclarationSyntaxTest)  Time elapsed: 0.001 s
test0011 - 11(org.eclipse.jdt.core.tests.compiler.parser.ModuleDeclarationSyntaxTest)  Time elapsed: 0 s
test0012 - 11(org.eclipse.jdt.core.tests.compiler.parser.ModuleDeclarationSyntaxTest)  Time elapsed: 0.001 s
test0013 - 11(org.eclipse.jdt.core.tests.compiler.parser.ModuleDeclarationSyntaxTest)  Time elapsed: 0 s
test0014 - 11(org.eclipse.jdt.core.tests.compiler.parser.ModuleDeclarationSyntaxTest)  Time elapsed: 0 s
test0015 - 11(org.eclipse.jdt.core.tests.compiler.parser.ModuleDeclarationSyntaxTest)  Time elapsed: 0 s
test0016 - 11(org.eclipse.jdt.core.tests.compiler.parser.ModuleDeclarationSyntaxTest)  Time elapsed: 0.001 s
test0017 - 11(org.eclipse.jdt.core.tests.compiler.parser.ModuleDeclarationSyntaxTest)  Time elapsed: 0 s
test0018 - 11(org.eclipse.jdt.core.tests.compiler.parser.ModuleDeclarationSyntaxTest)  Time elapsed: 0 s
test0019 - 11(org.eclipse.jdt.core.tests.compiler.parser.ModuleDeclarationSyntaxTest)  Time elapsed: 0 s
test0020 - 11(org.eclipse.jdt.core.tests.compiler.parser.ModuleDeclarationSyntaxTest)  Time elapsed: 0 s
test0021 - 11(org.eclipse.jdt.core.tests.compiler.parser.ModuleDeclarationSyntaxTest)  Time elapsed: 0 s
test0022 - 11(org.eclipse.jdt.core.tests.compiler.parser.ModuleDeclarationSyntaxTest)  Time elapsed: 0 s
test0023 - 11(org.eclipse.jdt.core.tests.compiler.parser.ModuleDeclarationSyntaxTest)  Time elapsed: 0 s
test0024 - 11(org.eclipse.jdt.core.tests.compiler.parser.ModuleDeclarationSyntaxTest)  Time elapsed: 0 s
test0025 - 11(org.eclipse.jdt.core.tests.compiler.parser.ModuleDeclarationSyntaxTest)  Time elapsed: 0 s
test0026 - 11(org.eclipse.jdt.core.tests.compiler.parser.ModuleDeclarationSyntaxTest)  Time elapsed: 0 s
test0027 - 11(org.eclipse.jdt.core.tests.compiler.parser.ModuleDeclarationSyntaxTest)  Time elapsed: 0 s
testBug518626 - 11(org.eclipse.jdt.core.tests.compiler.parser.ModuleDeclarationSyntaxTest)  Time elapsed: 0.001 s
testbug488541 - 11(org.eclipse.jdt.core.tests.compiler.parser.ModuleDeclarationSyntaxTest)  Time elapsed: 0 s
testbug488541a - 11(org.eclipse.jdt.core.tests.compiler.parser.ModuleDeclarationSyntaxTest)  Time elapsed: 0 s
testbug488541b - 11(org.eclipse.jdt.core.tests.compiler.parser.ModuleDeclarationSyntaxTest)  Time elapsed: 0 s
test0001_class_var_warning - 11(org.eclipse.jdt.core.tests.compiler.regression.JEP286ReservedWordTest)  Time elapsed: 0.002 s
test0002_interface_var_warning - 11(org.eclipse.jdt.core.tests.compiler.regression.JEP286ReservedWordTest)  Time elapsed: 0.001 s
testBug530920 - 11(org.eclipse.jdt.core.tests.compiler.regression.JEP286ReservedWordTest)  Time elapsed: 0.001 s
testBug530920a - 11(org.eclipse.jdt.core.tests.compiler.regression.JEP286ReservedWordTest)  Time elapsed: 0.001 s

Results:

Tests run: 40803, Failures: 0, Errors: 0, Skipped: 0

[INFO] All tests passed!
[INFO] 
[INFO] --- tycho-p2-extras-plugin:1.5.0-SNAPSHOT:compare-version-with-baselines (compare-attached-artifacts-with-release) @ org.eclipse.jdt.core.tests.compiler ---
[INFO] Skipped
[INFO] 
[INFO] --------< org.eclipse.jdt:org.eclipse.jdt.compiler.tool.tests >---------
[INFO] Building org.eclipse.jdt.compiler.tool.tests 1.2.550-SNAPSHOT     [8/17]
[INFO] ------------------------[ eclipse-test-plugin ]-------------------------
[INFO] 
[INFO] --- maven-clean-plugin:3.1.0:clean (default-clean) @ org.eclipse.jdt.compiler.tool.tests ---
[INFO] 
[INFO] --- tycho-packaging-plugin:1.5.0-SNAPSHOT:build-qualifier (default-build-qualifier) @ org.eclipse.jdt.compiler.tool.tests ---
[INFO] The project's OSGi version is 1.2.550.v20190919-0948
[INFO] 
[INFO] --- tycho-packaging-plugin:1.5.0-SNAPSHOT:validate-id (default-validate-id) @ org.eclipse.jdt.compiler.tool.tests ---
[INFO] 
[INFO] --- tycho-packaging-plugin:1.5.0-SNAPSHOT:validate-version (default-validate-version) @ org.eclipse.jdt.compiler.tool.tests ---
[INFO] 
[INFO] --- maven-resources-plugin:3.1.0:copy-resources (saveproperties) @ org.eclipse.jdt.compiler.tool.tests ---
[INFO] Using 'UTF-8' encoding to copy filtered resources.
[INFO] skip non existing resourceDirectory /home/jenkins/agent/workspace/eclipse.jdt.core-SonarQube/org.eclipse.jdt.compiler.tool.tests/saveproperties
[INFO] 
[INFO] --- maven-enforcer-plugin:3.0.0-M2:enforce (enforce-maven) @ org.eclipse.jdt.compiler.tool.tests ---
[INFO] 
[INFO] --- jacoco-maven-plugin:0.8.4:prepare-agent (jacoco-agent) @ org.eclipse.jdt.compiler.tool.tests ---
[INFO] tycho.testArgLine set to -javaagent:/home/jenkins/agent/workspace/eclipse.jdt.core-SonarQube/.repository/org/jacoco/org.jacoco.agent/0.8.4/org.jacoco.agent-0.8.4-runtime.jar=destfile=/home/jenkins/agent/workspace/eclipse.jdt.core-SonarQube/jacoco.exec,append=true
[INFO] 
[INFO] --- eclipse-cbi-plugin:1.1.8-SNAPSHOT:generate-api-build-xml (default) @ org.eclipse.jdt.compiler.tool.tests ---
[INFO] 
[INFO] --- maven-resources-plugin:3.1.0:resources (default-resources) @ org.eclipse.jdt.compiler.tool.tests ---
[INFO] Using 'UTF-8' encoding to copy filtered resources.
[INFO] skip non existing resourceDirectory /home/jenkins/agent/workspace/eclipse.jdt.core-SonarQube/org.eclipse.jdt.compiler.tool.tests/src/main/resources
[INFO] 
[INFO] --- maven-resources-plugin:3.1.0:resources (filter-resources) @ org.eclipse.jdt.compiler.tool.tests ---
[INFO] Using 'UTF-8' encoding to copy filtered resources.
[INFO] skip non existing resourceDirectory /home/jenkins/agent/workspace/eclipse.jdt.core-SonarQube/org.eclipse.jdt.compiler.tool.tests/src/main/resources
[INFO] 
[INFO] --- tycho-compiler-plugin:1.5.0-SNAPSHOT:compile (default-compile) @ org.eclipse.jdt.compiler.tool.tests ---
[INFO] Compiling 6 source files to /home/jenkins/agent/workspace/eclipse.jdt.core-SonarQube/org.eclipse.jdt.compiler.tool.tests/target/classes
[WARNING] /home/jenkins/agent/workspace/eclipse.jdt.core-SonarQube/org.eclipse.jdt.compiler.tool.tests/src/org/eclipse/jdt/compiler/tool/tests/CompilerToolTests.java:[52] 
	import org.eclipse.jdt.internal.compiler.classfmt.ClassFileConstants;
	       ^^^^^^^^^^^^^^^^^^^^^^^^^^^^^^^^^^^^^^^^^^^^^^^^^^^^^^^^^^^^^
Discouraged access: The type 'ClassFileConstants' is not API (restriction on classpath entry '/home/jenkins/agent/workspace/eclipse.jdt.core-SonarQube/org.eclipse.jdt.core/target/classes')
[WARNING] /home/jenkins/agent/workspace/eclipse.jdt.core-SonarQube/org.eclipse.jdt.compiler.tool.tests/src/org/eclipse/jdt/compiler/tool/tests/CompilerToolTests.java:[53] 
	import org.eclipse.jdt.internal.compiler.classfmt.ClassFileReader;
	       ^^^^^^^^^^^^^^^^^^^^^^^^^^^^^^^^^^^^^^^^^^^^^^^^^^^^^^^^^^
Discouraged access: The type 'ClassFileReader' is not API (restriction on classpath entry '/home/jenkins/agent/workspace/eclipse.jdt.core-SonarQube/org.eclipse.jdt.core/target/classes')
[WARNING] /home/jenkins/agent/workspace/eclipse.jdt.core-SonarQube/org.eclipse.jdt.compiler.tool.tests/src/org/eclipse/jdt/compiler/tool/tests/CompilerToolTests.java:[54] 
	import org.eclipse.jdt.internal.compiler.classfmt.ClassFormatException;
	       ^^^^^^^^^^^^^^^^^^^^^^^^^^^^^^^^^^^^^^^^^^^^^^^^^^^^^^^^^^^^^^^
Discouraged access: The type 'ClassFormatException' is not API (restriction on classpath entry '/home/jenkins/agent/workspace/eclipse.jdt.core-SonarQube/org.eclipse.jdt.core/target/classes')
[WARNING] /home/jenkins/agent/workspace/eclipse.jdt.core-SonarQube/org.eclipse.jdt.compiler.tool.tests/src/org/eclipse/jdt/compiler/tool/tests/CompilerToolTests.java:[55] 
	import org.eclipse.jdt.internal.compiler.tool.EclipseCompiler;
	       ^^^^^^^^^^^^^^^^^^^^^^^^^^^^^^^^^^^^^^^^^^^^^^^^^^^^^^
Discouraged access: The type 'EclipseCompiler' is not API (restriction on classpath entry '/home/jenkins/agent/workspace/eclipse.jdt.core-SonarQube/org.eclipse.jdt.compiler.tool/target/classes')
[WARNING] /home/jenkins/agent/workspace/eclipse.jdt.core-SonarQube/org.eclipse.jdt.compiler.tool.tests/src/org/eclipse/jdt/compiler/tool/tests/CompilerToolTests.java:[153] 
	ServiceLoader<JavaCompiler> javaCompilerLoader = ServiceLoader.load(JavaCompiler.class, EclipseCompiler.class.getClassLoader());
	                                                                                        ^^^^^^^^^^^^^^^
Discouraged access: The type 'EclipseCompiler' is not API (restriction on classpath entry '/home/jenkins/agent/workspace/eclipse.jdt.core-SonarQube/org.eclipse.jdt.compiler.tool/target/classes')
[WARNING] /home/jenkins/agent/workspace/eclipse.jdt.core-SonarQube/org.eclipse.jdt.compiler.tool.tests/src/org/eclipse/jdt/compiler/tool/tests/CompilerToolTests.java:[157] 
	if (javaCompiler instanceof EclipseCompiler) {
	                            ^^^^^^^^^^^^^^^
Discouraged access: The type 'EclipseCompiler' is not API (restriction on classpath entry '/home/jenkins/agent/workspace/eclipse.jdt.core-SonarQube/org.eclipse.jdt.compiler.tool/target/classes')
[WARNING] /home/jenkins/agent/workspace/eclipse.jdt.core-SonarQube/org.eclipse.jdt.compiler.tool.tests/src/org/eclipse/jdt/compiler/tool/tests/CompilerToolTests.java:[461] 
	ClassFileReader reader = null;
	^^^^^^^^^^^^^^^
Discouraged access: The type 'ClassFileReader' is not API (restriction on classpath entry '/home/jenkins/agent/workspace/eclipse.jdt.core-SonarQube/org.eclipse.jdt.core/target/classes')
[WARNING] /home/jenkins/agent/workspace/eclipse.jdt.core-SonarQube/org.eclipse.jdt.compiler.tool.tests/src/org/eclipse/jdt/compiler/tool/tests/CompilerToolTests.java:[463] 
	reader = ClassFileReader.read(new File(tmpFolder, "p/X.class"), true);
	         ^^^^^^^^^^^^^^^
Discouraged access: The type 'ClassFileReader' is not API (restriction on classpath entry '/home/jenkins/agent/workspace/eclipse.jdt.core-SonarQube/org.eclipse.jdt.core/target/classes')
[WARNING] /home/jenkins/agent/workspace/eclipse.jdt.core-SonarQube/org.eclipse.jdt.compiler.tool.tests/src/org/eclipse/jdt/compiler/tool/tests/CompilerToolTests.java:[463] 
	reader = ClassFileReader.read(new File(tmpFolder, "p/X.class"), true);
	                         ^^^^
Discouraged access: The method 'ClassFileReader.read(File, boolean)' is not API (restriction on classpath entry '/home/jenkins/agent/workspace/eclipse.jdt.core-SonarQube/org.eclipse.jdt.core/target/classes')
[WARNING] /home/jenkins/agent/workspace/eclipse.jdt.core-SonarQube/org.eclipse.jdt.compiler.tool.tests/src/org/eclipse/jdt/compiler/tool/tests/CompilerToolTests.java:[464] 
	} catch (ClassFormatException e) {
	         ^^^^^^^^^^^^^^^^^^^^
Discouraged access: The type 'ClassFormatException' is not API (restriction on classpath entry '/home/jenkins/agent/workspace/eclipse.jdt.core-SonarQube/org.eclipse.jdt.core/target/classes')
[WARNING] /home/jenkins/agent/workspace/eclipse.jdt.core-SonarQube/org.eclipse.jdt.compiler.tool.tests/src/org/eclipse/jdt/compiler/tool/tests/CompilerToolTests.java:[471] 
	assertEquals("Wrong value", ClassFileConstants.getLatestJDKLevel(), reader.getVersion()); // TODO: Fix this for JDK11
	                            ^^^^^^^^^^^^^^^^^^
Discouraged access: The type 'ClassFileConstants' is not API (restriction on classpath entry '/home/jenkins/agent/workspace/eclipse.jdt.core-SonarQube/org.eclipse.jdt.core/target/classes')
[WARNING] /home/jenkins/agent/workspace/eclipse.jdt.core-SonarQube/org.eclipse.jdt.compiler.tool.tests/src/org/eclipse/jdt/compiler/tool/tests/CompilerToolTests.java:[471] 
	assertEquals("Wrong value", ClassFileConstants.getLatestJDKLevel(), reader.getVersion()); // TODO: Fix this for JDK11
	                                               ^^^^^^^^^^^^^^^^^
Discouraged access: The method 'ClassFileConstants.getLatestJDKLevel()' is not API (restriction on classpath entry '/home/jenkins/agent/workspace/eclipse.jdt.core-SonarQube/org.eclipse.jdt.core/target/classes')
[WARNING] /home/jenkins/agent/workspace/eclipse.jdt.core-SonarQube/org.eclipse.jdt.compiler.tool.tests/src/org/eclipse/jdt/compiler/tool/tests/CompilerToolTests.java:[471] 
	assertEquals("Wrong value", ClassFileConstants.getLatestJDKLevel(), reader.getVersion()); // TODO: Fix this for JDK11
	                                                                           ^^^^^^^^^^
Discouraged access: The method 'ClassFileReader.getVersion()' is not API (restriction on classpath entry '/home/jenkins/agent/workspace/eclipse.jdt.core-SonarQube/org.eclipse.jdt.core/target/classes')
[WARNING] /home/jenkins/agent/workspace/eclipse.jdt.core-SonarQube/org.eclipse.jdt.compiler.tool.tests/src/org/eclipse/jdt/compiler/tool/tests/CompilerToolTests.java:[541] 
	ClassFileReader reader = null;
	^^^^^^^^^^^^^^^
Discouraged access: The type 'ClassFileReader' is not API (restriction on classpath entry '/home/jenkins/agent/workspace/eclipse.jdt.core-SonarQube/org.eclipse.jdt.core/target/classes')
[WARNING] /home/jenkins/agent/workspace/eclipse.jdt.core-SonarQube/org.eclipse.jdt.compiler.tool.tests/src/org/eclipse/jdt/compiler/tool/tests/CompilerToolTests.java:[543] 
	reader = ClassFileReader.read(outputFile);
	         ^^^^^^^^^^^^^^^
Discouraged access: The type 'ClassFileReader' is not API (restriction on classpath entry '/home/jenkins/agent/workspace/eclipse.jdt.core-SonarQube/org.eclipse.jdt.core/target/classes')
[WARNING] /home/jenkins/agent/workspace/eclipse.jdt.core-SonarQube/org.eclipse.jdt.compiler.tool.tests/src/org/eclipse/jdt/compiler/tool/tests/CompilerToolTests.java:[543] 
	reader = ClassFileReader.read(outputFile);
	                         ^^^^
Discouraged access: The method 'ClassFileReader.read(File)' is not API (restriction on classpath entry '/home/jenkins/agent/workspace/eclipse.jdt.core-SonarQube/org.eclipse.jdt.core/target/classes')
[WARNING] /home/jenkins/agent/workspace/eclipse.jdt.core-SonarQube/org.eclipse.jdt.compiler.tool.tests/src/org/eclipse/jdt/compiler/tool/tests/CompilerToolTests.java:[544] 
	} catch (ClassFormatException e) {
	         ^^^^^^^^^^^^^^^^^^^^
Discouraged access: The type 'ClassFormatException' is not API (restriction on classpath entry '/home/jenkins/agent/workspace/eclipse.jdt.core-SonarQube/org.eclipse.jdt.core/target/classes')
[WARNING] /home/jenkins/agent/workspace/eclipse.jdt.core-SonarQube/org.eclipse.jdt.compiler.tool.tests/src/org/eclipse/jdt/compiler/tool/tests/CompilerToolTests.java:[550] 
	assertEquals("Not a 1.5 .class file", ClassFileConstants.JDK1_5, reader.getVersion());
	                                      ^^^^^^^^^^^^^^^^^^^^^^^^^
Discouraged access: The type 'ClassFileConstants' is not API (restriction on classpath entry '/home/jenkins/agent/workspace/eclipse.jdt.core-SonarQube/org.eclipse.jdt.core/target/classes')
[WARNING] /home/jenkins/agent/workspace/eclipse.jdt.core-SonarQube/org.eclipse.jdt.compiler.tool.tests/src/org/eclipse/jdt/compiler/tool/tests/CompilerToolTests.java:[550] 
	assertEquals("Not a 1.5 .class file", ClassFileConstants.JDK1_5, reader.getVersion());
	                                                         ^^^^^^
Discouraged access: The field 'ClassFileConstants.JDK1_5' is not API (restriction on classpath entry '/home/jenkins/agent/workspace/eclipse.jdt.core-SonarQube/org.eclipse.jdt.core/target/classes')
[WARNING] /home/jenkins/agent/workspace/eclipse.jdt.core-SonarQube/org.eclipse.jdt.compiler.tool.tests/src/org/eclipse/jdt/compiler/tool/tests/CompilerToolTests.java:[550] 
	assertEquals("Not a 1.5 .class file", ClassFileConstants.JDK1_5, reader.getVersion());
	                                                                        ^^^^^^^^^^
Discouraged access: The method 'ClassFileReader.getVersion()' is not API (restriction on classpath entry '/home/jenkins/agent/workspace/eclipse.jdt.core-SonarQube/org.eclipse.jdt.core/target/classes')
[WARNING] /home/jenkins/agent/workspace/eclipse.jdt.core-SonarQube/org.eclipse.jdt.compiler.tool.tests/src/org/eclipse/jdt/compiler/tool/tests/AbstractCompilerToolTest.java:[32] 
	import org.eclipse.jdt.internal.compiler.tool.EclipseCompiler;
	       ^^^^^^^^^^^^^^^^^^^^^^^^^^^^^^^^^^^^^^^^^^^^^^^^^^^^^^
Discouraged access: The type 'EclipseCompiler' is not API (restriction on classpath entry '/home/jenkins/agent/workspace/eclipse.jdt.core-SonarQube/org.eclipse.jdt.compiler.tool/target/classes')
[WARNING] /home/jenkins/agent/workspace/eclipse.jdt.core-SonarQube/org.eclipse.jdt.compiler.tool.tests/src/org/eclipse/jdt/compiler/tool/tests/AbstractCompilerToolTest.java:[92] 
	static EclipseCompiler COMPILER = new EclipseCompiler();
	       ^^^^^^^^^^^^^^^
Discouraged access: The type 'EclipseCompiler' is not API (restriction on classpath entry '/home/jenkins/agent/workspace/eclipse.jdt.core-SonarQube/org.eclipse.jdt.compiler.tool/target/classes')
[WARNING] /home/jenkins/agent/workspace/eclipse.jdt.core-SonarQube/org.eclipse.jdt.compiler.tool.tests/src/org/eclipse/jdt/compiler/tool/tests/AbstractCompilerToolTest.java:[92] 
	static EclipseCompiler COMPILER = new EclipseCompiler();
	                                      ^^^^^^^^^^^^^^^
Discouraged access: The type 'EclipseCompiler' is not API (restriction on classpath entry '/home/jenkins/agent/workspace/eclipse.jdt.core-SonarQube/org.eclipse.jdt.compiler.tool/target/classes')
[WARNING] /home/jenkins/agent/workspace/eclipse.jdt.core-SonarQube/org.eclipse.jdt.compiler.tool.tests/src/org/eclipse/jdt/compiler/tool/tests/AbstractCompilerToolTest.java:[92] 
	static EclipseCompiler COMPILER = new EclipseCompiler();
	                                      ^^^^^^^^^^^^^^^
Discouraged access: The constructor 'EclipseCompiler()' is not API (restriction on classpath entry '/home/jenkins/agent/workspace/eclipse.jdt.core-SonarQube/org.eclipse.jdt.compiler.tool/target/classes')
[WARNING] /home/jenkins/agent/workspace/eclipse.jdt.core-SonarQube/org.eclipse.jdt.compiler.tool.tests/src/org/eclipse/jdt/compiler/tool/tests/AbstractCompilerToolTest.java:[104] 
	manager = COMPILER.getStandardFileManager(null, null, null); // will pick defaults up
	                   ^^^^^^^^^^^^^^^^^^^^^^
Discouraged access: The method 'EclipseCompiler.getStandardFileManager(DiagnosticListener<? super JavaFileObject>, Locale, Charset)' is not API (restriction on classpath entry '/home/jenkins/agent/workspace/eclipse.jdt.core-SonarQube/org.eclipse.jdt.compiler.tool/target/classes')
[WARNING] /home/jenkins/agent/workspace/eclipse.jdt.core-SonarQube/org.eclipse.jdt.compiler.tool.tests/src/org/eclipse/jdt/compiler/tool/tests/AbstractCompilerToolTest.java:[117] 
	CompilationTask task = COMPILER.getTask(out, arguments.standardJavaFileManager /* carry the null over */, new CompilerInvocationDiagnosticListener(err), arguments.options, null, manager.getJavaFileObjectsFromFiles(files));
	                                ^^^^^^^
Discouraged access: The method 'EclipseCompiler.getTask(Writer, JavaFileManager, DiagnosticListener<? super JavaFileObject>, Iterable<String>, Iterable<String>, Iterable<? extends JavaFileObject>)' is not API (restriction on classpath entry '/home/jenkins/agent/workspace/eclipse.jdt.core-SonarQube/org.eclipse.jdt.compiler.tool/target/classes')
[WARNING] /home/jenkins/agent/workspace/eclipse.jdt.core-SonarQube/org.eclipse.jdt.compiler.tool.tests/src/org/eclipse/jdt/compiler/tool/tests/CompilerInvocationTests.java:[43] 
	import org.eclipse.jdt.internal.compiler.batch.Main;
	       ^^^^^^^^^^^^^^^^^^^^^^^^^^^^^^^^^^^^^^^^^^^^
Discouraged access: The type 'Main' is not API (restriction on classpath entry '/home/jenkins/agent/workspace/eclipse.jdt.core-SonarQube/org.eclipse.jdt.core/target/classes')
[WARNING] /home/jenkins/agent/workspace/eclipse.jdt.core-SonarQube/org.eclipse.jdt.compiler.tool.tests/src/org/eclipse/jdt/compiler/tool/tests/CompilerInvocationTests.java:[44] 
	import org.eclipse.jdt.internal.compiler.classfmt.ClassFileConstants;
	       ^^^^^^^^^^^^^^^^^^^^^^^^^^^^^^^^^^^^^^^^^^^^^^^^^^^^^^^^^^^^^
Discouraged access: The type 'ClassFileConstants' is not API (restriction on classpath entry '/home/jenkins/agent/workspace/eclipse.jdt.core-SonarQube/org.eclipse.jdt.core/target/classes')
[WARNING] /home/jenkins/agent/workspace/eclipse.jdt.core-SonarQube/org.eclipse.jdt.compiler.tool.tests/src/org/eclipse/jdt/compiler/tool/tests/CompilerInvocationTests.java:[45] 
	import org.eclipse.jdt.internal.compiler.classfmt.ClassFileReader;
	       ^^^^^^^^^^^^^^^^^^^^^^^^^^^^^^^^^^^^^^^^^^^^^^^^^^^^^^^^^^
Discouraged access: The type 'ClassFileReader' is not API (restriction on classpath entry '/home/jenkins/agent/workspace/eclipse.jdt.core-SonarQube/org.eclipse.jdt.core/target/classes')
[WARNING] /home/jenkins/agent/workspace/eclipse.jdt.core-SonarQube/org.eclipse.jdt.compiler.tool.tests/src/org/eclipse/jdt/compiler/tool/tests/CompilerInvocationTests.java:[46] 
	import org.eclipse.jdt.internal.compiler.classfmt.ClassFormatException;
	       ^^^^^^^^^^^^^^^^^^^^^^^^^^^^^^^^^^^^^^^^^^^^^^^^^^^^^^^^^^^^^^^
Discouraged access: The type 'ClassFormatException' is not API (restriction on classpath entry '/home/jenkins/agent/workspace/eclipse.jdt.core-SonarQube/org.eclipse.jdt.core/target/classes')
[WARNING] /home/jenkins/agent/workspace/eclipse.jdt.core-SonarQube/org.eclipse.jdt.compiler.tool.tests/src/org/eclipse/jdt/compiler/tool/tests/CompilerInvocationTests.java:[60] 
	return buildUniqueComplianceTestSuite(CompilerInvocationTests.class, ClassFileConstants.JDK1_6);
	                                                                     ^^^^^^^^^^^^^^^^^^^^^^^^^
Discouraged access: The type 'ClassFileConstants' is not API (restriction on classpath entry '/home/jenkins/agent/workspace/eclipse.jdt.core-SonarQube/org.eclipse.jdt.core/target/classes')
[WARNING] /home/jenkins/agent/workspace/eclipse.jdt.core-SonarQube/org.eclipse.jdt.compiler.tool.tests/src/org/eclipse/jdt/compiler/tool/tests/CompilerInvocationTests.java:[60] 
	return buildUniqueComplianceTestSuite(CompilerInvocationTests.class, ClassFileConstants.JDK1_6);
	                                                                                        ^^^^^^
Discouraged access: The field 'ClassFileConstants.JDK1_6' is not API (restriction on classpath entry '/home/jenkins/agent/workspace/eclipse.jdt.core-SonarQube/org.eclipse.jdt.core/target/classes')
[WARNING] /home/jenkins/agent/workspace/eclipse.jdt.core-SonarQube/org.eclipse.jdt.compiler.tool.tests/src/org/eclipse/jdt/compiler/tool/tests/CompilerInvocationTests.java:[75] 
	ClassFileReader reader = null;
	^^^^^^^^^^^^^^^
Discouraged access: The type 'ClassFileReader' is not API (restriction on classpath entry '/home/jenkins/agent/workspace/eclipse.jdt.core-SonarQube/org.eclipse.jdt.core/target/classes')
[WARNING] /home/jenkins/agent/workspace/eclipse.jdt.core-SonarQube/org.eclipse.jdt.compiler.tool.tests/src/org/eclipse/jdt/compiler/tool/tests/CompilerInvocationTests.java:[77] 
	reader = ClassFileReader.read(new File(OUTPUT_DIR, fileNames[i]), true);
	         ^^^^^^^^^^^^^^^
Discouraged access: The type 'ClassFileReader' is not API (restriction on classpath entry '/home/jenkins/agent/workspace/eclipse.jdt.core-SonarQube/org.eclipse.jdt.core/target/classes')
[WARNING] /home/jenkins/agent/workspace/eclipse.jdt.core-SonarQube/org.eclipse.jdt.compiler.tool.tests/src/org/eclipse/jdt/compiler/tool/tests/CompilerInvocationTests.java:[77] 
	reader = ClassFileReader.read(new File(OUTPUT_DIR, fileNames[i]), true);
	                         ^^^^
Discouraged access: The method 'ClassFileReader.read(File, boolean)' is not API (restriction on classpath entry '/home/jenkins/agent/workspace/eclipse.jdt.core-SonarQube/org.eclipse.jdt.core/target/classes')
[WARNING] /home/jenkins/agent/workspace/eclipse.jdt.core-SonarQube/org.eclipse.jdt.compiler.tool.tests/src/org/eclipse/jdt/compiler/tool/tests/CompilerInvocationTests.java:[78] 
	} catch (ClassFormatException e) {
	         ^^^^^^^^^^^^^^^^^^^^
Discouraged access: The type 'ClassFormatException' is not API (restriction on classpath entry '/home/jenkins/agent/workspace/eclipse.jdt.core-SonarQube/org.eclipse.jdt.core/target/classes')
[WARNING] /home/jenkins/agent/workspace/eclipse.jdt.core-SonarQube/org.eclipse.jdt.compiler.tool.tests/src/org/eclipse/jdt/compiler/tool/tests/CompilerInvocationTests.java:[84] 
	assertEquals("Wrong Java version for " + fileNames[i], ClassFileConstants.JDK1_6, reader.getVersion());
	                                                       ^^^^^^^^^^^^^^^^^^^^^^^^^
Discouraged access: The type 'ClassFileConstants' is not API (restriction on classpath entry '/home/jenkins/agent/workspace/eclipse.jdt.core-SonarQube/org.eclipse.jdt.core/target/classes')
[WARNING] /home/jenkins/agent/workspace/eclipse.jdt.core-SonarQube/org.eclipse.jdt.compiler.tool.tests/src/org/eclipse/jdt/compiler/tool/tests/CompilerInvocationTests.java:[84] 
	assertEquals("Wrong Java version for " + fileNames[i], ClassFileConstants.JDK1_6, reader.getVersion());
	                                                                          ^^^^^^
Discouraged access: The field 'ClassFileConstants.JDK1_6' is not API (restriction on classpath entry '/home/jenkins/agent/workspace/eclipse.jdt.core-SonarQube/org.eclipse.jdt.core/target/classes')
[WARNING] /home/jenkins/agent/workspace/eclipse.jdt.core-SonarQube/org.eclipse.jdt.compiler.tool.tests/src/org/eclipse/jdt/compiler/tool/tests/CompilerInvocationTests.java:[84] 
	assertEquals("Wrong Java version for " + fileNames[i], ClassFileConstants.JDK1_6, reader.getVersion());
	                                                                                         ^^^^^^^^^^
Discouraged access: The method 'ClassFileReader.getVersion()' is not API (restriction on classpath entry '/home/jenkins/agent/workspace/eclipse.jdt.core-SonarQube/org.eclipse.jdt.core/target/classes')
[WARNING] /home/jenkins/agent/workspace/eclipse.jdt.core-SonarQube/org.eclipse.jdt.compiler.tool.tests/src/org/eclipse/jdt/compiler/tool/tests/CompilerInvocationTests.java:[520] 
	COMPILER.getStandardFileManager(null /* diagnosticListener */, null /* locale */, null /* charset */);
	         ^^^^^^^^^^^^^^^^^^^^^^
Discouraged access: The method 'EclipseCompiler.getStandardFileManager(DiagnosticListener<? super JavaFileObject>, Locale, Charset)' is not API (restriction on classpath entry '/home/jenkins/agent/workspace/eclipse.jdt.core-SonarQube/org.eclipse.jdt.compiler.tool/target/classes')
[WARNING] /home/jenkins/agent/workspace/eclipse.jdt.core-SonarQube/org.eclipse.jdt.compiler.tool.tests/src/org/eclipse/jdt/compiler/tool/tests/CompilerInvocationTests.java:[540] 
	COMPILER.getStandardFileManager(null /* diagnosticListener */, null /* locale */, null /* charset */);
	         ^^^^^^^^^^^^^^^^^^^^^^
Discouraged access: The method 'EclipseCompiler.getStandardFileManager(DiagnosticListener<? super JavaFileObject>, Locale, Charset)' is not API (restriction on classpath entry '/home/jenkins/agent/workspace/eclipse.jdt.core-SonarQube/org.eclipse.jdt.compiler.tool/target/classes')
[WARNING] /home/jenkins/agent/workspace/eclipse.jdt.core-SonarQube/org.eclipse.jdt.compiler.tool.tests/src/org/eclipse/jdt/compiler/tool/tests/CompilerInvocationTests.java:[563] 
	COMPILER.getStandardFileManager(null /* diagnosticListener */, null /* locale */, null /* charset */);
	         ^^^^^^^^^^^^^^^^^^^^^^
Discouraged access: The method 'EclipseCompiler.getStandardFileManager(DiagnosticListener<? super JavaFileObject>, Locale, Charset)' is not API (restriction on classpath entry '/home/jenkins/agent/workspace/eclipse.jdt.core-SonarQube/org.eclipse.jdt.compiler.tool/target/classes')
[WARNING] /home/jenkins/agent/workspace/eclipse.jdt.core-SonarQube/org.eclipse.jdt.compiler.tool.tests/src/org/eclipse/jdt/compiler/tool/tests/CompilerInvocationTests.java:[584] 
	passed = COMPILER.getStandardFileManager(null /* diagnosticListener */, null /* locale */, null /* charset */).
	                  ^^^^^^^^^^^^^^^^^^^^^^
Discouraged access: The method 'EclipseCompiler.getStandardFileManager(DiagnosticListener<? super JavaFileObject>, Locale, Charset)' is not API (restriction on classpath entry '/home/jenkins/agent/workspace/eclipse.jdt.core-SonarQube/org.eclipse.jdt.compiler.tool/target/classes')
[WARNING] /home/jenkins/agent/workspace/eclipse.jdt.core-SonarQube/org.eclipse.jdt.compiler.tool.tests/src/org/eclipse/jdt/compiler/tool/tests/CompilerInvocationTests.java:[689] 
	COMPILER.getStandardFileManager(null /* diagnosticListener */, null /* locale */, null /* charset */),
	         ^^^^^^^^^^^^^^^^^^^^^^
Discouraged access: The method 'EclipseCompiler.getStandardFileManager(DiagnosticListener<? super JavaFileObject>, Locale, Charset)' is not API (restriction on classpath entry '/home/jenkins/agent/workspace/eclipse.jdt.core-SonarQube/org.eclipse.jdt.compiler.tool/target/classes')
[WARNING] /home/jenkins/agent/workspace/eclipse.jdt.core-SonarQube/org.eclipse.jdt.compiler.tool.tests/src/org/eclipse/jdt/compiler/tool/tests/CompilerInvocationTests.java:[731] 
	COMPILER.getStandardFileManager(null /* diagnosticListener */, null /* locale */, null /* charset */),
	         ^^^^^^^^^^^^^^^^^^^^^^
Discouraged access: The method 'EclipseCompiler.getStandardFileManager(DiagnosticListener<? super JavaFileObject>, Locale, Charset)' is not API (restriction on classpath entry '/home/jenkins/agent/workspace/eclipse.jdt.core-SonarQube/org.eclipse.jdt.compiler.tool/target/classes')
[WARNING] /home/jenkins/agent/workspace/eclipse.jdt.core-SonarQube/org.eclipse.jdt.compiler.tool.tests/src/org/eclipse/jdt/compiler/tool/tests/CompilerInvocationTests.java:[790] 
	COMPILER.getStandardFileManager(null /* diagnosticListener */, null /* locale */, null /* charset */),
	         ^^^^^^^^^^^^^^^^^^^^^^
Discouraged access: The method 'EclipseCompiler.getStandardFileManager(DiagnosticListener<? super JavaFileObject>, Locale, Charset)' is not API (restriction on classpath entry '/home/jenkins/agent/workspace/eclipse.jdt.core-SonarQube/org.eclipse.jdt.compiler.tool/target/classes')
[WARNING] /home/jenkins/agent/workspace/eclipse.jdt.core-SonarQube/org.eclipse.jdt.compiler.tool.tests/src/org/eclipse/jdt/compiler/tool/tests/CompilerInvocationTests.java:[827] 
	COMPILER.getStandardFileManager(null /* diagnosticListener */, null /* locale */, null /* charset */),
	         ^^^^^^^^^^^^^^^^^^^^^^
Discouraged access: The method 'EclipseCompiler.getStandardFileManager(DiagnosticListener<? super JavaFileObject>, Locale, Charset)' is not API (restriction on classpath entry '/home/jenkins/agent/workspace/eclipse.jdt.core-SonarQube/org.eclipse.jdt.compiler.tool/target/classes')
[WARNING] /home/jenkins/agent/workspace/eclipse.jdt.core-SonarQube/org.eclipse.jdt.compiler.tool.tests/src/org/eclipse/jdt/compiler/tool/tests/CompilerInvocationTests.java:[930] 
	COMPILER.getStandardFileManager(null /* diagnosticListener */, null /* locale */, null /* charset */);
	         ^^^^^^^^^^^^^^^^^^^^^^
Discouraged access: The method 'EclipseCompiler.getStandardFileManager(DiagnosticListener<? super JavaFileObject>, Locale, Charset)' is not API (restriction on classpath entry '/home/jenkins/agent/workspace/eclipse.jdt.core-SonarQube/org.eclipse.jdt.compiler.tool/target/classes')
[WARNING] /home/jenkins/agent/workspace/eclipse.jdt.core-SonarQube/org.eclipse.jdt.compiler.tool.tests/src/org/eclipse/jdt/compiler/tool/tests/CompilerInvocationTests.java:[960] 
	COMPILER.getStandardFileManager(null /* diagnosticListener */, null /* locale */, null /* charset */);
	         ^^^^^^^^^^^^^^^^^^^^^^
Discouraged access: The method 'EclipseCompiler.getStandardFileManager(DiagnosticListener<? super JavaFileObject>, Locale, Charset)' is not API (restriction on classpath entry '/home/jenkins/agent/workspace/eclipse.jdt.core-SonarQube/org.eclipse.jdt.compiler.tool/target/classes')
[WARNING] /home/jenkins/agent/workspace/eclipse.jdt.core-SonarQube/org.eclipse.jdt.compiler.tool.tests/src/org/eclipse/jdt/compiler/tool/tests/CompilerInvocationTests.java:[992] 
	CompilationTask task = COMPILER.getTask(
	                                ^^^^^^^
Discouraged access: The method 'EclipseCompiler.getTask(Writer, JavaFileManager, DiagnosticListener<? super JavaFileObject>, Iterable<String>, Iterable<String>, Iterable<? extends JavaFileObject>)' is not API (restriction on classpath entry '/home/jenkins/agent/workspace/eclipse.jdt.core-SonarQube/org.eclipse.jdt.compiler.tool/target/classes')
[WARNING] /home/jenkins/agent/workspace/eclipse.jdt.core-SonarQube/org.eclipse.jdt.compiler.tool.tests/src/org/eclipse/jdt/compiler/tool/tests/CompilerInvocationTests.java:[994] 
	COMPILER.getStandardFileManager(null /* diagnosticListener */, null /* locale */, null /* charset */), 
	         ^^^^^^^^^^^^^^^^^^^^^^
Discouraged access: The method 'EclipseCompiler.getStandardFileManager(DiagnosticListener<? super JavaFileObject>, Locale, Charset)' is not API (restriction on classpath entry '/home/jenkins/agent/workspace/eclipse.jdt.core-SonarQube/org.eclipse.jdt.compiler.tool/target/classes')
[WARNING] /home/jenkins/agent/workspace/eclipse.jdt.core-SonarQube/org.eclipse.jdt.compiler.tool.tests/src/org/eclipse/jdt/compiler/tool/tests/CompilerInvocationTests.java:[1001] 
	resourceAsStream = Main.class.getResourceAsStream("messages.properties");
	                   ^^^^
Discouraged access: The type 'Main' is not API (restriction on classpath entry '/home/jenkins/agent/workspace/eclipse.jdt.core-SonarQube/org.eclipse.jdt.core/target/classes')
[WARNING] /home/jenkins/agent/workspace/eclipse.jdt.core-SonarQube/org.eclipse.jdt.compiler.tool.tests/src/org/eclipse/jdt/compiler/tool/tests/CompilerInvocationTests.java:[1021] 
	CompilationTask task = COMPILER.getTask(
	                                ^^^^^^^
Discouraged access: The method 'EclipseCompiler.getTask(Writer, JavaFileManager, DiagnosticListener<? super JavaFileObject>, Iterable<String>, Iterable<String>, Iterable<? extends JavaFileObject>)' is not API (restriction on classpath entry '/home/jenkins/agent/workspace/eclipse.jdt.core-SonarQube/org.eclipse.jdt.compiler.tool/target/classes')
[WARNING] /home/jenkins/agent/workspace/eclipse.jdt.core-SonarQube/org.eclipse.jdt.compiler.tool.tests/src/org/eclipse/jdt/compiler/tool/tests/CompilerInvocationTests.java:[1023] 
	COMPILER.getStandardFileManager(null /* diagnosticListener */, null /* locale */, null /* charset */), 
	         ^^^^^^^^^^^^^^^^^^^^^^
Discouraged access: The method 'EclipseCompiler.getStandardFileManager(DiagnosticListener<? super JavaFileObject>, Locale, Charset)' is not API (restriction on classpath entry '/home/jenkins/agent/workspace/eclipse.jdt.core-SonarQube/org.eclipse.jdt.compiler.tool/target/classes')
[WARNING] /home/jenkins/agent/workspace/eclipse.jdt.core-SonarQube/org.eclipse.jdt.compiler.tool.tests/src/org/eclipse/jdt/compiler/tool/tests/CompilerToolJava9Tests.java:[53] 
	import org.eclipse.jdt.internal.compiler.classfmt.ClassFileConstants;
	       ^^^^^^^^^^^^^^^^^^^^^^^^^^^^^^^^^^^^^^^^^^^^^^^^^^^^^^^^^^^^^
Discouraged access: The type 'ClassFileConstants' is not API (restriction on classpath entry '/home/jenkins/agent/workspace/eclipse.jdt.core-SonarQube/org.eclipse.jdt.core/target/classes')
[WARNING] /home/jenkins/agent/workspace/eclipse.jdt.core-SonarQube/org.eclipse.jdt.compiler.tool.tests/src/org/eclipse/jdt/compiler/tool/tests/CompilerToolJava9Tests.java:[54] 
	import org.eclipse.jdt.internal.compiler.classfmt.ClassFileReader;
	       ^^^^^^^^^^^^^^^^^^^^^^^^^^^^^^^^^^^^^^^^^^^^^^^^^^^^^^^^^^
Discouraged access: The type 'ClassFileReader' is not API (restriction on classpath entry '/home/jenkins/agent/workspace/eclipse.jdt.core-SonarQube/org.eclipse.jdt.core/target/classes')
[WARNING] /home/jenkins/agent/workspace/eclipse.jdt.core-SonarQube/org.eclipse.jdt.compiler.tool.tests/src/org/eclipse/jdt/compiler/tool/tests/CompilerToolJava9Tests.java:[55] 
	import org.eclipse.jdt.internal.compiler.classfmt.ClassFormatException;
	       ^^^^^^^^^^^^^^^^^^^^^^^^^^^^^^^^^^^^^^^^^^^^^^^^^^^^^^^^^^^^^^^
Discouraged access: The type 'ClassFormatException' is not API (restriction on classpath entry '/home/jenkins/agent/workspace/eclipse.jdt.core-SonarQube/org.eclipse.jdt.core/target/classes')
[WARNING] /home/jenkins/agent/workspace/eclipse.jdt.core-SonarQube/org.eclipse.jdt.compiler.tool.tests/src/org/eclipse/jdt/compiler/tool/tests/CompilerToolJava9Tests.java:[56] 
	import org.eclipse.jdt.internal.compiler.tool.EclipseCompiler;
	       ^^^^^^^^^^^^^^^^^^^^^^^^^^^^^^^^^^^^^^^^^^^^^^^^^^^^^^
Discouraged access: The type 'EclipseCompiler' is not API (restriction on classpath entry '/home/jenkins/agent/workspace/eclipse.jdt.core-SonarQube/org.eclipse.jdt.compiler.tool/target/classes')
[WARNING] /home/jenkins/agent/workspace/eclipse.jdt.core-SonarQube/org.eclipse.jdt.compiler.tool.tests/src/org/eclipse/jdt/compiler/tool/tests/CompilerToolJava9Tests.java:[88] 
	ServiceLoader<JavaCompiler> javaCompilerLoader = ServiceLoader.load(JavaCompiler.class, EclipseCompiler.class.getClassLoader());
	                                                                                        ^^^^^^^^^^^^^^^
Discouraged access: The type 'EclipseCompiler' is not API (restriction on classpath entry '/home/jenkins/agent/workspace/eclipse.jdt.core-SonarQube/org.eclipse.jdt.compiler.tool/target/classes')
[WARNING] /home/jenkins/agent/workspace/eclipse.jdt.core-SonarQube/org.eclipse.jdt.compiler.tool.tests/src/org/eclipse/jdt/compiler/tool/tests/CompilerToolJava9Tests.java:[90] 
	if (compiler instanceof EclipseCompiler) {
	                        ^^^^^^^^^^^^^^^
Discouraged access: The type 'EclipseCompiler' is not API (restriction on classpath entry '/home/jenkins/agent/workspace/eclipse.jdt.core-SonarQube/org.eclipse.jdt.compiler.tool/target/classes')
[WARNING] /home/jenkins/agent/workspace/eclipse.jdt.core-SonarQube/org.eclipse.jdt.compiler.tool.tests/src/org/eclipse/jdt/compiler/tool/tests/CompilerToolJava9Tests.java:[163] 
	if (!(compiler instanceof EclipseCompiler) &&
	                          ^^^^^^^^^^^^^^^
Discouraged access: The type 'EclipseCompiler' is not API (restriction on classpath entry '/home/jenkins/agent/workspace/eclipse.jdt.core-SonarQube/org.eclipse.jdt.compiler.tool/target/classes')
[WARNING] /home/jenkins/agent/workspace/eclipse.jdt.core-SonarQube/org.eclipse.jdt.compiler.tool.tests/src/org/eclipse/jdt/compiler/tool/tests/CompilerToolJava9Tests.java:[182] 
	if (!(compiler instanceof EclipseCompiler))
	                          ^^^^^^^^^^^^^^^
Discouraged access: The type 'EclipseCompiler' is not API (restriction on classpath entry '/home/jenkins/agent/workspace/eclipse.jdt.core-SonarQube/org.eclipse.jdt.compiler.tool/target/classes')
[WARNING] /home/jenkins/agent/workspace/eclipse.jdt.core-SonarQube/org.eclipse.jdt.compiler.tool.tests/src/org/eclipse/jdt/compiler/tool/tests/CompilerToolJava9Tests.java:[203] 
	if (!(compiler instanceof EclipseCompiler))
	                          ^^^^^^^^^^^^^^^
Discouraged access: The type 'EclipseCompiler' is not API (restriction on classpath entry '/home/jenkins/agent/workspace/eclipse.jdt.core-SonarQube/org.eclipse.jdt.compiler.tool/target/classes')
[WARNING] /home/jenkins/agent/workspace/eclipse.jdt.core-SonarQube/org.eclipse.jdt.compiler.tool.tests/src/org/eclipse/jdt/compiler/tool/tests/CompilerToolJava9Tests.java:[295] 
	ClassFileReader reader = null;
	^^^^^^^^^^^^^^^
Discouraged access: The type 'ClassFileReader' is not API (restriction on classpath entry '/home/jenkins/agent/workspace/eclipse.jdt.core-SonarQube/org.eclipse.jdt.core/target/classes')
[WARNING] /home/jenkins/agent/workspace/eclipse.jdt.core-SonarQube/org.eclipse.jdt.compiler.tool.tests/src/org/eclipse/jdt/compiler/tool/tests/CompilerToolJava9Tests.java:[297] 
	reader = ClassFileReader.read(new File(tmpFolder, "p/X.class"), true);
	         ^^^^^^^^^^^^^^^
Discouraged access: The type 'ClassFileReader' is not API (restriction on classpath entry '/home/jenkins/agent/workspace/eclipse.jdt.core-SonarQube/org.eclipse.jdt.core/target/classes')
[WARNING] /home/jenkins/agent/workspace/eclipse.jdt.core-SonarQube/org.eclipse.jdt.compiler.tool.tests/src/org/eclipse/jdt/compiler/tool/tests/CompilerToolJava9Tests.java:[297] 
	reader = ClassFileReader.read(new File(tmpFolder, "p/X.class"), true);
	                         ^^^^
Discouraged access: The method 'ClassFileReader.read(File, boolean)' is not API (restriction on classpath entry '/home/jenkins/agent/workspace/eclipse.jdt.core-SonarQube/org.eclipse.jdt.core/target/classes')
[WARNING] /home/jenkins/agent/workspace/eclipse.jdt.core-SonarQube/org.eclipse.jdt.compiler.tool.tests/src/org/eclipse/jdt/compiler/tool/tests/CompilerToolJava9Tests.java:[298] 
	} catch (ClassFormatException e) {
	         ^^^^^^^^^^^^^^^^^^^^
Discouraged access: The type 'ClassFormatException' is not API (restriction on classpath entry '/home/jenkins/agent/workspace/eclipse.jdt.core-SonarQube/org.eclipse.jdt.core/target/classes')
[WARNING] /home/jenkins/agent/workspace/eclipse.jdt.core-SonarQube/org.eclipse.jdt.compiler.tool.tests/src/org/eclipse/jdt/compiler/tool/tests/CompilerToolJava9Tests.java:[305] 
	assertEquals("Wrong value", ClassFileConstants.JDK1_8, reader.getVersion());
	                            ^^^^^^^^^^^^^^^^^^^^^^^^^
Discouraged access: The type 'ClassFileConstants' is not API (restriction on classpath entry '/home/jenkins/agent/workspace/eclipse.jdt.core-SonarQube/org.eclipse.jdt.core/target/classes')
[WARNING] /home/jenkins/agent/workspace/eclipse.jdt.core-SonarQube/org.eclipse.jdt.compiler.tool.tests/src/org/eclipse/jdt/compiler/tool/tests/CompilerToolJava9Tests.java:[305] 
	assertEquals("Wrong value", ClassFileConstants.JDK1_8, reader.getVersion());
	                                               ^^^^^^
Discouraged access: The field 'ClassFileConstants.JDK1_8' is not API (restriction on classpath entry '/home/jenkins/agent/workspace/eclipse.jdt.core-SonarQube/org.eclipse.jdt.core/target/classes')
[WARNING] /home/jenkins/agent/workspace/eclipse.jdt.core-SonarQube/org.eclipse.jdt.compiler.tool.tests/src/org/eclipse/jdt/compiler/tool/tests/CompilerToolJava9Tests.java:[305] 
	assertEquals("Wrong value", ClassFileConstants.JDK1_8, reader.getVersion());
	                                                              ^^^^^^^^^^
Discouraged access: The method 'ClassFileReader.getVersion()' is not API (restriction on classpath entry '/home/jenkins/agent/workspace/eclipse.jdt.core-SonarQube/org.eclipse.jdt.core/target/classes')
[WARNING] /home/jenkins/agent/workspace/eclipse.jdt.core-SonarQube/org.eclipse.jdt.compiler.tool.tests/src/org/eclipse/jdt/compiler/tool/tests/CompilerToolJava9Tests.java:[386] 
	ClassFileReader reader = null;
	^^^^^^^^^^^^^^^
Discouraged access: The type 'ClassFileReader' is not API (restriction on classpath entry '/home/jenkins/agent/workspace/eclipse.jdt.core-SonarQube/org.eclipse.jdt.core/target/classes')
[WARNING] /home/jenkins/agent/workspace/eclipse.jdt.core-SonarQube/org.eclipse.jdt.compiler.tool.tests/src/org/eclipse/jdt/compiler/tool/tests/CompilerToolJava9Tests.java:[388] 
	reader = ClassFileReader.read(new File(tmpFolder, "p/X.class"), true);
	         ^^^^^^^^^^^^^^^
Discouraged access: The type 'ClassFileReader' is not API (restriction on classpath entry '/home/jenkins/agent/workspace/eclipse.jdt.core-SonarQube/org.eclipse.jdt.core/target/classes')
[WARNING] /home/jenkins/agent/workspace/eclipse.jdt.core-SonarQube/org.eclipse.jdt.compiler.tool.tests/src/org/eclipse/jdt/compiler/tool/tests/CompilerToolJava9Tests.java:[388] 
	reader = ClassFileReader.read(new File(tmpFolder, "p/X.class"), true);
	                         ^^^^
Discouraged access: The method 'ClassFileReader.read(File, boolean)' is not API (restriction on classpath entry '/home/jenkins/agent/workspace/eclipse.jdt.core-SonarQube/org.eclipse.jdt.core/target/classes')
[WARNING] /home/jenkins/agent/workspace/eclipse.jdt.core-SonarQube/org.eclipse.jdt.compiler.tool.tests/src/org/eclipse/jdt/compiler/tool/tests/CompilerToolJava9Tests.java:[389] 
	} catch (ClassFormatException e) {
	         ^^^^^^^^^^^^^^^^^^^^
Discouraged access: The type 'ClassFormatException' is not API (restriction on classpath entry '/home/jenkins/agent/workspace/eclipse.jdt.core-SonarQube/org.eclipse.jdt.core/target/classes')
[WARNING] /home/jenkins/agent/workspace/eclipse.jdt.core-SonarQube/org.eclipse.jdt.compiler.tool.tests/src/org/eclipse/jdt/compiler/tool/tests/CompilerToolJava9Tests.java:[396] 
	assertEquals("Wrong value", ClassFileConstants.JDK1_8, reader.getVersion());
	                            ^^^^^^^^^^^^^^^^^^^^^^^^^
Discouraged access: The type 'ClassFileConstants' is not API (restriction on classpath entry '/home/jenkins/agent/workspace/eclipse.jdt.core-SonarQube/org.eclipse.jdt.core/target/classes')
[WARNING] /home/jenkins/agent/workspace/eclipse.jdt.core-SonarQube/org.eclipse.jdt.compiler.tool.tests/src/org/eclipse/jdt/compiler/tool/tests/CompilerToolJava9Tests.java:[396] 
	assertEquals("Wrong value", ClassFileConstants.JDK1_8, reader.getVersion());
	                                               ^^^^^^
Discouraged access: The field 'ClassFileConstants.JDK1_8' is not API (restriction on classpath entry '/home/jenkins/agent/workspace/eclipse.jdt.core-SonarQube/org.eclipse.jdt.core/target/classes')
[WARNING] /home/jenkins/agent/workspace/eclipse.jdt.core-SonarQube/org.eclipse.jdt.compiler.tool.tests/src/org/eclipse/jdt/compiler/tool/tests/CompilerToolJava9Tests.java:[396] 
	assertEquals("Wrong value", ClassFileConstants.JDK1_8, reader.getVersion());
	                                                              ^^^^^^^^^^
Discouraged access: The method 'ClassFileReader.getVersion()' is not API (restriction on classpath entry '/home/jenkins/agent/workspace/eclipse.jdt.core-SonarQube/org.eclipse.jdt.core/target/classes')
[WARNING] /home/jenkins/agent/workspace/eclipse.jdt.core-SonarQube/org.eclipse.jdt.compiler.tool.tests/src/org/eclipse/jdt/compiler/tool/tests/CompilerToolJava9Tests.java:[482] 
	if (!(compiler instanceof EclipseCompiler))
	                          ^^^^^^^^^^^^^^^
Discouraged access: The type 'EclipseCompiler' is not API (restriction on classpath entry '/home/jenkins/agent/workspace/eclipse.jdt.core-SonarQube/org.eclipse.jdt.compiler.tool/target/classes')
[WARNING] /home/jenkins/agent/workspace/eclipse.jdt.core-SonarQube/org.eclipse.jdt.compiler.tool.tests/src/org/eclipse/jdt/compiler/tool/tests/CompilerToolJava9Tests.java:[502] 
	if (!(compiler instanceof EclipseCompiler))
	                          ^^^^^^^^^^^^^^^
Discouraged access: The type 'EclipseCompiler' is not API (restriction on classpath entry '/home/jenkins/agent/workspace/eclipse.jdt.core-SonarQube/org.eclipse.jdt.compiler.tool/target/classes')
79 problems (79 warnings)
[INFO] 
[INFO] --- tycho-eclipserun-plugin:1.5.0-SNAPSHOT:eclipse-run (default) @ org.eclipse.jdt.compiler.tool.tests ---
[INFO] 
[INFO] --- maven-resources-plugin:3.1.0:testResources (default-testResources) @ org.eclipse.jdt.compiler.tool.tests ---
[INFO] Using 'UTF-8' encoding to copy filtered resources.
[INFO] skip non existing resourceDirectory /home/jenkins/agent/workspace/eclipse.jdt.core-SonarQube/org.eclipse.jdt.compiler.tool.tests/src/test/resources
[INFO] 
[INFO] --- tycho-source-plugin:1.5.0-SNAPSHOT:plugin-source (plugin-source) @ org.eclipse.jdt.compiler.tool.tests ---
[INFO] Building jar: /home/jenkins/agent/workspace/eclipse.jdt.core-SonarQube/org.eclipse.jdt.compiler.tool.tests/target/org.eclipse.jdt.compiler.tool.tests-1.2.550-SNAPSHOT-sources.jar
[INFO] 
[INFO] --- target-platform-configuration:1.5.0-SNAPSHOT:target-platform (default-target-platform) @ org.eclipse.jdt.compiler.tool.tests ---
[INFO] 
[INFO] --- tycho-packaging-plugin:1.5.0-SNAPSHOT:package-plugin (default-package-plugin) @ org.eclipse.jdt.compiler.tool.tests ---
[INFO] Building jar: /home/jenkins/agent/workspace/eclipse.jdt.core-SonarQube/org.eclipse.jdt.compiler.tool.tests/target/org.eclipse.jdt.compiler.tool.tests-1.2.550-SNAPSHOT.jar
[INFO] 
[INFO] --- tycho-p2-plugin:1.5.0-SNAPSHOT:p2-metadata-default (default-p2-metadata-default) @ org.eclipse.jdt.compiler.tool.tests ---
[WARNING] No repository found at file:/noThanks.
org.eclipse.equinox.p2.core.ProvisionException: No repository found at file:/noThanks.
    at org.eclipse.equinox.internal.p2.repository.helpers.AbstractRepositoryManager.fail (AbstractRepositoryManager.java:396)
    at org.eclipse.equinox.internal.p2.repository.helpers.AbstractRepositoryManager.loadRepository (AbstractRepositoryManager.java:661)
    at org.eclipse.equinox.internal.p2.metadata.repository.MetadataRepositoryManager.loadRepository (MetadataRepositoryManager.java:110)
    at org.eclipse.tycho.p2.remote.RemoteMetadataRepositoryManager.loadRepository (RemoteMetadataRepositoryManager.java:61)
    at org.eclipse.tycho.p2.remote.RemoteMetadataRepositoryManager.loadRepository (RemoteMetadataRepositoryManager.java:53)
    at org.eclipse.tycho.p2.tools.baseline.BaselineServiceImpl.getProjectBaseline (BaselineServiceImpl.java:95)
    at org.eclipse.tycho.plugins.p2.BaselineValidator.validateAndReplace (BaselineValidator.java:88)
    at org.eclipse.tycho.plugins.p2.P2MetadataMojo.attachP2Metadata (P2MetadataMojo.java:180)
    at org.eclipse.tycho.plugins.p2.P2MetadataMojo.execute (P2MetadataMojo.java:135)
    at org.eclipse.tycho.plugins.p2.P2MetadataDefaultMojo.execute (P2MetadataDefaultMojo.java:33)
    at org.apache.maven.plugin.DefaultBuildPluginManager.executeMojo (DefaultBuildPluginManager.java:137)
    at org.apache.maven.lifecycle.internal.MojoExecutor.execute (MojoExecutor.java:210)
    at org.apache.maven.lifecycle.internal.MojoExecutor.execute (MojoExecutor.java:156)
    at org.apache.maven.lifecycle.internal.MojoExecutor.execute (MojoExecutor.java:148)
    at org.apache.maven.lifecycle.internal.LifecycleModuleBuilder.buildProject (LifecycleModuleBuilder.java:117)
    at org.apache.maven.lifecycle.internal.LifecycleModuleBuilder.buildProject (LifecycleModuleBuilder.java:81)
    at org.apache.maven.lifecycle.internal.builder.singlethreaded.SingleThreadedBuilder.build (SingleThreadedBuilder.java:56)
    at org.apache.maven.lifecycle.internal.LifecycleStarter.execute (LifecycleStarter.java:128)
    at org.apache.maven.DefaultMaven.doExecute (DefaultMaven.java:305)
    at org.apache.maven.DefaultMaven.doExecute (DefaultMaven.java:192)
    at org.apache.maven.DefaultMaven.execute (DefaultMaven.java:105)
    at org.apache.maven.cli.MavenCli.execute (MavenCli.java:956)
    at org.apache.maven.cli.MavenCli.doMain (MavenCli.java:288)
    at org.apache.maven.cli.MavenCli.main (MavenCli.java:192)
    at sun.reflect.NativeMethodAccessorImpl.invoke0 (Native Method)
    at sun.reflect.NativeMethodAccessorImpl.invoke (NativeMethodAccessorImpl.java:62)
    at sun.reflect.DelegatingMethodAccessorImpl.invoke (DelegatingMethodAccessorImpl.java:43)
    at java.lang.reflect.Method.invoke (Method.java:498)
    at org.codehaus.plexus.classworlds.launcher.Launcher.launchEnhanced (Launcher.java:289)
    at org.codehaus.plexus.classworlds.launcher.Launcher.launch (Launcher.java:229)
    at org.codehaus.plexus.classworlds.launcher.Launcher.mainWithExitCode (Launcher.java:415)
    at org.codehaus.plexus.classworlds.launcher.Launcher.main (Launcher.java:356)
[INFO] No baseline version MavenProject: org.eclipse.jdt:org.eclipse.jdt.compiler.tool.tests:1.2.550-SNAPSHOT @ /home/jenkins/agent/workspace/eclipse.jdt.core-SonarQube/org.eclipse.jdt.compiler.tool.tests/pom.xml
[INFO] 
[INFO] --- tycho-surefire-plugin:1.5.0-SNAPSHOT:test (default-test) @ org.eclipse.jdt.compiler.tool.tests ---
[INFO] Expected eclipse log file: /home/jenkins/agent/workspace/eclipse.jdt.core-SonarQube/org.eclipse.jdt.compiler.tool.tests/target/work/data/.metadata/.log
[INFO] Command line:
	[/opt/tools/java/oracle/jdk-8/1.8.0_202/jre/bin/java, -Dosgi.noShutdown=false, -Dosgi.os=linux, -Dosgi.ws=gtk, -Dosgi.arch=x86_64, -javaagent:/home/jenkins/agent/workspace/eclipse.jdt.core-SonarQube/.repository/org/jacoco/org.jacoco.agent/0.8.4/org.jacoco.agent-0.8.4-runtime.jar=destfile=/home/jenkins/agent/workspace/eclipse.jdt.core-SonarQube/jacoco.exec,append=true, -Dosgi.clean=true, -ea, -jar, /home/jenkins/agent/workspace/eclipse.jdt.core-SonarQube/.repository/p2/osgi/bundle/org.eclipse.equinox.launcher/1.5.500.v20190715-1310/org.eclipse.equinox.launcher-1.5.500.v20190715-1310.jar, -data, /home/jenkins/agent/workspace/eclipse.jdt.core-SonarQube/org.eclipse.jdt.compiler.tool.tests/target/work/data, -install, /home/jenkins/agent/workspace/eclipse.jdt.core-SonarQube/org.eclipse.jdt.compiler.tool.tests/target/work, -configuration, /home/jenkins/agent/workspace/eclipse.jdt.core-SonarQube/org.eclipse.jdt.compiler.tool.tests/target/work/configuration, -application, org.eclipse.tycho.surefire.osgibooter.headlesstest, -testproperties, /home/jenkins/agent/workspace/eclipse.jdt.core-SonarQube/org.eclipse.jdt.compiler.tool.tests/target/surefire.properties]
Running org.eclipse.jdt.compiler.tool.tests.AllTests
reflectNestedClassUseDollar=true based on version=1.8.0_202
CLASS_PATH
/home/jenkins/agent/workspace/eclipse.jdt.core-SonarQube/.repository/p2/osgi/bundle/org.eclipse.equinox.launcher/1.5.500.v20190715-1310/org.eclipse.equinox.launcher-1.5.500.v20190715-1310.jar
/home/jenkins/agent/workspace/eclipse.jdt.core-SonarQube/.repository/org/jacoco/org.jacoco.agent/0.8.4/org.jacoco.agent-0.8.4-runtime.jar
PLATFORM_CLASS_PATH
/opt/tools/java/oracle/jdk-8/1.8.0_202/jre/lib/sunrsasign.jar
/opt/tools/java/oracle/jdk-8/1.8.0_202/jre/lib/rt.jar
/opt/tools/java/oracle/jdk-8/1.8.0_202/jre/lib/resources.jar
/opt/tools/java/oracle/jdk-8/1.8.0_202/jre/lib/jfr.jar
/opt/tools/java/oracle/jdk-8/1.8.0_202/jre/lib/jce.jar
/opt/tools/java/oracle/jdk-8/1.8.0_202/jre/lib/charsets.jar
/opt/tools/java/oracle/jdk-8/1.8.0_202/jre/lib/jsse.jar
----------
1. ERROR in /tmp/X.java (at line 2)
	public class X extends File {}
	                       ^^^^
File cannot be resolved to a type
----------
1 problem (1 error)
----------
1. ERROR in /tmp/X.java (at line 2)
	public class X extends File {}
	                       ^^^^
File cannot be resolved to a type
----------
1 problem (1 error)
Tests run: 53, Failures: 0, Errors: 0, Skipped: 0, Time elapsed: 3.626 s - in org.eclipse.jdt.compiler.tool.tests.AllTests
testCompilerUnusedVariable(org.eclipse.jdt.compiler.tool.tests.CompilerToolTests)  Time elapsed: 0.519 s
testCompilerOneClassWithSystemCompiler2(org.eclipse.jdt.compiler.tool.tests.CompilerToolTests)  Time elapsed: 0.61 s
testCompilerOneClassWithSystemCompiler(org.eclipse.jdt.compiler.tool.tests.CompilerToolTests)  Time elapsed: 0.127 s
testCompilerOneClassWithEclipseCompiler(org.eclipse.jdt.compiler.tool.tests.CompilerToolTests)  Time elapsed: 0.041 s
testCheckOptions(org.eclipse.jdt.compiler.tool.tests.CompilerToolTests)  Time elapsed: 0.002 s
testSupportedCompilerVersions(org.eclipse.jdt.compiler.tool.tests.CompilerToolTests)  Time elapsed: 0 s
testFileManager2(org.eclipse.jdt.compiler.tool.tests.CompilerToolTests)  Time elapsed: 0.002 s
testCompilerOneClassWithEclipseCompiler2(org.eclipse.jdt.compiler.tool.tests.CompilerToolTests)  Time elapsed: 0.067 s
testCompilerOneClassWithEclipseCompiler3(org.eclipse.jdt.compiler.tool.tests.CompilerToolTests)  Time elapsed: 0.03 s
testCompilerOneClassWithEclipseCompiler4(org.eclipse.jdt.compiler.tool.tests.CompilerToolTests)  Time elapsed: 0.028 s
testCompilerOneClassWithEclipseCompiler5(org.eclipse.jdt.compiler.tool.tests.CompilerToolTests)  Time elapsed: 0.04 s
testCompilerOneClassWithEclipseCompiler6(org.eclipse.jdt.compiler.tool.tests.CompilerToolTests)  Time elapsed: 0 s
testCompilerOneClassWithEclipseCompiler7(org.eclipse.jdt.compiler.tool.tests.CompilerToolTests)  Time elapsed: 0.027 s
testCleanUp(org.eclipse.jdt.compiler.tool.tests.CompilerToolTests)  Time elapsed: 0 s
testCompilerUnusedVariable2(org.eclipse.jdt.compiler.tool.tests.CompilerToolTests)  Time elapsed: 0.039 s
testFileManager(org.eclipse.jdt.compiler.tool.tests.CompilerToolTests)  Time elapsed: 0.001 s
testInferBinaryName(org.eclipse.jdt.compiler.tool.tests.CompilerToolTests)  Time elapsed: 0.001 s
testAsPath(org.eclipse.jdt.compiler.tool.tests.CompilerToolJava9Tests)  Time elapsed: 0.001 s
testBug533830_1(org.eclipse.jdt.compiler.tool.tests.CompilerToolJava9Tests)  Time elapsed: 0 s
testClassOutputLocationForModule_1(org.eclipse.jdt.compiler.tool.tests.CompilerToolJava9Tests)  Time elapsed: 0 s
testClassOutputLocationForModule_2(org.eclipse.jdt.compiler.tool.tests.CompilerToolJava9Tests)  Time elapsed: 0 s
testContains(org.eclipse.jdt.compiler.tool.tests.CompilerToolJava9Tests)  Time elapsed: 0 s
testGetJavaFileObjects(org.eclipse.jdt.compiler.tool.tests.CompilerToolJava9Tests)  Time elapsed: 0 s
testGetJavaFileObjects2(org.eclipse.jdt.compiler.tool.tests.CompilerToolJava9Tests)  Time elapsed: 0 s
testGetLocationForModule1(org.eclipse.jdt.compiler.tool.tests.CompilerToolJava9Tests)  Time elapsed: 0 s
testGetLocationForModule2(org.eclipse.jdt.compiler.tool.tests.CompilerToolJava9Tests)  Time elapsed: 0.001 s
testGetLocationForModule3(org.eclipse.jdt.compiler.tool.tests.CompilerToolJava9Tests)  Time elapsed: 0 s
testGetServiceLoader(org.eclipse.jdt.compiler.tool.tests.CompilerToolJava9Tests)  Time elapsed: 0 s
testInferModuleName(org.eclipse.jdt.compiler.tool.tests.CompilerToolJava9Tests)  Time elapsed: 0 s
testListLocationsForModules(org.eclipse.jdt.compiler.tool.tests.CompilerToolJava9Tests)  Time elapsed: 0 s
testOptionRelease1(org.eclipse.jdt.compiler.tool.tests.CompilerToolJava9Tests)  Time elapsed: 0 s
testOptionRelease2(org.eclipse.jdt.compiler.tool.tests.CompilerToolJava9Tests)  Time elapsed: 0 s
testOptionRelease3(org.eclipse.jdt.compiler.tool.tests.CompilerToolJava9Tests)  Time elapsed: 0 s
testSetLocationAsPaths(org.eclipse.jdt.compiler.tool.tests.CompilerToolJava9Tests)  Time elapsed: 0 s
testSupportedCompilerVersions(org.eclipse.jdt.compiler.tool.tests.CompilerToolJava9Tests)  Time elapsed: 0.001 s
test001_basic - 1.6(org.eclipse.jdt.compiler.tool.tests.CompilerInvocationTests)  Time elapsed: 0.101 s
test002_dash_d_option - 1.6(org.eclipse.jdt.compiler.tool.tests.CompilerInvocationTests)  Time elapsed: 0.063 s
test003_dash_d_option - 1.6(org.eclipse.jdt.compiler.tool.tests.CompilerInvocationTests)  Time elapsed: 0.064 s
test004_no_dash_d_option - 1.6(org.eclipse.jdt.compiler.tool.tests.CompilerInvocationTests)  Time elapsed: 0.042 s
test005_dash_d_option_custom_file_manager - 1.6(org.eclipse.jdt.compiler.tool.tests.CompilerInvocationTests)  Time elapsed: 0.049 s
test006_no_dash_d_option_custom_file_manager - 1.6(org.eclipse.jdt.compiler.tool.tests.CompilerInvocationTests)  Time elapsed: 0.039 s
test007_options_consumption - 1.6(org.eclipse.jdt.compiler.tool.tests.CompilerInvocationTests)  Time elapsed: 0.001 s
test008_options_consumption - 1.6(org.eclipse.jdt.compiler.tool.tests.CompilerInvocationTests)  Time elapsed: 0.001 s
test009_options_consumption - 1.6(org.eclipse.jdt.compiler.tool.tests.CompilerInvocationTests)  Time elapsed: 0 s
test010_inappropriate_encoding_diagnosis - 1.6(org.eclipse.jdt.compiler.tool.tests.CompilerInvocationTests)  Time elapsed: 0.005 s
test011_inappropriate_encoding_diagnosis - 1.6(org.eclipse.jdt.compiler.tool.tests.CompilerInvocationTests)  Time elapsed: 0.001 s
test012_files_access_read - 1.6(org.eclipse.jdt.compiler.tool.tests.CompilerInvocationTests)  Time elapsed: 0.039 s
test015_files_access_write - 1.6(org.eclipse.jdt.compiler.tool.tests.CompilerInvocationTests)  Time elapsed: 0.032 s
test016_files_access_write - 1.6(org.eclipse.jdt.compiler.tool.tests.CompilerInvocationTests)  Time elapsed: 0.128 s
test017_sourcepath_without_destination - 1.6(org.eclipse.jdt.compiler.tool.tests.CompilerInvocationTests)  Time elapsed: 0.13 s
test019_sourcepath_without_destination - 1.6(org.eclipse.jdt.compiler.tool.tests.CompilerInvocationTests)  Time elapsed: 0.128 s
test021_output_streams - 1.6(org.eclipse.jdt.compiler.tool.tests.CompilerInvocationTests)  Time elapsed: 0.002 s
test022_output_streams - 1.6(org.eclipse.jdt.compiler.tool.tests.CompilerInvocationTests)  Time elapsed: 0.001 s

Results:

Tests run: 53, Failures: 0, Errors: 0, Skipped: 0

[INFO] All tests passed!
[INFO] 
[INFO] --- tycho-p2-extras-plugin:1.5.0-SNAPSHOT:compare-version-with-baselines (compare-attached-artifacts-with-release) @ org.eclipse.jdt.compiler.tool.tests ---
[INFO] Skipped
[INFO] 
[INFO] ---------< org.eclipse.jdt:org.eclipse.jdt.core.tests.builder >---------
[INFO] Building org.eclipse.jdt.core.tests.builder 3.10.750-SNAPSHOT     [9/17]
[INFO] ------------------------[ eclipse-test-plugin ]-------------------------
[INFO] 
[INFO] --- maven-clean-plugin:3.1.0:clean (default-clean) @ org.eclipse.jdt.core.tests.builder ---
[INFO] 
[INFO] --- tycho-packaging-plugin:1.5.0-SNAPSHOT:build-qualifier (default-build-qualifier) @ org.eclipse.jdt.core.tests.builder ---
[INFO] The project's OSGi version is 3.10.750.v20190924-1339
[INFO] 
[INFO] --- tycho-packaging-plugin:1.5.0-SNAPSHOT:validate-id (default-validate-id) @ org.eclipse.jdt.core.tests.builder ---
[INFO] 
[INFO] --- tycho-packaging-plugin:1.5.0-SNAPSHOT:validate-version (default-validate-version) @ org.eclipse.jdt.core.tests.builder ---
[INFO] 
[INFO] --- maven-resources-plugin:3.1.0:copy-resources (saveproperties) @ org.eclipse.jdt.core.tests.builder ---
[INFO] Using 'UTF-8' encoding to copy filtered resources.
[INFO] skip non existing resourceDirectory /home/jenkins/agent/workspace/eclipse.jdt.core-SonarQube/org.eclipse.jdt.core.tests.builder/saveproperties
[INFO] 
[INFO] --- maven-enforcer-plugin:3.0.0-M2:enforce (enforce-maven) @ org.eclipse.jdt.core.tests.builder ---
[INFO] 
[INFO] --- maven-toolchains-plugin:1.1:toolchain (default) @ org.eclipse.jdt.core.tests.builder ---
[INFO] Required toolchain: jdk [ id='JavaSE-11' ]
[INFO] Found matching toolchain for type jdk: JDK[/opt/tools/java/openjdk/jdk-11/latest]
[INFO] 
[INFO] --- jacoco-maven-plugin:0.8.4:prepare-agent (jacoco-agent) @ org.eclipse.jdt.core.tests.builder ---
[INFO] tycho.testArgLine set to -javaagent:/home/jenkins/agent/workspace/eclipse.jdt.core-SonarQube/.repository/org/jacoco/org.jacoco.agent/0.8.4/org.jacoco.agent-0.8.4-runtime.jar=destfile=/home/jenkins/agent/workspace/eclipse.jdt.core-SonarQube/jacoco.exec,append=true
[INFO] 
[INFO] --- eclipse-cbi-plugin:1.1.8-SNAPSHOT:generate-api-build-xml (default) @ org.eclipse.jdt.core.tests.builder ---
[INFO] 
[INFO] --- maven-resources-plugin:3.1.0:resources (default-resources) @ org.eclipse.jdt.core.tests.builder ---
[INFO] Using 'UTF-8' encoding to copy filtered resources.
[INFO] skip non existing resourceDirectory /home/jenkins/agent/workspace/eclipse.jdt.core-SonarQube/org.eclipse.jdt.core.tests.builder/src/main/resources
[INFO] 
[INFO] --- maven-resources-plugin:3.1.0:resources (filter-resources) @ org.eclipse.jdt.core.tests.builder ---
[INFO] Using 'UTF-8' encoding to copy filtered resources.
[INFO] skip non existing resourceDirectory /home/jenkins/agent/workspace/eclipse.jdt.core-SonarQube/org.eclipse.jdt.core.tests.builder/src/main/resources
[INFO] 
[INFO] --- tycho-compiler-plugin:1.5.0-SNAPSHOT:compile (default-compile) @ org.eclipse.jdt.core.tests.builder ---
[INFO] Compiling 37 source files to /home/jenkins/agent/workspace/eclipse.jdt.core-SonarQube/org.eclipse.jdt.core.tests.builder/target/classes
[INFO] 
[INFO] --- tycho-eclipserun-plugin:1.5.0-SNAPSHOT:eclipse-run (default) @ org.eclipse.jdt.core.tests.builder ---
[INFO] 
[INFO] --- maven-resources-plugin:3.1.0:testResources (default-testResources) @ org.eclipse.jdt.core.tests.builder ---
[INFO] Using 'UTF-8' encoding to copy filtered resources.
[INFO] skip non existing resourceDirectory /home/jenkins/agent/workspace/eclipse.jdt.core-SonarQube/org.eclipse.jdt.core.tests.builder/src/test/resources
[INFO] 
[INFO] --- tycho-source-plugin:1.5.0-SNAPSHOT:plugin-source (plugin-source) @ org.eclipse.jdt.core.tests.builder ---
[INFO] Building jar: /home/jenkins/agent/workspace/eclipse.jdt.core-SonarQube/org.eclipse.jdt.core.tests.builder/target/org.eclipse.jdt.core.tests.builder-3.10.750-SNAPSHOT-sources.jar
[INFO] 
[INFO] --- target-platform-configuration:1.5.0-SNAPSHOT:target-platform (default-target-platform) @ org.eclipse.jdt.core.tests.builder ---
[INFO] 
[INFO] --- tycho-packaging-plugin:1.5.0-SNAPSHOT:package-plugin (default-package-plugin) @ org.eclipse.jdt.core.tests.builder ---
[INFO] Building jar: /home/jenkins/agent/workspace/eclipse.jdt.core-SonarQube/org.eclipse.jdt.core.tests.builder/target/org.eclipse.jdt.core.tests.builder-3.10.750-SNAPSHOT.jar
[INFO] 
[INFO] --- tycho-p2-plugin:1.5.0-SNAPSHOT:p2-metadata-default (default-p2-metadata-default) @ org.eclipse.jdt.core.tests.builder ---
[WARNING] No repository found at file:/noThanks.
org.eclipse.equinox.p2.core.ProvisionException: No repository found at file:/noThanks.
    at org.eclipse.equinox.internal.p2.repository.helpers.AbstractRepositoryManager.fail (AbstractRepositoryManager.java:396)
    at org.eclipse.equinox.internal.p2.repository.helpers.AbstractRepositoryManager.loadRepository (AbstractRepositoryManager.java:661)
    at org.eclipse.equinox.internal.p2.metadata.repository.MetadataRepositoryManager.loadRepository (MetadataRepositoryManager.java:110)
    at org.eclipse.tycho.p2.remote.RemoteMetadataRepositoryManager.loadRepository (RemoteMetadataRepositoryManager.java:61)
    at org.eclipse.tycho.p2.remote.RemoteMetadataRepositoryManager.loadRepository (RemoteMetadataRepositoryManager.java:53)
    at org.eclipse.tycho.p2.tools.baseline.BaselineServiceImpl.getProjectBaseline (BaselineServiceImpl.java:95)
    at org.eclipse.tycho.plugins.p2.BaselineValidator.validateAndReplace (BaselineValidator.java:88)
    at org.eclipse.tycho.plugins.p2.P2MetadataMojo.attachP2Metadata (P2MetadataMojo.java:180)
    at org.eclipse.tycho.plugins.p2.P2MetadataMojo.execute (P2MetadataMojo.java:135)
    at org.eclipse.tycho.plugins.p2.P2MetadataDefaultMojo.execute (P2MetadataDefaultMojo.java:33)
    at org.apache.maven.plugin.DefaultBuildPluginManager.executeMojo (DefaultBuildPluginManager.java:137)
    at org.apache.maven.lifecycle.internal.MojoExecutor.execute (MojoExecutor.java:210)
    at org.apache.maven.lifecycle.internal.MojoExecutor.execute (MojoExecutor.java:156)
    at org.apache.maven.lifecycle.internal.MojoExecutor.execute (MojoExecutor.java:148)
    at org.apache.maven.lifecycle.internal.LifecycleModuleBuilder.buildProject (LifecycleModuleBuilder.java:117)
    at org.apache.maven.lifecycle.internal.LifecycleModuleBuilder.buildProject (LifecycleModuleBuilder.java:81)
    at org.apache.maven.lifecycle.internal.builder.singlethreaded.SingleThreadedBuilder.build (SingleThreadedBuilder.java:56)
    at org.apache.maven.lifecycle.internal.LifecycleStarter.execute (LifecycleStarter.java:128)
    at org.apache.maven.DefaultMaven.doExecute (DefaultMaven.java:305)
    at org.apache.maven.DefaultMaven.doExecute (DefaultMaven.java:192)
    at org.apache.maven.DefaultMaven.execute (DefaultMaven.java:105)
    at org.apache.maven.cli.MavenCli.execute (MavenCli.java:956)
    at org.apache.maven.cli.MavenCli.doMain (MavenCli.java:288)
    at org.apache.maven.cli.MavenCli.main (MavenCli.java:192)
    at sun.reflect.NativeMethodAccessorImpl.invoke0 (Native Method)
    at sun.reflect.NativeMethodAccessorImpl.invoke (NativeMethodAccessorImpl.java:62)
    at sun.reflect.DelegatingMethodAccessorImpl.invoke (DelegatingMethodAccessorImpl.java:43)
    at java.lang.reflect.Method.invoke (Method.java:498)
    at org.codehaus.plexus.classworlds.launcher.Launcher.launchEnhanced (Launcher.java:289)
    at org.codehaus.plexus.classworlds.launcher.Launcher.launch (Launcher.java:229)
    at org.codehaus.plexus.classworlds.launcher.Launcher.mainWithExitCode (Launcher.java:415)
    at org.codehaus.plexus.classworlds.launcher.Launcher.main (Launcher.java:356)
[INFO] No baseline version MavenProject: org.eclipse.jdt:org.eclipse.jdt.core.tests.builder:3.10.750-SNAPSHOT @ /home/jenkins/agent/workspace/eclipse.jdt.core-SonarQube/org.eclipse.jdt.core.tests.builder/pom.xml
[INFO] 
[INFO] --- tycho-surefire-plugin:1.5.0-SNAPSHOT:test (default-test) @ org.eclipse.jdt.core.tests.builder ---
[INFO] Toolchain in tycho-surefire-plugin: JDK[/opt/tools/java/openjdk/jdk-11/latest]
[INFO] Expected eclipse log file: /home/jenkins/agent/workspace/eclipse.jdt.core-SonarQube/org.eclipse.jdt.core.tests.builder/target/work/data/.metadata/.log
[INFO] Command line:
	[/opt/tools/java/openjdk/jdk-11/latest/bin/java, -Dosgi.noShutdown=false, -Dosgi.os=linux, -Dosgi.ws=gtk, -Dosgi.arch=x86_64, --add-modules, ALL-SYSTEM, -Dcompliance=1.4,1.7,1.8,11, -Dosgi.clean=true, -ea, -jar, /home/jenkins/agent/workspace/eclipse.jdt.core-SonarQube/.repository/p2/osgi/bundle/org.eclipse.equinox.launcher/1.5.500.v20190715-1310/org.eclipse.equinox.launcher-1.5.500.v20190715-1310.jar, -data, /home/jenkins/agent/workspace/eclipse.jdt.core-SonarQube/org.eclipse.jdt.core.tests.builder/target/work/data, -install, /home/jenkins/agent/workspace/eclipse.jdt.core-SonarQube/org.eclipse.jdt.core.tests.builder/target/work, -configuration, /home/jenkins/agent/workspace/eclipse.jdt.core-SonarQube/org.eclipse.jdt.core.tests.builder/target/work/configuration, -application, org.eclipse.tycho.surefire.osgibooter.headlesstest, -testproperties, /home/jenkins/agent/workspace/eclipse.jdt.core-SonarQube/org.eclipse.jdt.core.tests.builder/target/surefire.properties]
Running org.eclipse.jdt.core.tests.builder.BuilderTests
reflectNestedClassUseDollar=true due to isJRE9Plus
Problem : One or more cycles were detected in the build path of project 'P1'. The paths towards the cycle and cycle are:
->{P1, P2} [ resource : </P1> range : <-1,-1> category : <10> severity : <2>]
Problem : One or more cycles were detected in the build path of project 'P2'. The paths towards the cycle and cycle are:
->{P1, P2} [ resource : </P2> range : <-1,-1> category : <10> severity : <2>]
Problem : The project cannot be built until build path errors are resolved [ resource : </P1> range : <-1,-1> category : <10> severity : <2>]
Problem : The project cannot be built until build path errors are resolved [ resource : </P2> range : <-1,-1> category : <10> severity : <2>]

Tests run: 339, Failures: 0, Errors: 6, Skipped: 0, Time elapsed: 147.825 s <<< FAILURE! - in org.eclipse.jdt.core.tests.builder.BuilderTests
test001(org.eclipse.jdt.core.tests.builder.AbstractMethodTests)  Time elapsed: 1.356 s
test002(org.eclipse.jdt.core.tests.builder.AbstractMethodTests)  Time elapsed: 0.574 s
test003(org.eclipse.jdt.core.tests.builder.AbstractMethodTests)  Time elapsed: 0.198 s
testBuild(org.eclipse.jdt.core.tests.builder.BasicBuildTests)  Time elapsed: 0.2 s
testToDoMarker(org.eclipse.jdt.core.tests.builder.BasicBuildTests)  Time elapsed: 0.177 s
testToDoMarker2(org.eclipse.jdt.core.tests.builder.BasicBuildTests)  Time elapsed: 0.169 s
testTags(org.eclipse.jdt.core.tests.builder.BasicBuildTests)  Time elapsed: 0.15 s
testTags2(org.eclipse.jdt.core.tests.builder.BasicBuildTests)  Time elapsed: 0.163 s
testTags3(org.eclipse.jdt.core.tests.builder.BasicBuildTests)  Time elapsed: 0.135 s
testUnusedImport(org.eclipse.jdt.core.tests.builder.BasicBuildTests)  Time elapsed: 0.161 s
test98667(org.eclipse.jdt.core.tests.builder.BasicBuildTests)  Time elapsed: 0.143 s
testBug164707(org.eclipse.jdt.core.tests.builder.BasicBuildTests)  Time elapsed: 0.082 s
testTags4(org.eclipse.jdt.core.tests.builder.BasicBuildTests)  Time elapsed: 0.136 s
testBug392727(org.eclipse.jdt.core.tests.builder.BasicBuildTests)  Time elapsed: 0.163 s
testbBug386901(org.eclipse.jdt.core.tests.builder.BasicBuildTests)  Time elapsed: 0.174 s
testBug425420(org.eclipse.jdt.core.tests.builder.BasicBuildTests)  Time elapsed: 0.03 s
testBug549942(org.eclipse.jdt.core.tests.builder.BasicBuildTests)  Time elapsed: 0.163 s
testClasspathFileChange(org.eclipse.jdt.core.tests.builder.BuildpathTests)  Time elapsed: 0.324 s
testClosedProject(org.eclipse.jdt.core.tests.builder.BuildpathTests)  Time elapsed: 1.205 s
testCorruptBuilder(org.eclipse.jdt.core.tests.builder.BuildpathTests)  Time elapsed: 0.909 s
testCorruptBuilder2(org.eclipse.jdt.core.tests.builder.BuildpathTests)  Time elapsed: 3.156 s
testChangeExternalFolder(org.eclipse.jdt.core.tests.builder.BuildpathTests)  Time elapsed: 3.28 s
testChangeZIPArchive1(org.eclipse.jdt.core.tests.builder.BuildpathTests)  Time elapsed: 1.153 s
testChangeZIPArchive2(org.eclipse.jdt.core.tests.builder.BuildpathTests)  Time elapsed: 1.219 s
testExternalJarChange(org.eclipse.jdt.core.tests.builder.BuildpathTests)  Time elapsed: 1.137 s
testMissingBuilder(org.eclipse.jdt.core.tests.builder.BuildpathTests)  Time elapsed: 0.255 s
testMissingFieldType(org.eclipse.jdt.core.tests.builder.BuildpathTests)  Time elapsed: 0.282 s
testMissingLibrary1(org.eclipse.jdt.core.tests.builder.BuildpathTests)  Time elapsed: 0.092 s
testMissingLibrary2(org.eclipse.jdt.core.tests.builder.BuildpathTests)  Time elapsed: 1.282 s
testMissingLibrary3(org.eclipse.jdt.core.tests.builder.BuildpathTests)  Time elapsed: 2.032 s
testMissingLibrary4(org.eclipse.jdt.core.tests.builder.BuildpathTests)  Time elapsed: 1.022 s
testIncompatibleJdkLEvelOnProject(org.eclipse.jdt.core.tests.builder.BuildpathTests)  Time elapsed: 2.076 s
testIncompatibleJdkLEvelOnWksp(org.eclipse.jdt.core.tests.builder.BuildpathTests)  Time elapsed: 3.166 s
testMissingProject(org.eclipse.jdt.core.tests.builder.BuildpathTests)  Time elapsed: 4.305 s
testMissingOptionalProject(org.eclipse.jdt.core.tests.builder.BuildpathTests)  Time elapsed: 1.003 s
test0100(org.eclipse.jdt.core.tests.builder.BuildpathTests)  Time elapsed: 0.002 s
testMissingOutputFolder(org.eclipse.jdt.core.tests.builder.BuildpathTests)  Time elapsed: 0.016 s
testFilteredResources(org.eclipse.jdt.core.tests.builder.CopyResourceTests)  Time elapsed: 0.204 s
testSimpleProject(org.eclipse.jdt.core.tests.builder.CopyResourceTests)  Time elapsed: 0.273 s
testProjectWithBin(org.eclipse.jdt.core.tests.builder.CopyResourceTests)  Time elapsed: 0.118 s
testProjectWithSrcBin(org.eclipse.jdt.core.tests.builder.CopyResourceTests)  Time elapsed: 0.171 s
testProjectWith2SrcBin(org.eclipse.jdt.core.tests.builder.CopyResourceTests)  Time elapsed: 0.118 s
testProjectWith2SrcAsBin(org.eclipse.jdt.core.tests.builder.CopyResourceTests)  Time elapsed: 0.125 s
testProjectWith2Src2Bin(org.eclipse.jdt.core.tests.builder.CopyResourceTests)  Time elapsed: 0.216 s
test2ProjectWith1Bin(org.eclipse.jdt.core.tests.builder.CopyResourceTests)  Time elapsed: 0.182 s
testBug154693(org.eclipse.jdt.core.tests.builder.CopyResourceTests)  Time elapsed: 0.164 s
testBug194420(org.eclipse.jdt.core.tests.builder.CopyResourceTests)  Time elapsed: 0.11 s
testAbstractMethod(org.eclipse.jdt.core.tests.builder.DependencyTests)  Time elapsed: 0.32 s
testCaseInvariantType(org.eclipse.jdt.core.tests.builder.DependencyTests)  Time elapsed: 0.194 s
testExactMethodDeleting(org.eclipse.jdt.core.tests.builder.DependencyTests)  Time elapsed: 0.192 s
testExactMethodVisibility(org.eclipse.jdt.core.tests.builder.DependencyTests)  Time elapsed: 0.182 s
testExternalJarChanged(org.eclipse.jdt.core.tests.builder.DependencyTests)  Time elapsed: 2.11 s
testFieldDeleting(org.eclipse.jdt.core.tests.builder.DependencyTests)  Time elapsed: 0.137 s
testFieldVisibility(org.eclipse.jdt.core.tests.builder.DependencyTests)  Time elapsed: 0.188 s
testInterfaceDeleting(org.eclipse.jdt.core.tests.builder.DependencyTests)  Time elapsed: 0.204 s
testMemberTypeDeleting(org.eclipse.jdt.core.tests.builder.DependencyTests)  Time elapsed: 0.194 s
testMemberTypeVisibility(org.eclipse.jdt.core.tests.builder.DependencyTests)  Time elapsed: 0.2 s
testMethodDeleting(org.eclipse.jdt.core.tests.builder.DependencyTests)  Time elapsed: 0.205 s
testMethodVisibility(org.eclipse.jdt.core.tests.builder.DependencyTests)  Time elapsed: 0.173 s
testMissingClassFile(org.eclipse.jdt.core.tests.builder.DependencyTests)  Time elapsed: 0.327 s
testSecondaryTypeDeleting(org.eclipse.jdt.core.tests.builder.DependencyTests)  Time elapsed: 0.112 s
testTypeDeleting(org.eclipse.jdt.core.tests.builder.DependencyTests)  Time elapsed: 0.131 s
testTypeVisibility(org.eclipse.jdt.core.tests.builder.DependencyTests)  Time elapsed: 0.183 s
testTypeVisibility2(org.eclipse.jdt.core.tests.builder.DependencyTests)  Time elapsed: 0.201 s
testTypeVariable(org.eclipse.jdt.core.tests.builder.DependencyTests)  Time elapsed: 0.003 s
test0100(org.eclipse.jdt.core.tests.builder.DependencyTests)  Time elapsed: 0.085 s
testErrors(org.eclipse.jdt.core.tests.builder.ErrorsTests)  Time elapsed: 0.148 s
testRenameToNonJava(org.eclipse.jdt.core.tests.builder.ErrorsTests)  Time elapsed: 0.118 s
test0100(org.eclipse.jdt.core.tests.builder.ErrorsTests)  Time elapsed: 0.12 s
test0101(org.eclipse.jdt.core.tests.builder.ErrorsTests)  Time elapsed: 0.122 s
test0102(org.eclipse.jdt.core.tests.builder.ErrorsTests)  Time elapsed: 0.13 s
test0103(org.eclipse.jdt.core.tests.builder.ErrorsTests)  Time elapsed: 0.11 s
test0104(org.eclipse.jdt.core.tests.builder.ErrorsTests)  Time elapsed: 0.017 s
test0106(org.eclipse.jdt.core.tests.builder.ErrorsTests)  Time elapsed: 0.16 s
test0107(org.eclipse.jdt.core.tests.builder.ErrorsTests)  Time elapsed: 0.115 s
test0108(org.eclipse.jdt.core.tests.builder.ErrorsTests)  Time elapsed: 0.152 s
test0109(org.eclipse.jdt.core.tests.builder.ErrorsTests)  Time elapsed: 0.168 s
test0110(org.eclipse.jdt.core.tests.builder.ErrorsTests)  Time elapsed: 0.161 s
test0111(org.eclipse.jdt.core.tests.builder.ErrorsTests)  Time elapsed: 0.128 s
test0112(org.eclipse.jdt.core.tests.builder.ErrorsTests)  Time elapsed: 0.119 s
testProjectAsClassFolder(org.eclipse.jdt.core.tests.builder.EfficiencyTests)  Time elapsed: 0.144 s
testEfficiency(org.eclipse.jdt.core.tests.builder.EfficiencyTests)  Time elapsed: 0.16 s
testMethodAddition(org.eclipse.jdt.core.tests.builder.EfficiencyTests)  Time elapsed: 0.206 s
testLocalTypeAddition(org.eclipse.jdt.core.tests.builder.EfficiencyTests)  Time elapsed: 0.271 s
testLocalTypeAddition2(org.eclipse.jdt.core.tests.builder.EfficiencyTests)  Time elapsed: 0.203 s
testLocalTypeRemoval(org.eclipse.jdt.core.tests.builder.EfficiencyTests)  Time elapsed: 0.225 s
testLocalTypeRemoval2(org.eclipse.jdt.core.tests.builder.EfficiencyTests)  Time elapsed: 0.2 s
testMissingType001(org.eclipse.jdt.core.tests.builder.EfficiencyTests)  Time elapsed: 0.303 s
testSuccess(org.eclipse.jdt.core.tests.builder.ExecutionTests)  Time elapsed: 0.576 s
testFailure(org.eclipse.jdt.core.tests.builder.ExecutionTests)  Time elapsed: 0.49 s
testAddDuplicateSecondaryType(org.eclipse.jdt.core.tests.builder.IncrementalTests)  Time elapsed: 0.492 s
testDefaultPackage(org.eclipse.jdt.core.tests.builder.IncrementalTests)  Time elapsed: 0.229 s
testDefaultPackage2(org.eclipse.jdt.core.tests.builder.IncrementalTests)  Time elapsed: 0.11 s
testNewJCL(org.eclipse.jdt.core.tests.builder.IncrementalTests)  Time elapsed: 0.093 s
testRenameMainType(org.eclipse.jdt.core.tests.builder.IncrementalTests)  Time elapsed: 0.27 s
testRemoveSecondaryType(org.eclipse.jdt.core.tests.builder.IncrementalTests)  Time elapsed: 0.218 s
testRemoveSecondaryType2(org.eclipse.jdt.core.tests.builder.IncrementalTests)  Time elapsed: 0.289 s
testMoveSecondaryType(org.eclipse.jdt.core.tests.builder.IncrementalTests)  Time elapsed: 0.321 s
testMoveMemberType(org.eclipse.jdt.core.tests.builder.IncrementalTests)  Time elapsed: 0.32 s
testMovePackage(org.eclipse.jdt.core.tests.builder.IncrementalTests)  Time elapsed: 0.201 s
testMovePackage2(org.eclipse.jdt.core.tests.builder.IncrementalTests)  Time elapsed: 0.191 s
testMemberTypeFromClassFile(org.eclipse.jdt.core.tests.builder.IncrementalTests)  Time elapsed: 0.2 s
testMemberTypeOfOtherProject(org.eclipse.jdt.core.tests.builder.IncrementalTests)  Time elapsed: 0.574 s
test$InTypeName(org.eclipse.jdt.core.tests.builder.IncrementalTests)  Time elapsed: 0.519 s
testObjectWithSuperInterfaces(org.eclipse.jdt.core.tests.builder.IncrementalTests)  Time elapsed: 0.36 s
testMemberTypeCollisionWithBinary(org.eclipse.jdt.core.tests.builder.IncrementalTests)  Time elapsed: 0.219 s
testMemberTypeCollisionWithBinary2(org.eclipse.jdt.core.tests.builder.IncrementalTests)  Time elapsed: 0.423 s
test129316(org.eclipse.jdt.core.tests.builder.IncrementalTests)  Time elapsed: 0.158 s
testSecondaryType(org.eclipse.jdt.core.tests.builder.IncrementalTests)  Time elapsed: 0.162 s
testMissingType001(org.eclipse.jdt.core.tests.builder.IncrementalTests)  Time elapsed: 0.153 s
testMissingType002(org.eclipse.jdt.core.tests.builder.IncrementalTests)  Time elapsed: 0.211 s
testMissingType003(org.eclipse.jdt.core.tests.builder.IncrementalTests)  Time elapsed: 0.132 s
testBug334377(org.eclipse.jdt.core.tests.builder.IncrementalTests)  Time elapsed: 0.164 s
testBug364450(org.eclipse.jdt.core.tests.builder.IncrementalTests)  Time elapsed: 1.304 s
testRemovePackageInDependencyProject(org.eclipse.jdt.core.tests.builder.IncrementalTests)  Time elapsed: 0.171 s
testBug526376(org.eclipse.jdt.core.tests.builder.IncrementalTests)  Time elapsed: 0.246 s
test423122(org.eclipse.jdt.core.tests.builder.IncrementalTests18)  Time elapsed: 0.198 s
test423122a(org.eclipse.jdt.core.tests.builder.IncrementalTests18)  Time elapsed: 0.257 s
test427105(org.eclipse.jdt.core.tests.builder.IncrementalTests18)  Time elapsed: 0.329 s
test427105a(org.eclipse.jdt.core.tests.builder.IncrementalTests18)  Time elapsed: 0.24 s
test428071(org.eclipse.jdt.core.tests.builder.IncrementalTests18)  Time elapsed: 0.191 s
test430425(org.eclipse.jdt.core.tests.builder.IncrementalTests18)  Time elapsed: 0.047 s
test435544(org.eclipse.jdt.core.tests.builder.IncrementalTests18)  Time elapsed: 0.334 s
test445049(org.eclipse.jdt.core.tests.builder.IncrementalTests18)  Time elapsed: 0.358 s
testBug442452(org.eclipse.jdt.core.tests.builder.IncrementalTests18)  Time elapsed: 0.115 s
testBug442755(org.eclipse.jdt.core.tests.builder.IncrementalTests18)  Time elapsed: 0.113 s
testBug442755a(org.eclipse.jdt.core.tests.builder.IncrementalTests18)  Time elapsed: 0.104 s
testBug481276a(org.eclipse.jdt.core.tests.builder.IncrementalTests18)  Time elapsed: 0.307 s
testBug481276b(org.eclipse.jdt.core.tests.builder.IncrementalTests18)  Time elapsed: 0.273 s
testBug481276c(org.eclipse.jdt.core.tests.builder.IncrementalTests18)  Time elapsed: 0.317 s
testBug483744_remove(org.eclipse.jdt.core.tests.builder.IncrementalTests18)  Time elapsed: 0.224 s
testCompileOnlyDependent(org.eclipse.jdt.core.tests.builder.MultiProjectTests)  Time elapsed: 1.972 s
testCompileOnlyStructuralDependent(org.eclipse.jdt.core.tests.builder.MultiProjectTests)  Time elapsed: 3.096 s
testRemoveField(org.eclipse.jdt.core.tests.builder.MultiProjectTests)  Time elapsed: 3.042 s
testCompileOrder(org.eclipse.jdt.core.tests.builder.MultiProjectTests)  Time elapsed: 2.106 s
testCyclesCleared(org.eclipse.jdt.core.tests.builder.MultiProjectTests)  Time elapsed: 1.938 s
testCycle1(org.eclipse.jdt.core.tests.builder.MultiProjectTests)  Time elapsed: 1.14 s
testCycle2(org.eclipse.jdt.core.tests.builder.MultiProjectTests)  Time elapsed: 2.063 s
testCycle3(org.eclipse.jdt.core.tests.builder.MultiProjectTests)  Time elapsed: 2.022 s
testCycle4(org.eclipse.jdt.core.tests.builder.MultiProjectTests)  Time elapsed: 1.989 s
testCycle5(org.eclipse.jdt.core.tests.builder.MultiProjectTests)  Time elapsed: 3.058 s
testCycle6(org.eclipse.jdt.core.tests.builder.MultiProjectTests)  Time elapsed: 2.068 s
testCycle7(org.eclipse.jdt.core.tests.builder.MultiProjectTests)  Time elapsed: 1.067 s
testCycle8(org.eclipse.jdt.core.tests.builder.MultiProjectTests)  Time elapsed: 2.074 s
testExcludePartOfAnotherProject1(org.eclipse.jdt.core.tests.builder.MultiProjectTests)  Time elapsed: 1.009 s
testExcludePartOfAnotherProject2(org.eclipse.jdt.core.tests.builder.MultiProjectTests)  Time elapsed: 2.013 s
testExcludePartOfAnotherProject3(org.eclipse.jdt.core.tests.builder.MultiProjectTests)  Time elapsed: 2.201 s
testIncludePartOfAnotherProject1(org.eclipse.jdt.core.tests.builder.MultiProjectTests)  Time elapsed: 0.918 s
testIncludePartOfAnotherProject2(org.eclipse.jdt.core.tests.builder.MultiProjectTests)  Time elapsed: 2.051 s
testIncludePartOfAnotherProject3(org.eclipse.jdt.core.tests.builder.MultiProjectTests)  Time elapsed: 2.063 s
testIgnoreIfBetterNonAccessibleRule1(org.eclipse.jdt.core.tests.builder.MultiProjectTests)  Time elapsed: 2.175 s
testIgnoreIfBetterNonAccessibleRule2(org.eclipse.jdt.core.tests.builder.MultiProjectTests)  Time elapsed: 0.964 s
testMissingRequiredBinaries(org.eclipse.jdt.core.tests.builder.MultiProjectTests)  Time elapsed: 2.077 s
test100_class_folder_exported(org.eclipse.jdt.core.tests.builder.MultiProjectTests)  Time elapsed: 3.142 s
test101_class_folder_non_exported(org.eclipse.jdt.core.tests.builder.MultiProjectTests)  Time elapsed: 1.132 s
test102_missing_required_binaries(org.eclipse.jdt.core.tests.builder.MultiProjectTests)  Time elapsed: 1.321 s
test103_missing_required_binaries(org.eclipse.jdt.core.tests.builder.MultiProjectTests)  Time elapsed: 0.722 s
test104_missing_required_binaries(org.eclipse.jdt.core.tests.builder.MultiProjectTests)  Time elapsed: 1.986 s
test438923(org.eclipse.jdt.core.tests.builder.MultiProjectTests)  Time elapsed: 1.014 s
test461074(org.eclipse.jdt.core.tests.builder.MultiProjectTests)  Time elapsed: 1.072 s
test461074_error(org.eclipse.jdt.core.tests.builder.MultiProjectTests)  Time elapsed: 2.054 s
test0001(org.eclipse.jdt.core.tests.builder.MultiSourceFolderAndOutputFolderTests)  Time elapsed: 0.059 s
test0002(org.eclipse.jdt.core.tests.builder.MultiSourceFolderAndOutputFolderTests)  Time elapsed: 0.062 s
test0003(org.eclipse.jdt.core.tests.builder.MultiSourceFolderAndOutputFolderTests)  Time elapsed: 0.012 s
test0004(org.eclipse.jdt.core.tests.builder.MultiSourceFolderAndOutputFolderTests)  Time elapsed: 0.012 s
test0005(org.eclipse.jdt.core.tests.builder.MultiSourceFolderAndOutputFolderTests)  Time elapsed: 0.064 s
test0006(org.eclipse.jdt.core.tests.builder.MultiSourceFolderAndOutputFolderTests)  Time elapsed: 0.064 s
test0007(org.eclipse.jdt.core.tests.builder.MultiSourceFolderAndOutputFolderTests)  Time elapsed: 0.068 s
test0008(org.eclipse.jdt.core.tests.builder.MultiSourceFolderAndOutputFolderTests)  Time elapsed: 0.081 s
test0009(org.eclipse.jdt.core.tests.builder.MultiSourceFolderAndOutputFolderTests)  Time elapsed: 0.092 s
test0010(org.eclipse.jdt.core.tests.builder.MultiSourceFolderAndOutputFolderTests)  Time elapsed: 0.109 s
test0011(org.eclipse.jdt.core.tests.builder.MultiSourceFolderAndOutputFolderTests)  Time elapsed: 0.108 s
test0012(org.eclipse.jdt.core.tests.builder.MultiSourceFolderAndOutputFolderTests)  Time elapsed: 0.06 s
testChangeOutputFolder(org.eclipse.jdt.core.tests.builder.OutputFolderTests)  Time elapsed: 0.171 s
testDeleteOutputFolder(org.eclipse.jdt.core.tests.builder.OutputFolderTests)  Time elapsed: 0.075 s
testInvalidOutput(org.eclipse.jdt.core.tests.builder.OutputFolderTests)  Time elapsed: 0.06 s
testSimpleProject(org.eclipse.jdt.core.tests.builder.OutputFolderTests)  Time elapsed: 0.061 s
testProjectWithBin(org.eclipse.jdt.core.tests.builder.OutputFolderTests)  Time elapsed: 0.057 s
testProjectWithSrcBin(org.eclipse.jdt.core.tests.builder.OutputFolderTests)  Time elapsed: 0.056 s
testProjectWith2SrcBin(org.eclipse.jdt.core.tests.builder.OutputFolderTests)  Time elapsed: 0.076 s
testProjectWith2SrcAsBin(org.eclipse.jdt.core.tests.builder.OutputFolderTests)  Time elapsed: 0.068 s
testProjectWith2Src2Bin(org.eclipse.jdt.core.tests.builder.OutputFolderTests)  Time elapsed: 0.069 s
testProjectWith3Src2Bin(org.eclipse.jdt.core.tests.builder.OutputFolderTests)  Time elapsed: 0.072 s
test2ProjectWith1Bin(org.eclipse.jdt.core.tests.builder.OutputFolderTests)  Time elapsed: 0.143 s
testPackageProblem(org.eclipse.jdt.core.tests.builder.PackageTests)  Time elapsed: 0.125 s
testNoPackageProblem(org.eclipse.jdt.core.tests.builder.PackageTests)  Time elapsed: 0.093 s
test001(org.eclipse.jdt.core.tests.builder.PackageTests)  Time elapsed: 0.193 s
test002(org.eclipse.jdt.core.tests.builder.PackageTests)  Time elapsed: 0.114 s
testBoolean(org.eclipse.jdt.core.tests.builder.StaticFinalTests)  Time elapsed: 0.419 s
testByte(org.eclipse.jdt.core.tests.builder.StaticFinalTests)  Time elapsed: 0.396 s
testChar(org.eclipse.jdt.core.tests.builder.StaticFinalTests)  Time elapsed: 0.328 s
testDouble(org.eclipse.jdt.core.tests.builder.StaticFinalTests)  Time elapsed: 0.357 s
testFloat(org.eclipse.jdt.core.tests.builder.StaticFinalTests)  Time elapsed: 0.346 s
testInt(org.eclipse.jdt.core.tests.builder.StaticFinalTests)  Time elapsed: 0.322 s
testLong(org.eclipse.jdt.core.tests.builder.StaticFinalTests)  Time elapsed: 0.337 s
testShort(org.eclipse.jdt.core.tests.builder.StaticFinalTests)  Time elapsed: 0.328 s
testString(org.eclipse.jdt.core.tests.builder.StaticFinalTests)  Time elapsed: 0.341 s
test001(org.eclipse.jdt.core.tests.builder.GetResourcesTests)  Time elapsed: 0.11 s
test002(org.eclipse.jdt.core.tests.builder.GetResourcesTests)  Time elapsed: 0.104 s
test003(org.eclipse.jdt.core.tests.builder.GetResourcesTests)  Time elapsed: 0.128 s
test004(org.eclipse.jdt.core.tests.builder.GetResourcesTests)  Time elapsed: 0.2 s
test005(org.eclipse.jdt.core.tests.builder.GetResourcesTests)  Time elapsed: 0.12 s
test006(org.eclipse.jdt.core.tests.builder.GetResourcesTests)  Time elapsed: 0.121 s
test007(org.eclipse.jdt.core.tests.builder.GetResourcesTests)  Time elapsed: 0.115 s
test008(org.eclipse.jdt.core.tests.builder.GetResourcesTests)  Time elapsed: 0.103 s
test009(org.eclipse.jdt.core.tests.builder.GetResourcesTests)  Time elapsed: 0.053 s
test010(org.eclipse.jdt.core.tests.builder.GetResourcesTests)  Time elapsed: 0.113 s
test011(org.eclipse.jdt.core.tests.builder.GetResourcesTests)  Time elapsed: 0.111 s
test012(org.eclipse.jdt.core.tests.builder.GetResourcesTests)  Time elapsed: 0.103 s
test013(org.eclipse.jdt.core.tests.builder.GetResourcesTests)  Time elapsed: 0.114 s
test014(org.eclipse.jdt.core.tests.builder.GetResourcesTests)  Time elapsed: 0.103 s
test015(org.eclipse.jdt.core.tests.builder.GetResourcesTests)  Time elapsed: 0.111 s
test016(org.eclipse.jdt.core.tests.builder.GetResourcesTests)  Time elapsed: 0.002 s
testIncludes(org.eclipse.jdt.core.tests.builder.FriendDependencyTests)  Time elapsed: 0.001 s
testInternSimpleNames(org.eclipse.jdt.core.tests.builder.FriendDependencyTests)  Time elapsed: 0.002 s
testInternQualifiedNames(org.eclipse.jdt.core.tests.builder.FriendDependencyTests)  Time elapsed: 0.002 s
testGetReferences(org.eclipse.jdt.core.tests.builder.FriendDependencyTests)  Time elapsed: 0.001 s
testStringSetAdd(org.eclipse.jdt.core.tests.builder.FriendDependencyTests)  Time elapsed: 0.002 s
testStringSetclear(org.eclipse.jdt.core.tests.builder.FriendDependencyTests)  Time elapsed: 0.001 s
testStringSetNew(org.eclipse.jdt.core.tests.builder.FriendDependencyTests)  Time elapsed: 0.002 s
testStringSetElementSize(org.eclipse.jdt.core.tests.builder.FriendDependencyTests)  Time elapsed: 0.001 s
testSimpleLookupTableKeyTable(org.eclipse.jdt.core.tests.builder.FriendDependencyTests)  Time elapsed: 0.002 s
testSimpleLookupTableValueTable(org.eclipse.jdt.core.tests.builder.FriendDependencyTests)  Time elapsed: 0.001 s
testJavaModelManagerGetJavaModelManager(org.eclipse.jdt.core.tests.builder.FriendDependencyTests)  Time elapsed: 0.005 s
testJavaModelManagerGetLastBuiltState(org.eclipse.jdt.core.tests.builder.FriendDependencyTests)  Time elapsed: 0.001 s
testInternQualifiedNamesSorts_01(org.eclipse.jdt.core.tests.builder.ReferenceCollectionTest)  Time elapsed: 0.005 s
testInternQualifiedNamesSorts_02(org.eclipse.jdt.core.tests.builder.ReferenceCollectionTest)  Time elapsed: 0.001 s
testInternSimpleNamesSorts_01(org.eclipse.jdt.core.tests.builder.ReferenceCollectionTest)  Time elapsed: 0.002 s
testInternSimpleNamesSorts_02(org.eclipse.jdt.core.tests.builder.ReferenceCollectionTest)  Time elapsed: 0.001 s
testIncludesWithBinarySearch(org.eclipse.jdt.core.tests.builder.ReferenceCollectionTest)  Time elapsed: 0.002 s
testIncludesWithLinearSearch(org.eclipse.jdt.core.tests.builder.ReferenceCollectionTest)  Time elapsed: 0.001 s
testIncludes01(org.eclipse.jdt.core.tests.builder.ReferenceCollectionTest)  Time elapsed: 0.002 s
testIncludes02(org.eclipse.jdt.core.tests.builder.ReferenceCollectionTest)  Time elapsed: 0.001 s
testIncludes03(org.eclipse.jdt.core.tests.builder.ReferenceCollectionTest)  Time elapsed: 0.002 s
testIncludes04(org.eclipse.jdt.core.tests.builder.ReferenceCollectionTest)  Time elapsed: 0.001 s
testIncludesNot(org.eclipse.jdt.core.tests.builder.ReferenceCollectionTest)  Time elapsed: 0.002 s
testAddDependencies(org.eclipse.jdt.core.tests.builder.ReferenceCollectionTest)  Time elapsed: 0.001 s
testRegression01(org.eclipse.jdt.core.tests.builder.ReferenceCollectionTest)  Time elapsed: 0.002 s
testRegression02(org.eclipse.jdt.core.tests.builder.ReferenceCollectionTest)  Time elapsed: 0.001 s
testWriteAndReadState(org.eclipse.jdt.core.tests.builder.StateTest)  Time elapsed: 0.122 s
testWithProjectAsMainDependency(org.eclipse.jdt.core.tests.builder.TestAttributeBuilderTests)  Time elapsed: 0.134 s
testWithProjectAsTestDependency(org.eclipse.jdt.core.tests.builder.TestAttributeBuilderTests)  Time elapsed: 0.109 s
testWithProjectAsMainDependencyWithoutTestCode(org.eclipse.jdt.core.tests.builder.TestAttributeBuilderTests)  Time elapsed: 0.14 s
testWithProjectAsTestDependencyWithoutTestCode(org.eclipse.jdt.core.tests.builder.TestAttributeBuilderTests)  Time elapsed: 0.16 s
testIncrementalBuildMainChange(org.eclipse.jdt.core.tests.builder.TestAttributeBuilderTests)  Time elapsed: 0.11 s
testIncrementalBuildTestChange(org.eclipse.jdt.core.tests.builder.TestAttributeBuilderTests)  Time elapsed: 0.115 s
testIncrementalBuildTestOnlyProject(org.eclipse.jdt.core.tests.builder.TestAttributeBuilderTests)  Time elapsed: 0.049 s
testClasspathEntryTestAttributeChanges(org.eclipse.jdt.core.tests.builder.TestAttributeBuilderTests)  Time elapsed: 0.255 s
testExternalTestJarChanged(org.eclipse.jdt.core.tests.builder.TestAttributeBuilderTests)  Time elapsed: 2.107 s
testBug536868(org.eclipse.jdt.core.tests.builder.TestAttributeBuilderTests)  Time elapsed: 0.138 s
testBug530366(org.eclipse.jdt.core.tests.builder.Bug530366Test)  Time elapsed: 0.161 s
testBug531382(org.eclipse.jdt.core.tests.builder.Bug531382Test)  Time elapsed: 0.141 s
testBug549457(org.eclipse.jdt.core.tests.builder.Bug549457Test)  Time elapsed: 3.35 s
testLeaksOnCleanBuild(org.eclipse.jdt.core.tests.builder.LeakTestsBefore9)  Time elapsed: 0.088 s  <<< ERROR!
java.io.IOException: Cannot run program "lsof": error=2, No such file or directory
	at org.eclipse.jdt.core.tests.builder.LeakTestsBefore9.testLeaksOnCleanBuild(LeakTestsBefore9.java:36)
Caused by: java.io.IOException: error=2, No such file or directory
	at org.eclipse.jdt.core.tests.builder.LeakTestsBefore9.testLeaksOnCleanBuild(LeakTestsBefore9.java:36)

testLeaksOnFullBuild(org.eclipse.jdt.core.tests.builder.LeakTestsBefore9)  Time elapsed: 0.074 s  <<< ERROR!
java.io.IOException: Cannot run program "lsof": error=2, No such file or directory
	at org.eclipse.jdt.core.tests.builder.LeakTestsBefore9.testLeaksOnFullBuild(LeakTestsBefore9.java:41)
Caused by: java.io.IOException: error=2, No such file or directory
	at org.eclipse.jdt.core.tests.builder.LeakTestsBefore9.testLeaksOnFullBuild(LeakTestsBefore9.java:41)

testLeaksOnIncrementalBuild(org.eclipse.jdt.core.tests.builder.LeakTestsBefore9)  Time elapsed: 0.085 s  <<< ERROR!
java.io.IOException: Cannot run program "lsof": error=2, No such file or directory
	at org.eclipse.jdt.core.tests.builder.LeakTestsBefore9.testLeaksOnIncrementalBuild(LeakTestsBefore9.java:46)
Caused by: java.io.IOException: error=2, No such file or directory
	at org.eclipse.jdt.core.tests.builder.LeakTestsBefore9.testLeaksOnIncrementalBuild(LeakTestsBefore9.java:46)

testAnnotation(org.eclipse.jdt.core.tests.builder.Java50Tests)  Time elapsed: 0.079 s
testHierarchyCycle(org.eclipse.jdt.core.tests.builder.Java50Tests)  Time elapsed: 0.078 s
testHierarchyCycleInstanceof(org.eclipse.jdt.core.tests.builder.Java50Tests)  Time elapsed: 0.091 s
testMissingRequiredBinaries(org.eclipse.jdt.core.tests.builder.Java50Tests)  Time elapsed: 0.372 s
testParameterizedMemberType(org.eclipse.jdt.core.tests.builder.Java50Tests)  Time elapsed: 0.198 s
testParameterizedType1(org.eclipse.jdt.core.tests.builder.Java50Tests)  Time elapsed: 0.133 s
testParameterizedType2(org.eclipse.jdt.core.tests.builder.Java50Tests)  Time elapsed: 0.185 s
testHierarchyNonCycle(org.eclipse.jdt.core.tests.builder.Java50Tests)  Time elapsed: 0.176 s
testHierarchyNonCycle2(org.eclipse.jdt.core.tests.builder.Java50Tests)  Time elapsed: 0.15 s
test001(org.eclipse.jdt.core.tests.builder.PackageInfoTest)  Time elapsed: 0.235 s
test002(org.eclipse.jdt.core.tests.builder.PackageInfoTest)  Time elapsed: 0.53 s
test003(org.eclipse.jdt.core.tests.builder.PackageInfoTest)  Time elapsed: 0.273 s
test004(org.eclipse.jdt.core.tests.builder.PackageInfoTest)  Time elapsed: 0.217 s
test258145(org.eclipse.jdt.core.tests.builder.PackageInfoTest)  Time elapsed: 0.352 s
test323785(org.eclipse.jdt.core.tests.builder.PackageInfoTest)  Time elapsed: 0.154 s
test323785a(org.eclipse.jdt.core.tests.builder.PackageInfoTest)  Time elapsed: 0.158 s
testBug372012(org.eclipse.jdt.core.tests.builder.PackageInfoTest)  Time elapsed: 0.248 s
testBug372012a(org.eclipse.jdt.core.tests.builder.PackageInfoTest)  Time elapsed: 0.189 s
testBug372012b(org.eclipse.jdt.core.tests.builder.PackageInfoTest)  Time elapsed: 0.303 s
testBug372012c(org.eclipse.jdt.core.tests.builder.PackageInfoTest)  Time elapsed: 0.28 s
testBug367836(org.eclipse.jdt.core.tests.builder.PackageInfoTest)  Time elapsed: 0.173 s
testBug374063(org.eclipse.jdt.core.tests.builder.PackageInfoTest)  Time elapsed: 0.254 s
testBug382960(org.eclipse.jdt.core.tests.builder.PackageInfoTest)  Time elapsed: 0.298 s
testBug525469(org.eclipse.jdt.core.tests.builder.PackageInfoTest)  Time elapsed: 0.486 s
testBuildStarting(org.eclipse.jdt.core.tests.builder.ParticipantBuildTests)  Time elapsed: 0.151 s
testDefaultValue(org.eclipse.jdt.core.tests.builder.ParticipantBuildTests)  Time elapsed: 0.548 s
testParticipantProblems(org.eclipse.jdt.core.tests.builder.ParticipantBuildTests)  Time elapsed: 0.112 s
testProcessAnnotationDeclarations(org.eclipse.jdt.core.tests.builder.ParticipantBuildTests)  Time elapsed: 0.12 s
testProcessAnnotationQualifiedReferences(org.eclipse.jdt.core.tests.builder.ParticipantBuildTests)  Time elapsed: 0.167 s
testProcessAnnotationReferences(org.eclipse.jdt.core.tests.builder.ParticipantBuildTests)  Time elapsed: 0.124 s
testResolvedMethod(org.eclipse.jdt.core.tests.builder.ParticipantBuildTests)  Time elapsed: 0.187 s
test1001(org.eclipse.jdt.core.tests.builder.ParticipantBuildTests)  Time elapsed: 0.106 s
test1002(org.eclipse.jdt.core.tests.builder.ParticipantBuildTests)  Time elapsed: 0.112 s
testTypeAnnotationDependency(org.eclipse.jdt.core.tests.builder.AnnotationDependencyTests)  Time elapsed: 0.132 s
testFieldAnnotationDependency(org.eclipse.jdt.core.tests.builder.AnnotationDependencyTests)  Time elapsed: 0.13 s
testMethodAnnotationDependency(org.eclipse.jdt.core.tests.builder.AnnotationDependencyTests)  Time elapsed: 0.135 s
testInnerTypeAnnotationDependency(org.eclipse.jdt.core.tests.builder.AnnotationDependencyTests)  Time elapsed: 0.123 s
testUnrelatedTypeAnnotationDependency(org.eclipse.jdt.core.tests.builder.AnnotationDependencyTests)  Time elapsed: 0.114 s
testPackageInfoDependency(org.eclipse.jdt.core.tests.builder.AnnotationDependencyTests)  Time elapsed: 0.147 s
testTypeAnnotationDependency2(org.eclipse.jdt.core.tests.builder.AnnotationDependencyTests)  Time elapsed: 0.164 s
testTypeAnnotationDependency3(org.eclipse.jdt.core.tests.builder.AnnotationDependencyTests)  Time elapsed: 0.131 s
testTypeAnnotationDependency4(org.eclipse.jdt.core.tests.builder.AnnotationDependencyTests)  Time elapsed: 0.124 s
testTypeAnnotationDependency5(org.eclipse.jdt.core.tests.builder.AnnotationDependencyTests)  Time elapsed: 0.133 s
testTypeAnnotationDependency6(org.eclipse.jdt.core.tests.builder.AnnotationDependencyTests)  Time elapsed: 0.133 s
testTypeAnnotationDependency7(org.eclipse.jdt.core.tests.builder.AnnotationDependencyTests)  Time elapsed: 0.144 s
testTypeAnnotationDependency8(org.eclipse.jdt.core.tests.builder.AnnotationDependencyTests)  Time elapsed: 0.157 s
testTypeAnnotationDependency9(org.eclipse.jdt.core.tests.builder.AnnotationDependencyTests)  Time elapsed: 0.149 s
testTypeAnnotationDependency10(org.eclipse.jdt.core.tests.builder.AnnotationDependencyTests)  Time elapsed: 0.152 s
testTypeAnnotationDependency11(org.eclipse.jdt.core.tests.builder.AnnotationDependencyTests)  Time elapsed: 0.157 s
testTypeAnnotationDependency12(org.eclipse.jdt.core.tests.builder.AnnotationDependencyTests)  Time elapsed: 0.139 s
testTypeAnnotationDependency13(org.eclipse.jdt.core.tests.builder.AnnotationDependencyTests)  Time elapsed: 0.12 s
testTypeAnnotationDependency14(org.eclipse.jdt.core.tests.builder.AnnotationDependencyTests)  Time elapsed: 0.113 s
testTypeAnnotationDependency15(org.eclipse.jdt.core.tests.builder.AnnotationDependencyTests)  Time elapsed: 0.124 s
testTypeAnnotationDependency16(org.eclipse.jdt.core.tests.builder.AnnotationDependencyTests)  Time elapsed: 0.14 s
testTypeAnnotationDependency17(org.eclipse.jdt.core.tests.builder.AnnotationDependencyTests)  Time elapsed: 0.119 s
testTypeAnnotationDependency18(org.eclipse.jdt.core.tests.builder.AnnotationDependencyTests)  Time elapsed: 0.119 s
testTypeAnnotationDependency19(org.eclipse.jdt.core.tests.builder.AnnotationDependencyTests)  Time elapsed: 0.12 s
testTypeAnnotationDependency20(org.eclipse.jdt.core.tests.builder.AnnotationDependencyTests)  Time elapsed: 0.12 s
testTypeAnnotationDependency21(org.eclipse.jdt.core.tests.builder.AnnotationDependencyTests)  Time elapsed: 0.127 s
testTypeAnnotationDependency22(org.eclipse.jdt.core.tests.builder.AnnotationDependencyTests)  Time elapsed: 0.137 s
testTypeAnnotationDependency23(org.eclipse.jdt.core.tests.builder.AnnotationDependencyTests)  Time elapsed: 0.129 s
testTypeAnnotationDependency24(org.eclipse.jdt.core.tests.builder.AnnotationDependencyTests)  Time elapsed: 0.116 s
testTypeAnnotationDependency25(org.eclipse.jdt.core.tests.builder.AnnotationDependencyTests)  Time elapsed: 0.123 s
testTypeAnnotationDependency26(org.eclipse.jdt.core.tests.builder.AnnotationDependencyTests)  Time elapsed: 0.126 s
testTypeAnnotationDependency27(org.eclipse.jdt.core.tests.builder.AnnotationDependencyTests)  Time elapsed: 0.123 s
testParameterAnnotationDependency01(org.eclipse.jdt.core.tests.builder.AnnotationDependencyTests)  Time elapsed: 0.138 s
testReturnAnnotationDependency01(org.eclipse.jdt.core.tests.builder.AnnotationDependencyTests)  Time elapsed: 0.155 s
testReturnAnnotationDependency02(org.eclipse.jdt.core.tests.builder.AnnotationDependencyTests)  Time elapsed: 0.133 s
test411771a(org.eclipse.jdt.core.tests.builder.AnnotationDependencyTests)  Time elapsed: 0.134 s
test411771b(org.eclipse.jdt.core.tests.builder.AnnotationDependencyTests)  Time elapsed: 0.164 s
test411771c(org.eclipse.jdt.core.tests.builder.AnnotationDependencyTests)  Time elapsed: 0.14 s
testCompilerRegression(org.eclipse.jdt.core.tests.builder.Bug544921Test)  Time elapsed: 0.08 s
testBuildLargeFile_01(org.eclipse.jdt.core.tests.builder.Bug544921Test)  Time elapsed: 0.213 s
testBuildLargeFile_02(org.eclipse.jdt.core.tests.builder.Bug544921Test)  Time elapsed: 4.191 s
testBuildLargeFile_03(org.eclipse.jdt.core.tests.builder.Bug544921Test)  Time elapsed: 5.15 s
testBuildLargeFile_04(org.eclipse.jdt.core.tests.builder.Bug544921Test)  Time elapsed: 0.002 s
testBuildLargeFile_05(org.eclipse.jdt.core.tests.builder.Bug544921Test)  Time elapsed: 0.002 s
testBuildLargeFile_08(org.eclipse.jdt.core.tests.builder.Bug544921Test)  Time elapsed: 0.002 s
testBuildLargeFile_10(org.eclipse.jdt.core.tests.builder.Bug544921Test)  Time elapsed: 0.002 s
testLeaksOnCleanBuild(org.eclipse.jdt.core.tests.builder.LeakTestsAfter9)  Time elapsed: 0.146 s  <<< ERROR!
java.io.IOException: Cannot run program "lsof": error=2, No such file or directory
	at org.eclipse.jdt.core.tests.builder.LeakTestsAfter9.testLeaksOnCleanBuild(LeakTestsAfter9.java:36)
Caused by: java.io.IOException: error=2, No such file or directory
	at org.eclipse.jdt.core.tests.builder.LeakTestsAfter9.testLeaksOnCleanBuild(LeakTestsAfter9.java:36)

testLeaksOnFullBuild(org.eclipse.jdt.core.tests.builder.LeakTestsAfter9)  Time elapsed: 0.103 s  <<< ERROR!
java.io.IOException: Cannot run program "lsof": error=2, No such file or directory
	at org.eclipse.jdt.core.tests.builder.LeakTestsAfter9.testLeaksOnFullBuild(LeakTestsAfter9.java:41)
Caused by: java.io.IOException: error=2, No such file or directory
	at org.eclipse.jdt.core.tests.builder.LeakTestsAfter9.testLeaksOnFullBuild(LeakTestsAfter9.java:41)

testLeaksOnIncrementalBuild(org.eclipse.jdt.core.tests.builder.LeakTestsAfter9)  Time elapsed: 0.107 s  <<< ERROR!
java.io.IOException: Cannot run program "lsof": error=2, No such file or directory
	at org.eclipse.jdt.core.tests.builder.LeakTestsAfter9.testLeaksOnIncrementalBuild(LeakTestsAfter9.java:46)
Caused by: java.io.IOException: error=2, No such file or directory
	at org.eclipse.jdt.core.tests.builder.LeakTestsAfter9.testLeaksOnIncrementalBuild(LeakTestsAfter9.java:46)

testCompilerRegression(org.eclipse.jdt.core.tests.builder.Bug549646Test)  Time elapsed: 0.196 s

Results:

Errors: 
  LeakTestsAfter9>TestCase.runTest:964->testLeaksOnCleanBuild:36->AbstractLeakTest.testLeaksOnCleanBuild:63->AbstractLeakTest.internalTestUsedLibraryLeaks:85->AbstractLeakTest.assertNotLeaked:137->AbstractLeakTest.checkOpenDescriptors:162->AbstractLeakTest.getOpenDescriptors:176->AbstractLeakTest.readLsofLines:190 » IO
  LeakTestsAfter9>TestCase.runTest:964->testLeaksOnFullBuild:41->AbstractLeakTest.testLeaksOnFullBuild:70->AbstractLeakTest.internalTestUsedLibraryLeaks:89->AbstractLeakTest.assertNotLeaked:137->AbstractLeakTest.checkOpenDescriptors:162->AbstractLeakTest.getOpenDescriptors:176->AbstractLeakTest.readLsofLines:190 » IO
  LeakTestsAfter9>TestCase.runTest:964->testLeaksOnIncrementalBuild:46->AbstractLeakTest.testLeaksOnIncrementalBuild:56->AbstractLeakTest.internalTestUsedLibraryLeaks:95->AbstractLeakTest.assertNotLeaked:137->AbstractLeakTest.checkOpenDescriptors:162->AbstractLeakTest.getOpenDescriptors:176->AbstractLeakTest.readLsofLines:190 » IO
  LeakTestsBefore9>TestCase.runTest:964->testLeaksOnCleanBuild:36->AbstractLeakTest.testLeaksOnCleanBuild:63->AbstractLeakTest.internalTestUsedLibraryLeaks:85->AbstractLeakTest.assertNotLeaked:137->AbstractLeakTest.checkOpenDescriptors:162->AbstractLeakTest.getOpenDescriptors:176->AbstractLeakTest.readLsofLines:190 » IO
  LeakTestsBefore9>TestCase.runTest:964->testLeaksOnFullBuild:41->AbstractLeakTest.testLeaksOnFullBuild:70->AbstractLeakTest.internalTestUsedLibraryLeaks:89->AbstractLeakTest.assertNotLeaked:137->AbstractLeakTest.checkOpenDescriptors:162->AbstractLeakTest.getOpenDescriptors:176->AbstractLeakTest.readLsofLines:190 » IO
  LeakTestsBefore9>TestCase.runTest:964->testLeaksOnIncrementalBuild:46->AbstractLeakTest.testLeaksOnIncrementalBuild:56->AbstractLeakTest.internalTestUsedLibraryLeaks:95->AbstractLeakTest.assertNotLeaked:137->AbstractLeakTest.checkOpenDescriptors:162->AbstractLeakTest.getOpenDescriptors:176->AbstractLeakTest.readLsofLines:190 » IO

Tests run: 339, Failures: 0, Errors: 6, Skipped: 0

[INFO] ------------------------------------------------------------------------
[INFO] Reactor Summary:
[INFO] 
[INFO] eclipse.jdt.core 4.14.0-SNAPSHOT ................... SUCCESS [ 20.360 s]
[INFO] org.eclipse.jdt.annotation 2.2.300-SNAPSHOT ........ SUCCESS [ 10.109 s]
[INFO] org.eclipse.jdt.annotation 1.1.400-SNAPSHOT ........ SUCCESS [  5.223 s]
[INFO] org.eclipse.jdt.core 3.20.0-SNAPSHOT ............... SUCCESS [ 32.824 s]
[INFO] org.eclipse.jdt.compiler.tool 1.2.700-SNAPSHOT ..... SUCCESS [  5.912 s]
[INFO] org.eclipse.jdt.compiler.apt 1.3.800-SNAPSHOT ...... SUCCESS [  5.283 s]
[INFO] org.eclipse.jdt.core.tests.compiler 3.12.1000-SNAPSHOT SUCCESS [06:13 min]
[INFO] org.eclipse.jdt.compiler.tool.tests 1.2.550-SNAPSHOT SUCCESS [  8.831 s]
[INFO] org.eclipse.jdt.core.tests.builder 3.10.750-SNAPSHOT FAILURE [02:32 min]
[INFO] org.eclipse.jdt.compiler.apt.tests 1.1.1000-SNAPSHOT SKIPPED
[INFO] org.eclipse.jdt.core.tests.model 3.10.1000-SNAPSHOT  SKIPPED
[INFO] org.eclipse.jdt.core.tests.performance 3.10.650-SNAPSHOT SKIPPED
[INFO] org.eclipse.jdt.apt.core 3.6.550-SNAPSHOT .......... SKIPPED
[INFO] org.eclipse.jdt.apt.pluggable.core 1.2.400-SNAPSHOT  SKIPPED
[INFO] org.eclipse.jdt.apt.ui 3.6.300-SNAPSHOT ............ SKIPPED
[INFO] org.eclipse.jdt.apt.pluggable.tests 3.4.600-SNAPSHOT SKIPPED
[INFO] org.eclipse.jdt.apt.tests 3.4.550-SNAPSHOT ......... SKIPPED
[INFO] ------------------------------------------------------------------------
[INFO] BUILD FAILURE
[INFO] ------------------------------------------------------------------------
[INFO] Total time:  11:50 min
[INFO] Finished at: 2019-10-14T19:06:12Z
[INFO] ------------------------------------------------------------------------
[ERROR] Failed to execute goal org.eclipse.tycho:tycho-surefire-plugin:1.5.0-SNAPSHOT:test (default-test) on project org.eclipse.jdt.core.tests.builder: There are test failures.
[ERROR] 
[ERROR] Please refer to /home/jenkins/agent/workspace/eclipse.jdt.core-SonarQube/org.eclipse.jdt.core.tests.builder/target/surefire-reports for the individual test results.
[ERROR] -> [Help 1]
[ERROR] 
[ERROR] To see the full stack trace of the errors, re-run Maven with the -e switch.
[ERROR] Re-run Maven using the -X switch to enable full debug logging.
[ERROR] 
[ERROR] For more information about the errors and possible solutions, please read the following articles:
[ERROR] [Help 1] http://cwiki.apache.org/confluence/display/MAVEN/MojoFailureException
[ERROR] 
[ERROR] After correcting the problems, you can resume the build with the command
[ERROR]   mvn <goals> -rf :org.eclipse.jdt.core.tests.builder
Build step 'Invoke top-level Maven targets' marked build as failure
Terminating xvnc.
Skipping sonar analysis due to bad build status FAILURE
Archiving artifacts
Finished: FAILURE