FailedConsole Output

Skipping 5,292 KB.. Full Log
 Time elapsed: 0 s
17:55:32 test0217_Method - 11(org.eclipse.jdt.core.tests.compiler.parser.GenericsCompletionParserTest)  Time elapsed: 0.001 s
17:55:32 test0218_Diet - 11(org.eclipse.jdt.core.tests.compiler.parser.GenericsCompletionParserTest)  Time elapsed: 0 s
17:55:32 test0219_Diet - 11(org.eclipse.jdt.core.tests.compiler.parser.GenericsCompletionParserTest)  Time elapsed: 0 s
17:55:32 test0220_Diet - 11(org.eclipse.jdt.core.tests.compiler.parser.GenericsCompletionParserTest)  Time elapsed: 0.001 s
17:55:32 testBug351426 - 11(org.eclipse.jdt.core.tests.compiler.parser.GenericsCompletionParserTest)  Time elapsed: 0 s
17:55:32 testBug351426b - 11(org.eclipse.jdt.core.tests.compiler.parser.GenericsCompletionParserTest)  Time elapsed: 0 s
17:55:32 testBug351426c - 11(org.eclipse.jdt.core.tests.compiler.parser.GenericsCompletionParserTest)  Time elapsed: 0.001 s
17:55:32 test0001 - 11(org.eclipse.jdt.core.tests.compiler.parser.EnumCompletionParserTest)  Time elapsed: 0 s
17:55:32 test0002 - 11(org.eclipse.jdt.core.tests.compiler.parser.EnumCompletionParserTest)  Time elapsed: 0 s
17:55:32 test0003 - 11(org.eclipse.jdt.core.tests.compiler.parser.EnumCompletionParserTest)  Time elapsed: 0.001 s
17:55:32 test0004 - 11(org.eclipse.jdt.core.tests.compiler.parser.EnumCompletionParserTest)  Time elapsed: 0 s
17:55:32 test0005 - 11(org.eclipse.jdt.core.tests.compiler.parser.EnumCompletionParserTest)  Time elapsed: 0.001 s
17:55:32 test0006 - 11(org.eclipse.jdt.core.tests.compiler.parser.EnumCompletionParserTest)  Time elapsed: 0 s
17:55:32 test0007 - 11(org.eclipse.jdt.core.tests.compiler.parser.EnumCompletionParserTest)  Time elapsed: 0 s
17:55:32 test0008 - 11(org.eclipse.jdt.core.tests.compiler.parser.EnumCompletionParserTest)  Time elapsed: 0.001 s
17:55:32 test0009 - 11(org.eclipse.jdt.core.tests.compiler.parser.EnumCompletionParserTest)  Time elapsed: 0 s
17:55:32 test0010 - 11(org.eclipse.jdt.core.tests.compiler.parser.EnumCompletionParserTest)  Time elapsed: 0 s
17:55:32 test0011 - 11(org.eclipse.jdt.core.tests.compiler.parser.EnumCompletionParserTest)  Time elapsed: 0.001 s
17:55:32 test0012 - 11(org.eclipse.jdt.core.tests.compiler.parser.EnumCompletionParserTest)  Time elapsed: 0 s
17:55:32 test0013 - 11(org.eclipse.jdt.core.tests.compiler.parser.EnumCompletionParserTest)  Time elapsed: 0 s
17:55:32 test0014 - 11(org.eclipse.jdt.core.tests.compiler.parser.EnumCompletionParserTest)  Time elapsed: 0 s
17:55:32 test0001 - 11(org.eclipse.jdt.core.tests.compiler.parser.AnnotationCompletionParserTest)  Time elapsed: 0.001 s
17:55:32 test0002 - 11(org.eclipse.jdt.core.tests.compiler.parser.AnnotationCompletionParserTest)  Time elapsed: 0 s
17:55:32 test0003 - 11(org.eclipse.jdt.core.tests.compiler.parser.AnnotationCompletionParserTest)  Time elapsed: 0 s
17:55:32 test0004 - 11(org.eclipse.jdt.core.tests.compiler.parser.AnnotationCompletionParserTest)  Time elapsed: 0 s
17:55:32 test0005 - 11(org.eclipse.jdt.core.tests.compiler.parser.AnnotationCompletionParserTest)  Time elapsed: 0 s
17:55:32 test0006 - 11(org.eclipse.jdt.core.tests.compiler.parser.AnnotationCompletionParserTest)  Time elapsed: 0.001 s
17:55:32 test0007 - 11(org.eclipse.jdt.core.tests.compiler.parser.AnnotationCompletionParserTest)  Time elapsed: 0 s
17:55:32 test0008 - 11(org.eclipse.jdt.core.tests.compiler.parser.AnnotationCompletionParserTest)  Time elapsed: 0 s
17:55:32 test0009 - 11(org.eclipse.jdt.core.tests.compiler.parser.AnnotationCompletionParserTest)  Time elapsed: 0 s
17:55:32 test0010 - 11(org.eclipse.jdt.core.tests.compiler.parser.AnnotationCompletionParserTest)  Time elapsed: 0.001 s
17:55:32 test0011 - 11(org.eclipse.jdt.core.tests.compiler.parser.AnnotationCompletionParserTest)  Time elapsed: 0 s
17:55:32 test0012 - 11(org.eclipse.jdt.core.tests.compiler.parser.AnnotationCompletionParserTest)  Time elapsed: 0 s
17:55:32 test0013_Diet - 11(org.eclipse.jdt.core.tests.compiler.parser.AnnotationCompletionParserTest)  Time elapsed: 0 s
17:55:32 test0013_Method - 11(org.eclipse.jdt.core.tests.compiler.parser.AnnotationCompletionParserTest)  Time elapsed: 0 s
17:55:32 test0014 - 11(org.eclipse.jdt.core.tests.compiler.parser.AnnotationCompletionParserTest)  Time elapsed: 0.001 s
17:55:32 test0015 - 11(org.eclipse.jdt.core.tests.compiler.parser.AnnotationCompletionParserTest)  Time elapsed: 0 s
17:55:32 test0016 - 11(org.eclipse.jdt.core.tests.compiler.parser.AnnotationCompletionParserTest)  Time elapsed: 0 s
17:55:32 test0017 - 11(org.eclipse.jdt.core.tests.compiler.parser.AnnotationCompletionParserTest)  Time elapsed: 0 s
17:55:32 test0018 - 11(org.eclipse.jdt.core.tests.compiler.parser.AnnotationCompletionParserTest)  Time elapsed: 0.001 s
17:55:32 test0019 - 11(org.eclipse.jdt.core.tests.compiler.parser.AnnotationCompletionParserTest)  Time elapsed: 0 s
17:55:32 test0020 - 11(org.eclipse.jdt.core.tests.compiler.parser.AnnotationCompletionParserTest)  Time elapsed: 0 s
17:55:32 test0021 - 11(org.eclipse.jdt.core.tests.compiler.parser.AnnotationCompletionParserTest)  Time elapsed: 0 s
17:55:32 test0022 - 11(org.eclipse.jdt.core.tests.compiler.parser.AnnotationCompletionParserTest)  Time elapsed: 0.001 s
17:55:32 test0023 - 11(org.eclipse.jdt.core.tests.compiler.parser.AnnotationCompletionParserTest)  Time elapsed: 0 s
17:55:32 test0024_Diet - 11(org.eclipse.jdt.core.tests.compiler.parser.AnnotationCompletionParserTest)  Time elapsed: 0 s
17:55:32 test0024_Method - 11(org.eclipse.jdt.core.tests.compiler.parser.AnnotationCompletionParserTest)  Time elapsed: 0 s
17:55:32 test0025 - 11(org.eclipse.jdt.core.tests.compiler.parser.AnnotationCompletionParserTest)  Time elapsed: 0 s
17:55:32 test0026 - 11(org.eclipse.jdt.core.tests.compiler.parser.AnnotationCompletionParserTest)  Time elapsed: 0.001 s
17:55:32 test0027 - 11(org.eclipse.jdt.core.tests.compiler.parser.AnnotationCompletionParserTest)  Time elapsed: 0 s
17:55:32 test0028_Diet - 11(org.eclipse.jdt.core.tests.compiler.parser.AnnotationCompletionParserTest)  Time elapsed: 0 s
17:55:32 test0028_Method - 11(org.eclipse.jdt.core.tests.compiler.parser.AnnotationCompletionParserTest)  Time elapsed: 0 s
17:55:32 test0029_Diet - 11(org.eclipse.jdt.core.tests.compiler.parser.AnnotationCompletionParserTest)  Time elapsed: 0.001 s
17:55:32 test0029_Method - 11(org.eclipse.jdt.core.tests.compiler.parser.AnnotationCompletionParserTest)  Time elapsed: 0 s
17:55:32 test0030 - 11(org.eclipse.jdt.core.tests.compiler.parser.AnnotationCompletionParserTest)  Time elapsed: 0 s
17:55:32 test0031 - 11(org.eclipse.jdt.core.tests.compiler.parser.AnnotationCompletionParserTest)  Time elapsed: 0.001 s
17:55:32 test0032 - 11(org.eclipse.jdt.core.tests.compiler.parser.AnnotationCompletionParserTest)  Time elapsed: 0 s
17:55:32 test0033 - 11(org.eclipse.jdt.core.tests.compiler.parser.AnnotationCompletionParserTest)  Time elapsed: 0 s
17:55:32 test0034_Diet - 11(org.eclipse.jdt.core.tests.compiler.parser.AnnotationCompletionParserTest)  Time elapsed: 0 s
17:55:32 test0034_Method - 11(org.eclipse.jdt.core.tests.compiler.parser.AnnotationCompletionParserTest)  Time elapsed: 0.001 s
17:55:32 test0035_Diet - 11(org.eclipse.jdt.core.tests.compiler.parser.AnnotationCompletionParserTest)  Time elapsed: 0 s
17:55:32 test0035_Method - 11(org.eclipse.jdt.core.tests.compiler.parser.AnnotationCompletionParserTest)  Time elapsed: 0 s
17:55:32 test0036 - 11(org.eclipse.jdt.core.tests.compiler.parser.AnnotationCompletionParserTest)  Time elapsed: 0 s
17:55:32 test0037 - 11(org.eclipse.jdt.core.tests.compiler.parser.AnnotationCompletionParserTest)  Time elapsed: 0.001 s
17:55:32 test0038 - 11(org.eclipse.jdt.core.tests.compiler.parser.AnnotationCompletionParserTest)  Time elapsed: 0 s
17:55:32 test0039 - 11(org.eclipse.jdt.core.tests.compiler.parser.AnnotationCompletionParserTest)  Time elapsed: 0 s
17:55:32 test0040_Diet - 11(org.eclipse.jdt.core.tests.compiler.parser.AnnotationCompletionParserTest)  Time elapsed: 0 s
17:55:32 test0040_Method - 11(org.eclipse.jdt.core.tests.compiler.parser.AnnotationCompletionParserTest)  Time elapsed: 0.001 s
17:55:32 test0041_Diet - 11(org.eclipse.jdt.core.tests.compiler.parser.AnnotationCompletionParserTest)  Time elapsed: 0 s
17:55:32 test0041_Method - 11(org.eclipse.jdt.core.tests.compiler.parser.AnnotationCompletionParserTest)  Time elapsed: 0 s
17:55:32 test0042 - 11(org.eclipse.jdt.core.tests.compiler.parser.AnnotationCompletionParserTest)  Time elapsed: 0 s
17:55:32 test0043 - 11(org.eclipse.jdt.core.tests.compiler.parser.AnnotationCompletionParserTest)  Time elapsed: 0.001 s
17:55:32 test0044 - 11(org.eclipse.jdt.core.tests.compiler.parser.AnnotationCompletionParserTest)  Time elapsed: 0 s
17:55:32 test0045 - 11(org.eclipse.jdt.core.tests.compiler.parser.AnnotationCompletionParserTest)  Time elapsed: 0 s
17:55:32 test0046_Diet - 11(org.eclipse.jdt.core.tests.compiler.parser.AnnotationCompletionParserTest)  Time elapsed: 0 s
17:55:32 test0046_Method - 11(org.eclipse.jdt.core.tests.compiler.parser.AnnotationCompletionParserTest)  Time elapsed: 0.001 s
17:55:32 test0047_Diet - 11(org.eclipse.jdt.core.tests.compiler.parser.AnnotationCompletionParserTest)  Time elapsed: 0 s
17:55:32 test0047_Method - 11(org.eclipse.jdt.core.tests.compiler.parser.AnnotationCompletionParserTest)  Time elapsed: 0 s
17:55:32 test0048 - 11(org.eclipse.jdt.core.tests.compiler.parser.AnnotationCompletionParserTest)  Time elapsed: 0.001 s
17:55:32 test0049 - 11(org.eclipse.jdt.core.tests.compiler.parser.AnnotationCompletionParserTest)  Time elapsed: 0 s
17:55:32 test0050 - 11(org.eclipse.jdt.core.tests.compiler.parser.AnnotationCompletionParserTest)  Time elapsed: 0 s
17:55:32 test0051 - 11(org.eclipse.jdt.core.tests.compiler.parser.AnnotationCompletionParserTest)  Time elapsed: 0 s
17:55:32 test0052_Diet - 11(org.eclipse.jdt.core.tests.compiler.parser.AnnotationCompletionParserTest)  Time elapsed: 0.001 s
17:55:32 test0052_Method - 11(org.eclipse.jdt.core.tests.compiler.parser.AnnotationCompletionParserTest)  Time elapsed: 0 s
17:55:32 test0053_Diet - 11(org.eclipse.jdt.core.tests.compiler.parser.AnnotationCompletionParserTest)  Time elapsed: 0 s
17:55:32 test0053_Method - 11(org.eclipse.jdt.core.tests.compiler.parser.AnnotationCompletionParserTest)  Time elapsed: 0 s
17:55:32 test0054 - 11(org.eclipse.jdt.core.tests.compiler.parser.AnnotationCompletionParserTest)  Time elapsed: 0.001 s
17:55:32 test0055 - 11(org.eclipse.jdt.core.tests.compiler.parser.AnnotationCompletionParserTest)  Time elapsed: 0 s
17:55:32 test0056 - 11(org.eclipse.jdt.core.tests.compiler.parser.AnnotationCompletionParserTest)  Time elapsed: 0 s
17:55:32 test0057 - 11(org.eclipse.jdt.core.tests.compiler.parser.AnnotationCompletionParserTest)  Time elapsed: 0 s
17:55:32 test0058_Diet - 11(org.eclipse.jdt.core.tests.compiler.parser.AnnotationCompletionParserTest)  Time elapsed: 0.001 s
17:55:32 test0058_Method - 11(org.eclipse.jdt.core.tests.compiler.parser.AnnotationCompletionParserTest)  Time elapsed: 0 s
17:55:32 test0059_Diet - 11(org.eclipse.jdt.core.tests.compiler.parser.AnnotationCompletionParserTest)  Time elapsed: 0 s
17:55:32 test0059_Method - 11(org.eclipse.jdt.core.tests.compiler.parser.AnnotationCompletionParserTest)  Time elapsed: 0 s
17:55:32 test0060 - 11(org.eclipse.jdt.core.tests.compiler.parser.AnnotationCompletionParserTest)  Time elapsed: 0.001 s
17:55:32 test0061 - 11(org.eclipse.jdt.core.tests.compiler.parser.AnnotationCompletionParserTest)  Time elapsed: 0 s
17:55:32 test0062 - 11(org.eclipse.jdt.core.tests.compiler.parser.AnnotationCompletionParserTest)  Time elapsed: 0 s
17:55:32 test0063 - 11(org.eclipse.jdt.core.tests.compiler.parser.AnnotationCompletionParserTest)  Time elapsed: 0 s
17:55:32 test0064_Diet - 11(org.eclipse.jdt.core.tests.compiler.parser.AnnotationCompletionParserTest)  Time elapsed: 0.001 s
17:55:32 test0064_Method - 11(org.eclipse.jdt.core.tests.compiler.parser.AnnotationCompletionParserTest)  Time elapsed: 0 s
17:55:32 test0065_Diet - 11(org.eclipse.jdt.core.tests.compiler.parser.AnnotationCompletionParserTest)  Time elapsed: 0 s
17:55:32 test0065_Method - 11(org.eclipse.jdt.core.tests.compiler.parser.AnnotationCompletionParserTest)  Time elapsed: 0 s
17:55:32 test0066 - 11(org.eclipse.jdt.core.tests.compiler.parser.AnnotationCompletionParserTest)  Time elapsed: 0.001 s
17:55:32 test0067 - 11(org.eclipse.jdt.core.tests.compiler.parser.AnnotationCompletionParserTest)  Time elapsed: 0 s
17:55:32 test0068 - 11(org.eclipse.jdt.core.tests.compiler.parser.AnnotationCompletionParserTest)  Time elapsed: 0 s
17:55:32 test0069 - 11(org.eclipse.jdt.core.tests.compiler.parser.AnnotationCompletionParserTest)  Time elapsed: 0 s
17:55:32 test0070_Diet - 11(org.eclipse.jdt.core.tests.compiler.parser.AnnotationCompletionParserTest)  Time elapsed: 0.001 s
17:55:32 test0070_Method - 11(org.eclipse.jdt.core.tests.compiler.parser.AnnotationCompletionParserTest)  Time elapsed: 0 s
17:55:32 test0071_Diet - 11(org.eclipse.jdt.core.tests.compiler.parser.AnnotationCompletionParserTest)  Time elapsed: 0 s
17:55:32 test0071_Method - 11(org.eclipse.jdt.core.tests.compiler.parser.AnnotationCompletionParserTest)  Time elapsed: 0 s
17:55:32 test0072 - 11(org.eclipse.jdt.core.tests.compiler.parser.AnnotationCompletionParserTest)  Time elapsed: 0.001 s
17:55:32 test0073 - 11(org.eclipse.jdt.core.tests.compiler.parser.AnnotationCompletionParserTest)  Time elapsed: 0 s
17:55:32 test0074 - 11(org.eclipse.jdt.core.tests.compiler.parser.AnnotationCompletionParserTest)  Time elapsed: 0 s
17:55:32 test0075 - 11(org.eclipse.jdt.core.tests.compiler.parser.AnnotationCompletionParserTest)  Time elapsed: 0 s
17:55:32 test0076 - 11(org.eclipse.jdt.core.tests.compiler.parser.AnnotationCompletionParserTest)  Time elapsed: 0.001 s
17:55:32 test0078 - 11(org.eclipse.jdt.core.tests.compiler.parser.AnnotationCompletionParserTest)  Time elapsed: 0 s
17:55:32 test0079 - 11(org.eclipse.jdt.core.tests.compiler.parser.AnnotationCompletionParserTest)  Time elapsed: 0 s
17:55:32 test0080 - 11(org.eclipse.jdt.core.tests.compiler.parser.AnnotationCompletionParserTest)  Time elapsed: 0 s
17:55:32 test0081 - 11(org.eclipse.jdt.core.tests.compiler.parser.AnnotationCompletionParserTest)  Time elapsed: 0 s
17:55:32 test0082 - 11(org.eclipse.jdt.core.tests.compiler.parser.AnnotationCompletionParserTest)  Time elapsed: 0 s
17:55:32 test0083 - 11(org.eclipse.jdt.core.tests.compiler.parser.AnnotationCompletionParserTest)  Time elapsed: 0 s
17:55:32 test0084 - 11(org.eclipse.jdt.core.tests.compiler.parser.AnnotationCompletionParserTest)  Time elapsed: 0.001 s
17:55:32 test0085 - 11(org.eclipse.jdt.core.tests.compiler.parser.AnnotationCompletionParserTest)  Time elapsed: 0 s
17:55:32 test0086 - 11(org.eclipse.jdt.core.tests.compiler.parser.AnnotationCompletionParserTest)  Time elapsed: 0 s
17:55:32 test0087 - 11(org.eclipse.jdt.core.tests.compiler.parser.AnnotationCompletionParserTest)  Time elapsed: 0 s
17:55:32 test0088 - 11(org.eclipse.jdt.core.tests.compiler.parser.AnnotationCompletionParserTest)  Time elapsed: 0.001 s
17:55:32 test0089 - 11(org.eclipse.jdt.core.tests.compiler.parser.AnnotationCompletionParserTest)  Time elapsed: 0 s
17:55:32 test0090 - 11(org.eclipse.jdt.core.tests.compiler.parser.AnnotationCompletionParserTest)  Time elapsed: 0 s
17:55:32 test0091 - 11(org.eclipse.jdt.core.tests.compiler.parser.AnnotationCompletionParserTest)  Time elapsed: 0 s
17:55:32 test0092 - 11(org.eclipse.jdt.core.tests.compiler.parser.AnnotationCompletionParserTest)  Time elapsed: 0.001 s
17:55:32 test0093 - 11(org.eclipse.jdt.core.tests.compiler.parser.AnnotationCompletionParserTest)  Time elapsed: 0 s
17:55:32 test0094 - 11(org.eclipse.jdt.core.tests.compiler.parser.AnnotationCompletionParserTest)  Time elapsed: 0 s
17:55:32 test0095 - 11(org.eclipse.jdt.core.tests.compiler.parser.AnnotationCompletionParserTest)  Time elapsed: 0 s
17:55:32 test0096 - 11(org.eclipse.jdt.core.tests.compiler.parser.AnnotationCompletionParserTest)  Time elapsed: 0.001 s
17:55:32 test0097 - 11(org.eclipse.jdt.core.tests.compiler.parser.AnnotationCompletionParserTest)  Time elapsed: 0 s
17:55:32 test0098 - 11(org.eclipse.jdt.core.tests.compiler.parser.AnnotationCompletionParserTest)  Time elapsed: 0 s
17:55:32 test0099 - 11(org.eclipse.jdt.core.tests.compiler.parser.AnnotationCompletionParserTest)  Time elapsed: 0 s
17:55:32 test0100 - 11(org.eclipse.jdt.core.tests.compiler.parser.AnnotationCompletionParserTest)  Time elapsed: 0.001 s
17:55:32 test0101 - 11(org.eclipse.jdt.core.tests.compiler.parser.AnnotationCompletionParserTest)  Time elapsed: 0 s
17:55:32 test0102 - 11(org.eclipse.jdt.core.tests.compiler.parser.AnnotationCompletionParserTest)  Time elapsed: 0 s
17:55:32 test0103 - 11(org.eclipse.jdt.core.tests.compiler.parser.AnnotationCompletionParserTest)  Time elapsed: 0 s
17:55:32 test0104 - 11(org.eclipse.jdt.core.tests.compiler.parser.AnnotationCompletionParserTest)  Time elapsed: 0.001 s
17:55:32 test0105_Diet - 11(org.eclipse.jdt.core.tests.compiler.parser.AnnotationCompletionParserTest)  Time elapsed: 0 s
17:55:32 test0105_Method - 11(org.eclipse.jdt.core.tests.compiler.parser.AnnotationCompletionParserTest)  Time elapsed: 0 s
17:55:32 test0106_Diet - 11(org.eclipse.jdt.core.tests.compiler.parser.AnnotationCompletionParserTest)  Time elapsed: 0 s
17:55:32 test0106_Method - 11(org.eclipse.jdt.core.tests.compiler.parser.AnnotationCompletionParserTest)  Time elapsed: 0.001 s
17:55:32 test0107_Diet - 11(org.eclipse.jdt.core.tests.compiler.parser.AnnotationCompletionParserTest)  Time elapsed: 0 s
17:55:32 test0107_Method - 11(org.eclipse.jdt.core.tests.compiler.parser.AnnotationCompletionParserTest)  Time elapsed: 0 s
17:55:32 test0108_Diet - 11(org.eclipse.jdt.core.tests.compiler.parser.AnnotationCompletionParserTest)  Time elapsed: 0 s
17:55:32 test0108_Method - 11(org.eclipse.jdt.core.tests.compiler.parser.AnnotationCompletionParserTest)  Time elapsed: 0.001 s
17:55:32 test0109_Diet - 11(org.eclipse.jdt.core.tests.compiler.parser.AnnotationCompletionParserTest)  Time elapsed: 0 s
17:55:32 test0109_Method - 11(org.eclipse.jdt.core.tests.compiler.parser.AnnotationCompletionParserTest)  Time elapsed: 0 s
17:55:32 test0110_Diet - 11(org.eclipse.jdt.core.tests.compiler.parser.AnnotationCompletionParserTest)  Time elapsed: 0 s
17:55:32 test0110_Method - 11(org.eclipse.jdt.core.tests.compiler.parser.AnnotationCompletionParserTest)  Time elapsed: 0.001 s
17:55:32 test0111_Diet - 11(org.eclipse.jdt.core.tests.compiler.parser.AnnotationCompletionParserTest)  Time elapsed: 0 s
17:55:32 test0111_Method - 11(org.eclipse.jdt.core.tests.compiler.parser.AnnotationCompletionParserTest)  Time elapsed: 0 s
17:55:32 test0112_Diet - 11(org.eclipse.jdt.core.tests.compiler.parser.AnnotationCompletionParserTest)  Time elapsed: 0 s
17:55:32 test0112_Method - 11(org.eclipse.jdt.core.tests.compiler.parser.AnnotationCompletionParserTest)  Time elapsed: 0.001 s
17:55:32 test0113_Diet - 11(org.eclipse.jdt.core.tests.compiler.parser.AnnotationCompletionParserTest)  Time elapsed: 0 s
17:55:32 test0113_Method - 11(org.eclipse.jdt.core.tests.compiler.parser.AnnotationCompletionParserTest)  Time elapsed: 0 s
17:55:32 test0114_Diet - 11(org.eclipse.jdt.core.tests.compiler.parser.AnnotationCompletionParserTest)  Time elapsed: 0 s
17:55:32 test0114_Method - 11(org.eclipse.jdt.core.tests.compiler.parser.AnnotationCompletionParserTest)  Time elapsed: 0 s
17:55:32 test0115 - 11(org.eclipse.jdt.core.tests.compiler.parser.AnnotationCompletionParserTest)  Time elapsed: 0.001 s
17:55:32 test0116 - 11(org.eclipse.jdt.core.tests.compiler.parser.AnnotationCompletionParserTest)  Time elapsed: 0 s
17:55:32 test0117 - 11(org.eclipse.jdt.core.tests.compiler.parser.AnnotationCompletionParserTest)  Time elapsed: 0 s
17:55:32 test0118 - 11(org.eclipse.jdt.core.tests.compiler.parser.AnnotationCompletionParserTest)  Time elapsed: 0 s
17:55:32 test0119_Diet - 11(org.eclipse.jdt.core.tests.compiler.parser.AnnotationCompletionParserTest)  Time elapsed: 0.001 s
17:55:32 test0119_Method - 11(org.eclipse.jdt.core.tests.compiler.parser.AnnotationCompletionParserTest)  Time elapsed: 0 s
17:55:32 test0120_Diet - 11(org.eclipse.jdt.core.tests.compiler.parser.AnnotationCompletionParserTest)  Time elapsed: 0 s
17:55:32 test0120_Method - 11(org.eclipse.jdt.core.tests.compiler.parser.AnnotationCompletionParserTest)  Time elapsed: 0 s
17:55:32 test0121 - 11(org.eclipse.jdt.core.tests.compiler.parser.AnnotationCompletionParserTest)  Time elapsed: 0.001 s
17:55:32 test0122 - 11(org.eclipse.jdt.core.tests.compiler.parser.AnnotationCompletionParserTest)  Time elapsed: 0 s
17:55:32 test0123 - 11(org.eclipse.jdt.core.tests.compiler.parser.AnnotationCompletionParserTest)  Time elapsed: 0 s
17:55:32 test0124 - 11(org.eclipse.jdt.core.tests.compiler.parser.AnnotationCompletionParserTest)  Time elapsed: 0 s
17:55:32 test0125 - 11(org.eclipse.jdt.core.tests.compiler.parser.AnnotationCompletionParserTest)  Time elapsed: 0 s
17:55:32 test0126 - 11(org.eclipse.jdt.core.tests.compiler.parser.AnnotationCompletionParserTest)  Time elapsed: 0 s
17:55:32 test0127 - 11(org.eclipse.jdt.core.tests.compiler.parser.AnnotationCompletionParserTest)  Time elapsed: 0 s
17:55:32 test0128 - 11(org.eclipse.jdt.core.tests.compiler.parser.AnnotationCompletionParserTest)  Time elapsed: 0 s
17:55:32 test0129 - 11(org.eclipse.jdt.core.tests.compiler.parser.AnnotationCompletionParserTest)  Time elapsed: 0 s
17:55:32 test0001 - 11(org.eclipse.jdt.core.tests.compiler.parser.GenericsSelectionTest)  Time elapsed: 0 s
17:55:32 test0002 - 11(org.eclipse.jdt.core.tests.compiler.parser.GenericsSelectionTest)  Time elapsed: 0 s
17:55:32 test0003 - 11(org.eclipse.jdt.core.tests.compiler.parser.GenericsSelectionTest)  Time elapsed: 0 s
17:55:32 test0004 - 11(org.eclipse.jdt.core.tests.compiler.parser.GenericsSelectionTest)  Time elapsed: 0 s
17:55:32 test0005 - 11(org.eclipse.jdt.core.tests.compiler.parser.GenericsSelectionTest)  Time elapsed: 0.001 s
17:55:32 test0006 - 11(org.eclipse.jdt.core.tests.compiler.parser.GenericsSelectionTest)  Time elapsed: 0 s
17:55:32 test0007 - 11(org.eclipse.jdt.core.tests.compiler.parser.GenericsSelectionTest)  Time elapsed: 0 s
17:55:32 test0008 - 11(org.eclipse.jdt.core.tests.compiler.parser.GenericsSelectionTest)  Time elapsed: 0 s
17:55:32 test0009 - 11(org.eclipse.jdt.core.tests.compiler.parser.GenericsSelectionTest)  Time elapsed: 0 s
17:55:32 test0010 - 11(org.eclipse.jdt.core.tests.compiler.parser.GenericsSelectionTest)  Time elapsed: 0.001 s
17:55:32 test0011 - 11(org.eclipse.jdt.core.tests.compiler.parser.GenericsSelectionTest)  Time elapsed: 0 s
17:55:32 test0012 - 11(org.eclipse.jdt.core.tests.compiler.parser.GenericsSelectionTest)  Time elapsed: 0 s
17:55:32 test0013 - 11(org.eclipse.jdt.core.tests.compiler.parser.GenericsSelectionTest)  Time elapsed: 0 s
17:55:32 test0014 - 11(org.eclipse.jdt.core.tests.compiler.parser.GenericsSelectionTest)  Time elapsed: 0 s
17:55:32 test0015 - 11(org.eclipse.jdt.core.tests.compiler.parser.GenericsSelectionTest)  Time elapsed: 0.001 s
17:55:32 test0016 - 11(org.eclipse.jdt.core.tests.compiler.parser.GenericsSelectionTest)  Time elapsed: 0 s
17:55:32 test0017 - 11(org.eclipse.jdt.core.tests.compiler.parser.GenericsSelectionTest)  Time elapsed: 0 s
17:55:32 test0018 - 11(org.eclipse.jdt.core.tests.compiler.parser.GenericsSelectionTest)  Time elapsed: 0.001 s
17:55:32 test0019 - 11(org.eclipse.jdt.core.tests.compiler.parser.GenericsSelectionTest)  Time elapsed: 0 s
17:55:32 test0020 - 11(org.eclipse.jdt.core.tests.compiler.parser.GenericsSelectionTest)  Time elapsed: 0 s
17:55:32 test0021 - 11(org.eclipse.jdt.core.tests.compiler.parser.GenericsSelectionTest)  Time elapsed: 0 s
17:55:32 test0022 - 11(org.eclipse.jdt.core.tests.compiler.parser.GenericsSelectionTest)  Time elapsed: 0.001 s
17:55:32 test0023 - 11(org.eclipse.jdt.core.tests.compiler.parser.GenericsSelectionTest)  Time elapsed: 0 s
17:55:32 test0024 - 11(org.eclipse.jdt.core.tests.compiler.parser.GenericsSelectionTest)  Time elapsed: 0 s
17:55:32 test0001 - 11(org.eclipse.jdt.core.tests.compiler.parser.AnnotationSelectionTest)  Time elapsed: 0 s
17:55:32 test0002 - 11(org.eclipse.jdt.core.tests.compiler.parser.AnnotationSelectionTest)  Time elapsed: 0.001 s
17:55:32 test0003 - 11(org.eclipse.jdt.core.tests.compiler.parser.AnnotationSelectionTest)  Time elapsed: 0 s
17:55:32 test0004 - 11(org.eclipse.jdt.core.tests.compiler.parser.AnnotationSelectionTest)  Time elapsed: 0 s
17:55:32 test0006 - 11(org.eclipse.jdt.core.tests.compiler.parser.AnnotationSelectionTest)  Time elapsed: 0 s
17:55:32 test0007 - 11(org.eclipse.jdt.core.tests.compiler.parser.AnnotationSelectionTest)  Time elapsed: 0.001 s
17:55:32 test0008 - 11(org.eclipse.jdt.core.tests.compiler.parser.AnnotationSelectionTest)  Time elapsed: 0 s
17:55:32 test0009 - 11(org.eclipse.jdt.core.tests.compiler.parser.AnnotationSelectionTest)  Time elapsed: 0.001 s
17:55:32 test0010 - 11(org.eclipse.jdt.core.tests.compiler.parser.AnnotationSelectionTest)  Time elapsed: 0 s
17:55:32 test0011 - 11(org.eclipse.jdt.core.tests.compiler.parser.AnnotationSelectionTest)  Time elapsed: 0 s
17:55:32 test0012 - 11(org.eclipse.jdt.core.tests.compiler.parser.AnnotationSelectionTest)  Time elapsed: 0 s
17:55:32 test0013 - 11(org.eclipse.jdt.core.tests.compiler.parser.AnnotationSelectionTest)  Time elapsed: 0 s
17:55:32 test0014 - 11(org.eclipse.jdt.core.tests.compiler.parser.AnnotationSelectionTest)  Time elapsed: 0.001 s
17:55:32 test0015 - 11(org.eclipse.jdt.core.tests.compiler.parser.AnnotationSelectionTest)  Time elapsed: 0 s
17:55:32 test0016 - 11(org.eclipse.jdt.core.tests.compiler.parser.AnnotationSelectionTest)  Time elapsed: 0 s
17:55:32 test0017 - 11(org.eclipse.jdt.core.tests.compiler.parser.AnnotationSelectionTest)  Time elapsed: 0 s
17:55:32 test0001 - 11(org.eclipse.jdt.core.tests.compiler.parser.EnumSelectionTest)  Time elapsed: 0.001 s
17:55:32 test0001 - 11(org.eclipse.jdt.core.tests.compiler.parser.GenericDietRecoveryTest)  Time elapsed: 0.001 s
17:55:32 test0002 - 11(org.eclipse.jdt.core.tests.compiler.parser.GenericDietRecoveryTest)  Time elapsed: 0.002 s
17:55:32 test0003 - 11(org.eclipse.jdt.core.tests.compiler.parser.GenericDietRecoveryTest)  Time elapsed: 0.002 s
17:55:32 test0004 - 11(org.eclipse.jdt.core.tests.compiler.parser.GenericDietRecoveryTest)  Time elapsed: 0.002 s
17:55:32 test0005 - 11(org.eclipse.jdt.core.tests.compiler.parser.GenericDietRecoveryTest)  Time elapsed: 0.002 s
17:55:32 test0006 - 11(org.eclipse.jdt.core.tests.compiler.parser.GenericDietRecoveryTest)  Time elapsed: 0.002 s
17:55:32 test0007 - 11(org.eclipse.jdt.core.tests.compiler.parser.GenericDietRecoveryTest)  Time elapsed: 0.003 s
17:55:32 test0008 - 11(org.eclipse.jdt.core.tests.compiler.parser.GenericDietRecoveryTest)  Time elapsed: 0.002 s
17:55:32 test0009 - 11(org.eclipse.jdt.core.tests.compiler.parser.GenericDietRecoveryTest)  Time elapsed: 0.002 s
17:55:32 test0010 - 11(org.eclipse.jdt.core.tests.compiler.parser.GenericDietRecoveryTest)  Time elapsed: 0.003 s
17:55:32 test0011 - 11(org.eclipse.jdt.core.tests.compiler.parser.GenericDietRecoveryTest)  Time elapsed: 0.002 s
17:55:32 test0012 - 11(org.eclipse.jdt.core.tests.compiler.parser.GenericDietRecoveryTest)  Time elapsed: 0.002 s
17:55:32 test0013 - 11(org.eclipse.jdt.core.tests.compiler.parser.GenericDietRecoveryTest)  Time elapsed: 0.002 s
17:55:32 test0014 - 11(org.eclipse.jdt.core.tests.compiler.parser.GenericDietRecoveryTest)  Time elapsed: 0.003 s
17:55:32 test0015 - 11(org.eclipse.jdt.core.tests.compiler.parser.GenericDietRecoveryTest)  Time elapsed: 0.002 s
17:55:32 test0016 - 11(org.eclipse.jdt.core.tests.compiler.parser.GenericDietRecoveryTest)  Time elapsed: 0.003 s
17:55:32 test0017 - 11(org.eclipse.jdt.core.tests.compiler.parser.GenericDietRecoveryTest)  Time elapsed: 0.003 s
17:55:32 test0018 - 11(org.eclipse.jdt.core.tests.compiler.parser.GenericDietRecoveryTest)  Time elapsed: 0.004 s
17:55:32 test0019 - 11(org.eclipse.jdt.core.tests.compiler.parser.GenericDietRecoveryTest)  Time elapsed: 0.005 s
17:55:32 test0020 - 11(org.eclipse.jdt.core.tests.compiler.parser.GenericDietRecoveryTest)  Time elapsed: 0.002 s
17:55:32 test0021 - 11(org.eclipse.jdt.core.tests.compiler.parser.GenericDietRecoveryTest)  Time elapsed: 0.005 s
17:55:32 test0022 - 11(org.eclipse.jdt.core.tests.compiler.parser.GenericDietRecoveryTest)  Time elapsed: 0.003 s
17:55:32 test0023 - 11(org.eclipse.jdt.core.tests.compiler.parser.GenericDietRecoveryTest)  Time elapsed: 0.002 s
17:55:32 test0024 - 11(org.eclipse.jdt.core.tests.compiler.parser.GenericDietRecoveryTest)  Time elapsed: 0.002 s
17:55:32 test0025 - 11(org.eclipse.jdt.core.tests.compiler.parser.GenericDietRecoveryTest)  Time elapsed: 0.004 s
17:55:32 test0026 - 11(org.eclipse.jdt.core.tests.compiler.parser.GenericDietRecoveryTest)  Time elapsed: 0.003 s
17:55:32 test0001 - 11(org.eclipse.jdt.core.tests.compiler.parser.EnumDietRecoveryTest)  Time elapsed: 0.001 s
17:55:32 test0002 - 11(org.eclipse.jdt.core.tests.compiler.parser.EnumDietRecoveryTest)  Time elapsed: 0.002 s
17:55:32 test0003 - 11(org.eclipse.jdt.core.tests.compiler.parser.EnumDietRecoveryTest)  Time elapsed: 0.002 s
17:55:32 test0004 - 11(org.eclipse.jdt.core.tests.compiler.parser.EnumDietRecoveryTest)  Time elapsed: 0.001 s
17:55:32 test0005 - 11(org.eclipse.jdt.core.tests.compiler.parser.EnumDietRecoveryTest)  Time elapsed: 0.002 s
17:55:32 test0006 - 11(org.eclipse.jdt.core.tests.compiler.parser.EnumDietRecoveryTest)  Time elapsed: 0.002 s
17:55:32 test0007 - 11(org.eclipse.jdt.core.tests.compiler.parser.EnumDietRecoveryTest)  Time elapsed: 0.003 s
17:55:32 test0008 - 11(org.eclipse.jdt.core.tests.compiler.parser.EnumDietRecoveryTest)  Time elapsed: 0.001 s
17:55:32 test0009 - 11(org.eclipse.jdt.core.tests.compiler.parser.EnumDietRecoveryTest)  Time elapsed: 0.002 s
17:55:32 test0010 - 11(org.eclipse.jdt.core.tests.compiler.parser.EnumDietRecoveryTest)  Time elapsed: 0.002 s
17:55:32 test0011 - 11(org.eclipse.jdt.core.tests.compiler.parser.EnumDietRecoveryTest)  Time elapsed: 0.003 s
17:55:32 test0012 - 11(org.eclipse.jdt.core.tests.compiler.parser.EnumDietRecoveryTest)  Time elapsed: 0.003 s
17:55:32 test0013 - 11(org.eclipse.jdt.core.tests.compiler.parser.EnumDietRecoveryTest)  Time elapsed: 0.004 s
17:55:32 test0014 - 11(org.eclipse.jdt.core.tests.compiler.parser.EnumDietRecoveryTest)  Time elapsed: 0.002 s
17:55:32 test0015 - 11(org.eclipse.jdt.core.tests.compiler.parser.EnumDietRecoveryTest)  Time elapsed: 0.004 s
17:55:32 test0016 - 11(org.eclipse.jdt.core.tests.compiler.parser.EnumDietRecoveryTest)  Time elapsed: 0.002 s
17:55:32 test0017 - 11(org.eclipse.jdt.core.tests.compiler.parser.EnumDietRecoveryTest)  Time elapsed: 0.002 s
17:55:32 test0001 - 11(org.eclipse.jdt.core.tests.compiler.parser.AnnotationDietRecoveryTest)  Time elapsed: 0.002 s
17:55:32 test0002 - 11(org.eclipse.jdt.core.tests.compiler.parser.AnnotationDietRecoveryTest)  Time elapsed: 0.001 s
17:55:32 test0003 - 11(org.eclipse.jdt.core.tests.compiler.parser.AnnotationDietRecoveryTest)  Time elapsed: 0.003 s
17:55:32 test0004 - 11(org.eclipse.jdt.core.tests.compiler.parser.AnnotationDietRecoveryTest)  Time elapsed: 0.002 s
17:55:32 test0005 - 11(org.eclipse.jdt.core.tests.compiler.parser.AnnotationDietRecoveryTest)  Time elapsed: 0.003 s
17:55:32 test0006 - 11(org.eclipse.jdt.core.tests.compiler.parser.AnnotationDietRecoveryTest)  Time elapsed: 0.003 s
17:55:32 test0007 - 11(org.eclipse.jdt.core.tests.compiler.parser.AnnotationDietRecoveryTest)  Time elapsed: 0.003 s
17:55:32 test0008 - 11(org.eclipse.jdt.core.tests.compiler.parser.AnnotationDietRecoveryTest)  Time elapsed: 0.004 s
17:55:32 test0009 - 11(org.eclipse.jdt.core.tests.compiler.parser.AnnotationDietRecoveryTest)  Time elapsed: 0.004 s
17:55:32 test0010 - 11(org.eclipse.jdt.core.tests.compiler.parser.AnnotationDietRecoveryTest)  Time elapsed: 0.003 s
17:55:32 test0011 - 11(org.eclipse.jdt.core.tests.compiler.parser.AnnotationDietRecoveryTest)  Time elapsed: 0.002 s
17:55:32 test0012 - 11(org.eclipse.jdt.core.tests.compiler.parser.AnnotationDietRecoveryTest)  Time elapsed: 0.004 s
17:55:32 test0013 - 11(org.eclipse.jdt.core.tests.compiler.parser.AnnotationDietRecoveryTest)  Time elapsed: 0.001 s
17:55:32 test0014 - 11(org.eclipse.jdt.core.tests.compiler.parser.AnnotationDietRecoveryTest)  Time elapsed: 0.002 s
17:55:32 test0015 - 11(org.eclipse.jdt.core.tests.compiler.parser.AnnotationDietRecoveryTest)  Time elapsed: 0.003 s
17:55:32 test0016 - 11(org.eclipse.jdt.core.tests.compiler.parser.AnnotationDietRecoveryTest)  Time elapsed: 0.004 s
17:55:32 test0017 - 11(org.eclipse.jdt.core.tests.compiler.parser.AnnotationDietRecoveryTest)  Time elapsed: 0.005 s
17:55:32 test0018 - 11(org.eclipse.jdt.core.tests.compiler.parser.AnnotationDietRecoveryTest)  Time elapsed: 0.004 s
17:55:32 test0019 - 11(org.eclipse.jdt.core.tests.compiler.parser.AnnotationDietRecoveryTest)  Time elapsed: 0.005 s
17:55:32 test0020 - 11(org.eclipse.jdt.core.tests.compiler.parser.AnnotationDietRecoveryTest)  Time elapsed: 0.005 s
17:55:32 test0021 - 11(org.eclipse.jdt.core.tests.compiler.parser.AnnotationDietRecoveryTest)  Time elapsed: 0.005 s
17:55:32 test0022 - 11(org.eclipse.jdt.core.tests.compiler.parser.AnnotationDietRecoveryTest)  Time elapsed: 0.006 s
17:55:32 test0023 - 11(org.eclipse.jdt.core.tests.compiler.parser.AnnotationDietRecoveryTest)  Time elapsed: 0.005 s
17:55:32 test0024 - 11(org.eclipse.jdt.core.tests.compiler.parser.AnnotationDietRecoveryTest)  Time elapsed: 0.005 s
17:55:32 test0025 - 11(org.eclipse.jdt.core.tests.compiler.parser.AnnotationDietRecoveryTest)  Time elapsed: 0.004 s
17:55:32 test0026 - 11(org.eclipse.jdt.core.tests.compiler.parser.AnnotationDietRecoveryTest)  Time elapsed: 0.003 s
17:55:32 test0027 - 11(org.eclipse.jdt.core.tests.compiler.parser.AnnotationDietRecoveryTest)  Time elapsed: 0.003 s
17:55:32 test0028 - 11(org.eclipse.jdt.core.tests.compiler.parser.AnnotationDietRecoveryTest)  Time elapsed: 0.003 s
17:55:32 test0030 - 11(org.eclipse.jdt.core.tests.compiler.parser.AnnotationDietRecoveryTest)  Time elapsed: 0.003 s
17:55:32 test0031 - 11(org.eclipse.jdt.core.tests.compiler.parser.AnnotationDietRecoveryTest)  Time elapsed: 0.005 s
17:55:32 test0032 - 11(org.eclipse.jdt.core.tests.compiler.parser.AnnotationDietRecoveryTest)  Time elapsed: 0.004 s
17:55:32 test0033 - 11(org.eclipse.jdt.core.tests.compiler.parser.AnnotationDietRecoveryTest)  Time elapsed: 0.003 s
17:55:32 test0034 - 11(org.eclipse.jdt.core.tests.compiler.parser.AnnotationDietRecoveryTest)  Time elapsed: 0.003 s
17:55:32 test0035 - 11(org.eclipse.jdt.core.tests.compiler.parser.AnnotationDietRecoveryTest)  Time elapsed: 0.003 s
17:55:32 test0036 - 11(org.eclipse.jdt.core.tests.compiler.parser.AnnotationDietRecoveryTest)  Time elapsed: 0.002 s
17:55:32 test0037 - 11(org.eclipse.jdt.core.tests.compiler.parser.AnnotationDietRecoveryTest)  Time elapsed: 0.001 s
17:55:32 test0038 - 11(org.eclipse.jdt.core.tests.compiler.parser.AnnotationDietRecoveryTest)  Time elapsed: 0.004 s
17:55:32 test0039 - 11(org.eclipse.jdt.core.tests.compiler.parser.AnnotationDietRecoveryTest)  Time elapsed: 0.001 s
17:55:32 test0040 - 11(org.eclipse.jdt.core.tests.compiler.parser.AnnotationDietRecoveryTest)  Time elapsed: 0.002 s
17:55:32 test0041 - 11(org.eclipse.jdt.core.tests.compiler.parser.AnnotationDietRecoveryTest)  Time elapsed: 0.034 s
17:55:32 test0001 - 11(org.eclipse.jdt.core.tests.compiler.parser.StatementRecoveryTest_1_5)  Time elapsed: 0.003 s
17:55:32 test0002 - 11(org.eclipse.jdt.core.tests.compiler.parser.StatementRecoveryTest_1_5)  Time elapsed: 0.005 s
17:55:32 test0003 - 11(org.eclipse.jdt.core.tests.compiler.parser.StatementRecoveryTest_1_5)  Time elapsed: 0.004 s
17:55:32 test0004 - 11(org.eclipse.jdt.core.tests.compiler.parser.StatementRecoveryTest_1_5)  Time elapsed: 0.003 s
17:55:32 test0005 - 11(org.eclipse.jdt.core.tests.compiler.parser.StatementRecoveryTest_1_5)  Time elapsed: 0.004 s
17:55:32 test0006 - 11(org.eclipse.jdt.core.tests.compiler.parser.StatementRecoveryTest_1_5)  Time elapsed: 0.003 s
17:55:32 test0007 - 11(org.eclipse.jdt.core.tests.compiler.parser.StatementRecoveryTest_1_5)  Time elapsed: 0.004 s
17:55:32 test0008 - 11(org.eclipse.jdt.core.tests.compiler.parser.StatementRecoveryTest_1_5)  Time elapsed: 0.002 s
17:55:32 test0001 - 11(org.eclipse.jdt.core.tests.compiler.parser.ParserTest1_7)  Time elapsed: 0.001 s
17:55:32 test0002 - 11(org.eclipse.jdt.core.tests.compiler.parser.ParserTest1_7)  Time elapsed: 0.001 s
17:55:32 test0003 - 11(org.eclipse.jdt.core.tests.compiler.parser.ParserTest1_7)  Time elapsed: 0.001 s
17:55:32 test0004 - 11(org.eclipse.jdt.core.tests.compiler.parser.ParserTest1_7)  Time elapsed: 0.001 s
17:55:32 test0005 - 11(org.eclipse.jdt.core.tests.compiler.parser.ParserTest1_7)  Time elapsed: 0.001 s
17:55:32 test0006 - 11(org.eclipse.jdt.core.tests.compiler.parser.ParserTest1_7)  Time elapsed: 0.001 s
17:55:32 test0007 - 11(org.eclipse.jdt.core.tests.compiler.parser.ParserTest1_7)  Time elapsed: 0 s
17:55:32 test0008 - 11(org.eclipse.jdt.core.tests.compiler.parser.ParserTest1_7)  Time elapsed: 0.001 s
17:55:32 test0009 - 11(org.eclipse.jdt.core.tests.compiler.parser.ParserTest1_7)  Time elapsed: 0.001 s
17:55:32 test0010 - 11(org.eclipse.jdt.core.tests.compiler.parser.ParserTest1_7)  Time elapsed: 0.001 s
17:55:32 test0011 - 11(org.eclipse.jdt.core.tests.compiler.parser.ParserTest1_7)  Time elapsed: 0.001 s
17:55:32 test0012 - 11(org.eclipse.jdt.core.tests.compiler.parser.ParserTest1_7)  Time elapsed: 0.001 s
17:55:32 test0001 - 11(org.eclipse.jdt.core.tests.compiler.parser.LambdaExpressionSyntaxTest)  Time elapsed: 0.001 s
17:55:32 test00010 - 11(org.eclipse.jdt.core.tests.compiler.parser.LambdaExpressionSyntaxTest)  Time elapsed: 0 s
17:55:32 test0002 - 11(org.eclipse.jdt.core.tests.compiler.parser.LambdaExpressionSyntaxTest)  Time elapsed: 0 s
17:55:32 test0003 - 11(org.eclipse.jdt.core.tests.compiler.parser.LambdaExpressionSyntaxTest)  Time elapsed: 0 s
17:55:32 test0004 - 11(org.eclipse.jdt.core.tests.compiler.parser.LambdaExpressionSyntaxTest)  Time elapsed: 0 s
17:55:32 test0005 - 11(org.eclipse.jdt.core.tests.compiler.parser.LambdaExpressionSyntaxTest)  Time elapsed: 0.001 s
17:55:32 test0006 - 11(org.eclipse.jdt.core.tests.compiler.parser.LambdaExpressionSyntaxTest)  Time elapsed: 0 s
17:55:32 test0007 - 11(org.eclipse.jdt.core.tests.compiler.parser.LambdaExpressionSyntaxTest)  Time elapsed: 0 s
17:55:32 test0008 - 11(org.eclipse.jdt.core.tests.compiler.parser.LambdaExpressionSyntaxTest)  Time elapsed: 0.001 s
17:55:32 test0009 - 11(org.eclipse.jdt.core.tests.compiler.parser.LambdaExpressionSyntaxTest)  Time elapsed: 0 s
17:55:32 test0011 - 11(org.eclipse.jdt.core.tests.compiler.parser.LambdaExpressionSyntaxTest)  Time elapsed: 0 s
17:55:32 test0012 - 11(org.eclipse.jdt.core.tests.compiler.parser.LambdaExpressionSyntaxTest)  Time elapsed: 0 s
17:55:32 test0013 - 11(org.eclipse.jdt.core.tests.compiler.parser.LambdaExpressionSyntaxTest)  Time elapsed: 0.001 s
17:55:32 test0014 - 11(org.eclipse.jdt.core.tests.compiler.parser.LambdaExpressionSyntaxTest)  Time elapsed: 0 s
17:55:32 test0015 - 11(org.eclipse.jdt.core.tests.compiler.parser.LambdaExpressionSyntaxTest)  Time elapsed: 0 s
17:55:32 test0016 - 11(org.eclipse.jdt.core.tests.compiler.parser.LambdaExpressionSyntaxTest)  Time elapsed: 0.001 s
17:55:32 test0017 - 11(org.eclipse.jdt.core.tests.compiler.parser.LambdaExpressionSyntaxTest)  Time elapsed: 0 s
17:55:32 test0018 - 11(org.eclipse.jdt.core.tests.compiler.parser.LambdaExpressionSyntaxTest)  Time elapsed: 0 s
17:55:32 test0019 - 11(org.eclipse.jdt.core.tests.compiler.parser.LambdaExpressionSyntaxTest)  Time elapsed: 0 s
17:55:32 test385132 - 11(org.eclipse.jdt.core.tests.compiler.parser.LambdaExpressionSyntaxTest)  Time elapsed: 0.001 s
17:55:32 testNestedLambda01 - 11(org.eclipse.jdt.core.tests.compiler.parser.LambdaExpressionSyntaxTest)  Time elapsed: 0 s
17:55:32 test0001 - 11(org.eclipse.jdt.core.tests.compiler.parser.ReferenceExpressionSyntaxTest)  Time elapsed: 0 s
17:55:32 test0002 - 11(org.eclipse.jdt.core.tests.compiler.parser.ReferenceExpressionSyntaxTest)  Time elapsed: 0.001 s
17:55:32 test0003 - 11(org.eclipse.jdt.core.tests.compiler.parser.ReferenceExpressionSyntaxTest)  Time elapsed: 0 s
17:55:32 test0004 - 11(org.eclipse.jdt.core.tests.compiler.parser.ReferenceExpressionSyntaxTest)  Time elapsed: 0 s
17:55:32 test0005 - 11(org.eclipse.jdt.core.tests.compiler.parser.ReferenceExpressionSyntaxTest)  Time elapsed: 0 s
17:55:32 test0006 - 11(org.eclipse.jdt.core.tests.compiler.parser.ReferenceExpressionSyntaxTest)  Time elapsed: 0.001 s
17:55:32 test0007 - 11(org.eclipse.jdt.core.tests.compiler.parser.ReferenceExpressionSyntaxTest)  Time elapsed: 0 s
17:55:32 test0008 - 11(org.eclipse.jdt.core.tests.compiler.parser.ReferenceExpressionSyntaxTest)  Time elapsed: 0 s
17:55:32 test0009 - 11(org.eclipse.jdt.core.tests.compiler.parser.ReferenceExpressionSyntaxTest)  Time elapsed: 0.001 s
17:55:32 test0010 - 11(org.eclipse.jdt.core.tests.compiler.parser.ReferenceExpressionSyntaxTest)  Time elapsed: 0 s
17:55:32 test0011 - 11(org.eclipse.jdt.core.tests.compiler.parser.ReferenceExpressionSyntaxTest)  Time elapsed: 0 s
17:55:32 test0012 - 11(org.eclipse.jdt.core.tests.compiler.parser.ReferenceExpressionSyntaxTest)  Time elapsed: 0 s
17:55:32 test0013 - 11(org.eclipse.jdt.core.tests.compiler.parser.ReferenceExpressionSyntaxTest)  Time elapsed: 0.001 s
17:55:32 test0014 - 11(org.eclipse.jdt.core.tests.compiler.parser.ReferenceExpressionSyntaxTest)  Time elapsed: 0 s
17:55:32 test0015 - 11(org.eclipse.jdt.core.tests.compiler.parser.ReferenceExpressionSyntaxTest)  Time elapsed: 0 s
17:55:32 test0016 - 11(org.eclipse.jdt.core.tests.compiler.parser.ReferenceExpressionSyntaxTest)  Time elapsed: 0 s
17:55:32 test0017 - 11(org.eclipse.jdt.core.tests.compiler.parser.ReferenceExpressionSyntaxTest)  Time elapsed: 0.001 s
17:55:32 test0018 - 11(org.eclipse.jdt.core.tests.compiler.parser.ReferenceExpressionSyntaxTest)  Time elapsed: 0 s
17:55:32 test0019 - 11(org.eclipse.jdt.core.tests.compiler.parser.ReferenceExpressionSyntaxTest)  Time elapsed: 0 s
17:55:32 test0020 - 11(org.eclipse.jdt.core.tests.compiler.parser.ReferenceExpressionSyntaxTest)  Time elapsed: 0.001 s
17:55:32 test385132 - 11(org.eclipse.jdt.core.tests.compiler.parser.ReferenceExpressionSyntaxTest)  Time elapsed: 0 s
17:55:32 test385374 - 11(org.eclipse.jdt.core.tests.compiler.parser.ReferenceExpressionSyntaxTest)  Time elapsed: 0 s
17:55:32 test385374a - 11(org.eclipse.jdt.core.tests.compiler.parser.ReferenceExpressionSyntaxTest)  Time elapsed: 0 s
17:55:32 test0001 - 11(org.eclipse.jdt.core.tests.compiler.parser.TypeAnnotationSyntaxTest)  Time elapsed: 0.002 s
17:55:32 test0002 - 11(org.eclipse.jdt.core.tests.compiler.parser.TypeAnnotationSyntaxTest)  Time elapsed: 0.001 s
17:55:32 test0003 - 11(org.eclipse.jdt.core.tests.compiler.parser.TypeAnnotationSyntaxTest)  Time elapsed: 0.001 s
17:55:32 test0004 - 11(org.eclipse.jdt.core.tests.compiler.parser.TypeAnnotationSyntaxTest)  Time elapsed: 0.001 s
17:55:32 test0005 - 11(org.eclipse.jdt.core.tests.compiler.parser.TypeAnnotationSyntaxTest)  Time elapsed: 0.001 s
17:55:32 test0006 - 11(org.eclipse.jdt.core.tests.compiler.parser.TypeAnnotationSyntaxTest)  Time elapsed: 0.001 s
17:55:32 test0008 - 11(org.eclipse.jdt.core.tests.compiler.parser.TypeAnnotationSyntaxTest)  Time elapsed: 0.001 s
17:55:32 test0009 - 11(org.eclipse.jdt.core.tests.compiler.parser.TypeAnnotationSyntaxTest)  Time elapsed: 0.001 s
17:55:32 test0010 - 11(org.eclipse.jdt.core.tests.compiler.parser.TypeAnnotationSyntaxTest)  Time elapsed: 0.002 s
17:55:32 test0011 - 11(org.eclipse.jdt.core.tests.compiler.parser.TypeAnnotationSyntaxTest)  Time elapsed: 0.001 s
17:55:32 test0012 - 11(org.eclipse.jdt.core.tests.compiler.parser.TypeAnnotationSyntaxTest)  Time elapsed: 0.001 s
17:55:32 test0013 - 11(org.eclipse.jdt.core.tests.compiler.parser.TypeAnnotationSyntaxTest)  Time elapsed: 0.002 s
17:55:32 test0014 - 11(org.eclipse.jdt.core.tests.compiler.parser.TypeAnnotationSyntaxTest)  Time elapsed: 0.002 s
17:55:32 test0015 - 11(org.eclipse.jdt.core.tests.compiler.parser.TypeAnnotationSyntaxTest)  Time elapsed: 0.002 s
17:55:32 test0016 - 11(org.eclipse.jdt.core.tests.compiler.parser.TypeAnnotationSyntaxTest)  Time elapsed: 0.001 s
17:55:32 test0017 - 11(org.eclipse.jdt.core.tests.compiler.parser.TypeAnnotationSyntaxTest)  Time elapsed: 0.002 s
17:55:32 test0018 - 11(org.eclipse.jdt.core.tests.compiler.parser.TypeAnnotationSyntaxTest)  Time elapsed: 0.001 s
17:55:32 test0019 - 11(org.eclipse.jdt.core.tests.compiler.parser.TypeAnnotationSyntaxTest)  Time elapsed: 0.002 s
17:55:32 test0020 - 11(org.eclipse.jdt.core.tests.compiler.parser.TypeAnnotationSyntaxTest)  Time elapsed: 0.001 s
17:55:32 test0021 - 11(org.eclipse.jdt.core.tests.compiler.parser.TypeAnnotationSyntaxTest)  Time elapsed: 0.001 s
17:55:32 test0022 - 11(org.eclipse.jdt.core.tests.compiler.parser.TypeAnnotationSyntaxTest)  Time elapsed: 0.002 s
17:55:32 test0023 - 11(org.eclipse.jdt.core.tests.compiler.parser.TypeAnnotationSyntaxTest)  Time elapsed: 0.001 s
17:55:32 test0024 - 11(org.eclipse.jdt.core.tests.compiler.parser.TypeAnnotationSyntaxTest)  Time elapsed: 0.001 s
17:55:32 test0025 - 11(org.eclipse.jdt.core.tests.compiler.parser.TypeAnnotationSyntaxTest)  Time elapsed: 0.002 s
17:55:32 test0026 - 11(org.eclipse.jdt.core.tests.compiler.parser.TypeAnnotationSyntaxTest)  Time elapsed: 0 s
17:55:32 test0027 - 11(org.eclipse.jdt.core.tests.compiler.parser.TypeAnnotationSyntaxTest)  Time elapsed: 0 s
17:55:32 test0028 - 11(org.eclipse.jdt.core.tests.compiler.parser.TypeAnnotationSyntaxTest)  Time elapsed: 0 s
17:55:32 test0029 - 11(org.eclipse.jdt.core.tests.compiler.parser.TypeAnnotationSyntaxTest)  Time elapsed: 0.001 s
17:55:32 test0030 - 11(org.eclipse.jdt.core.tests.compiler.parser.TypeAnnotationSyntaxTest)  Time elapsed: 0 s
17:55:32 test0031 - 11(org.eclipse.jdt.core.tests.compiler.parser.TypeAnnotationSyntaxTest)  Time elapsed: 0 s
17:55:32 test0032 - 11(org.eclipse.jdt.core.tests.compiler.parser.TypeAnnotationSyntaxTest)  Time elapsed: 0 s
17:55:32 test0033 - 11(org.eclipse.jdt.core.tests.compiler.parser.TypeAnnotationSyntaxTest)  Time elapsed: 0 s
17:55:32 test0034 - 11(org.eclipse.jdt.core.tests.compiler.parser.TypeAnnotationSyntaxTest)  Time elapsed: 0.001 s
17:55:32 test0035 - 11(org.eclipse.jdt.core.tests.compiler.parser.TypeAnnotationSyntaxTest)  Time elapsed: 0.001 s
17:55:32 test0036 - 11(org.eclipse.jdt.core.tests.compiler.parser.TypeAnnotationSyntaxTest)  Time elapsed: 0.001 s
17:55:32 test0037 - 11(org.eclipse.jdt.core.tests.compiler.parser.TypeAnnotationSyntaxTest)  Time elapsed: 0.001 s
17:55:32 test0038 - 11(org.eclipse.jdt.core.tests.compiler.parser.TypeAnnotationSyntaxTest)  Time elapsed: 0.001 s
17:55:32 test0039 - 11(org.eclipse.jdt.core.tests.compiler.parser.TypeAnnotationSyntaxTest)  Time elapsed: 0.001 s
17:55:32 test0040 - 11(org.eclipse.jdt.core.tests.compiler.parser.TypeAnnotationSyntaxTest)  Time elapsed: 0.002 s
17:55:32 test0041 - 11(org.eclipse.jdt.core.tests.compiler.parser.TypeAnnotationSyntaxTest)  Time elapsed: 0.001 s
17:55:32 test0042 - 11(org.eclipse.jdt.core.tests.compiler.parser.TypeAnnotationSyntaxTest)  Time elapsed: 0.001 s
17:55:32 test0043 - 11(org.eclipse.jdt.core.tests.compiler.parser.TypeAnnotationSyntaxTest)  Time elapsed: 0.002 s
17:55:32 test0044 - 11(org.eclipse.jdt.core.tests.compiler.parser.TypeAnnotationSyntaxTest)  Time elapsed: 0.001 s
17:55:32 test0045 - 11(org.eclipse.jdt.core.tests.compiler.parser.TypeAnnotationSyntaxTest)  Time elapsed: 0.001 s
17:55:32 test0046 - 11(org.eclipse.jdt.core.tests.compiler.parser.TypeAnnotationSyntaxTest)  Time elapsed: 0.002 s
17:55:32 test0047 - 11(org.eclipse.jdt.core.tests.compiler.parser.TypeAnnotationSyntaxTest)  Time elapsed: 0.001 s
17:55:32 test0048 - 11(org.eclipse.jdt.core.tests.compiler.parser.TypeAnnotationSyntaxTest)  Time elapsed: 0.001 s
17:55:32 test0049 - 11(org.eclipse.jdt.core.tests.compiler.parser.TypeAnnotationSyntaxTest)  Time elapsed: 0.002 s
17:55:32 test0050 - 11(org.eclipse.jdt.core.tests.compiler.parser.TypeAnnotationSyntaxTest)  Time elapsed: 0.001 s
17:55:32 test0051 - 11(org.eclipse.jdt.core.tests.compiler.parser.TypeAnnotationSyntaxTest)  Time elapsed: 0.001 s
17:55:32 test0052 - 11(org.eclipse.jdt.core.tests.compiler.parser.TypeAnnotationSyntaxTest)  Time elapsed: 0.001 s
17:55:32 test0053 - 11(org.eclipse.jdt.core.tests.compiler.parser.TypeAnnotationSyntaxTest)  Time elapsed: 0.001 s
17:55:32 test0054 - 11(org.eclipse.jdt.core.tests.compiler.parser.TypeAnnotationSyntaxTest)  Time elapsed: 0.002 s
17:55:32 test0055 - 11(org.eclipse.jdt.core.tests.compiler.parser.TypeAnnotationSyntaxTest)  Time elapsed: 0.001 s
17:55:32 test0056 - 11(org.eclipse.jdt.core.tests.compiler.parser.TypeAnnotationSyntaxTest)  Time elapsed: 0.001 s
17:55:32 test0057 - 11(org.eclipse.jdt.core.tests.compiler.parser.TypeAnnotationSyntaxTest)  Time elapsed: 0.002 s
17:55:32 test0058 - 11(org.eclipse.jdt.core.tests.compiler.parser.TypeAnnotationSyntaxTest)  Time elapsed: 0.001 s
17:55:32 test0059 - 11(org.eclipse.jdt.core.tests.compiler.parser.TypeAnnotationSyntaxTest)  Time elapsed: 0.002 s
17:55:32 test0060 - 11(org.eclipse.jdt.core.tests.compiler.parser.TypeAnnotationSyntaxTest)  Time elapsed: 0.006 s
17:55:32 test0061 - 11(org.eclipse.jdt.core.tests.compiler.parser.TypeAnnotationSyntaxTest)  Time elapsed: 0.004 s
17:55:32 test0062 - 11(org.eclipse.jdt.core.tests.compiler.parser.TypeAnnotationSyntaxTest)  Time elapsed: 0.003 s
17:55:32 test0063 - 11(org.eclipse.jdt.core.tests.compiler.parser.TypeAnnotationSyntaxTest)  Time elapsed: 0.004 s
17:55:32 test0064 - 11(org.eclipse.jdt.core.tests.compiler.parser.TypeAnnotationSyntaxTest)  Time elapsed: 0.001 s
17:55:32 test0066 - 11(org.eclipse.jdt.core.tests.compiler.parser.TypeAnnotationSyntaxTest)  Time elapsed: 0.002 s
17:55:32 test0067 - 11(org.eclipse.jdt.core.tests.compiler.parser.TypeAnnotationSyntaxTest)  Time elapsed: 0.001 s
17:55:32 test0068 - 11(org.eclipse.jdt.core.tests.compiler.parser.TypeAnnotationSyntaxTest)  Time elapsed: 0.001 s
17:55:32 test0069 - 11(org.eclipse.jdt.core.tests.compiler.parser.TypeAnnotationSyntaxTest)  Time elapsed: 0.002 s
17:55:32 test007 - 11(org.eclipse.jdt.core.tests.compiler.parser.TypeAnnotationSyntaxTest)  Time elapsed: 0.001 s
17:55:32 test0070 - 11(org.eclipse.jdt.core.tests.compiler.parser.TypeAnnotationSyntaxTest)  Time elapsed: 0.001 s
17:55:32 test0071 - 11(org.eclipse.jdt.core.tests.compiler.parser.TypeAnnotationSyntaxTest)  Time elapsed: 0.001 s
17:55:32 test0072 - 11(org.eclipse.jdt.core.tests.compiler.parser.TypeAnnotationSyntaxTest)  Time elapsed: 0.002 s
17:55:32 test0073 - 11(org.eclipse.jdt.core.tests.compiler.parser.TypeAnnotationSyntaxTest)  Time elapsed: 0.001 s
17:55:32 test0074 - 11(org.eclipse.jdt.core.tests.compiler.parser.TypeAnnotationSyntaxTest)  Time elapsed: 0.002 s
17:55:32 test0075 - 11(org.eclipse.jdt.core.tests.compiler.parser.TypeAnnotationSyntaxTest)  Time elapsed: 0.001 s
17:55:32 test0076 - 11(org.eclipse.jdt.core.tests.compiler.parser.TypeAnnotationSyntaxTest)  Time elapsed: 0.001 s
17:55:32 test0077 - 11(org.eclipse.jdt.core.tests.compiler.parser.TypeAnnotationSyntaxTest)  Time elapsed: 0.001 s
17:55:32 test0078 - 11(org.eclipse.jdt.core.tests.compiler.parser.TypeAnnotationSyntaxTest)  Time elapsed: 0.002 s
17:55:32 test0079 - 11(org.eclipse.jdt.core.tests.compiler.parser.TypeAnnotationSyntaxTest)  Time elapsed: 0.001 s
17:55:32 test0080 - 11(org.eclipse.jdt.core.tests.compiler.parser.TypeAnnotationSyntaxTest)  Time elapsed: 0.001 s
17:55:32 test0081 - 11(org.eclipse.jdt.core.tests.compiler.parser.TypeAnnotationSyntaxTest)  Time elapsed: 0.002 s
17:55:32 test0082 - 11(org.eclipse.jdt.core.tests.compiler.parser.TypeAnnotationSyntaxTest)  Time elapsed: 0.001 s
17:55:32 test0083 - 11(org.eclipse.jdt.core.tests.compiler.parser.TypeAnnotationSyntaxTest)  Time elapsed: 0.002 s
17:55:32 test0084 - 11(org.eclipse.jdt.core.tests.compiler.parser.TypeAnnotationSyntaxTest)  Time elapsed: 0.001 s
17:55:32 test0085 - 11(org.eclipse.jdt.core.tests.compiler.parser.TypeAnnotationSyntaxTest)  Time elapsed: 0.003 s
17:55:32 test0086 - 11(org.eclipse.jdt.core.tests.compiler.parser.TypeAnnotationSyntaxTest)  Time elapsed: 0.002 s
17:55:32 test0087 - 11(org.eclipse.jdt.core.tests.compiler.parser.TypeAnnotationSyntaxTest)  Time elapsed: 0.002 s
17:55:32 test0088 - 11(org.eclipse.jdt.core.tests.compiler.parser.TypeAnnotationSyntaxTest)  Time elapsed: 0.002 s
17:55:32 test0089 - 11(org.eclipse.jdt.core.tests.compiler.parser.TypeAnnotationSyntaxTest)  Time elapsed: 0.001 s
17:55:32 test0090 - 11(org.eclipse.jdt.core.tests.compiler.parser.TypeAnnotationSyntaxTest)  Time elapsed: 0.002 s
17:55:32 test0091 - 11(org.eclipse.jdt.core.tests.compiler.parser.TypeAnnotationSyntaxTest)  Time elapsed: 0.001 s
17:55:32 test0092 - 11(org.eclipse.jdt.core.tests.compiler.parser.TypeAnnotationSyntaxTest)  Time elapsed: 0.002 s
17:55:32 test0093 - 11(org.eclipse.jdt.core.tests.compiler.parser.TypeAnnotationSyntaxTest)  Time elapsed: 0.001 s
17:55:32 test0094 - 11(org.eclipse.jdt.core.tests.compiler.parser.TypeAnnotationSyntaxTest)  Time elapsed: 0.001 s
17:55:32 test0095 - 11(org.eclipse.jdt.core.tests.compiler.parser.TypeAnnotationSyntaxTest)  Time elapsed: 0.002 s
17:55:32 test0096 - 11(org.eclipse.jdt.core.tests.compiler.parser.TypeAnnotationSyntaxTest)  Time elapsed: 0.002 s
17:55:32 test0097 - 11(org.eclipse.jdt.core.tests.compiler.parser.TypeAnnotationSyntaxTest)  Time elapsed: 0.001 s
17:55:32 test0098 - 11(org.eclipse.jdt.core.tests.compiler.parser.TypeAnnotationSyntaxTest)  Time elapsed: 0.001 s
17:55:32 test0099 - 11(org.eclipse.jdt.core.tests.compiler.parser.TypeAnnotationSyntaxTest)  Time elapsed: 0.002 s
17:55:32 test0100 - 11(org.eclipse.jdt.core.tests.compiler.parser.TypeAnnotationSyntaxTest)  Time elapsed: 0.002 s
17:55:32 test0101 - 11(org.eclipse.jdt.core.tests.compiler.parser.TypeAnnotationSyntaxTest)  Time elapsed: 0.001 s
17:55:32 test0102 - 11(org.eclipse.jdt.core.tests.compiler.parser.TypeAnnotationSyntaxTest)  Time elapsed: 0.003 s
17:55:32 test0103 - 11(org.eclipse.jdt.core.tests.compiler.parser.TypeAnnotationSyntaxTest)  Time elapsed: 0.002 s
17:55:32 test0104 - 11(org.eclipse.jdt.core.tests.compiler.parser.TypeAnnotationSyntaxTest)  Time elapsed: 0.002 s
17:55:32 test0105 - 11(org.eclipse.jdt.core.tests.compiler.parser.TypeAnnotationSyntaxTest)  Time elapsed: 0.002 s
17:55:32 test0106 - 11(org.eclipse.jdt.core.tests.compiler.parser.TypeAnnotationSyntaxTest)  Time elapsed: 0.002 s
17:55:32 test0107 - 11(org.eclipse.jdt.core.tests.compiler.parser.TypeAnnotationSyntaxTest)  Time elapsed: 0.002 s
17:55:32 test0108 - 11(org.eclipse.jdt.core.tests.compiler.parser.TypeAnnotationSyntaxTest)  Time elapsed: 0.002 s
17:55:32 test0109 - 11(org.eclipse.jdt.core.tests.compiler.parser.TypeAnnotationSyntaxTest)  Time elapsed: 0.001 s
17:55:32 test0110 - 11(org.eclipse.jdt.core.tests.compiler.parser.TypeAnnotationSyntaxTest)  Time elapsed: 0 s
17:55:32 test0111 - 11(org.eclipse.jdt.core.tests.compiler.parser.TypeAnnotationSyntaxTest)  Time elapsed: 0 s
17:55:32 test0112 - 11(org.eclipse.jdt.core.tests.compiler.parser.TypeAnnotationSyntaxTest)  Time elapsed: 0.001 s
17:55:32 test0113 - 11(org.eclipse.jdt.core.tests.compiler.parser.TypeAnnotationSyntaxTest)  Time elapsed: 0.002 s
17:55:32 test0114 - 11(org.eclipse.jdt.core.tests.compiler.parser.TypeAnnotationSyntaxTest)  Time elapsed: 0.001 s
17:55:32 test0115 - 11(org.eclipse.jdt.core.tests.compiler.parser.TypeAnnotationSyntaxTest)  Time elapsed: 0.002 s
17:55:32 test0116 - 11(org.eclipse.jdt.core.tests.compiler.parser.TypeAnnotationSyntaxTest)  Time elapsed: 0.002 s
17:55:32 test0117 - 11(org.eclipse.jdt.core.tests.compiler.parser.TypeAnnotationSyntaxTest)  Time elapsed: 0.002 s
17:55:32 test0118 - 11(org.eclipse.jdt.core.tests.compiler.parser.TypeAnnotationSyntaxTest)  Time elapsed: 0.002 s
17:55:32 test0119 - 11(org.eclipse.jdt.core.tests.compiler.parser.TypeAnnotationSyntaxTest)  Time elapsed: 0.004 s
17:55:32 test0120 - 11(org.eclipse.jdt.core.tests.compiler.parser.TypeAnnotationSyntaxTest)  Time elapsed: 0.002 s
17:55:32 test0121 - 11(org.eclipse.jdt.core.tests.compiler.parser.TypeAnnotationSyntaxTest)  Time elapsed: 0.002 s
17:55:32 test0122 - 11(org.eclipse.jdt.core.tests.compiler.parser.TypeAnnotationSyntaxTest)  Time elapsed: 0.002 s
17:55:32 test0123 - 11(org.eclipse.jdt.core.tests.compiler.parser.TypeAnnotationSyntaxTest)  Time elapsed: 0.002 s
17:55:32 test0125 - 11(org.eclipse.jdt.core.tests.compiler.parser.TypeAnnotationSyntaxTest)  Time elapsed: 0 s
17:55:32 test0126 - 11(org.eclipse.jdt.core.tests.compiler.parser.TypeAnnotationSyntaxTest)  Time elapsed: 0.001 s
17:55:32 test0127 - 11(org.eclipse.jdt.core.tests.compiler.parser.TypeAnnotationSyntaxTest)  Time elapsed: 0 s
17:55:32 test0128 - 11(org.eclipse.jdt.core.tests.compiler.parser.TypeAnnotationSyntaxTest)  Time elapsed: 0.002 s
17:55:32 test0129 - 11(org.eclipse.jdt.core.tests.compiler.parser.TypeAnnotationSyntaxTest)  Time elapsed: 0.001 s
17:55:32 test0130 - 11(org.eclipse.jdt.core.tests.compiler.parser.TypeAnnotationSyntaxTest)  Time elapsed: 0.001 s
17:55:32 test0131 - 11(org.eclipse.jdt.core.tests.compiler.parser.TypeAnnotationSyntaxTest)  Time elapsed: 0.001 s
17:55:32 test0132 - 11(org.eclipse.jdt.core.tests.compiler.parser.TypeAnnotationSyntaxTest)  Time elapsed: 0 s
17:55:32 test0133 - 11(org.eclipse.jdt.core.tests.compiler.parser.TypeAnnotationSyntaxTest)  Time elapsed: 0 s
17:55:32 test0134 - 11(org.eclipse.jdt.core.tests.compiler.parser.TypeAnnotationSyntaxTest)  Time elapsed: 0.001 s
17:55:32 test0135 - 11(org.eclipse.jdt.core.tests.compiler.parser.TypeAnnotationSyntaxTest)  Time elapsed: 0 s
17:55:32 test0136 - 11(org.eclipse.jdt.core.tests.compiler.parser.TypeAnnotationSyntaxTest)  Time elapsed: 0 s
17:55:32 test0137 - 11(org.eclipse.jdt.core.tests.compiler.parser.TypeAnnotationSyntaxTest)  Time elapsed: 0.001 s
17:55:32 test0138 - 11(org.eclipse.jdt.core.tests.compiler.parser.TypeAnnotationSyntaxTest)  Time elapsed: 0 s
17:55:32 test0139 - 11(org.eclipse.jdt.core.tests.compiler.parser.TypeAnnotationSyntaxTest)  Time elapsed: 0 s
17:55:32 test0001 - 11(org.eclipse.jdt.core.tests.compiler.parser.CompletionParserTest18)  Time elapsed: 0.001 s
17:55:32 test0002 - 11(org.eclipse.jdt.core.tests.compiler.parser.CompletionParserTest18)  Time elapsed: 0.001 s
17:55:32 test0003 - 11(org.eclipse.jdt.core.tests.compiler.parser.CompletionParserTest18)  Time elapsed: 0 s
17:55:32 test0004 - 11(org.eclipse.jdt.core.tests.compiler.parser.CompletionParserTest18)  Time elapsed: 0.001 s
17:55:32 test0005 - 11(org.eclipse.jdt.core.tests.compiler.parser.CompletionParserTest18)  Time elapsed: 0.001 s
17:55:32 test0006 - 11(org.eclipse.jdt.core.tests.compiler.parser.CompletionParserTest18)  Time elapsed: 0.001 s
17:55:32 test0007 - 11(org.eclipse.jdt.core.tests.compiler.parser.CompletionParserTest18)  Time elapsed: 0 s
17:55:32 test0010 - 11(org.eclipse.jdt.core.tests.compiler.parser.CompletionParserTest18)  Time elapsed: 0.001 s
17:55:32 test402081 - 11(org.eclipse.jdt.core.tests.compiler.parser.CompletionParserTest18)  Time elapsed: 0 s
17:55:32 test405126 - 11(org.eclipse.jdt.core.tests.compiler.parser.CompletionParserTest18)  Time elapsed: 0 s
17:55:32 test417935 - 11(org.eclipse.jdt.core.tests.compiler.parser.CompletionParserTest18)  Time elapsed: 0.001 s
17:55:32 test422468 - 11(org.eclipse.jdt.core.tests.compiler.parser.CompletionParserTest18)  Time elapsed: 0.001 s
17:55:32 test424080 - 11(org.eclipse.jdt.core.tests.compiler.parser.CompletionParserTest18)  Time elapsed: 0.001 s
17:55:32 test425084 - 11(org.eclipse.jdt.core.tests.compiler.parser.CompletionParserTest18)  Time elapsed: 0 s
17:55:32 test425084b - 11(org.eclipse.jdt.core.tests.compiler.parser.CompletionParserTest18)  Time elapsed: 0.001 s
17:55:32 test427117 - 11(org.eclipse.jdt.core.tests.compiler.parser.CompletionParserTest18)  Time elapsed: 0 s
17:55:32 test427255 - 11(org.eclipse.jdt.core.tests.compiler.parser.CompletionParserTest18)  Time elapsed: 0.001 s
17:55:32 test427322 - 11(org.eclipse.jdt.core.tests.compiler.parser.CompletionParserTest18)  Time elapsed: 0 s
17:55:32 test427322a - 11(org.eclipse.jdt.core.tests.compiler.parser.CompletionParserTest18)  Time elapsed: 0 s
17:55:32 test427463 - 11(org.eclipse.jdt.core.tests.compiler.parser.CompletionParserTest18)  Time elapsed: 0.001 s
17:55:32 test427532 - 11(org.eclipse.jdt.core.tests.compiler.parser.CompletionParserTest18)  Time elapsed: 0.001 s
17:55:32 test428735 - 11(org.eclipse.jdt.core.tests.compiler.parser.CompletionParserTest18)  Time elapsed: 0 s
17:55:32 test428735a - 11(org.eclipse.jdt.core.tests.compiler.parser.CompletionParserTest18)  Time elapsed: 0.001 s
17:55:32 test428735b - 11(org.eclipse.jdt.core.tests.compiler.parser.CompletionParserTest18)  Time elapsed: 0 s
17:55:32 test428735c - 11(org.eclipse.jdt.core.tests.compiler.parser.CompletionParserTest18)  Time elapsed: 0.001 s
17:55:32 test428735d - 11(org.eclipse.jdt.core.tests.compiler.parser.CompletionParserTest18)  Time elapsed: 0 s
17:55:32 test428735e - 11(org.eclipse.jdt.core.tests.compiler.parser.CompletionParserTest18)  Time elapsed: 0.001 s
17:55:32 test428735f - 11(org.eclipse.jdt.core.tests.compiler.parser.CompletionParserTest18)  Time elapsed: 0 s
17:55:32 test428735g - 11(org.eclipse.jdt.core.tests.compiler.parser.CompletionParserTest18)  Time elapsed: 0.001 s
17:55:32 test428735h - 11(org.eclipse.jdt.core.tests.compiler.parser.CompletionParserTest18)  Time elapsed: 0.001 s
17:55:32 test430656 - 11(org.eclipse.jdt.core.tests.compiler.parser.CompletionParserTest18)  Time elapsed: 0 s
17:55:32 test430667 - 11(org.eclipse.jdt.core.tests.compiler.parser.CompletionParserTest18)  Time elapsed: 0.001 s
17:55:32 test430667a - 11(org.eclipse.jdt.core.tests.compiler.parser.CompletionParserTest18)  Time elapsed: 0.001 s
17:55:32 test430667b - 11(org.eclipse.jdt.core.tests.compiler.parser.CompletionParserTest18)  Time elapsed: 0.001 s
17:55:32 test430667c - 11(org.eclipse.jdt.core.tests.compiler.parser.CompletionParserTest18)  Time elapsed: 0 s
17:55:32 test430667d - 11(org.eclipse.jdt.core.tests.compiler.parser.CompletionParserTest18)  Time elapsed: 0 s
17:55:32 test435219 - 11(org.eclipse.jdt.core.tests.compiler.parser.CompletionParserTest18)  Time elapsed: 0.001 s
17:55:32 test435682 - 11(org.eclipse.jdt.core.tests.compiler.parser.CompletionParserTest18)  Time elapsed: 0 s
17:55:32 test438952 - 11(org.eclipse.jdt.core.tests.compiler.parser.CompletionParserTest18)  Time elapsed: 0 s
17:55:32 test446765 - 11(org.eclipse.jdt.core.tests.compiler.parser.CompletionParserTest18)  Time elapsed: 0.001 s
17:55:32 test473008 - 11(org.eclipse.jdt.core.tests.compiler.parser.CompletionParserTest18)  Time elapsed: 0.001 s
17:55:32 testBrokenMethodCall - 11(org.eclipse.jdt.core.tests.compiler.parser.CompletionParserTest18)  Time elapsed: 0 s
17:55:32 testCompletionLocation - 11(org.eclipse.jdt.core.tests.compiler.parser.CompletionParserTest18)  Time elapsed: 0.001 s
17:55:32 testElidedCompletion - 11(org.eclipse.jdt.core.tests.compiler.parser.CompletionParserTest18)  Time elapsed: 0 s
17:55:32 testElidedCompletion2 - 11(org.eclipse.jdt.core.tests.compiler.parser.CompletionParserTest18)  Time elapsed: 0.001 s
17:55:32 testLocalsPromotion - 11(org.eclipse.jdt.core.tests.compiler.parser.CompletionParserTest18)  Time elapsed: 0.001 s
17:55:32 testUnspecifiedReference - 11(org.eclipse.jdt.core.tests.compiler.parser.CompletionParserTest18)  Time elapsed: 0 s
17:55:32 test424110 - 11(org.eclipse.jdt.core.tests.compiler.parser.SelectionParserTest18)  Time elapsed: 0 s
17:55:32 test424110a - 11(org.eclipse.jdt.core.tests.compiler.parser.SelectionParserTest18)  Time elapsed: 0.001 s
17:55:32 test430572 - 11(org.eclipse.jdt.core.tests.compiler.parser.SelectionParserTest18)  Time elapsed: 0.001 s
17:55:32 test476693 - 11(org.eclipse.jdt.core.tests.compiler.parser.SelectionParserTest18)  Time elapsed: 0 s
17:55:32 test495912 - 11(org.eclipse.jdt.core.tests.compiler.parser.SelectionParserTest18)  Time elapsed: 0.001 s
17:55:32 test495912a - 11(org.eclipse.jdt.core.tests.compiler.parser.SelectionParserTest18)  Time elapsed: 0 s
17:55:32 test495912b - 11(org.eclipse.jdt.core.tests.compiler.parser.SelectionParserTest18)  Time elapsed: 0.001 s
17:55:32 test510339_001_since_9 - 11(org.eclipse.jdt.core.tests.compiler.parser.SelectionParserTest9)  Time elapsed: 0.001 s
17:55:32 test510339_002_since_9 - 11(org.eclipse.jdt.core.tests.compiler.parser.SelectionParserTest9)  Time elapsed: 0 s
17:55:32 test510339_003_since_9 - 11(org.eclipse.jdt.core.tests.compiler.parser.SelectionParserTest9)  Time elapsed: 0 s
17:55:32 test510339_004_since_9 - 11(org.eclipse.jdt.core.tests.compiler.parser.SelectionParserTest9)  Time elapsed: 0 s
17:55:32 test510339_005_since_9 - 11(org.eclipse.jdt.core.tests.compiler.parser.SelectionParserTest9)  Time elapsed: 0 s
17:55:32 test510339_006_since_9 - 11(org.eclipse.jdt.core.tests.compiler.parser.SelectionParserTest9)  Time elapsed: 0 s
17:55:32 test510339_007_since_9 - 11(org.eclipse.jdt.core.tests.compiler.parser.SelectionParserTest9)  Time elapsed: 0.001 s
17:55:32 test510339_008_since_9 - 11(org.eclipse.jdt.core.tests.compiler.parser.SelectionParserTest9)  Time elapsed: 0 s
17:55:32 test510339_009_since_9 - 11(org.eclipse.jdt.core.tests.compiler.parser.SelectionParserTest9)  Time elapsed: 0 s
17:55:32 test510339_010_since_9 - 11(org.eclipse.jdt.core.tests.compiler.parser.SelectionParserTest9)  Time elapsed: 0 s
17:55:32 test510339_011_since_9 - 11(org.eclipse.jdt.core.tests.compiler.parser.SelectionParserTest9)  Time elapsed: 0.001 s
17:55:32 test001 - 11(org.eclipse.jdt.core.tests.compiler.parser.SelectionParserTest10)  Time elapsed: 0 s
17:55:32 test002 - 11(org.eclipse.jdt.core.tests.compiler.parser.SelectionParserTest10)  Time elapsed: 0 s
17:55:32 test0001 - 11(org.eclipse.jdt.core.tests.compiler.parser.ModuleDeclarationSyntaxTest)  Time elapsed: 0 s
17:55:32 test0002 - 11(org.eclipse.jdt.core.tests.compiler.parser.ModuleDeclarationSyntaxTest)  Time elapsed: 0.001 s
17:55:32 test0003 - 11(org.eclipse.jdt.core.tests.compiler.parser.ModuleDeclarationSyntaxTest)  Time elapsed: 0 s
17:55:32 test0004 - 11(org.eclipse.jdt.core.tests.compiler.parser.ModuleDeclarationSyntaxTest)  Time elapsed: 0 s
17:55:32 test0005 - 11(org.eclipse.jdt.core.tests.compiler.parser.ModuleDeclarationSyntaxTest)  Time elapsed: 0 s
17:55:32 test0006 - 11(org.eclipse.jdt.core.tests.compiler.parser.ModuleDeclarationSyntaxTest)  Time elapsed: 0 s
17:55:32 test0007 - 11(org.eclipse.jdt.core.tests.compiler.parser.ModuleDeclarationSyntaxTest)  Time elapsed: 0.003 s
17:55:32 test0008 - 11(org.eclipse.jdt.core.tests.compiler.parser.ModuleDeclarationSyntaxTest)  Time elapsed: 0.001 s
17:55:32 test0009 - 11(org.eclipse.jdt.core.tests.compiler.parser.ModuleDeclarationSyntaxTest)  Time elapsed: 0.001 s
17:55:32 test0010 - 11(org.eclipse.jdt.core.tests.compiler.parser.ModuleDeclarationSyntaxTest)  Time elapsed: 0 s
17:55:32 test0011 - 11(org.eclipse.jdt.core.tests.compiler.parser.ModuleDeclarationSyntaxTest)  Time elapsed: 0.001 s
17:55:32 test0012 - 11(org.eclipse.jdt.core.tests.compiler.parser.ModuleDeclarationSyntaxTest)  Time elapsed: 0 s
17:55:32 test0013 - 11(org.eclipse.jdt.core.tests.compiler.parser.ModuleDeclarationSyntaxTest)  Time elapsed: 0.001 s
17:55:32 test0014 - 11(org.eclipse.jdt.core.tests.compiler.parser.ModuleDeclarationSyntaxTest)  Time elapsed: 0 s
17:55:32 test0015 - 11(org.eclipse.jdt.core.tests.compiler.parser.ModuleDeclarationSyntaxTest)  Time elapsed: 0 s
17:55:32 test0016 - 11(org.eclipse.jdt.core.tests.compiler.parser.ModuleDeclarationSyntaxTest)  Time elapsed: 0 s
17:55:32 test0017 - 11(org.eclipse.jdt.core.tests.compiler.parser.ModuleDeclarationSyntaxTest)  Time elapsed: 0 s
17:55:32 test0018 - 11(org.eclipse.jdt.core.tests.compiler.parser.ModuleDeclarationSyntaxTest)  Time elapsed: 0.001 s
17:55:32 test0019 - 11(org.eclipse.jdt.core.tests.compiler.parser.ModuleDeclarationSyntaxTest)  Time elapsed: 0 s
17:55:32 test0020 - 11(org.eclipse.jdt.core.tests.compiler.parser.ModuleDeclarationSyntaxTest)  Time elapsed: 0 s
17:55:32 test0021 - 11(org.eclipse.jdt.core.tests.compiler.parser.ModuleDeclarationSyntaxTest)  Time elapsed: 0 s
17:55:32 test0022 - 11(org.eclipse.jdt.core.tests.compiler.parser.ModuleDeclarationSyntaxTest)  Time elapsed: 0 s
17:55:32 test0023 - 11(org.eclipse.jdt.core.tests.compiler.parser.ModuleDeclarationSyntaxTest)  Time elapsed: 0.001 s
17:55:32 test0024 - 11(org.eclipse.jdt.core.tests.compiler.parser.ModuleDeclarationSyntaxTest)  Time elapsed: 0 s
17:55:32 test0025 - 11(org.eclipse.jdt.core.tests.compiler.parser.ModuleDeclarationSyntaxTest)  Time elapsed: 0 s
17:55:32 test0026 - 11(org.eclipse.jdt.core.tests.compiler.parser.ModuleDeclarationSyntaxTest)  Time elapsed: 0 s
17:55:32 test0027 - 11(org.eclipse.jdt.core.tests.compiler.parser.ModuleDeclarationSyntaxTest)  Time elapsed: 0.001 s
17:55:32 testBug518626 - 11(org.eclipse.jdt.core.tests.compiler.parser.ModuleDeclarationSyntaxTest)  Time elapsed: 0 s
17:55:32 testbug488541 - 11(org.eclipse.jdt.core.tests.compiler.parser.ModuleDeclarationSyntaxTest)  Time elapsed: 0 s
17:55:32 testbug488541a - 11(org.eclipse.jdt.core.tests.compiler.parser.ModuleDeclarationSyntaxTest)  Time elapsed: 0 s
17:55:32 testbug488541b - 11(org.eclipse.jdt.core.tests.compiler.parser.ModuleDeclarationSyntaxTest)  Time elapsed: 0.001 s
17:55:32 test0001_class_var_warning - 11(org.eclipse.jdt.core.tests.compiler.regression.JEP286ReservedWordTest)  Time elapsed: 0.001 s
17:55:32 test0002_interface_var_warning - 11(org.eclipse.jdt.core.tests.compiler.regression.JEP286ReservedWordTest)  Time elapsed: 0.001 s
17:55:32 testBug530920 - 11(org.eclipse.jdt.core.tests.compiler.regression.JEP286ReservedWordTest)  Time elapsed: 0.001 s
17:55:32 testBug530920a - 11(org.eclipse.jdt.core.tests.compiler.regression.JEP286ReservedWordTest)  Time elapsed: 0.001 s
17:55:32 Running org.eclipse.jdt.core.tests.eval.TestAll
17:55:32 Listening for transport dt_socket at address: 51020
17:55:32 1.4: connected to VM using port 51020
17:55:32 1.4: connected to target using port 51020
17:55:32 This is an expected exception printed by the target VM:
17:55:32 java.io.IOException
17:55:32 	at CodeSnippet_73.run(Unknown Source)
17:55:32 	at java.base/jdk.internal.reflect.GeneratedMethodAccessor1.invoke(Unknown Source)
17:55:32 	at java.base/jdk.internal.reflect.DelegatingMethodAccessorImpl.invoke(DelegatingMethodAccessorImpl.java:43)
17:55:32 	at java.base/java.lang.reflect.Method.invoke(Method.java:566)
17:55:32 	at org.eclipse.jdt.core.tests.eval.target.CodeSnippetRunner$2.run(CodeSnippetRunner.java:351)
17:55:33 This is an expected error printed by the target VM:
17:55:33 java.lang.Error
17:55:33 	at CodeSnippet_75.run(Unknown Source)
17:55:33 	at java.base/jdk.internal.reflect.GeneratedMethodAccessor1.invoke(Unknown Source)
17:55:33 	at java.base/jdk.internal.reflect.DelegatingMethodAccessorImpl.invoke(DelegatingMethodAccessorImpl.java:43)
17:55:33 	at java.base/java.lang.reflect.Method.invoke(Method.java:566)
17:55:33 	at org.eclipse.jdt.core.tests.eval.target.CodeSnippetRunner$2.run(CodeSnippetRunner.java:351)
17:55:43 java.net.ConnectException: Connection refused (Connection refused)
17:55:43 	at java.base/java.net.PlainSocketImpl.socketConnect(Native Method)
17:55:43 	at java.base/java.net.AbstractPlainSocketImpl.doConnect(AbstractPlainSocketImpl.java:399)
17:55:43 	at java.base/java.net.AbstractPlainSocketImpl.connectToAddress(AbstractPlainSocketImpl.java:242)
17:55:43 	at java.base/java.net.AbstractPlainSocketImpl.connect(AbstractPlainSocketImpl.java:224)
17:55:43 	at java.base/java.net.SocksSocketImpl.connect(SocksSocketImpl.java:403)
17:55:43 	at java.base/java.net.Socket.connect(Socket.java:591)
17:55:43 	at java.base/java.net.Socket.connect(Socket.java:540)
17:55:43 	at java.base/java.net.Socket.<init>(Socket.java:436)
17:55:43 	at java.base/java.net.Socket.<init>(Socket.java:213)
17:55:43 	at org.eclipse.jdi.internal.connect.SocketTransportService$2.run(SocketTransportService.java:147)
17:55:43 	at java.base/java.lang.Thread.run(Thread.java:834)
17:55:43 1.7: could not contact the VM at localhost:53236. Retrying...
17:55:43 Listening for transport dt_socket at address: 53236
17:55:44 1.7: connected to VM using port 53236
17:55:44 1.7: connected to target using port 53236
17:55:44 This is an expected exception printed by the target VM:
17:55:44 java.io.IOException
17:55:44 	at CodeSnippet_395.run(Unknown Source)
17:55:44 	at java.base/jdk.internal.reflect.GeneratedMethodAccessor1.invoke(Unknown Source)
17:55:44 	at java.base/jdk.internal.reflect.DelegatingMethodAccessorImpl.invoke(DelegatingMethodAccessorImpl.java:43)
17:55:44 	at java.base/java.lang.reflect.Method.invoke(Method.java:566)
17:55:44 	at org.eclipse.jdt.core.tests.eval.target.CodeSnippetRunner$2.run(CodeSnippetRunner.java:351)
17:55:44 This is an expected error printed by the target VM:
17:55:44 java.lang.Error
17:55:44 	at CodeSnippet_398.run(Unknown Source)
17:55:44 	at java.base/jdk.internal.reflect.GeneratedMethodAccessor1.invoke(Unknown Source)
17:55:44 	at java.base/jdk.internal.reflect.DelegatingMethodAccessorImpl.invoke(DelegatingMethodAccessorImpl.java:43)
17:55:44 	at java.base/java.lang.reflect.Method.invoke(Method.java:566)
17:55:44 	at org.eclipse.jdt.core.tests.eval.target.CodeSnippetRunner$2.run(CodeSnippetRunner.java:351)
17:55:55 java.net.ConnectException: Connection refused (Connection refused)
17:55:55 	at java.base/java.net.PlainSocketImpl.socketConnect(Native Method)
17:55:55 	at java.base/java.net.AbstractPlainSocketImpl.doConnect(AbstractPlainSocketImpl.java:399)
17:55:55 	at java.base/java.net.AbstractPlainSocketImpl.connectToAddress(AbstractPlainSocketImpl.java:242)
17:55:55 	at java.base/java.net.AbstractPlainSocketImpl.connect(AbstractPlainSocketImpl.java:224)
17:55:55 	at java.base/java.net.SocksSocketImpl.connect(SocksSocketImpl.java:403)
17:55:55 	at java.base/java.net.Socket.connect(Socket.java:591)
17:55:55 	at java.base/java.net.Socket.connect(Socket.java:540)
17:55:55 	at java.base/java.net.Socket.<init>(Socket.java:436)
17:55:55 	at java.base/java.net.Socket.<init>(Socket.java:213)
17:55:55 	at org.eclipse.jdi.internal.connect.SocketTransportService$2.run(SocketTransportService.java:147)
17:55:55 	at java.base/java.lang.Thread.run(Thread.java:834)
17:55:55 1.8: could not contact the VM at localhost:39157. Retrying...
17:55:56 Listening for transport dt_socket at address: 39157
17:55:56 1.8: connected to VM using port 39157
17:55:56 1.8: connected to target using port 39157
17:55:57 This is an expected exception printed by the target VM:
17:55:57 java.io.IOException
17:55:57 	at CodeSnippet_736.run(Unknown Source)
17:55:57 	at java.base/jdk.internal.reflect.GeneratedMethodAccessor1.invoke(Unknown Source)
17:55:57 	at java.base/jdk.internal.reflect.DelegatingMethodAccessorImpl.invoke(DelegatingMethodAccessorImpl.java:43)
17:55:57 	at java.base/java.lang.reflect.Method.invoke(Method.java:566)
17:55:57 	at org.eclipse.jdt.core.tests.eval.target.CodeSnippetRunner$2.run(CodeSnippetRunner.java:351)
17:55:57 This is an expected error printed by the target VM:
17:55:57 java.lang.Error
17:55:57 	at CodeSnippet_739.run(Unknown Source)
17:55:57 	at java.base/jdk.internal.reflect.GeneratedMethodAccessor1.invoke(Unknown Source)
17:55:57 	at java.base/jdk.internal.reflect.DelegatingMethodAccessorImpl.invoke(DelegatingMethodAccessorImpl.java:43)
17:55:57 	at java.base/java.lang.reflect.Method.invoke(Method.java:566)
17:55:57 	at org.eclipse.jdt.core.tests.eval.target.CodeSnippetRunner$2.run(CodeSnippetRunner.java:351)
17:56:08 java.net.ConnectException: Connection refused (Connection refused)
17:56:08 	at java.base/java.net.PlainSocketImpl.socketConnect(Native Method)
17:56:08 	at java.base/java.net.AbstractPlainSocketImpl.doConnect(AbstractPlainSocketImpl.java:399)
17:56:08 	at java.base/java.net.AbstractPlainSocketImpl.connectToAddress(AbstractPlainSocketImpl.java:242)
17:56:08 	at java.base/java.net.AbstractPlainSocketImpl.connect(AbstractPlainSocketImpl.java:224)
17:56:08 	at java.base/java.net.SocksSocketImpl.connect(SocksSocketImpl.java:403)
17:56:08 	at java.base/java.net.Socket.connect(Socket.java:591)
17:56:08 	at java.base/java.net.Socket.connect(Socket.java:540)
17:56:08 	at java.base/java.net.Socket.<init>(Socket.java:436)
17:56:08 	at java.base/java.net.Socket.<init>(Socket.java:213)
17:56:08 	at org.eclipse.jdi.internal.connect.SocketTransportService$2.run(SocketTransportService.java:147)
17:56:08 	at java.base/java.lang.Thread.run(Thread.java:834)
17:56:08 11: could not contact the VM at localhost:57646. Retrying...
17:56:08 Listening for transport dt_socket at address: 57646
17:56:09 11: connected to VM using port 57646
17:56:09 11: connected to target using port 57646
17:56:09 This is an expected exception printed by the target VM:
17:56:09 java.io.IOException
17:56:09 	at CodeSnippet_1077.run(Unknown Source)
17:56:09 	at java.base/jdk.internal.reflect.GeneratedMethodAccessor1.invoke(Unknown Source)
17:56:09 	at java.base/jdk.internal.reflect.DelegatingMethodAccessorImpl.invoke(DelegatingMethodAccessorImpl.java:43)
17:56:09 	at java.base/java.lang.reflect.Method.invoke(Method.java:566)
17:56:09 	at org.eclipse.jdt.core.tests.eval.target.CodeSnippetRunner$2.run(CodeSnippetRunner.java:351)
17:56:09 This is an expected error printed by the target VM:
17:56:09 java.lang.Error
17:56:09 	at CodeSnippet_1080.run(Unknown Source)
17:56:09 	at java.base/jdk.internal.reflect.GeneratedMethodAccessor1.invoke(Unknown Source)
17:56:09 	at java.base/jdk.internal.reflect.DelegatingMethodAccessorImpl.invoke(DelegatingMethodAccessorImpl.java:43)
17:56:09 	at java.base/java.lang.reflect.Method.invoke(Method.java:566)
17:56:09 	at org.eclipse.jdt.core.tests.eval.target.CodeSnippetRunner$2.run(CodeSnippetRunner.java:351)
17:56:21 Tests run: 760, Failures: 0, Errors: 0, Skipped: 0, Time elapsed: 48.799 s - in org.eclipse.jdt.core.tests.eval.TestAll
17:56:21 testAllVariables - 1.4(org.eclipse.jdt.core.tests.eval.SanityTestEvaluationContext)  Time elapsed: 0 s
17:56:21 testEvaluate - 1.4(org.eclipse.jdt.core.tests.eval.SanityTestEvaluationContext)  Time elapsed: 0.031 s
17:56:21 testEvaluateImports - 1.4(org.eclipse.jdt.core.tests.eval.SanityTestEvaluationContext)  Time elapsed: 0.001 s
17:56:21 testEvaluateVariable - 1.4(org.eclipse.jdt.core.tests.eval.SanityTestEvaluationContext)  Time elapsed: 0.008 s
17:56:21 testEvaluateVariables - 1.4(org.eclipse.jdt.core.tests.eval.SanityTestEvaluationContext)  Time elapsed: 0.002 s
17:56:21 testGetSetImports - 1.4(org.eclipse.jdt.core.tests.eval.SanityTestEvaluationContext)  Time elapsed: 0 s
17:56:21 testGetSetPackageName - 1.4(org.eclipse.jdt.core.tests.eval.SanityTestEvaluationContext)  Time elapsed: 0.001 s
17:56:21 testNewDeleteVariable - 1.4(org.eclipse.jdt.core.tests.eval.SanityTestEvaluationContext)  Time elapsed: 0 s
17:56:21 testGetEvaluationType - 1.4(org.eclipse.jdt.core.tests.eval.SanityTestEvaluationResult)  Time elapsed: 0.004 s
17:56:21 testGetProblems - 1.4(org.eclipse.jdt.core.tests.eval.SanityTestEvaluationResult)  Time elapsed: 0.003 s
17:56:21 testGetValue - 1.4(org.eclipse.jdt.core.tests.eval.SanityTestEvaluationResult)  Time elapsed: 0.003 s
17:56:21 testGetValueDisplayString - 1.4(org.eclipse.jdt.core.tests.eval.SanityTestEvaluationResult)  Time elapsed: 0.002 s
17:56:21 testGetValueTypeName - 1.4(org.eclipse.jdt.core.tests.eval.SanityTestEvaluationResult)  Time elapsed: 0.003 s
17:56:21 testHasErrors - 1.4(org.eclipse.jdt.core.tests.eval.SanityTestEvaluationResult)  Time elapsed: 0.003 s
17:56:21 testHasProblems - 1.4(org.eclipse.jdt.core.tests.eval.SanityTestEvaluationResult)  Time elapsed: 0.003 s
17:56:21 testHasValue - 1.4(org.eclipse.jdt.core.tests.eval.SanityTestEvaluationResult)  Time elapsed: 0.003 s
17:56:21 testHasWarnings - 1.4(org.eclipse.jdt.core.tests.eval.SanityTestEvaluationResult)  Time elapsed: 0.003 s
17:56:21 testAllKindOfValues - 1.4(org.eclipse.jdt.core.tests.eval.VariableTest)  Time elapsed: 0.061 s
17:56:21 testCodeSnippetVarAssign - 1.4(org.eclipse.jdt.core.tests.eval.VariableTest)  Time elapsed: 0.071 s
17:56:21 testCodeSnippetVarRetrieval - 1.4(org.eclipse.jdt.core.tests.eval.VariableTest)  Time elapsed: 0.031 s
17:56:21 testImports - 1.4(org.eclipse.jdt.core.tests.eval.VariableTest)  Time elapsed: 0.026 s
17:56:21 testSeveralVariableInstallations - 1.4(org.eclipse.jdt.core.tests.eval.VariableTest)  Time elapsed: 0.086 s
17:56:21 testBug345334 - 1.4(org.eclipse.jdt.core.tests.eval.CodeSnippetTest)  Time elapsed: 0.004 s
17:56:21 testBug464656 - 1.4(org.eclipse.jdt.core.tests.eval.CodeSnippetTest)  Time elapsed: 0 s
17:56:21 testCheckedException - 1.4(org.eclipse.jdt.core.tests.eval.CodeSnippetTest)  Time elapsed: 0.005 s
17:56:21 testDiamond - 1.4(org.eclipse.jdt.core.tests.eval.CodeSnippetTest)  Time elapsed: 0 s
17:56:21 testEmptyStatement - 1.4(org.eclipse.jdt.core.tests.eval.CodeSnippetTest)  Time elapsed: 0.004 s
17:56:21 testEvaluateEmptyImport - 1.4(org.eclipse.jdt.core.tests.eval.CodeSnippetTest)  Time elapsed: 0.001 s
17:56:21 testEvaluateExistingPackageAndNonExistingTypeImports - 1.4(org.eclipse.jdt.core.tests.eval.CodeSnippetTest)  Time elapsed: 0 s
17:56:21 testEvaluateNonExistingPackageAndExistingTypeImports - 1.4(org.eclipse.jdt.core.tests.eval.CodeSnippetTest)  Time elapsed: 0 s
17:56:21 testEvaluateNonExistingPackageImport - 1.4(org.eclipse.jdt.core.tests.eval.CodeSnippetTest)  Time elapsed: 0.001 s
17:56:21 testEvaluateNonExistingTypeImport - 1.4(org.eclipse.jdt.core.tests.eval.CodeSnippetTest)  Time elapsed: 0 s
17:56:21 testEvaluateValidPackageAndTypeImports - 1.4(org.eclipse.jdt.core.tests.eval.CodeSnippetTest)  Time elapsed: 0 s
17:56:21 testEvaluateValidPackageImport - 1.4(org.eclipse.jdt.core.tests.eval.CodeSnippetTest)  Time elapsed: 0 s
17:56:21 testEvaluateValidTypeImport - 1.4(org.eclipse.jdt.core.tests.eval.CodeSnippetTest)  Time elapsed: 0.001 s
17:56:21 testFinallyError - 1.4(org.eclipse.jdt.core.tests.eval.CodeSnippetTest)  Time elapsed: 0.004 s
17:56:21 testFinallyOneBlock - 1.4(org.eclipse.jdt.core.tests.eval.CodeSnippetTest)  Time elapsed: 0.004 s
17:56:21 testFinallyTwoBlock - 1.4(org.eclipse.jdt.core.tests.eval.CodeSnippetTest)  Time elapsed: 0.003 s
17:56:21 testFor89632 - 1.4(org.eclipse.jdt.core.tests.eval.CodeSnippetTest)  Time elapsed: 0 s
17:56:21 testFreeReturnAnonymous - 1.4(org.eclipse.jdt.core.tests.eval.CodeSnippetTest)  Time elapsed: 0.004 s
17:56:21 testFreeReturnClassDeclaration - 1.4(org.eclipse.jdt.core.tests.eval.CodeSnippetTest)  Time elapsed: 0.004 s
17:56:21 testFreeReturnExpression - 1.4(org.eclipse.jdt.core.tests.eval.CodeSnippetTest)  Time elapsed: 0.003 s
17:56:21 testFreeReturnInteger - 1.4(org.eclipse.jdt.core.tests.eval.CodeSnippetTest)  Time elapsed: 0.003 s
17:56:21 testFreeReturnLocalVar - 1.4(org.eclipse.jdt.core.tests.eval.CodeSnippetTest)  Time elapsed: 0.004 s
17:56:21 testFreeReturnStatement - 1.4(org.eclipse.jdt.core.tests.eval.CodeSnippetTest)  Time elapsed: 0.003 s
17:56:21 testImportPackage - 1.4(org.eclipse.jdt.core.tests.eval.CodeSnippetTest)  Time elapsed: 0.005 s
17:56:21 testImportType - 1.4(org.eclipse.jdt.core.tests.eval.CodeSnippetTest)  Time elapsed: 0.006 s
17:56:21 testImportTypeAndPackage - 1.4(org.eclipse.jdt.core.tests.eval.CodeSnippetTest)  Time elapsed: 0.005 s
17:56:21 testInnerClassAnonymous - 1.4(org.eclipse.jdt.core.tests.eval.CodeSnippetTest)  Time elapsed: 0.005 s
17:56:21 testInnerClassNamed - 1.4(org.eclipse.jdt.core.tests.eval.CodeSnippetTest)  Time elapsed: 0.005 s
17:56:21 testReturnDisplayStringBoolean - 1.4(org.eclipse.jdt.core.tests.eval.CodeSnippetTest)  Time elapsed: 0.003 s
17:56:21 testReturnDisplayStringCharacter - 1.4(org.eclipse.jdt.core.tests.eval.CodeSnippetTest)  Time elapsed: 0.003 s
17:56:21 testReturnDisplayStringDouble - 1.4(org.eclipse.jdt.core.tests.eval.CodeSnippetTest)  Time elapsed: 0.003 s
17:56:21 testReturnDisplayStringEmptyCodeSnippet - 1.4(org.eclipse.jdt.core.tests.eval.CodeSnippetTest)  Time elapsed: 0.002 s
17:56:21 testReturnDisplayStringFloat - 1.4(org.eclipse.jdt.core.tests.eval.CodeSnippetTest)  Time elapsed: 0.003 s
17:56:21 testReturnDisplayStringInteger - 1.4(org.eclipse.jdt.core.tests.eval.CodeSnippetTest)  Time elapsed: 0.002 s
17:56:21 testReturnDisplayStringLong - 1.4(org.eclipse.jdt.core.tests.eval.CodeSnippetTest)  Time elapsed: 0.003 s
17:56:21 testReturnDisplayStringNoExplicitReturnedValue - 1.4(org.eclipse.jdt.core.tests.eval.CodeSnippetTest)  Time elapsed: 0.003 s
17:56:21 testReturnDisplayStringObject - 1.4(org.eclipse.jdt.core.tests.eval.CodeSnippetTest)  Time elapsed: 0.004 s
17:56:21 testReturnDisplayStringShort - 1.4(org.eclipse.jdt.core.tests.eval.CodeSnippetTest)  Time elapsed: 0.002 s
17:56:21 testReturnDisplayStringString - 1.4(org.eclipse.jdt.core.tests.eval.CodeSnippetTest)  Time elapsed: 0.003 s
17:56:21 testReturnDisplayStringVoid - 1.4(org.eclipse.jdt.core.tests.eval.CodeSnippetTest)  Time elapsed: 0.003 s
17:56:21 testReturnTypeBoolean - 1.4(org.eclipse.jdt.core.tests.eval.CodeSnippetTest)  Time elapsed: 0.002 s
17:56:21 testReturnTypeBooleanArray - 1.4(org.eclipse.jdt.core.tests.eval.CodeSnippetTest)  Time elapsed: 0.003 s
17:56:21 testReturnTypeBooleanObject - 1.4(org.eclipse.jdt.core.tests.eval.CodeSnippetTest)  Time elapsed: 0.002 s
17:56:21 testReturnTypeChar - 1.4(org.eclipse.jdt.core.tests.eval.CodeSnippetTest)  Time elapsed: 0.003 s
17:56:21 testReturnTypeCharArray - 1.4(org.eclipse.jdt.core.tests.eval.CodeSnippetTest)  Time elapsed: 0.002 s
17:56:21 testReturnTypeCharacterObject - 1.4(org.eclipse.jdt.core.tests.eval.CodeSnippetTest)  Time elapsed: 0.004 s
17:56:21 testReturnTypeDouble - 1.4(org.eclipse.jdt.core.tests.eval.CodeSnippetTest)  Time elapsed: 0.004 s
17:56:21 testReturnTypeDoubleArray - 1.4(org.eclipse.jdt.core.tests.eval.CodeSnippetTest)  Time elapsed: 0.003 s
17:56:21 testReturnTypeDoubleObject - 1.4(org.eclipse.jdt.core.tests.eval.CodeSnippetTest)  Time elapsed: 0.003 s
17:56:21 testReturnTypeEmptyCodeSnippet - 1.4(org.eclipse.jdt.core.tests.eval.CodeSnippetTest)  Time elapsed: 0.002 s
17:56:21 testReturnTypeFloat - 1.4(org.eclipse.jdt.core.tests.eval.CodeSnippetTest)  Time elapsed: 0.002 s
17:56:21 testReturnTypeFloatArray - 1.4(org.eclipse.jdt.core.tests.eval.CodeSnippetTest)  Time elapsed: 0.003 s
17:56:21 testReturnTypeFloatObject - 1.4(org.eclipse.jdt.core.tests.eval.CodeSnippetTest)  Time elapsed: 0.004 s
17:56:21 testReturnTypeInt - 1.4(org.eclipse.jdt.core.tests.eval.CodeSnippetTest)  Time elapsed: 0.003 s
17:56:21 testReturnTypeIntegerObject - 1.4(org.eclipse.jdt.core.tests.eval.CodeSnippetTest)  Time elapsed: 0.004 s
17:56:21 testReturnTypeLong - 1.4(org.eclipse.jdt.core.tests.eval.CodeSnippetTest)  Time elapsed: 0.004 s
17:56:21 testReturnTypeLongArray - 1.4(org.eclipse.jdt.core.tests.eval.CodeSnippetTest)  Time elapsed: 0.003 s
17:56:21 testReturnTypeLongObject - 1.4(org.eclipse.jdt.core.tests.eval.CodeSnippetTest)  Time elapsed: 0.003 s
17:56:21 testReturnTypeNoExplicitReturnedValue - 1.4(org.eclipse.jdt.core.tests.eval.CodeSnippetTest)  Time elapsed: 0.003 s
17:56:21 testReturnTypeObject - 1.4(org.eclipse.jdt.core.tests.eval.CodeSnippetTest)  Time elapsed: 0.003 s
17:56:21 testReturnTypeObjectArray - 1.4(org.eclipse.jdt.core.tests.eval.CodeSnippetTest)  Time elapsed: 0.003 s
17:56:21 testReturnTypeShort - 1.4(org.eclipse.jdt.core.tests.eval.CodeSnippetTest)  Time elapsed: 0.003 s
17:56:21 testReturnTypeShortArray - 1.4(org.eclipse.jdt.core.tests.eval.CodeSnippetTest)  Time elapsed: 0.003 s
17:56:21 testReturnTypeShortObject - 1.4(org.eclipse.jdt.core.tests.eval.CodeSnippetTest)  Time elapsed: 0.003 s
17:56:21 testReturnTypeString - 1.4(org.eclipse.jdt.core.tests.eval.CodeSnippetTest)  Time elapsed: 0.003 s
17:56:21 testReturnTypeStringArray - 1.4(org.eclipse.jdt.core.tests.eval.CodeSnippetTest)  Time elapsed: 0.003 s
17:56:21 testReturnTypeVoid - 1.4(org.eclipse.jdt.core.tests.eval.CodeSnippetTest)  Time elapsed: 0.003 s
17:56:21 testReturnTypesIntArray - 1.4(org.eclipse.jdt.core.tests.eval.CodeSnippetTest)  Time elapsed: 0.003 s
17:56:21 testRunMethodInAnonymous - 1.4(org.eclipse.jdt.core.tests.eval.CodeSnippetTest)  Time elapsed: 0.207 s
17:56:21 testRunMethodInAnonymous2 - 1.4(org.eclipse.jdt.core.tests.eval.CodeSnippetTest)  Time elapsed: 0.207 s
17:56:21 testRunMethodInAnonymous3 - 1.4(org.eclipse.jdt.core.tests.eval.CodeSnippetTest)  Time elapsed: 0.207 s
17:56:21 testRunMethodInAnonymous4 - 1.4(org.eclipse.jdt.core.tests.eval.CodeSnippetTest)  Time elapsed: 0.206 s
17:56:21 testRunMethodInAnonymous5 - 1.4(org.eclipse.jdt.core.tests.eval.CodeSnippetTest)  Time elapsed: 0.206 s
17:56:21 testRunMethodInAnonymous6 - 1.4(org.eclipse.jdt.core.tests.eval.CodeSnippetTest)  Time elapsed: 0.206 s
17:56:21 testRunMethodInAnonymous7 - 1.4(org.eclipse.jdt.core.tests.eval.CodeSnippetTest)  Time elapsed: 0.206 s
17:56:21 testRunMethodInAnonymous8 - 1.4(org.eclipse.jdt.core.tests.eval.CodeSnippetTest)  Time elapsed: 0.206 s
17:56:21 testExpressionInInnerClass - 1.4(org.eclipse.jdt.core.tests.eval.NegativeCodeSnippetTest)  Time elapsed: 0.001 s
17:56:21 testExtraClosingCurlyBracket - 1.4(org.eclipse.jdt.core.tests.eval.NegativeCodeSnippetTest)  Time elapsed: 0.001 s
17:56:21 testExtraOpenRoundBracket - 1.4(org.eclipse.jdt.core.tests.eval.NegativeCodeSnippetTest)  Time elapsed: 0.001 s
17:56:21 testExtraSemiColonInExpression - 1.4(org.eclipse.jdt.core.tests.eval.NegativeCodeSnippetTest)  Time elapsed: 0.001 s
17:56:21 testInvalidField - 1.4(org.eclipse.jdt.core.tests.eval.NegativeCodeSnippetTest)  Time elapsed: 0.006 s
17:56:21 testInvalidImport - 1.4(org.eclipse.jdt.core.tests.eval.NegativeCodeSnippetTest)  Time elapsed: 0.002 s
17:56:21 testInvalidUseOfThisInSnippet - 1.4(org.eclipse.jdt.core.tests.eval.NegativeCodeSnippetTest)  Time elapsed: 0.002 s
17:56:21 testInvalidUseOfThisInSnippet2 - 1.4(org.eclipse.jdt.core.tests.eval.NegativeCodeSnippetTest)  Time elapsed: 0.001 s
17:56:21 testMissingClosingRoundBracket - 1.4(org.eclipse.jdt.core.tests.eval.NegativeCodeSnippetTest)  Time elapsed: 0 s
17:56:21 testMissingDoubleQuote - 1.4(org.eclipse.jdt.core.tests.eval.NegativeCodeSnippetTest)  Time elapsed: 0.001 s
17:56:21 testNonLastExpressionStatement - 1.4(org.eclipse.jdt.core.tests.eval.NegativeCodeSnippetTest)  Time elapsed: 0.001 s
17:56:21 testProblemInExpression - 1.4(org.eclipse.jdt.core.tests.eval.NegativeCodeSnippetTest)  Time elapsed: 0 s
17:56:21 testProblemInExpression2 - 1.4(org.eclipse.jdt.core.tests.eval.NegativeCodeSnippetTest)  Time elapsed: 0.001 s
17:56:21 testProblemInInnerClass - 1.4(org.eclipse.jdt.core.tests.eval.NegativeCodeSnippetTest)  Time elapsed: 0.006 s
17:56:21 testProblemInPreviousStatement - 1.4(org.eclipse.jdt.core.tests.eval.NegativeCodeSnippetTest)  Time elapsed: 0.001 s
17:56:21 testProblemInReturnStatement - 1.4(org.eclipse.jdt.core.tests.eval.NegativeCodeSnippetTest)  Time elapsed: 0 s
17:56:21 testRemoveImport - 1.4(org.eclipse.jdt.core.tests.eval.NegativeCodeSnippetTest)  Time elapsed: 0.005 s
17:56:21 testRemoveVariable - 1.4(org.eclipse.jdt.core.tests.eval.NegativeCodeSnippetTest)  Time elapsed: 0.006 s
17:56:21 testUnreachableExpression - 1.4(org.eclipse.jdt.core.tests.eval.NegativeCodeSnippetTest)  Time elapsed: 0.001 s
17:56:21 testUnusedImport - 1.4(org.eclipse.jdt.core.tests.eval.NegativeCodeSnippetTest)  Time elapsed: 0.005 s
17:56:21 testWarning - 1.4(org.eclipse.jdt.core.tests.eval.NegativeCodeSnippetTest)  Time elapsed: 0.003 s
17:56:21 testInitializerProblem - 1.4(org.eclipse.jdt.core.tests.eval.NegativeVariableTest)  Time elapsed: 0.003 s
17:56:21 testUnknownType - 1.4(org.eclipse.jdt.core.tests.eval.NegativeVariableTest)  Time elapsed: 0.001 s
17:56:21 test001 - 1.4(org.eclipse.jdt.core.tests.eval.DebugEvaluationTest)  Time elapsed: 0.147 s
17:56:21 test002 - 1.4(org.eclipse.jdt.core.tests.eval.DebugEvaluationTest)  Time elapsed: 0.13 s
17:56:21 test003 - 1.4(org.eclipse.jdt.core.tests.eval.DebugEvaluationTest)  Time elapsed: 0.022 s
17:56:21 test004 - 1.4(org.eclipse.jdt.core.tests.eval.DebugEvaluationTest)  Time elapsed: 0.119 s
17:56:21 test005 - 1.4(org.eclipse.jdt.core.tests.eval.DebugEvaluationTest)  Time elapsed: 0.128 s
17:56:21 test006 - 1.4(org.eclipse.jdt.core.tests.eval.DebugEvaluationTest)  Time elapsed: 0.125 s
17:56:21 test007 - 1.4(org.eclipse.jdt.core.tests.eval.DebugEvaluationTest)  Time elapsed: 0.125 s
17:56:21 test008 - 1.4(org.eclipse.jdt.core.tests.eval.DebugEvaluationTest)  Time elapsed: 0.125 s
17:56:21 test009 - 1.4(org.eclipse.jdt.core.tests.eval.DebugEvaluationTest)  Time elapsed: 0.12 s
17:56:21 test010 - 1.4(org.eclipse.jdt.core.tests.eval.DebugEvaluationTest)  Time elapsed: 0.129 s
17:56:21 test011 - 1.4(org.eclipse.jdt.core.tests.eval.DebugEvaluationTest)  Time elapsed: 0.123 s
17:56:21 test016 - 1.4(org.eclipse.jdt.core.tests.eval.DebugEvaluationTest)  Time elapsed: 0.22 s
17:56:21 test017 - 1.4(org.eclipse.jdt.core.tests.eval.DebugEvaluationTest)  Time elapsed: 0.117 s
17:56:21 test018 - 1.4(org.eclipse.jdt.core.tests.eval.DebugEvaluationTest)  Time elapsed: 0.237 s
17:56:21 test019 - 1.4(org.eclipse.jdt.core.tests.eval.DebugEvaluationTest)  Time elapsed: 0.017 s
17:56:21 test020 - 1.4(org.eclipse.jdt.core.tests.eval.DebugEvaluationTest)  Time elapsed: 0.122 s
17:56:21 test021 - 1.4(org.eclipse.jdt.core.tests.eval.DebugEvaluationTest)  Time elapsed: 0.234 s
17:56:21 test022 - 1.4(org.eclipse.jdt.core.tests.eval.DebugEvaluationTest)  Time elapsed: 0.238 s
17:56:21 test023 - 1.4(org.eclipse.jdt.core.tests.eval.DebugEvaluationTest)  Time elapsed: 0.243 s
17:56:21 test024 - 1.4(org.eclipse.jdt.core.tests.eval.DebugEvaluationTest)  Time elapsed: 0.242 s
17:56:21 test025 - 1.4(org.eclipse.jdt.core.tests.eval.DebugEvaluationTest)  Time elapsed: 0.233 s
17:56:21 test026 - 1.4(org.eclipse.jdt.core.tests.eval.DebugEvaluationTest)  Time elapsed: 0.123 s
17:56:21 test027 - 1.4(org.eclipse.jdt.core.tests.eval.DebugEvaluationTest)  Time elapsed: 0.126 s
17:56:21 test028 - 1.4(org.eclipse.jdt.core.tests.eval.DebugEvaluationTest)  Time elapsed: 0.123 s
17:56:21 test029 - 1.4(org.eclipse.jdt.core.tests.eval.DebugEvaluationTest)  Time elapsed: 0.123 s
17:56:21 test030 - 1.4(org.eclipse.jdt.core.tests.eval.DebugEvaluationTest)  Time elapsed: 0.124 s
17:56:21 test031 - 1.4(org.eclipse.jdt.core.tests.eval.DebugEvaluationTest)  Time elapsed: 0.124 s
17:56:21 test032 - 1.4(org.eclipse.jdt.core.tests.eval.DebugEvaluationTest)  Time elapsed: 0.021 s
17:56:21 test033 - 1.4(org.eclipse.jdt.core.tests.eval.DebugEvaluationTest)  Time elapsed: 0.128 s
17:56:21 test034 - 1.4(org.eclipse.jdt.core.tests.eval.DebugEvaluationTest)  Time elapsed: 0.123 s
17:56:21 test035 - 1.4(org.eclipse.jdt.core.tests.eval.DebugEvaluationTest)  Time elapsed: 0.124 s
17:56:21 test036 - 1.4(org.eclipse.jdt.core.tests.eval.DebugEvaluationTest)  Time elapsed: 0.125 s
17:56:21 test037 - 1.4(org.eclipse.jdt.core.tests.eval.DebugEvaluationTest)  Time elapsed: 0.125 s
17:56:21 test038 - 1.4(org.eclipse.jdt.core.tests.eval.DebugEvaluationTest)  Time elapsed: 0.126 s
17:56:21 test039 - 1.4(org.eclipse.jdt.core.tests.eval.DebugEvaluationTest)  Time elapsed: 0.126 s
17:56:21 test040 - 1.4(org.eclipse.jdt.core.tests.eval.DebugEvaluationTest)  Time elapsed: 0.126 s
17:56:21 test041 - 1.4(org.eclipse.jdt.core.tests.eval.DebugEvaluationTest)  Time elapsed: 0.127 s
17:56:21 test042 - 1.4(org.eclipse.jdt.core.tests.eval.DebugEvaluationTest)  Time elapsed: 0.125 s
17:56:21 test043 - 1.4(org.eclipse.jdt.core.tests.eval.DebugEvaluationTest)  Time elapsed: 0.125 s
17:56:21 test044 - 1.4(org.eclipse.jdt.core.tests.eval.DebugEvaluationTest)  Time elapsed: 0.126 s
17:56:21 test045 - 1.4(org.eclipse.jdt.core.tests.eval.DebugEvaluationTest)  Time elapsed: 0.126 s
17:56:21 test046 - 1.4(org.eclipse.jdt.core.tests.eval.DebugEvaluationTest)  Time elapsed: 0.124 s
17:56:21 test047 - 1.4(org.eclipse.jdt.core.tests.eval.DebugEvaluationTest)  Time elapsed: 0.125 s
17:56:21 test048 - 1.4(org.eclipse.jdt.core.tests.eval.DebugEvaluationTest)  Time elapsed: 0.129 s
17:56:21 test049 - 1.4(org.eclipse.jdt.core.tests.eval.DebugEvaluationTest)  Time elapsed: 0.125 s
17:56:21 test050 - 1.4(org.eclipse.jdt.core.tests.eval.DebugEvaluationTest)  Time elapsed: 0.124 s
17:56:21 test051 - 1.4(org.eclipse.jdt.core.tests.eval.DebugEvaluationTest)  Time elapsed: 0.127 s
17:56:21 test052 - 1.4(org.eclipse.jdt.core.tests.eval.DebugEvaluationTest)  Time elapsed: 0.127 s
17:56:21 test053 - 1.4(org.eclipse.jdt.core.tests.eval.DebugEvaluationTest)  Time elapsed: 0.126 s
17:56:21 test054 - 1.4(org.eclipse.jdt.core.tests.eval.DebugEvaluationTest)  Time elapsed: 0.125 s
17:56:21 test055 - 1.4(org.eclipse.jdt.core.tests.eval.DebugEvaluationTest)  Time elapsed: 0.127 s
17:56:21 test056 - 1.4(org.eclipse.jdt.core.tests.eval.DebugEvaluationTest)  Time elapsed: 0.131 s
17:56:21 test057 - 1.4(org.eclipse.jdt.core.tests.eval.DebugEvaluationTest)  Time elapsed: 0.127 s
17:56:21 test058 - 1.4(org.eclipse.jdt.core.tests.eval.DebugEvaluationTest)  Time elapsed: 0.127 s
17:56:21 test059 - 1.4(org.eclipse.jdt.core.tests.eval.DebugEvaluationTest)  Time elapsed: 0.128 s
17:56:21 test060 - 1.4(org.eclipse.jdt.core.tests.eval.DebugEvaluationTest)  Time elapsed: 0.127 s
17:56:21 test061 - 1.4(org.eclipse.jdt.core.tests.eval.DebugEvaluationTest)  Time elapsed: 0.127 s
17:56:21 test062 - 1.4(org.eclipse.jdt.core.tests.eval.DebugEvaluationTest)  Time elapsed: 0.125 s
17:56:21 test063 - 1.4(org.eclipse.jdt.core.tests.eval.DebugEvaluationTest)  Time elapsed: 0 s
17:56:21 test065 - 1.4(org.eclipse.jdt.core.tests.eval.DebugEvaluationTest)  Time elapsed: 0 s
17:56:21 test066 - 1.4(org.eclipse.jdt.core.tests.eval.DebugEvaluationTest)  Time elapsed: 0 s
17:56:21 test067 - 1.4(org.eclipse.jdt.core.tests.eval.DebugEvaluationTest)  Time elapsed: 0 s
17:56:21 test068 - 1.4(org.eclipse.jdt.core.tests.eval.DebugEvaluationTest)  Time elapsed: 0 s
17:56:21 test069 - 1.4(org.eclipse.jdt.core.tests.eval.DebugEvaluationTest)  Time elapsed: 0 s
17:56:21 testNegative001 - 1.4(org.eclipse.jdt.core.tests.eval.DebugEvaluationTest)  Time elapsed: 0.019 s
17:56:21 testNegative002 - 1.4(org.eclipse.jdt.core.tests.eval.DebugEvaluationTest)  Time elapsed: 0.02 s
17:56:21 testNegative003 - 1.4(org.eclipse.jdt.core.tests.eval.DebugEvaluationTest)  Time elapsed: 0.018 s
17:56:21 testNegative004 - 1.4(org.eclipse.jdt.core.tests.eval.DebugEvaluationTest)  Time elapsed: 0.009 s
17:56:21 testNegative005 - 1.4(org.eclipse.jdt.core.tests.eval.DebugEvaluationTest)  Time elapsed: 0.009 s
17:56:21 testAllVariables - 1.7(org.eclipse.jdt.core.tests.eval.SanityTestEvaluationContext)  Time elapsed: 0.001 s
17:56:21 testEvaluate - 1.7(org.eclipse.jdt.core.tests.eval.SanityTestEvaluationContext)  Time elapsed: 0.011 s
17:56:21 testEvaluateImports - 1.7(org.eclipse.jdt.core.tests.eval.SanityTestEvaluationContext)  Time elapsed: 0 s
17:56:21 testEvaluateVariable - 1.7(org.eclipse.jdt.core.tests.eval.SanityTestEvaluationContext)  Time elapsed: 0.007 s
17:56:21 testEvaluateVariables - 1.7(org.eclipse.jdt.core.tests.eval.SanityTestEvaluationContext)  Time elapsed: 0.002 s
17:56:21 testGetSetImports - 1.7(org.eclipse.jdt.core.tests.eval.SanityTestEvaluationContext)  Time elapsed: 0 s
17:56:21 testGetSetPackageName - 1.7(org.eclipse.jdt.core.tests.eval.SanityTestEvaluationContext)  Time elapsed: 0 s
17:56:21 testNewDeleteVariable - 1.7(org.eclipse.jdt.core.tests.eval.SanityTestEvaluationContext)  Time elapsed: 0 s
17:56:21 testGetEvaluationType - 1.7(org.eclipse.jdt.core.tests.eval.SanityTestEvaluationResult)  Time elapsed: 0.004 s
17:56:21 testGetProblems - 1.7(org.eclipse.jdt.core.tests.eval.SanityTestEvaluationResult)  Time elapsed: 0.003 s
17:56:21 testGetValue - 1.7(org.eclipse.jdt.core.tests.eval.SanityTestEvaluationResult)  Time elapsed: 0.004 s
17:56:21 testGetValueDisplayString - 1.7(org.eclipse.jdt.core.tests.eval.SanityTestEvaluationResult)  Time elapsed: 0.003 s
17:56:21 testGetValueTypeName - 1.7(org.eclipse.jdt.core.tests.eval.SanityTestEvaluationResult)  Time elapsed: 0.002 s
17:56:21 testHasErrors - 1.7(org.eclipse.jdt.core.tests.eval.SanityTestEvaluationResult)  Time elapsed: 0.003 s
17:56:21 testHasProblems - 1.7(org.eclipse.jdt.core.tests.eval.SanityTestEvaluationResult)  Time elapsed: 0.004 s
17:56:21 testHasValue - 1.7(org.eclipse.jdt.core.tests.eval.SanityTestEvaluationResult)  Time elapsed: 0.002 s
17:56:21 testHasWarnings - 1.7(org.eclipse.jdt.core.tests.eval.SanityTestEvaluationResult)  Time elapsed: 0.003 s
17:56:21 testAllKindOfValues - 1.7(org.eclipse.jdt.core.tests.eval.VariableTest)  Time elapsed: 0.046 s
17:56:21 testCodeSnippetVarAssign - 1.7(org.eclipse.jdt.core.tests.eval.VariableTest)  Time elapsed: 0.059 s
17:56:21 testCodeSnippetVarRetrieval - 1.7(org.eclipse.jdt.core.tests.eval.VariableTest)  Time elapsed: 0.03 s
17:56:21 testImports - 1.7(org.eclipse.jdt.core.tests.eval.VariableTest)  Time elapsed: 0.023 s
17:56:21 testSeveralVariableInstallations - 1.7(org.eclipse.jdt.core.tests.eval.VariableTest)  Time elapsed: 0.081 s
17:56:21 testBug345334 - 1.7(org.eclipse.jdt.core.tests.eval.CodeSnippetTest)  Time elapsed: 0.005 s
17:56:21 testBug464656 - 1.7(org.eclipse.jdt.core.tests.eval.CodeSnippetTest)  Time elapsed: 0 s
17:56:21 testCheckedException - 1.7(org.eclipse.jdt.core.tests.eval.CodeSnippetTest)  Time elapsed: 0.004 s
17:56:21 testDiamond - 1.7(org.eclipse.jdt.core.tests.eval.CodeSnippetTest)  Time elapsed: 0.005 s
17:56:21 testEmptyStatement - 1.7(org.eclipse.jdt.core.tests.eval.CodeSnippetTest)  Time elapsed: 0.003 s
17:56:21 testEvaluateEmptyImport - 1.7(org.eclipse.jdt.core.tests.eval.CodeSnippetTest)  Time elapsed: 0 s
17:56:21 testEvaluateExistingPackageAndNonExistingTypeImports - 1.7(org.eclipse.jdt.core.tests.eval.CodeSnippetTest)  Time elapsed: 0 s
17:56:21 testEvaluateNonExistingPackageAndExistingTypeImports - 1.7(org.eclipse.jdt.core.tests.eval.CodeSnippetTest)  Time elapsed: 0 s
17:56:21 testEvaluateNonExistingPackageImport - 1.7(org.eclipse.jdt.core.tests.eval.CodeSnippetTest)  Time elapsed: 0 s
17:56:21 testEvaluateNonExistingTypeImport - 1.7(org.eclipse.jdt.core.tests.eval.CodeSnippetTest)  Time elapsed: 0.001 s
17:56:21 testEvaluateValidPackageAndTypeImports - 1.7(org.eclipse.jdt.core.tests.eval.CodeSnippetTest)  Time elapsed: 0 s
17:56:21 testEvaluateValidPackageImport - 1.7(org.eclipse.jdt.core.tests.eval.CodeSnippetTest)  Time elapsed: 0 s
17:56:21 testEvaluateValidTypeImport - 1.7(org.eclipse.jdt.core.tests.eval.CodeSnippetTest)  Time elapsed: 0 s
17:56:21 testFinallyError - 1.7(org.eclipse.jdt.core.tests.eval.CodeSnippetTest)  Time elapsed: 0.003 s
17:56:21 testFinallyOneBlock - 1.7(org.eclipse.jdt.core.tests.eval.CodeSnippetTest)  Time elapsed: 0.003 s
17:56:21 testFinallyTwoBlock - 1.7(org.eclipse.jdt.core.tests.eval.CodeSnippetTest)  Time elapsed: 0.003 s
17:56:21 testFor89632 - 1.7(org.eclipse.jdt.core.tests.eval.CodeSnippetTest)  Time elapsed: 0.007 s
17:56:21 testFreeReturnAnonymous - 1.7(org.eclipse.jdt.core.tests.eval.CodeSnippetTest)  Time elapsed: 0.004 s
17:56:21 testFreeReturnClassDeclaration - 1.7(org.eclipse.jdt.core.tests.eval.CodeSnippetTest)  Time elapsed: 0.003 s
17:56:21 testFreeReturnExpression - 1.7(org.eclipse.jdt.core.tests.eval.CodeSnippetTest)  Time elapsed: 0.003 s
17:56:21 testFreeReturnInteger - 1.7(org.eclipse.jdt.core.tests.eval.CodeSnippetTest)  Time elapsed: 0.002 s
17:56:21 testFreeReturnLocalVar - 1.7(org.eclipse.jdt.core.tests.eval.CodeSnippetTest)  Time elapsed: 0.002 s
17:56:21 testFreeReturnStatement - 1.7(org.eclipse.jdt.core.tests.eval.CodeSnippetTest)  Time elapsed: 0.003 s
17:56:21 testImportPackage - 1.7(org.eclipse.jdt.core.tests.eval.CodeSnippetTest)  Time elapsed: 0.003 s
17:56:21 testImportType - 1.7(org.eclipse.jdt.core.tests.eval.CodeSnippetTest)  Time elapsed: 0.005 s
17:56:21 testImportTypeAndPackage - 1.7(org.eclipse.jdt.core.tests.eval.CodeSnippetTest)  Time elapsed: 0.004 s
17:56:21 testInnerClassAnonymous - 1.7(org.eclipse.jdt.core.tests.eval.CodeSnippetTest)  Time elapsed: 0.004 s
17:56:21 testInnerClassNamed - 1.7(org.eclipse.jdt.core.tests.eval.CodeSnippetTest)  Time elapsed: 0.002 s
17:56:21 testReturnDisplayStringBoolean - 1.7(org.eclipse.jdt.core.tests.eval.CodeSnippetTest)  Time elapsed: 0.003 s
17:56:21 testReturnDisplayStringCharacter - 1.7(org.eclipse.jdt.core.tests.eval.CodeSnippetTest)  Time elapsed: 0.002 s
17:56:21 testReturnDisplayStringDouble - 1.7(org.eclipse.jdt.core.tests.eval.CodeSnippetTest)  Time elapsed: 0.002 s
17:56:21 testReturnDisplayStringEmptyCodeSnippet - 1.7(org.eclipse.jdt.core.tests.eval.CodeSnippetTest)  Time elapsed: 0.002 s
17:56:21 testReturnDisplayStringFloat - 1.7(org.eclipse.jdt.core.tests.eval.CodeSnippetTest)  Time elapsed: 0.002 s
17:56:21 testReturnDisplayStringInteger - 1.7(org.eclipse.jdt.core.tests.eval.CodeSnippetTest)  Time elapsed: 0.002 s
17:56:21 testReturnDisplayStringLong - 1.7(org.eclipse.jdt.core.tests.eval.CodeSnippetTest)  Time elapsed: 0.003 s
17:56:21 testReturnDisplayStringNoExplicitReturnedValue - 1.7(org.eclipse.jdt.core.tests.eval.CodeSnippetTest)  Time elapsed: 0.003 s
17:56:21 testReturnDisplayStringObject - 1.7(org.eclipse.jdt.core.tests.eval.CodeSnippetTest)  Time elapsed: 0.004 s
17:56:21 testReturnDisplayStringShort - 1.7(org.eclipse.jdt.core.tests.eval.CodeSnippetTest)  Time elapsed: 0.002 s
17:56:21 testReturnDisplayStringString - 1.7(org.eclipse.jdt.core.tests.eval.CodeSnippetTest)  Time elapsed: 0.003 s
17:56:21 testReturnDisplayStringVoid - 1.7(org.eclipse.jdt.core.tests.eval.CodeSnippetTest)  Time elapsed: 0.002 s
17:56:21 testReturnTypeBoolean - 1.7(org.eclipse.jdt.core.tests.eval.CodeSnippetTest)  Time elapsed: 0.003 s
17:56:21 testReturnTypeBooleanArray - 1.7(org.eclipse.jdt.core.tests.eval.CodeSnippetTest)  Time elapsed: 0.003 s
17:56:21 testReturnTypeBooleanObject - 1.7(org.eclipse.jdt.core.tests.eval.CodeSnippetTest)  Time elapsed: 0.002 s
17:56:21 testReturnTypeChar - 1.7(org.eclipse.jdt.core.tests.eval.CodeSnippetTest)  Time elapsed: 0.002 s
17:56:21 testReturnTypeCharArray - 1.7(org.eclipse.jdt.core.tests.eval.CodeSnippetTest)  Time elapsed: 0.003 s
17:56:21 testReturnTypeCharacterObject - 1.7(org.eclipse.jdt.core.tests.eval.CodeSnippetTest)  Time elapsed: 0.002 s
17:56:21 testReturnTypeDouble - 1.7(org.eclipse.jdt.core.tests.eval.CodeSnippetTest)  Time elapsed: 0.002 s
17:56:21 testReturnTypeDoubleArray - 1.7(org.eclipse.jdt.core.tests.eval.CodeSnippetTest)  Time elapsed: 0.002 s
17:56:21 testReturnTypeDoubleObject - 1.7(org.eclipse.jdt.core.tests.eval.CodeSnippetTest)  Time elapsed: 0.003 s
17:56:21 testReturnTypeEmptyCodeSnippet - 1.7(org.eclipse.jdt.core.tests.eval.CodeSnippetTest)  Time elapsed: 0.002 s
17:56:21 testReturnTypeFloat - 1.7(org.eclipse.jdt.core.tests.eval.CodeSnippetTest)  Time elapsed: 0.002 s
17:56:21 testReturnTypeFloatArray - 1.7(org.eclipse.jdt.core.tests.eval.CodeSnippetTest)  Time elapsed: 0.002 s
17:56:21 testReturnTypeFloatObject - 1.7(org.eclipse.jdt.core.tests.eval.CodeSnippetTest)  Time elapsed: 0.002 s
17:56:21 testReturnTypeInt - 1.7(org.eclipse.jdt.core.tests.eval.CodeSnippetTest)  Time elapsed: 0.002 s
17:56:21 testReturnTypeIntegerObject - 1.7(org.eclipse.jdt.core.tests.eval.CodeSnippetTest)  Time elapsed: 0.002 s
17:56:21 testReturnTypeLong - 1.7(org.eclipse.jdt.core.tests.eval.CodeSnippetTest)  Time elapsed: 0.002 s
17:56:21 testReturnTypeLongArray - 1.7(org.eclipse.jdt.core.tests.eval.CodeSnippetTest)  Time elapsed: 0.002 s
17:56:21 testReturnTypeLongObject - 1.7(org.eclipse.jdt.core.tests.eval.CodeSnippetTest)  Time elapsed: 0.002 s
17:56:21 testReturnTypeNoExplicitReturnedValue - 1.7(org.eclipse.jdt.core.tests.eval.CodeSnippetTest)  Time elapsed: 0.002 s
17:56:21 testReturnTypeObject - 1.7(org.eclipse.jdt.core.tests.eval.CodeSnippetTest)  Time elapsed: 0.002 s
17:56:21 testReturnTypeObjectArray - 1.7(org.eclipse.jdt.core.tests.eval.CodeSnippetTest)  Time elapsed: 0.002 s
17:56:21 testReturnTypeShort - 1.7(org.eclipse.jdt.core.tests.eval.CodeSnippetTest)  Time elapsed: 0.003 s
17:56:21 testReturnTypeShortArray - 1.7(org.eclipse.jdt.core.tests.eval.CodeSnippetTest)  Time elapsed: 0.002 s
17:56:21 testReturnTypeShortObject - 1.7(org.eclipse.jdt.core.tests.eval.CodeSnippetTest)  Time elapsed: 0.002 s
17:56:21 testReturnTypeString - 1.7(org.eclipse.jdt.core.tests.eval.CodeSnippetTest)  Time elapsed: 0.003 s
17:56:21 testReturnTypeStringArray - 1.7(org.eclipse.jdt.core.tests.eval.CodeSnippetTest)  Time elapsed: 0.003 s
17:56:21 testReturnTypeVoid - 1.7(org.eclipse.jdt.core.tests.eval.CodeSnippetTest)  Time elapsed: 0.002 s
17:56:21 testReturnTypesIntArray - 1.7(org.eclipse.jdt.core.tests.eval.CodeSnippetTest)  Time elapsed: 0.002 s
17:56:21 testRunMethodInAnonymous - 1.7(org.eclipse.jdt.core.tests.eval.CodeSnippetTest)  Time elapsed: 0.206 s
17:56:21 testRunMethodInAnonymous2 - 1.7(org.eclipse.jdt.core.tests.eval.CodeSnippetTest)  Time elapsed: 0.206 s
17:56:21 testRunMethodInAnonymous3 - 1.7(org.eclipse.jdt.core.tests.eval.CodeSnippetTest)  Time elapsed: 0.204 s
17:56:21 testRunMethodInAnonymous4 - 1.7(org.eclipse.jdt.core.tests.eval.CodeSnippetTest)  Time elapsed: 0.206 s
17:56:21 testRunMethodInAnonymous5 - 1.7(org.eclipse.jdt.core.tests.eval.CodeSnippetTest)  Time elapsed: 0.206 s
17:56:21 testRunMethodInAnonymous6 - 1.7(org.eclipse.jdt.core.tests.eval.CodeSnippetTest)  Time elapsed: 0.205 s
17:56:21 testRunMethodInAnonymous7 - 1.7(org.eclipse.jdt.core.tests.eval.CodeSnippetTest)  Time elapsed: 0.207 s
17:56:21 testRunMethodInAnonymous8 - 1.7(org.eclipse.jdt.core.tests.eval.CodeSnippetTest)  Time elapsed: 0.206 s
17:56:21 testExpressionInInnerClass - 1.7(org.eclipse.jdt.core.tests.eval.NegativeCodeSnippetTest)  Time elapsed: 0.002 s
17:56:21 testExtraClosingCurlyBracket - 1.7(org.eclipse.jdt.core.tests.eval.NegativeCodeSnippetTest)  Time elapsed: 0.001 s
17:56:21 testExtraOpenRoundBracket - 1.7(org.eclipse.jdt.core.tests.eval.NegativeCodeSnippetTest)  Time elapsed: 0.001 s
17:56:21 testExtraSemiColonInExpression - 1.7(org.eclipse.jdt.core.tests.eval.NegativeCodeSnippetTest)  Time elapsed: 0.001 s
17:56:21 testInvalidField - 1.7(org.eclipse.jdt.core.tests.eval.NegativeCodeSnippetTest)  Time elapsed: 0.003 s
17:56:21 testInvalidImport - 1.7(org.eclipse.jdt.core.tests.eval.NegativeCodeSnippetTest)  Time elapsed: 0.003 s
17:56:21 testInvalidUseOfThisInSnippet - 1.7(org.eclipse.jdt.core.tests.eval.NegativeCodeSnippetTest)  Time elapsed: 0.002 s
17:56:21 testInvalidUseOfThisInSnippet2 - 1.7(org.eclipse.jdt.core.tests.eval.NegativeCodeSnippetTest)  Time elapsed: 0 s
17:56:21 testMissingClosingRoundBracket - 1.7(org.eclipse.jdt.core.tests.eval.NegativeCodeSnippetTest)  Time elapsed: 0.001 s
17:56:21 testMissingDoubleQuote - 1.7(org.eclipse.jdt.core.tests.eval.NegativeCodeSnippetTest)  Time elapsed: 0.001 s
17:56:21 testNonLastExpressionStatement - 1.7(org.eclipse.jdt.core.tests.eval.NegativeCodeSnippetTest)  Time elapsed: 0 s
17:56:21 testProblemInExpression - 1.7(org.eclipse.jdt.core.tests.eval.NegativeCodeSnippetTest)  Time elapsed: 0.001 s
17:56:21 testProblemInExpression2 - 1.7(org.eclipse.jdt.core.tests.eval.NegativeCodeSnippetTest)  Time elapsed: 0 s
17:56:21 testProblemInInnerClass - 1.7(org.eclipse.jdt.core.tests.eval.NegativeCodeSnippetTest)  Time elapsed: 0.005 s
17:56:21 testProblemInPreviousStatement - 1.7(org.eclipse.jdt.core.tests.eval.NegativeCodeSnippetTest)  Time elapsed: 0.001 s
17:56:21 testProblemInReturnStatement - 1.7(org.eclipse.jdt.core.tests.eval.NegativeCodeSnippetTest)  Time elapsed: 0.001 s
17:56:21 testRemoveImport - 1.7(org.eclipse.jdt.core.tests.eval.NegativeCodeSnippetTest)  Time elapsed: 0.008 s
17:56:21 testRemoveVariable - 1.7(org.eclipse.jdt.core.tests.eval.NegativeCodeSnippetTest)  Time elapsed: 0.005 s
17:56:21 testUnreachableExpression - 1.7(org.eclipse.jdt.core.tests.eval.NegativeCodeSnippetTest)  Time elapsed: 0.002 s
17:56:21 testUnusedImport - 1.7(org.eclipse.jdt.core.tests.eval.NegativeCodeSnippetTest)  Time elapsed: 0.005 s
17:56:21 testWarning - 1.7(org.eclipse.jdt.core.tests.eval.NegativeCodeSnippetTest)  Time elapsed: 0.004 s
17:56:21 testInitializerProblem - 1.7(org.eclipse.jdt.core.tests.eval.NegativeVariableTest)  Time elapsed: 0.003 s
17:56:21 testUnknownType - 1.7(org.eclipse.jdt.core.tests.eval.NegativeVariableTest)  Time elapsed: 0.001 s
17:56:21 test001 - 1.7(org.eclipse.jdt.core.tests.eval.DebugEvaluationTest)  Time elapsed: 0.13 s
17:56:21 test002 - 1.7(org.eclipse.jdt.core.tests.eval.DebugEvaluationTest)  Time elapsed: 0.127 s
17:56:21 test003 - 1.7(org.eclipse.jdt.core.tests.eval.DebugEvaluationTest)  Time elapsed: 0.019 s
17:56:21 test004 - 1.7(org.eclipse.jdt.core.tests.eval.DebugEvaluationTest)  Time elapsed: 0.119 s
17:56:21 test005 - 1.7(org.eclipse.jdt.core.tests.eval.DebugEvaluationTest)  Time elapsed: 0.126 s
17:56:21 test006 - 1.7(org.eclipse.jdt.core.tests.eval.DebugEvaluationTest)  Time elapsed: 0.132 s
17:56:21 test007 - 1.7(org.eclipse.jdt.core.tests.eval.DebugEvaluationTest)  Time elapsed: 0.128 s
17:56:21 test008 - 1.7(org.eclipse.jdt.core.tests.eval.DebugEvaluationTest)  Time elapsed: 0.127 s
17:56:21 test009 - 1.7(org.eclipse.jdt.core.tests.eval.DebugEvaluationTest)  Time elapsed: 0.118 s
17:56:21 test010 - 1.7(org.eclipse.jdt.core.tests.eval.DebugEvaluationTest)  Time elapsed: 0.127 s
17:56:21 test011 - 1.7(org.eclipse.jdt.core.tests.eval.DebugEvaluationTest)  Time elapsed: 0.123 s
17:56:21 test016 - 1.7(org.eclipse.jdt.core.tests.eval.DebugEvaluationTest)  Time elapsed: 0.223 s
17:56:21 test017 - 1.7(org.eclipse.jdt.core.tests.eval.DebugEvaluationTest)  Time elapsed: 0.114 s
17:56:21 test018 - 1.7(org.eclipse.jdt.core.tests.eval.DebugEvaluationTest)  Time elapsed: 0.233 s
17:56:21 test019 - 1.7(org.eclipse.jdt.core.tests.eval.DebugEvaluationTest)  Time elapsed: 0.019 s
17:56:21 test020 - 1.7(org.eclipse.jdt.core.tests.eval.DebugEvaluationTest)  Time elapsed: 0.124 s
17:56:21 test021 - 1.7(org.eclipse.jdt.core.tests.eval.DebugEvaluationTest)  Time elapsed: 0.239 s
17:56:21 test022 - 1.7(org.eclipse.jdt.core.tests.eval.DebugEvaluationTest)  Time elapsed: 0.241 s
17:56:21 test023 - 1.7(org.eclipse.jdt.core.tests.eval.DebugEvaluationTest)  Time elapsed: 0.242 s
17:56:21 test024 - 1.7(org.eclipse.jdt.core.tests.eval.DebugEvaluationTest)  Time elapsed: 0.247 s
17:56:21 test025 - 1.7(org.eclipse.jdt.core.tests.eval.DebugEvaluationTest)  Time elapsed: 0.238 s
17:56:21 test026 - 1.7(org.eclipse.jdt.core.tests.eval.DebugEvaluationTest)  Time elapsed: 0.128 s
17:56:21 test027 - 1.7(org.eclipse.jdt.core.tests.eval.DebugEvaluationTest)  Time elapsed: 0.126 s
17:56:21 test028 - 1.7(org.eclipse.jdt.core.tests.eval.DebugEvaluationTest)  Time elapsed: 0.127 s
17:56:21 test029 - 1.7(org.eclipse.jdt.core.tests.eval.DebugEvaluationTest)  Time elapsed: 0.129 s
17:56:21 test030 - 1.7(org.eclipse.jdt.core.tests.eval.DebugEvaluationTest)  Time elapsed: 0.127 s
17:56:21 test031 - 1.7(org.eclipse.jdt.core.tests.eval.DebugEvaluationTest)  Time elapsed: 0.128 s
17:56:21 test032 - 1.7(org.eclipse.jdt.core.tests.eval.DebugEvaluationTest)  Time elapsed: 0.025 s
17:56:21 test033 - 1.7(org.eclipse.jdt.core.tests.eval.DebugEvaluationTest)  Time elapsed: 0.131 s
17:56:21 test034 - 1.7(org.eclipse.jdt.core.tests.eval.DebugEvaluationTest)  Time elapsed: 0.128 s
17:56:21 test035 - 1.7(org.eclipse.jdt.core.tests.eval.DebugEvaluationTest)  Time elapsed: 0.129 s
17:56:21 test036 - 1.7(org.eclipse.jdt.core.tests.eval.DebugEvaluationTest)  Time elapsed: 0.127 s
17:56:21 test037 - 1.7(org.eclipse.jdt.core.tests.eval.DebugEvaluationTest)  Time elapsed: 0.128 s
17:56:21 test038 - 1.7(org.eclipse.jdt.core.tests.eval.DebugEvaluationTest)  Time elapsed: 0.127 s
17:56:21 test039 - 1.7(org.eclipse.jdt.core.tests.eval.DebugEvaluationTest)  Time elapsed: 0.129 s
17:56:21 test040 - 1.7(org.eclipse.jdt.core.tests.eval.DebugEvaluationTest)  Time elapsed: 0.128 s
17:56:21 test041 - 1.7(org.eclipse.jdt.core.tests.eval.DebugEvaluationTest)  Time elapsed: 0.128 s
17:56:21 test042 - 1.7(org.eclipse.jdt.core.tests.eval.DebugEvaluationTest)  Time elapsed: 0.129 s
17:56:21 test043 - 1.7(org.eclipse.jdt.core.tests.eval.DebugEvaluationTest)  Time elapsed: 0.417 s
17:56:21 test044 - 1.7(org.eclipse.jdt.core.tests.eval.DebugEvaluationTest)  Time elapsed: 0.127 s
17:56:21 test045 - 1.7(org.eclipse.jdt.core.tests.eval.DebugEvaluationTest)  Time elapsed: 0.128 s
17:56:21 test046 - 1.7(org.eclipse.jdt.core.tests.eval.DebugEvaluationTest)  Time elapsed: 0.127 s
17:56:21 test047 - 1.7(org.eclipse.jdt.core.tests.eval.DebugEvaluationTest)  Time elapsed: 0.127 s
17:56:21 test048 - 1.7(org.eclipse.jdt.core.tests.eval.DebugEvaluationTest)  Time elapsed: 0.127 s
17:56:21 test049 - 1.7(org.eclipse.jdt.core.tests.eval.DebugEvaluationTest)  Time elapsed: 0.126 s
17:56:21 test050 - 1.7(org.eclipse.jdt.core.tests.eval.DebugEvaluationTest)  Time elapsed: 0.126 s
17:56:21 test051 - 1.7(org.eclipse.jdt.core.tests.eval.DebugEvaluationTest)  Time elapsed: 0.131 s
17:56:21 test052 - 1.7(org.eclipse.jdt.core.tests.eval.DebugEvaluationTest)  Time elapsed: 0.128 s
17:56:21 test053 - 1.7(org.eclipse.jdt.core.tests.eval.DebugEvaluationTest)  Time elapsed: 0.127 s
17:56:21 test054 - 1.7(org.eclipse.jdt.core.tests.eval.DebugEvaluationTest)  Time elapsed: 0.128 s
17:56:21 test055 - 1.7(org.eclipse.jdt.core.tests.eval.DebugEvaluationTest)  Time elapsed: 0.127 s
17:56:21 test056 - 1.7(org.eclipse.jdt.core.tests.eval.DebugEvaluationTest)  Time elapsed: 0.127 s
17:56:21 test057 - 1.7(org.eclipse.jdt.core.tests.eval.DebugEvaluationTest)  Time elapsed: 0.127 s
17:56:21 test058 - 1.7(org.eclipse.jdt.core.tests.eval.DebugEvaluationTest)  Time elapsed: 0.131 s
17:56:21 test059 - 1.7(org.eclipse.jdt.core.tests.eval.DebugEvaluationTest)  Time elapsed: 0.129 s
17:56:21 test060 - 1.7(org.eclipse.jdt.core.tests.eval.DebugEvaluationTest)  Time elapsed: 0.13 s
17:56:21 test061 - 1.7(org.eclipse.jdt.core.tests.eval.DebugEvaluationTest)  Time elapsed: 0.128 s
17:56:21 test062 - 1.7(org.eclipse.jdt.core.tests.eval.DebugEvaluationTest)  Time elapsed: 0.126 s
17:56:21 test063 - 1.7(org.eclipse.jdt.core.tests.eval.DebugEvaluationTest)  Time elapsed: 0.127 s
17:56:21 test065 - 1.7(org.eclipse.jdt.core.tests.eval.DebugEvaluationTest)  Time elapsed: 0.134 s
17:56:21 test066 - 1.7(org.eclipse.jdt.core.tests.eval.DebugEvaluationTest)  Time elapsed: 0.135 s
17:56:21 test067 - 1.7(org.eclipse.jdt.core.tests.eval.DebugEvaluationTest)  Time elapsed: 0.136 s
17:56:21 test068 - 1.7(org.eclipse.jdt.core.tests.eval.DebugEvaluationTest)  Time elapsed: 0.025 s
17:56:21 test069 - 1.7(org.eclipse.jdt.core.tests.eval.DebugEvaluationTest)  Time elapsed: 0.028 s
17:56:21 testNegative001 - 1.7(org.eclipse.jdt.core.tests.eval.DebugEvaluationTest)  Time elapsed: 0.045 s
17:56:21 testNegative002 - 1.7(org.eclipse.jdt.core.tests.eval.DebugEvaluationTest)  Time elapsed: 0.02 s
17:56:21 testNegative003 - 1.7(org.eclipse.jdt.core.tests.eval.DebugEvaluationTest)  Time elapsed: 0.018 s
17:56:21 testNegative004 - 1.7(org.eclipse.jdt.core.tests.eval.DebugEvaluationTest)  Time elapsed: 0.009 s
17:56:21 testNegative005 - 1.7(org.eclipse.jdt.core.tests.eval.DebugEvaluationTest)  Time elapsed: 0.008 s
17:56:21 testAllVariables - 1.8(org.eclipse.jdt.core.tests.eval.SanityTestEvaluationContext)  Time elapsed: 0 s
17:56:21 testEvaluate - 1.8(org.eclipse.jdt.core.tests.eval.SanityTestEvaluationContext)  Time elapsed: 0.009 s
17:56:21 testEvaluateImports - 1.8(org.eclipse.jdt.core.tests.eval.SanityTestEvaluationContext)  Time elapsed: 0 s
17:56:21 testEvaluateVariable - 1.8(org.eclipse.jdt.core.tests.eval.SanityTestEvaluationContext)  Time elapsed: 0.008 s
17:56:21 testEvaluateVariables - 1.8(org.eclipse.jdt.core.tests.eval.SanityTestEvaluationContext)  Time elapsed: 0.001 s
17:56:21 testGetSetImports - 1.8(org.eclipse.jdt.core.tests.eval.SanityTestEvaluationContext)  Time elapsed: 0 s
17:56:21 testGetSetPackageName - 1.8(org.eclipse.jdt.core.tests.eval.SanityTestEvaluationContext)  Time elapsed: 0 s
17:56:21 testNewDeleteVariable - 1.8(org.eclipse.jdt.core.tests.eval.SanityTestEvaluationContext)  Time elapsed: 0 s
17:56:21 testGetEvaluationType - 1.8(org.eclipse.jdt.core.tests.eval.SanityTestEvaluationResult)  Time elapsed: 0.004 s
17:56:21 testGetProblems - 1.8(org.eclipse.jdt.core.tests.eval.SanityTestEvaluationResult)  Time elapsed: 0.003 s
17:56:21 testGetValue - 1.8(org.eclipse.jdt.core.tests.eval.SanityTestEvaluationResult)  Time elapsed: 0.004 s
17:56:21 testGetValueDisplayString - 1.8(org.eclipse.jdt.core.tests.eval.SanityTestEvaluationResult)  Time elapsed: 0.003 s
17:56:21 testGetValueTypeName - 1.8(org.eclipse.jdt.core.tests.eval.SanityTestEvaluationResult)  Time elapsed: 0.003 s
17:56:21 testHasErrors - 1.8(org.eclipse.jdt.core.tests.eval.SanityTestEvaluationResult)  Time elapsed: 0.003 s
17:56:21 testHasProblems - 1.8(org.eclipse.jdt.core.tests.eval.SanityTestEvaluationResult)  Time elapsed: 0.003 s
17:56:21 testHasValue - 1.8(org.eclipse.jdt.core.tests.eval.SanityTestEvaluationResult)  Time elapsed: 0.003 s
17:56:21 testHasWarnings - 1.8(org.eclipse.jdt.core.tests.eval.SanityTestEvaluationResult)  Time elapsed: 0.003 s
17:56:21 testAllKindOfValues - 1.8(org.eclipse.jdt.core.tests.eval.VariableTest)  Time elapsed: 0.045 s
17:56:21 testCodeSnippetVarAssign - 1.8(org.eclipse.jdt.core.tests.eval.VariableTest)  Time elapsed: 0.061 s
17:56:21 testCodeSnippetVarRetrieval - 1.8(org.eclipse.jdt.core.tests.eval.VariableTest)  Time elapsed: 0.025 s
17:56:21 testImports - 1.8(org.eclipse.jdt.core.tests.eval.VariableTest)  Time elapsed: 0.023 s
17:56:21 testSeveralVariableInstallations - 1.8(org.eclipse.jdt.core.tests.eval.VariableTest)  Time elapsed: 0.083 s
17:56:21 testBug345334 - 1.8(org.eclipse.jdt.core.tests.eval.CodeSnippetTest)  Time elapsed: 0.003 s
17:56:21 testBug464656 - 1.8(org.eclipse.jdt.core.tests.eval.CodeSnippetTest)  Time elapsed: 0.026 s
17:56:21 testCheckedException - 1.8(org.eclipse.jdt.core.tests.eval.CodeSnippetTest)  Time elapsed: 0.004 s
17:56:21 testDiamond - 1.8(org.eclipse.jdt.core.tests.eval.CodeSnippetTest)  Time elapsed: 0.005 s
17:56:21 testEmptyStatement - 1.8(org.eclipse.jdt.core.tests.eval.CodeSnippetTest)  Time elapsed: 0.004 s
17:56:21 testEvaluateEmptyImport - 1.8(org.eclipse.jdt.core.tests.eval.CodeSnippetTest)  Time elapsed: 0 s
17:56:21 testEvaluateExistingPackageAndNonExistingTypeImports - 1.8(org.eclipse.jdt.core.tests.eval.CodeSnippetTest)  Time elapsed: 0 s
17:56:21 testEvaluateNonExistingPackageAndExistingTypeImports - 1.8(org.eclipse.jdt.core.tests.eval.CodeSnippetTest)  Time elapsed: 0 s
17:56:21 testEvaluateNonExistingPackageImport - 1.8(org.eclipse.jdt.core.tests.eval.CodeSnippetTest)  Time elapsed: 0 s
17:56:21 testEvaluateNonExistingTypeImport - 1.8(org.eclipse.jdt.core.tests.eval.CodeSnippetTest)  Time elapsed: 0 s
17:56:21 testEvaluateValidPackageAndTypeImports - 1.8(org.eclipse.jdt.core.tests.eval.CodeSnippetTest)  Time elapsed: 0 s
17:56:21 testEvaluateValidPackageImport - 1.8(org.eclipse.jdt.core.tests.eval.CodeSnippetTest)  Time elapsed: 0 s
17:56:21 testEvaluateValidTypeImport - 1.8(org.eclipse.jdt.core.tests.eval.CodeSnippetTest)  Time elapsed: 0.001 s
17:56:21 testFinallyError - 1.8(org.eclipse.jdt.core.tests.eval.CodeSnippetTest)  Time elapsed: 0.004 s
17:56:21 testFinallyOneBlock - 1.8(org.eclipse.jdt.core.tests.eval.CodeSnippetTest)  Time elapsed: 0.003 s
17:56:21 testFinallyTwoBlock - 1.8(org.eclipse.jdt.core.tests.eval.CodeSnippetTest)  Time elapsed: 0.003 s
17:56:21 testFor89632 - 1.8(org.eclipse.jdt.core.tests.eval.CodeSnippetTest)  Time elapsed: 0.007 s
17:56:21 testFreeReturnAnonymous - 1.8(org.eclipse.jdt.core.tests.eval.CodeSnippetTest)  Time elapsed: 0.004 s
17:56:21 testFreeReturnClassDeclaration - 1.8(org.eclipse.jdt.core.tests.eval.CodeSnippetTest)  Time elapsed: 0.004 s
17:56:21 testFreeReturnExpression - 1.8(org.eclipse.jdt.core.tests.eval.CodeSnippetTest)  Time elapsed: 0.002 s
17:56:21 testFreeReturnInteger - 1.8(org.eclipse.jdt.core.tests.eval.CodeSnippetTest)  Time elapsed: 0.003 s
17:56:21 testFreeReturnLocalVar - 1.8(org.eclipse.jdt.core.tests.eval.CodeSnippetTest)  Time elapsed: 0.003 s
17:56:21 testFreeReturnStatement - 1.8(org.eclipse.jdt.core.tests.eval.CodeSnippetTest)  Time elapsed: 0.002 s
17:56:21 testImportPackage - 1.8(org.eclipse.jdt.core.tests.eval.CodeSnippetTest)  Time elapsed: 0.005 s
17:56:21 testImportType - 1.8(org.eclipse.jdt.core.tests.eval.CodeSnippetTest)  Time elapsed: 0.005 s
17:56:21 testImportTypeAndPackage - 1.8(org.eclipse.jdt.core.tests.eval.CodeSnippetTest)  Time elapsed: 0.005 s
17:56:21 testInnerClassAnonymous - 1.8(org.eclipse.jdt.core.tests.eval.CodeSnippetTest)  Time elapsed: 0.004 s
17:56:21 testInnerClassNamed - 1.8(org.eclipse.jdt.core.tests.eval.CodeSnippetTest)  Time elapsed: 0.003 s
17:56:21 testReturnDisplayStringBoolean - 1.8(org.eclipse.jdt.core.tests.eval.CodeSnippetTest)  Time elapsed: 0.003 s
17:56:21 testReturnDisplayStringCharacter - 1.8(org.eclipse.jdt.core.tests.eval.CodeSnippetTest)  Time elapsed: 0.002 s
17:56:21 testReturnDisplayStringDouble - 1.8(org.eclipse.jdt.core.tests.eval.CodeSnippetTest)  Time elapsed: 0.002 s
17:56:21 testReturnDisplayStringEmptyCodeSnippet - 1.8(org.eclipse.jdt.core.tests.eval.CodeSnippetTest)  Time elapsed: 0.002 s
17:56:21 testReturnDisplayStringFloat - 1.8(org.eclipse.jdt.core.tests.eval.CodeSnippetTest)  Time elapsed: 0.002 s
17:56:21 testReturnDisplayStringInteger - 1.8(org.eclipse.jdt.core.tests.eval.CodeSnippetTest)  Time elapsed: 0.003 s
17:56:21 testReturnDisplayStringLong - 1.8(org.eclipse.jdt.core.tests.eval.CodeSnippetTest)  Time elapsed: 0.002 s
17:56:21 testReturnDisplayStringNoExplicitReturnedValue - 1.8(org.eclipse.jdt.core.tests.eval.CodeSnippetTest)  Time elapsed: 0.004 s
17:56:21 testReturnDisplayStringObject - 1.8(org.eclipse.jdt.core.tests.eval.CodeSnippetTest)  Time elapsed: 0.003 s
17:56:21 testReturnDisplayStringShort - 1.8(org.eclipse.jdt.core.tests.eval.CodeSnippetTest)  Time elapsed: 0.003 s
17:56:21 testReturnDisplayStringString - 1.8(org.eclipse.jdt.core.tests.eval.CodeSnippetTest)  Time elapsed: 0.002 s
17:56:21 testReturnDisplayStringVoid - 1.8(org.eclipse.jdt.core.tests.eval.CodeSnippetTest)  Time elapsed: 0.004 s
17:56:21 testReturnTypeBoolean - 1.8(org.eclipse.jdt.core.tests.eval.CodeSnippetTest)  Time elapsed: 0.002 s
17:56:21 testReturnTypeBooleanArray - 1.8(org.eclipse.jdt.core.tests.eval.CodeSnippetTest)  Time elapsed: 0.003 s
17:56:21 testReturnTypeBooleanObject - 1.8(org.eclipse.jdt.core.tests.eval.CodeSnippetTest)  Time elapsed: 0.002 s
17:56:21 testReturnTypeChar - 1.8(org.eclipse.jdt.core.tests.eval.CodeSnippetTest)  Time elapsed: 0.003 s
17:56:21 testReturnTypeCharArray - 1.8(org.eclipse.jdt.core.tests.eval.CodeSnippetTest)  Time elapsed: 0.002 s
17:56:21 testReturnTypeCharacterObject - 1.8(org.eclipse.jdt.core.tests.eval.CodeSnippetTest)  Time elapsed: 0.003 s
17:56:21 testReturnTypeDouble - 1.8(org.eclipse.jdt.core.tests.eval.CodeSnippetTest)  Time elapsed: 0.002 s
17:56:21 testReturnTypeDoubleArray - 1.8(org.eclipse.jdt.core.tests.eval.CodeSnippetTest)  Time elapsed: 0.002 s
17:56:21 testReturnTypeDoubleObject - 1.8(org.eclipse.jdt.core.tests.eval.CodeSnippetTest)  Time elapsed: 0.003 s
17:56:21 testReturnTypeEmptyCodeSnippet - 1.8(org.eclipse.jdt.core.tests.eval.CodeSnippetTest)  Time elapsed: 0.001 s
17:56:21 testReturnTypeFloat - 1.8(org.eclipse.jdt.core.tests.eval.CodeSnippetTest)  Time elapsed: 0.003 s
17:56:21 testReturnTypeFloatArray - 1.8(org.eclipse.jdt.core.tests.eval.CodeSnippetTest)  Time elapsed: 0.002 s
17:56:21 testReturnTypeFloatObject - 1.8(org.eclipse.jdt.core.tests.eval.CodeSnippetTest)  Time elapsed: 0.003 s
17:56:21 testReturnTypeInt - 1.8(org.eclipse.jdt.core.tests.eval.CodeSnippetTest)  Time elapsed: 0.002 s
17:56:21 testReturnTypeIntegerObject - 1.8(org.eclipse.jdt.core.tests.eval.CodeSnippetTest)  Time elapsed: 0.003 s
17:56:21 testReturnTypeLong - 1.8(org.eclipse.jdt.core.tests.eval.CodeSnippetTest)  Time elapsed: 0.002 s
17:56:21 testReturnTypeLongArray - 1.8(org.eclipse.jdt.core.tests.eval.CodeSnippetTest)  Time elapsed: 0.003 s
17:56:21 testReturnTypeLongObject - 1.8(org.eclipse.jdt.core.tests.eval.CodeSnippetTest)  Time elapsed: 0.003 s
17:56:21 testReturnTypeNoExplicitReturnedValue - 1.8(org.eclipse.jdt.core.tests.eval.CodeSnippetTest)  Time elapsed: 0.002 s
17:56:21 testReturnTypeObject - 1.8(org.eclipse.jdt.core.tests.eval.CodeSnippetTest)  Time elapsed: 0.002 s
17:56:21 testReturnTypeObjectArray - 1.8(org.eclipse.jdt.core.tests.eval.CodeSnippetTest)  Time elapsed: 0.003 s
17:56:21 testReturnTypeShort - 1.8(org.eclipse.jdt.core.tests.eval.CodeSnippetTest)  Time elapsed: 0.002 s
17:56:21 testReturnTypeShortArray - 1.8(org.eclipse.jdt.core.tests.eval.CodeSnippetTest)  Time elapsed: 0.003 s
17:56:21 testReturnTypeShortObject - 1.8(org.eclipse.jdt.core.tests.eval.CodeSnippetTest)  Time elapsed: 0.003 s
17:56:21 testReturnTypeString - 1.8(org.eclipse.jdt.core.tests.eval.CodeSnippetTest)  Time elapsed: 0.002 s
17:56:21 testReturnTypeStringArray - 1.8(org.eclipse.jdt.core.tests.eval.CodeSnippetTest)  Time elapsed: 0.003 s
17:56:21 testReturnTypeVoid - 1.8(org.eclipse.jdt.core.tests.eval.CodeSnippetTest)  Time elapsed: 0.003 s
17:56:21 testReturnTypesIntArray - 1.8(org.eclipse.jdt.core.tests.eval.CodeSnippetTest)  Time elapsed: 0.003 s
17:56:21 testRunMethodInAnonymous - 1.8(org.eclipse.jdt.core.tests.eval.CodeSnippetTest)  Time elapsed: 0.206 s
17:56:21 testRunMethodInAnonymous2 - 1.8(org.eclipse.jdt.core.tests.eval.CodeSnippetTest)  Time elapsed: 0.205 s
17:56:21 testRunMethodInAnonymous3 - 1.8(org.eclipse.jdt.core.tests.eval.CodeSnippetTest)  Time elapsed: 0.205 s
17:56:21 testRunMethodInAnonymous4 - 1.8(org.eclipse.jdt.core.tests.eval.CodeSnippetTest)  Time elapsed: 0.206 s
17:56:21 testRunMethodInAnonymous5 - 1.8(org.eclipse.jdt.core.tests.eval.CodeSnippetTest)  Time elapsed: 0.205 s
17:56:21 testRunMethodInAnonymous6 - 1.8(org.eclipse.jdt.core.tests.eval.CodeSnippetTest)  Time elapsed: 0.206 s
17:56:21 testRunMethodInAnonymous7 - 1.8(org.eclipse.jdt.core.tests.eval.CodeSnippetTest)  Time elapsed: 0.206 s
17:56:21 testRunMethodInAnonymous8 - 1.8(org.eclipse.jdt.core.tests.eval.CodeSnippetTest)  Time elapsed: 0.205 s
17:56:21 testExpressionInInnerClass - 1.8(org.eclipse.jdt.core.tests.eval.NegativeCodeSnippetTest)  Time elapsed: 0.002 s
17:56:21 testExtraClosingCurlyBracket - 1.8(org.eclipse.jdt.core.tests.eval.NegativeCodeSnippetTest)  Time elapsed: 0.001 s
17:56:21 testExtraOpenRoundBracket - 1.8(org.eclipse.jdt.core.tests.eval.NegativeCodeSnippetTest)  Time elapsed: 0.001 s
17:56:21 testExtraSemiColonInExpression - 1.8(org.eclipse.jdt.core.tests.eval.NegativeCodeSnippetTest)  Time elapsed: 0 s
17:56:21 testInvalidField - 1.8(org.eclipse.jdt.core.tests.eval.NegativeCodeSnippetTest)  Time elapsed: 0.002 s
17:56:21 testInvalidImport - 1.8(org.eclipse.jdt.core.tests.eval.NegativeCodeSnippetTest)  Time elapsed: 0.002 s
17:56:21 testInvalidUseOfThisInSnippet - 1.8(org.eclipse.jdt.core.tests.eval.NegativeCodeSnippetTest)  Time elapsed: 0.001 s
17:56:21 testInvalidUseOfThisInSnippet2 - 1.8(org.eclipse.jdt.core.tests.eval.NegativeCodeSnippetTest)  Time elapsed: 0.001 s
17:56:21 testMissingClosingRoundBracket - 1.8(org.eclipse.jdt.core.tests.eval.NegativeCodeSnippetTest)  Time elapsed: 0.001 s
17:56:21 testMissingDoubleQuote - 1.8(org.eclipse.jdt.core.tests.eval.NegativeCodeSnippetTest)  Time elapsed: 0.001 s
17:56:21 testNonLastExpressionStatement - 1.8(org.eclipse.jdt.core.tests.eval.NegativeCodeSnippetTest)  Time elapsed: 0 s
17:56:21 testProblemInExpression - 1.8(org.eclipse.jdt.core.tests.eval.NegativeCodeSnippetTest)  Time elapsed: 0.001 s
17:56:21 testProblemInExpression2 - 1.8(org.eclipse.jdt.core.tests.eval.NegativeCodeSnippetTest)  Time elapsed: 0.001 s
17:56:21 testProblemInInnerClass - 1.8(org.eclipse.jdt.core.tests.eval.NegativeCodeSnippetTest)  Time elapsed: 0.005 s
17:56:21 testProblemInPreviousStatement - 1.8(org.eclipse.jdt.core.tests.eval.NegativeCodeSnippetTest)  Time elapsed: 0.002 s
17:56:21 testProblemInReturnStatement - 1.8(org.eclipse.jdt.core.tests.eval.NegativeCodeSnippetTest)  Time elapsed: 0 s
17:56:21 testRemoveImport - 1.8(org.eclipse.jdt.core.tests.eval.NegativeCodeSnippetTest)  Time elapsed: 0.007 s
17:56:21 testRemoveVariable - 1.8(org.eclipse.jdt.core.tests.eval.NegativeCodeSnippetTest)  Time elapsed: 0.005 s
17:56:21 testUnreachableExpression - 1.8(org.eclipse.jdt.core.tests.eval.NegativeCodeSnippetTest)  Time elapsed: 0.001 s
17:56:21 testUnusedImport - 1.8(org.eclipse.jdt.core.tests.eval.NegativeCodeSnippetTest)  Time elapsed: 0.006 s
17:56:21 testWarning - 1.8(org.eclipse.jdt.core.tests.eval.NegativeCodeSnippetTest)  Time elapsed: 0.004 s
17:56:21 testInitializerProblem - 1.8(org.eclipse.jdt.core.tests.eval.NegativeVariableTest)  Time elapsed: 0.002 s
17:56:21 testUnknownType - 1.8(org.eclipse.jdt.core.tests.eval.NegativeVariableTest)  Time elapsed: 0.002 s
17:56:21 test001 - 1.8(org.eclipse.jdt.core.tests.eval.DebugEvaluationTest)  Time elapsed: 0.129 s
17:56:21 test002 - 1.8(org.eclipse.jdt.core.tests.eval.DebugEvaluationTest)  Time elapsed: 0.13 s
17:56:21 test003 - 1.8(org.eclipse.jdt.core.tests.eval.DebugEvaluationTest)  Time elapsed: 0.021 s
17:56:21 test004 - 1.8(org.eclipse.jdt.core.tests.eval.DebugEvaluationTest)  Time elapsed: 0.119 s
17:56:21 test005 - 1.8(org.eclipse.jdt.core.tests.eval.DebugEvaluationTest)  Time elapsed: 0.129 s
17:56:21 test006 - 1.8(org.eclipse.jdt.core.tests.eval.DebugEvaluationTest)  Time elapsed: 0.128 s
17:56:21 test007 - 1.8(org.eclipse.jdt.core.tests.eval.DebugEvaluationTest)  Time elapsed: 0.128 s
17:56:21 test008 - 1.8(org.eclipse.jdt.core.tests.eval.DebugEvaluationTest)  Time elapsed: 0.127 s
17:56:21 test009 - 1.8(org.eclipse.jdt.core.tests.eval.DebugEvaluationTest)  Time elapsed: 0.12 s
17:56:21 test010 - 1.8(org.eclipse.jdt.core.tests.eval.DebugEvaluationTest)  Time elapsed: 0.135 s
17:56:21 test011 - 1.8(org.eclipse.jdt.core.tests.eval.DebugEvaluationTest)  Time elapsed: 0.126 s
17:56:21 test016 - 1.8(org.eclipse.jdt.core.tests.eval.DebugEvaluationTest)  Time elapsed: 0.225 s
17:56:21 test017 - 1.8(org.eclipse.jdt.core.tests.eval.DebugEvaluationTest)  Time elapsed: 0.117 s
17:56:21 test018 - 1.8(org.eclipse.jdt.core.tests.eval.DebugEvaluationTest)  Time elapsed: 0.24 s
17:56:21 test019 - 1.8(org.eclipse.jdt.core.tests.eval.DebugEvaluationTest)  Time elapsed: 0.022 s
17:56:21 test020 - 1.8(org.eclipse.jdt.core.tests.eval.DebugEvaluationTest)  Time elapsed: 0.13 s
17:56:21 test021 - 1.8(org.eclipse.jdt.core.tests.eval.DebugEvaluationTest)  Time elapsed: 0.237 s
17:56:21 test022 - 1.8(org.eclipse.jdt.core.tests.eval.DebugEvaluationTest)  Time elapsed: 0.249 s
17:56:21 test023 - 1.8(org.eclipse.jdt.core.tests.eval.DebugEvaluationTest)  Time elapsed: 0.254 s
17:56:21 test024 - 1.8(org.eclipse.jdt.core.tests.eval.DebugEvaluationTest)  Time elapsed: 0.249 s
17:56:21 test025 - 1.8(org.eclipse.jdt.core.tests.eval.DebugEvaluationTest)  Time elapsed: 0.241 s
17:56:21 test026 - 1.8(org.eclipse.jdt.core.tests.eval.DebugEvaluationTest)  Time elapsed: 0.129 s
17:56:21 test027 - 1.8(org.eclipse.jdt.core.tests.eval.DebugEvaluationTest)  Time elapsed: 0.128 s
17:56:21 test028 - 1.8(org.eclipse.jdt.core.tests.eval.DebugEvaluationTest)  Time elapsed: 0.128 s
17:56:21 test029 - 1.8(org.eclipse.jdt.core.tests.eval.DebugEvaluationTest)  Time elapsed: 0.127 s
17:56:21 test030 - 1.8(org.eclipse.jdt.core.tests.eval.DebugEvaluationTest)  Time elapsed: 0.129 s
17:56:21 test031 - 1.8(org.eclipse.jdt.core.tests.eval.DebugEvaluationTest)  Time elapsed: 0.128 s
17:56:21 test032 - 1.8(org.eclipse.jdt.core.tests.eval.DebugEvaluationTest)  Time elapsed: 0.025 s
17:56:21 test033 - 1.8(org.eclipse.jdt.core.tests.eval.DebugEvaluationTest)  Time elapsed: 0.131 s
17:56:21 test034 - 1.8(org.eclipse.jdt.core.tests.eval.DebugEvaluationTest)  Time elapsed: 0.126 s
17:56:21 test035 - 1.8(org.eclipse.jdt.core.tests.eval.DebugEvaluationTest)  Time elapsed: 0.128 s
17:56:21 test036 - 1.8(org.eclipse.jdt.core.tests.eval.DebugEvaluationTest)  Time elapsed: 0.127 s
17:56:21 test037 - 1.8(org.eclipse.jdt.core.tests.eval.DebugEvaluationTest)  Time elapsed: 0.13 s
17:56:21 test038 - 1.8(org.eclipse.jdt.core.tests.eval.DebugEvaluationTest)  Time elapsed: 0.131 s
17:56:21 test039 - 1.8(org.eclipse.jdt.core.tests.eval.DebugEvaluationTest)  Time elapsed: 0.132 s
17:56:21 test040 - 1.8(org.eclipse.jdt.core.tests.eval.DebugEvaluationTest)  Time elapsed: 0.129 s
17:56:21 test041 - 1.8(org.eclipse.jdt.core.tests.eval.DebugEvaluationTest)  Time elapsed: 0.127 s
17:56:21 test042 - 1.8(org.eclipse.jdt.core.tests.eval.DebugEvaluationTest)  Time elapsed: 0.127 s
17:56:21 test043 - 1.8(org.eclipse.jdt.core.tests.eval.DebugEvaluationTest)  Time elapsed: 0.127 s
17:56:21 test044 - 1.8(org.eclipse.jdt.core.tests.eval.DebugEvaluationTest)  Time elapsed: 0.128 s
17:56:21 test045 - 1.8(org.eclipse.jdt.core.tests.eval.DebugEvaluationTest)  Time elapsed: 0.127 s
17:56:21 test046 - 1.8(org.eclipse.jdt.core.tests.eval.DebugEvaluationTest)  Time elapsed: 0.128 s
17:56:21 test047 - 1.8(org.eclipse.jdt.core.tests.eval.DebugEvaluationTest)  Time elapsed: 0.128 s
17:56:21 test048 - 1.8(org.eclipse.jdt.core.tests.eval.DebugEvaluationTest)  Time elapsed: 0.128 s
17:56:21 test049 - 1.8(org.eclipse.jdt.core.tests.eval.DebugEvaluationTest)  Time elapsed: 0.128 s
17:56:21 test050 - 1.8(org.eclipse.jdt.core.tests.eval.DebugEvaluationTest)  Time elapsed: 0.128 s
17:56:21 test051 - 1.8(org.eclipse.jdt.core.tests.eval.DebugEvaluationTest)  Time elapsed: 0.127 s
17:56:21 test052 - 1.8(org.eclipse.jdt.core.tests.eval.DebugEvaluationTest)  Time elapsed: 0.127 s
17:56:21 test053 - 1.8(org.eclipse.jdt.core.tests.eval.DebugEvaluationTest)  Time elapsed: 0.128 s
17:56:21 test054 - 1.8(org.eclipse.jdt.core.tests.eval.DebugEvaluationTest)  Time elapsed: 0.128 s
17:56:21 test055 - 1.8(org.eclipse.jdt.core.tests.eval.DebugEvaluationTest)  Time elapsed: 0.13 s
17:56:21 test056 - 1.8(org.eclipse.jdt.core.tests.eval.DebugEvaluationTest)  Time elapsed: 0.129 s
17:56:21 test057 - 1.8(org.eclipse.jdt.core.tests.eval.DebugEvaluationTest)  Time elapsed: 0.129 s
17:56:21 test058 - 1.8(org.eclipse.jdt.core.tests.eval.DebugEvaluationTest)  Time elapsed: 0.129 s
17:56:21 test059 - 1.8(org.eclipse.jdt.core.tests.eval.DebugEvaluationTest)  Time elapsed: 0.128 s
17:56:21 test060 - 1.8(org.eclipse.jdt.core.tests.eval.DebugEvaluationTest)  Time elapsed: 0.133 s
17:56:21 test061 - 1.8(org.eclipse.jdt.core.tests.eval.DebugEvaluationTest)  Time elapsed: 0.135 s
17:56:21 test062 - 1.8(org.eclipse.jdt.core.tests.eval.DebugEvaluationTest)  Time elapsed: 0.132 s
17:56:21 test063 - 1.8(org.eclipse.jdt.core.tests.eval.DebugEvaluationTest)  Time elapsed: 0.135 s
17:56:21 test065 - 1.8(org.eclipse.jdt.core.tests.eval.DebugEvaluationTest)  Time elapsed: 0.136 s
17:56:21 test066 - 1.8(org.eclipse.jdt.core.tests.eval.DebugEvaluationTest)  Time elapsed: 0.135 s
17:56:21 test067 - 1.8(org.eclipse.jdt.core.tests.eval.DebugEvaluationTest)  Time elapsed: 0.142 s
17:56:21 test068 - 1.8(org.eclipse.jdt.core.tests.eval.DebugEvaluationTest)  Time elapsed: 0.029 s
17:56:21 test069 - 1.8(org.eclipse.jdt.core.tests.eval.DebugEvaluationTest)  Time elapsed: 0.027 s
17:56:21 testNegative001 - 1.8(org.eclipse.jdt.core.tests.eval.DebugEvaluationTest)  Time elapsed: 0.022 s
17:56:21 testNegative002 - 1.8(org.eclipse.jdt.core.tests.eval.DebugEvaluationTest)  Time elapsed: 0.023 s
17:56:21 testNegative003 - 1.8(org.eclipse.jdt.core.tests.eval.DebugEvaluationTest)  Time elapsed: 0.022 s
17:56:21 testNegative004 - 1.8(org.eclipse.jdt.core.tests.eval.DebugEvaluationTest)  Time elapsed: 0.01 s
17:56:21 testNegative005 - 1.8(org.eclipse.jdt.core.tests.eval.DebugEvaluationTest)  Time elapsed: 0.01 s
17:56:21 testAllVariables - 11(org.eclipse.jdt.core.tests.eval.SanityTestEvaluationContext)  Time elapsed: 0.001 s
17:56:21 testEvaluate - 11(org.eclipse.jdt.core.tests.eval.SanityTestEvaluationContext)  Time elapsed: 0.01 s
17:56:21 testEvaluateImports - 11(org.eclipse.jdt.core.tests.eval.SanityTestEvaluationContext)  Time elapsed: 0.001 s
17:56:21 testEvaluateVariable - 11(org.eclipse.jdt.core.tests.eval.SanityTestEvaluationContext)  Time elapsed: 0.007 s
17:56:21 testEvaluateVariables - 11(org.eclipse.jdt.core.tests.eval.SanityTestEvaluationContext)  Time elapsed: 0.002 s
17:56:21 testGetSetImports - 11(org.eclipse.jdt.core.tests.eval.SanityTestEvaluationContext)  Time elapsed: 0 s
17:56:21 testGetSetPackageName - 11(org.eclipse.jdt.core.tests.eval.SanityTestEvaluationContext)  Time elapsed: 0 s
17:56:21 testNewDeleteVariable - 11(org.eclipse.jdt.core.tests.eval.SanityTestEvaluationContext)  Time elapsed: 0 s
17:56:21 testGetEvaluationType - 11(org.eclipse.jdt.core.tests.eval.SanityTestEvaluationResult)  Time elapsed: 0.005 s
17:56:21 testGetProblems - 11(org.eclipse.jdt.core.tests.eval.SanityTestEvaluationResult)  Time elapsed: 0.003 s
17:56:21 testGetValue - 11(org.eclipse.jdt.core.tests.eval.SanityTestEvaluationResult)  Time elapsed: 0.004 s
17:56:21 testGetValueDisplayString - 11(org.eclipse.jdt.core.tests.eval.SanityTestEvaluationResult)  Time elapsed: 0.004 s
17:56:21 testGetValueTypeName - 11(org.eclipse.jdt.core.tests.eval.SanityTestEvaluationResult)  Time elapsed: 0.003 s
17:56:21 testHasErrors - 11(org.eclipse.jdt.core.tests.eval.SanityTestEvaluationResult)  Time elapsed: 0.004 s
17:56:21 testHasProblems - 11(org.eclipse.jdt.core.tests.eval.SanityTestEvaluationResult)  Time elapsed: 0.004 s
17:56:21 testHasValue - 11(org.eclipse.jdt.core.tests.eval.SanityTestEvaluationResult)  Time elapsed: 0.003 s
17:56:21 testHasWarnings - 11(org.eclipse.jdt.core.tests.eval.SanityTestEvaluationResult)  Time elapsed: 0.004 s
17:56:21 testAllKindOfValues - 11(org.eclipse.jdt.core.tests.eval.VariableTest)  Time elapsed: 0.057 s
17:56:21 testCodeSnippetVarAssign - 11(org.eclipse.jdt.core.tests.eval.VariableTest)  Time elapsed: 0.085 s
17:56:21 testCodeSnippetVarRetrieval - 11(org.eclipse.jdt.core.tests.eval.VariableTest)  Time elapsed: 0.043 s
17:56:21 testImports - 11(org.eclipse.jdt.core.tests.eval.VariableTest)  Time elapsed: 0.028 s
17:56:21 testSeveralVariableInstallations - 11(org.eclipse.jdt.core.tests.eval.VariableTest)  Time elapsed: 0.113 s
17:56:21 testBug345334 - 11(org.eclipse.jdt.core.tests.eval.CodeSnippetTest)  Time elapsed: 0.005 s
17:56:21 testBug464656 - 11(org.eclipse.jdt.core.tests.eval.CodeSnippetTest)  Time elapsed: 0.029 s
17:56:21 testCheckedException - 11(org.eclipse.jdt.core.tests.eval.CodeSnippetTest)  Time elapsed: 0.007 s
17:56:21 testDiamond - 11(org.eclipse.jdt.core.tests.eval.CodeSnippetTest)  Time elapsed: 0.006 s
17:56:21 testEmptyStatement - 11(org.eclipse.jdt.core.tests.eval.CodeSnippetTest)  Time elapsed: 0.005 s
17:56:21 testEvaluateEmptyImport - 11(org.eclipse.jdt.core.tests.eval.CodeSnippetTest)  Time elapsed: 0.001 s
17:56:21 testEvaluateExistingPackageAndNonExistingTypeImports - 11(org.eclipse.jdt.core.tests.eval.CodeSnippetTest)  Time elapsed: 0 s
17:56:21 testEvaluateNonExistingPackageAndExistingTypeImports - 11(org.eclipse.jdt.core.tests.eval.CodeSnippetTest)  Time elapsed: 0 s
17:56:21 testEvaluateNonExistingPackageImport - 11(org.eclipse.jdt.core.tests.eval.CodeSnippetTest)  Time elapsed: 0 s
17:56:21 testEvaluateNonExistingTypeImport - 11(org.eclipse.jdt.core.tests.eval.CodeSnippetTest)  Time elapsed: 0 s
17:56:21 testEvaluateValidPackageAndTypeImports - 11(org.eclipse.jdt.core.tests.eval.CodeSnippetTest)  Time elapsed: 0 s
17:56:21 testEvaluateValidPackageImport - 11(org.eclipse.jdt.core.tests.eval.CodeSnippetTest)  Time elapsed: 0 s
17:56:21 testEvaluateValidTypeImport - 11(org.eclipse.jdt.core.tests.eval.CodeSnippetTest)  Time elapsed: 0 s
17:56:21 testFinallyError - 11(org.eclipse.jdt.core.tests.eval.CodeSnippetTest)  Time elapsed: 0.005 s
17:56:21 testFinallyOneBlock - 11(org.eclipse.jdt.core.tests.eval.CodeSnippetTest)  Time elapsed: 0.004 s
17:56:21 testFinallyTwoBlock - 11(org.eclipse.jdt.core.tests.eval.CodeSnippetTest)  Time elapsed: 0.004 s
17:56:21 testFor89632 - 11(org.eclipse.jdt.core.tests.eval.CodeSnippetTest)  Time elapsed: 0.008 s
17:56:21 testFreeReturnAnonymous - 11(org.eclipse.jdt.core.tests.eval.CodeSnippetTest)  Time elapsed: 0.005 s
17:56:21 testFreeReturnClassDeclaration - 11(org.eclipse.jdt.core.tests.eval.CodeSnippetTest)  Time elapsed: 0.004 s
17:56:21 testFreeReturnExpression - 11(org.eclipse.jdt.core.tests.eval.CodeSnippetTest)  Time elapsed: 0.003 s
17:56:21 testFreeReturnInteger - 11(org.eclipse.jdt.core.tests.eval.CodeSnippetTest)  Time elapsed: 0.003 s
17:56:21 testFreeReturnLocalVar - 11(org.eclipse.jdt.core.tests.eval.CodeSnippetTest)  Time elapsed: 0.003 s
17:56:21 testFreeReturnStatement - 11(org.eclipse.jdt.core.tests.eval.CodeSnippetTest)  Time elapsed: 0.003 s
17:56:21 testImportPackage - 11(org.eclipse.jdt.core.tests.eval.CodeSnippetTest)  Time elapsed: 0.006 s
17:56:21 testImportType - 11(org.eclipse.jdt.core.tests.eval.CodeSnippetTest)  Time elapsed: 0.006 s
17:56:21 testImportTypeAndPackage - 11(org.eclipse.jdt.core.tests.eval.CodeSnippetTest)  Time elapsed: 0.006 s
17:56:21 testInnerClassAnonymous - 11(org.eclipse.jdt.core.tests.eval.CodeSnippetTest)  Time elapsed: 0.005 s
17:56:21 testInnerClassNamed - 11(org.eclipse.jdt.core.tests.eval.CodeSnippetTest)  Time elapsed: 0.004 s
17:56:21 testReturnDisplayStringBoolean - 11(org.eclipse.jdt.core.tests.eval.CodeSnippetTest)  Time elapsed: 0.003 s
17:56:21 testReturnDisplayStringCharacter - 11(org.eclipse.jdt.core.tests.eval.CodeSnippetTest)  Time elapsed: 0.003 s
17:56:21 testReturnDisplayStringDouble - 11(org.eclipse.jdt.core.tests.eval.CodeSnippetTest)  Time elapsed: 0.003 s
17:56:21 testReturnDisplayStringEmptyCodeSnippet - 11(org.eclipse.jdt.core.tests.eval.CodeSnippetTest)  Time elapsed: 0.002 s
17:56:21 testReturnDisplayStringFloat - 11(org.eclipse.jdt.core.tests.eval.CodeSnippetTest)  Time elapsed: 0.003 s
17:56:21 testReturnDisplayStringInteger - 11(org.eclipse.jdt.core.tests.eval.CodeSnippetTest)  Time elapsed: 0.003 s
17:56:21 testReturnDisplayStringLong - 11(org.eclipse.jdt.core.tests.eval.CodeSnippetTest)  Time elapsed: 0.003 s
17:56:21 testReturnDisplayStringNoExplicitReturnedValue - 11(org.eclipse.jdt.core.tests.eval.CodeSnippetTest)  Time elapsed: 0.004 s
17:56:21 testReturnDisplayStringObject - 11(org.eclipse.jdt.core.tests.eval.CodeSnippetTest)  Time elapsed: 0.004 s
17:56:21 testReturnDisplayStringShort - 11(org.eclipse.jdt.core.tests.eval.CodeSnippetTest)  Time elapsed: 0.003 s
17:56:21 testReturnDisplayStringString - 11(org.eclipse.jdt.core.tests.eval.CodeSnippetTest)  Time elapsed: 0.003 s
17:56:21 testReturnDisplayStringVoid - 11(org.eclipse.jdt.core.tests.eval.CodeSnippetTest)  Time elapsed: 0.004 s
17:56:21 testReturnTypeBoolean - 11(org.eclipse.jdt.core.tests.eval.CodeSnippetTest)  Time elapsed: 0.003 s
17:56:21 testReturnTypeBooleanArray - 11(org.eclipse.jdt.core.tests.eval.CodeSnippetTest)  Time elapsed: 0.004 s
17:56:21 testReturnTypeBooleanObject - 11(org.eclipse.jdt.core.tests.eval.CodeSnippetTest)  Time elapsed: 0.008 s
17:56:21 testReturnTypeChar - 11(org.eclipse.jdt.core.tests.eval.CodeSnippetTest)  Time elapsed: 0.004 s
17:56:21 testReturnTypeCharArray - 11(org.eclipse.jdt.core.tests.eval.CodeSnippetTest)  Time elapsed: 0.003 s
17:56:21 testReturnTypeCharacterObject - 11(org.eclipse.jdt.core.tests.eval.CodeSnippetTest)  Time elapsed: 0.003 s
17:56:21 testReturnTypeDouble - 11(org.eclipse.jdt.core.tests.eval.CodeSnippetTest)  Time elapsed: 0.003 s
17:56:21 testReturnTypeDoubleArray - 11(org.eclipse.jdt.core.tests.eval.CodeSnippetTest)  Time elapsed: 0.004 s
17:56:21 testReturnTypeDoubleObject - 11(org.eclipse.jdt.core.tests.eval.CodeSnippetTest)  Time elapsed: 0.003 s
17:56:21 testReturnTypeEmptyCodeSnippet - 11(org.eclipse.jdt.core.tests.eval.CodeSnippetTest)  Time elapsed: 0.003 s
17:56:21 testReturnTypeFloat - 11(org.eclipse.jdt.core.tests.eval.CodeSnippetTest)  Time elapsed: 0.003 s
17:56:21 testReturnTypeFloatArray - 11(org.eclipse.jdt.core.tests.eval.CodeSnippetTest)  Time elapsed: 0.002 s
17:56:21 testReturnTypeFloatObject - 11(org.eclipse.jdt.core.tests.eval.CodeSnippetTest)  Time elapsed: 0.004 s
17:56:21 testReturnTypeInt - 11(org.eclipse.jdt.core.tests.eval.CodeSnippetTest)  Time elapsed: 0.003 s
17:56:21 testReturnTypeIntegerObject - 11(org.eclipse.jdt.core.tests.eval.CodeSnippetTest)  Time elapsed: 0.003 s
17:56:21 testReturnTypeLong - 11(org.eclipse.jdt.core.tests.eval.CodeSnippetTest)  Time elapsed: 0.003 s
17:56:21 testReturnTypeLongArray - 11(org.eclipse.jdt.core.tests.eval.CodeSnippetTest)  Time elapsed: 0.003 s
17:56:21 testReturnTypeLongObject - 11(org.eclipse.jdt.core.tests.eval.CodeSnippetTest)  Time elapsed: 0.004 s
17:56:21 testReturnTypeNoExplicitReturnedValue - 11(org.eclipse.jdt.core.tests.eval.CodeSnippetTest)  Time elapsed: 0.003 s
17:56:21 testReturnTypeObject - 11(org.eclipse.jdt.core.tests.eval.CodeSnippetTest)  Time elapsed: 0.003 s
17:56:21 testReturnTypeObjectArray - 11(org.eclipse.jdt.core.tests.eval.CodeSnippetTest)  Time elapsed: 0.003 s
17:56:21 testReturnTypeShort - 11(org.eclipse.jdt.core.tests.eval.CodeSnippetTest)  Time elapsed: 0.003 s
17:56:21 testReturnTypeShortArray - 11(org.eclipse.jdt.core.tests.eval.CodeSnippetTest)  Time elapsed: 0.003 s
17:56:21 testReturnTypeShortObject - 11(org.eclipse.jdt.core.tests.eval.CodeSnippetTest)  Time elapsed: 0.003 s
17:56:21 testReturnTypeString - 11(org.eclipse.jdt.core.tests.eval.CodeSnippetTest)  Time elapsed: 0.003 s
17:56:21 testReturnTypeStringArray - 11(org.eclipse.jdt.core.tests.eval.CodeSnippetTest)  Time elapsed: 0.004 s
17:56:21 testReturnTypeVoid - 11(org.eclipse.jdt.core.tests.eval.CodeSnippetTest)  Time elapsed: 0.003 s
17:56:21 testReturnTypesIntArray - 11(org.eclipse.jdt.core.tests.eval.CodeSnippetTest)  Time elapsed: 0.003 s
17:56:21 testRunMethodInAnonymous - 11(org.eclipse.jdt.core.tests.eval.CodeSnippetTest)  Time elapsed: 0.207 s
17:56:21 testRunMethodInAnonymous2 - 11(org.eclipse.jdt.core.tests.eval.CodeSnippetTest)  Time elapsed: 0.208 s
17:56:21 testRunMethodInAnonymous3 - 11(org.eclipse.jdt.core.tests.eval.CodeSnippetTest)  Time elapsed: 0.206 s
17:56:21 testRunMethodInAnonymous4 - 11(org.eclipse.jdt.core.tests.eval.CodeSnippetTest)  Time elapsed: 0.208 s
17:56:21 testRunMethodInAnonymous5 - 11(org.eclipse.jdt.core.tests.eval.CodeSnippetTest)  Time elapsed: 0.207 s
17:56:21 testRunMethodInAnonymous6 - 11(org.eclipse.jdt.core.tests.eval.CodeSnippetTest)  Time elapsed: 0.207 s
17:56:21 testRunMethodInAnonymous7 - 11(org.eclipse.jdt.core.tests.eval.CodeSnippetTest)  Time elapsed: 0.206 s
17:56:21 testRunMethodInAnonymous8 - 11(org.eclipse.jdt.core.tests.eval.CodeSnippetTest)  Time elapsed: 0.207 s
17:56:21 testExpressionInInnerClass - 11(org.eclipse.jdt.core.tests.eval.NegativeCodeSnippetTest)  Time elapsed: 0.001 s
17:56:21 testExtraClosingCurlyBracket - 11(org.eclipse.jdt.core.tests.eval.NegativeCodeSnippetTest)  Time elapsed: 0.003 s
17:56:21 testExtraOpenRoundBracket - 11(org.eclipse.jdt.core.tests.eval.NegativeCodeSnippetTest)  Time elapsed: 0.001 s
17:56:21 testExtraSemiColonInExpression - 11(org.eclipse.jdt.core.tests.eval.NegativeCodeSnippetTest)  Time elapsed: 0.001 s
17:56:21 testInvalidField - 11(org.eclipse.jdt.core.tests.eval.NegativeCodeSnippetTest)  Time elapsed: 0.002 s
17:56:21 testInvalidImport - 11(org.eclipse.jdt.core.tests.eval.NegativeCodeSnippetTest)  Time elapsed: 0.003 s
17:56:21 testInvalidUseOfThisInSnippet - 11(org.eclipse.jdt.core.tests.eval.NegativeCodeSnippetTest)  Time elapsed: 0.003 s
17:56:21 testInvalidUseOfThisInSnippet2 - 11(org.eclipse.jdt.core.tests.eval.NegativeCodeSnippetTest)  Time elapsed: 0.001 s
17:56:21 testMissingClosingRoundBracket - 11(org.eclipse.jdt.core.tests.eval.NegativeCodeSnippetTest)  Time elapsed: 0.001 s
17:56:21 testMissingDoubleQuote - 11(org.eclipse.jdt.core.tests.eval.NegativeCodeSnippetTest)  Time elapsed: 0.002 s
17:56:21 testNonLastExpressionStatement - 11(org.eclipse.jdt.core.tests.eval.NegativeCodeSnippetTest)  Time elapsed: 0.001 s
17:56:21 testProblemInExpression - 11(org.eclipse.jdt.core.tests.eval.NegativeCodeSnippetTest)  Time elapsed: 0.001 s
17:56:21 testProblemInExpression2 - 11(org.eclipse.jdt.core.tests.eval.NegativeCodeSnippetTest)  Time elapsed: 0.001 s
17:56:21 testProblemInInnerClass - 11(org.eclipse.jdt.core.tests.eval.NegativeCodeSnippetTest)  Time elapsed: 0.007 s
17:56:21 testProblemInPreviousStatement - 11(org.eclipse.jdt.core.tests.eval.NegativeCodeSnippetTest)  Time elapsed: 0.002 s
17:56:21 testProblemInReturnStatement - 11(org.eclipse.jdt.core.tests.eval.NegativeCodeSnippetTest)  Time elapsed: 0.001 s
17:56:21 testRemoveImport - 11(org.eclipse.jdt.core.tests.eval.NegativeCodeSnippetTest)  Time elapsed: 0.009 s
17:56:21 testRemoveVariable - 11(org.eclipse.jdt.core.tests.eval.NegativeCodeSnippetTest)  Time elapsed: 0.008 s
17:56:21 testUnreachableExpression - 11(org.eclipse.jdt.core.tests.eval.NegativeCodeSnippetTest)  Time elapsed: 0.002 s
17:56:21 testUnusedImport - 11(org.eclipse.jdt.core.tests.eval.NegativeCodeSnippetTest)  Time elapsed: 0.01 s
17:56:21 testWarning - 11(org.eclipse.jdt.core.tests.eval.NegativeCodeSnippetTest)  Time elapsed: 0.004 s
17:56:21 testInitializerProblem - 11(org.eclipse.jdt.core.tests.eval.NegativeVariableTest)  Time elapsed: 0.004 s
17:56:21 testUnknownType - 11(org.eclipse.jdt.core.tests.eval.NegativeVariableTest)  Time elapsed: 0.003 s
17:56:21 test001 - 11(org.eclipse.jdt.core.tests.eval.DebugEvaluationTest)  Time elapsed: 0.137 s
17:56:21 test002 - 11(org.eclipse.jdt.core.tests.eval.DebugEvaluationTest)  Time elapsed: 0.136 s
17:56:21 test003 - 11(org.eclipse.jdt.core.tests.eval.DebugEvaluationTest)  Time elapsed: 0.028 s
17:56:21 test004 - 11(org.eclipse.jdt.core.tests.eval.DebugEvaluationTest)  Time elapsed: 0.123 s
17:56:21 test005 - 11(org.eclipse.jdt.core.tests.eval.DebugEvaluationTest)  Time elapsed: 0.131 s
17:56:21 test006 - 11(org.eclipse.jdt.core.tests.eval.DebugEvaluationTest)  Time elapsed: 0.131 s
17:56:21 test007 - 11(org.eclipse.jdt.core.tests.eval.DebugEvaluationTest)  Time elapsed: 0.132 s
17:56:21 test008 - 11(org.eclipse.jdt.core.tests.eval.DebugEvaluationTest)  Time elapsed: 0.13 s
17:56:21 test009 - 11(org.eclipse.jdt.core.tests.eval.DebugEvaluationTest)  Time elapsed: 0.119 s
17:56:21 test010 - 11(org.eclipse.jdt.core.tests.eval.DebugEvaluationTest)  Time elapsed: 0.132 s
17:56:21 test011 - 11(org.eclipse.jdt.core.tests.eval.DebugEvaluationTest)  Time elapsed: 0.125 s
17:56:21 test016 - 11(org.eclipse.jdt.core.tests.eval.DebugEvaluationTest)  Time elapsed: 0.224 s
17:56:21 test017 - 11(org.eclipse.jdt.core.tests.eval.DebugEvaluationTest)  Time elapsed: 0.117 s
17:56:21 test018 - 11(org.eclipse.jdt.core.tests.eval.DebugEvaluationTest)  Time elapsed: 0.243 s
17:56:21 test019 - 11(org.eclipse.jdt.core.tests.eval.DebugEvaluationTest)  Time elapsed: 0.023 s
17:56:21 test020 - 11(org.eclipse.jdt.core.tests.eval.DebugEvaluationTest)  Time elapsed: 0.131 s
17:56:21 test021 - 11(org.eclipse.jdt.core.tests.eval.DebugEvaluationTest)  Time elapsed: 0.242 s
17:56:21 test022 - 11(org.eclipse.jdt.core.tests.eval.DebugEvaluationTest)  Time elapsed: 0.246 s
17:56:21 test023 - 11(org.eclipse.jdt.core.tests.eval.DebugEvaluationTest)  Time elapsed: 0.25 s
17:56:21 test024 - 11(org.eclipse.jdt.core.tests.eval.DebugEvaluationTest)  Time elapsed: 0.248 s
17:56:21 test025 - 11(org.eclipse.jdt.core.tests.eval.DebugEvaluationTest)  Time elapsed: 0.239 s
17:56:21 test026 - 11(org.eclipse.jdt.core.tests.eval.DebugEvaluationTest)  Time elapsed: 0.129 s
17:56:21 test027 - 11(org.eclipse.jdt.core.tests.eval.DebugEvaluationTest)  Time elapsed: 0.128 s
17:56:21 test028 - 11(org.eclipse.jdt.core.tests.eval.DebugEvaluationTest)  Time elapsed: 0.131 s
17:56:21 test029 - 11(org.eclipse.jdt.core.tests.eval.DebugEvaluationTest)  Time elapsed: 0.131 s
17:56:21 test030 - 11(org.eclipse.jdt.core.tests.eval.DebugEvaluationTest)  Time elapsed: 0.131 s
17:56:21 test031 - 11(org.eclipse.jdt.core.tests.eval.DebugEvaluationTest)  Time elapsed: 0.131 s
17:56:21 test032 - 11(org.eclipse.jdt.core.tests.eval.DebugEvaluationTest)  Time elapsed: 0.028 s
17:56:21 test033 - 11(org.eclipse.jdt.core.tests.eval.DebugEvaluationTest)  Time elapsed: 0.133 s
17:56:21 test034 - 11(org.eclipse.jdt.core.tests.eval.DebugEvaluationTest)  Time elapsed: 0.134 s
17:56:21 test035 - 11(org.eclipse.jdt.core.tests.eval.DebugEvaluationTest)  Time elapsed: 0.133 s
17:56:21 test036 - 11(org.eclipse.jdt.core.tests.eval.DebugEvaluationTest)  Time elapsed: 0.137 s
17:56:21 test037 - 11(org.eclipse.jdt.core.tests.eval.DebugEvaluationTest)  Time elapsed: 0.138 s
17:56:21 test038 - 11(org.eclipse.jdt.core.tests.eval.DebugEvaluationTest)  Time elapsed: 0.134 s
17:56:21 test039 - 11(org.eclipse.jdt.core.tests.eval.DebugEvaluationTest)  Time elapsed: 0.133 s
17:56:21 test040 - 11(org.eclipse.jdt.core.tests.eval.DebugEvaluationTest)  Time elapsed: 0.132 s
17:56:21 test041 - 11(org.eclipse.jdt.core.tests.eval.DebugEvaluationTest)  Time elapsed: 0.134 s
17:56:21 test042 - 11(org.eclipse.jdt.core.tests.eval.DebugEvaluationTest)  Time elapsed: 0.136 s
17:56:21 test043 - 11(org.eclipse.jdt.core.tests.eval.DebugEvaluationTest)  Time elapsed: 0.136 s
17:56:21 test044 - 11(org.eclipse.jdt.core.tests.eval.DebugEvaluationTest)  Time elapsed: 0.135 s
17:56:21 test045 - 11(org.eclipse.jdt.core.tests.eval.DebugEvaluationTest)  Time elapsed: 0.135 s
17:56:21 test046 - 11(org.eclipse.jdt.core.tests.eval.DebugEvaluationTest)  Time elapsed: 0.132 s
17:56:21 test047 - 11(org.eclipse.jdt.core.tests.eval.DebugEvaluationTest)  Time elapsed: 0.133 s
17:56:21 test048 - 11(org.eclipse.jdt.core.tests.eval.DebugEvaluationTest)  Time elapsed: 0.135 s
17:56:21 test049 - 11(org.eclipse.jdt.core.tests.eval.DebugEvaluationTest)  Time elapsed: 0.136 s
17:56:21 test050 - 11(org.eclipse.jdt.core.tests.eval.DebugEvaluationTest)  Time elapsed: 0.136 s
17:56:21 test051 - 11(org.eclipse.jdt.core.tests.eval.DebugEvaluationTest)  Time elapsed: 0.133 s
17:56:21 test052 - 11(org.eclipse.jdt.core.tests.eval.DebugEvaluationTest)  Time elapsed: 0.135 s
17:56:21 test053 - 11(org.eclipse.jdt.core.tests.eval.DebugEvaluationTest)  Time elapsed: 0.135 s
17:56:21 test054 - 11(org.eclipse.jdt.core.tests.eval.DebugEvaluationTest)  Time elapsed: 0.137 s
17:56:21 test055 - 11(org.eclipse.jdt.core.tests.eval.DebugEvaluationTest)  Time elapsed: 0.137 s
17:56:21 test056 - 11(org.eclipse.jdt.core.tests.eval.DebugEvaluationTest)  Time elapsed: 0.137 s
17:56:21 test057 - 11(org.eclipse.jdt.core.tests.eval.DebugEvaluationTest)  Time elapsed: 0.135 s
17:56:21 test058 - 11(org.eclipse.jdt.core.tests.eval.DebugEvaluationTest)  Time elapsed: 0.137 s
17:56:21 test059 - 11(org.eclipse.jdt.core.tests.eval.DebugEvaluationTest)  Time elapsed: 0.135 s
17:56:21 test060 - 11(org.eclipse.jdt.core.tests.eval.DebugEvaluationTest)  Time elapsed: 0.14 s
17:56:21 test061 - 11(org.eclipse.jdt.core.tests.eval.DebugEvaluationTest)  Time elapsed: 0.133 s
17:56:21 test062 - 11(org.eclipse.jdt.core.tests.eval.DebugEvaluationTest)  Time elapsed: 0.132 s
17:56:21 test063 - 11(org.eclipse.jdt.core.tests.eval.DebugEvaluationTest)  Time elapsed: 0.132 s
17:56:21 test065 - 11(org.eclipse.jdt.core.tests.eval.DebugEvaluationTest)  Time elapsed: 0.136 s
17:56:21 test066 - 11(org.eclipse.jdt.core.tests.eval.DebugEvaluationTest)  Time elapsed: 0.134 s
17:56:21 test067 - 11(org.eclipse.jdt.core.tests.eval.DebugEvaluationTest)  Time elapsed: 0.14 s
17:56:21 test068 - 11(org.eclipse.jdt.core.tests.eval.DebugEvaluationTest)  Time elapsed: 0.034 s
17:56:21 test069 - 11(org.eclipse.jdt.core.tests.eval.DebugEvaluationTest)  Time elapsed: 0.029 s
17:56:21 testNegative001 - 11(org.eclipse.jdt.core.tests.eval.DebugEvaluationTest)  Time elapsed: 0.028 s
17:56:21 testNegative002 - 11(org.eclipse.jdt.core.tests.eval.DebugEvaluationTest)  Time elapsed: 0.059 s
17:56:21 testNegative003 - 11(org.eclipse.jdt.core.tests.eval.DebugEvaluationTest)  Time elapsed: 0.028 s
17:56:21 testNegative004 - 11(org.eclipse.jdt.core.tests.eval.DebugEvaluationTest)  Time elapsed: 0.014 s
17:56:21 testNegative005 - 11(org.eclipse.jdt.core.tests.eval.DebugEvaluationTest)  Time elapsed: 0.013 s
17:56:21 
17:56:21 Results:
17:56:21 
17:56:21 Errors: 
17:56:21   NullTypeAnnotationTest>TestCase.runTest:964->testBug500885:13945->AbstractNullAnnotationTest.runConformTestWithLibs:199->AbstractRegressionTest.runConformTest:3431->AbstractRegressionTest.runTest:2942->AbstractRegressionTest.runTest:3131 » NullPointer
17:56:21   NullTypeAnnotationTest>TestCase.runTest:964->testBug500885:13945->AbstractNullAnnotationTest.runConformTestWithLibs:199->AbstractRegressionTest.runConformTest:3431->AbstractRegressionTest.runTest:2942->AbstractRegressionTest.runTest:3131 » NullPointer
17:56:21 
17:56:21 Tests run: 40721, Failures: 0, Errors: 2, Skipped: 0
17:56:21 
17:56:22 [INFO] ------------------------------------------------------------------------
17:56:22 [INFO] Reactor Summary:
17:56:22 [INFO] 
17:56:22 [INFO] eclipse.jdt.core 4.13.0-SNAPSHOT ................... SUCCESS [  9.120 s]
17:56:22 [INFO] org.eclipse.jdt.annotation 2.2.300-SNAPSHOT ........ SUCCESS [ 29.552 s]
17:56:22 [INFO] org.eclipse.jdt.annotation 1.1.400-SNAPSHOT ........ SUCCESS [ 12.760 s]
17:56:22 [INFO] org.eclipse.jdt.core 3.19.0-SNAPSHOT ............... SUCCESS [ 56.417 s]
17:56:22 [INFO] org.eclipse.jdt.compiler.tool 1.2.600-SNAPSHOT ..... SUCCESS [ 22.264 s]
17:56:22 [INFO] org.eclipse.jdt.compiler.apt 1.3.700-SNAPSHOT ...... SUCCESS [ 16.683 s]
17:56:22 [INFO] org.eclipse.jdt.core.tests.compiler 3.12.950-SNAPSHOT FAILURE [26:57 min]
17:56:22 [INFO] org.eclipse.jdt.compiler.tool.tests 1.2.500-SNAPSHOT SKIPPED
17:56:22 [INFO] org.eclipse.jdt.core.tests.builder 3.10.700-SNAPSHOT SKIPPED
17:56:22 [INFO] org.eclipse.jdt.compiler.apt.tests 1.1.800-SNAPSHOT  SKIPPED
17:56:22 [INFO] org.eclipse.jdt.core.tests.model 3.10.950-SNAPSHOT . SKIPPED
17:56:22 [INFO] org.eclipse.jdt.core.tests.performance 3.10.600-SNAPSHOT SKIPPED
17:56:22 [INFO] org.eclipse.jdt.apt.core 3.6.500-SNAPSHOT .......... SKIPPED
17:56:22 [INFO] org.eclipse.jdt.apt.pluggable.core 1.2.400-SNAPSHOT  SKIPPED
17:56:22 [INFO] org.eclipse.jdt.apt.ui 3.6.300-SNAPSHOT ............ SKIPPED
17:56:22 [INFO] org.eclipse.jdt.apt.pluggable.tests 3.4.600-SNAPSHOT SKIPPED
17:56:22 [INFO] org.eclipse.jdt.apt.tests 3.4.500-SNAPSHOT ......... SKIPPED
17:56:22 [INFO] ------------------------------------------------------------------------
17:56:22 [INFO] BUILD FAILURE
17:56:22 [INFO] ------------------------------------------------------------------------
17:56:22 [INFO] Total time:  31:02 min
17:56:22 [INFO] Finished at: 2019-08-13T17:56:22-04:00
17:56:22 [INFO] ------------------------------------------------------------------------
17:56:22 [ERROR] Failed to execute goal org.eclipse.tycho:tycho-surefire-plugin:1.5.0-SNAPSHOT:test (default-test) on project org.eclipse.jdt.core.tests.compiler: There are test failures.
17:56:22 [ERROR] 
17:56:22 [ERROR] Please refer to /jobs/genie.jdt/eclipse.jdt.core-Gerrit/workspace/org.eclipse.jdt.core.tests.compiler/target/surefire-reports for the individual test results.
17:56:22 [ERROR] -> [Help 1]
17:56:22 [ERROR] 
17:56:22 [ERROR] To see the full stack trace of the errors, re-run Maven with the -e switch.
17:56:22 [ERROR] Re-run Maven using the -X switch to enable full debug logging.
17:56:22 [ERROR] 
17:56:22 [ERROR] For more information about the errors and possible solutions, please read the following articles:
17:56:22 [ERROR] [Help 1] http://cwiki.apache.org/confluence/display/MAVEN/MojoFailureException
17:56:22 [ERROR] 
17:56:22 [ERROR] After correcting the problems, you can resume the build with the command
17:56:22 [ERROR]   mvn <goals> -rf :org.eclipse.jdt.core.tests.compiler
17:56:24 Build step 'Invoke top-level Maven targets' marked build as failure
17:56:24 Recording test results
17:56:25 Archiving artifacts
17:56:29 Started calculate disk usage of build
17:56:29 Finished Calculation of disk usage of build in 0 seconds
17:56:34 Started calculate disk usage of workspace
17:56:34 Finished Calculation of disk usage of workspace in 0 seconds
17:56:36 Finished: FAILURE