FailedConsole Output

Skipping 5,421 KB.. Full Log
elapsed: 0.025 s
17:07:34 test033 - 1.8(org.eclipse.jdt.core.tests.eval.DebugEvaluationTest)  Time elapsed: 0.157 s
17:07:34 test034 - 1.8(org.eclipse.jdt.core.tests.eval.DebugEvaluationTest)  Time elapsed: 0.133 s
17:07:34 test035 - 1.8(org.eclipse.jdt.core.tests.eval.DebugEvaluationTest)  Time elapsed: 0.13 s
17:07:34 test036 - 1.8(org.eclipse.jdt.core.tests.eval.DebugEvaluationTest)  Time elapsed: 0.127 s
17:07:34 test037 - 1.8(org.eclipse.jdt.core.tests.eval.DebugEvaluationTest)  Time elapsed: 0.129 s
17:07:34 test038 - 1.8(org.eclipse.jdt.core.tests.eval.DebugEvaluationTest)  Time elapsed: 0.128 s
17:07:34 test039 - 1.8(org.eclipse.jdt.core.tests.eval.DebugEvaluationTest)  Time elapsed: 0.132 s
17:07:34 test040 - 1.8(org.eclipse.jdt.core.tests.eval.DebugEvaluationTest)  Time elapsed: 0.127 s
17:07:34 test041 - 1.8(org.eclipse.jdt.core.tests.eval.DebugEvaluationTest)  Time elapsed: 0.128 s
17:07:34 test042 - 1.8(org.eclipse.jdt.core.tests.eval.DebugEvaluationTest)  Time elapsed: 0.128 s
17:07:34 test043 - 1.8(org.eclipse.jdt.core.tests.eval.DebugEvaluationTest)  Time elapsed: 0.128 s
17:07:34 test044 - 1.8(org.eclipse.jdt.core.tests.eval.DebugEvaluationTest)  Time elapsed: 0.127 s
17:07:34 test045 - 1.8(org.eclipse.jdt.core.tests.eval.DebugEvaluationTest)  Time elapsed: 0.125 s
17:07:34 test046 - 1.8(org.eclipse.jdt.core.tests.eval.DebugEvaluationTest)  Time elapsed: 0.133 s
17:07:34 test047 - 1.8(org.eclipse.jdt.core.tests.eval.DebugEvaluationTest)  Time elapsed: 0.128 s
17:07:34 test048 - 1.8(org.eclipse.jdt.core.tests.eval.DebugEvaluationTest)  Time elapsed: 0.129 s
17:07:34 test049 - 1.8(org.eclipse.jdt.core.tests.eval.DebugEvaluationTest)  Time elapsed: 0.128 s
17:07:34 test050 - 1.8(org.eclipse.jdt.core.tests.eval.DebugEvaluationTest)  Time elapsed: 0.128 s
17:07:34 test051 - 1.8(org.eclipse.jdt.core.tests.eval.DebugEvaluationTest)  Time elapsed: 0.128 s
17:07:34 test052 - 1.8(org.eclipse.jdt.core.tests.eval.DebugEvaluationTest)  Time elapsed: 0.128 s
17:07:34 test053 - 1.8(org.eclipse.jdt.core.tests.eval.DebugEvaluationTest)  Time elapsed: 0.127 s
17:07:34 test054 - 1.8(org.eclipse.jdt.core.tests.eval.DebugEvaluationTest)  Time elapsed: 0.128 s
17:07:34 test055 - 1.8(org.eclipse.jdt.core.tests.eval.DebugEvaluationTest)  Time elapsed: 0.128 s
17:07:34 test056 - 1.8(org.eclipse.jdt.core.tests.eval.DebugEvaluationTest)  Time elapsed: 0.128 s
17:07:34 test057 - 1.8(org.eclipse.jdt.core.tests.eval.DebugEvaluationTest)  Time elapsed: 0.127 s
17:07:34 test058 - 1.8(org.eclipse.jdt.core.tests.eval.DebugEvaluationTest)  Time elapsed: 0.127 s
17:07:34 test059 - 1.8(org.eclipse.jdt.core.tests.eval.DebugEvaluationTest)  Time elapsed: 0.127 s
17:07:34 test060 - 1.8(org.eclipse.jdt.core.tests.eval.DebugEvaluationTest)  Time elapsed: 0.127 s
17:07:34 test061 - 1.8(org.eclipse.jdt.core.tests.eval.DebugEvaluationTest)  Time elapsed: 0.128 s
17:07:34 test062 - 1.8(org.eclipse.jdt.core.tests.eval.DebugEvaluationTest)  Time elapsed: 0.127 s
17:07:34 test063 - 1.8(org.eclipse.jdt.core.tests.eval.DebugEvaluationTest)  Time elapsed: 0.124 s
17:07:34 test065 - 1.8(org.eclipse.jdt.core.tests.eval.DebugEvaluationTest)  Time elapsed: 0.129 s
17:07:34 test066 - 1.8(org.eclipse.jdt.core.tests.eval.DebugEvaluationTest)  Time elapsed: 0.128 s
17:07:34 test067 - 1.8(org.eclipse.jdt.core.tests.eval.DebugEvaluationTest)  Time elapsed: 0.133 s
17:07:34 test068 - 1.8(org.eclipse.jdt.core.tests.eval.DebugEvaluationTest)  Time elapsed: 0.025 s
17:07:34 test069 - 1.8(org.eclipse.jdt.core.tests.eval.DebugEvaluationTest)  Time elapsed: 0.024 s
17:07:34 testNegative001 - 1.8(org.eclipse.jdt.core.tests.eval.DebugEvaluationTest)  Time elapsed: 0.019 s
17:07:34 testNegative002 - 1.8(org.eclipse.jdt.core.tests.eval.DebugEvaluationTest)  Time elapsed: 0.02 s
17:07:34 testNegative003 - 1.8(org.eclipse.jdt.core.tests.eval.DebugEvaluationTest)  Time elapsed: 0.021 s
17:07:34 testNegative004 - 1.8(org.eclipse.jdt.core.tests.eval.DebugEvaluationTest)  Time elapsed: 0.011 s
17:07:34 testNegative005 - 1.8(org.eclipse.jdt.core.tests.eval.DebugEvaluationTest)  Time elapsed: 0.01 s
17:07:34 testAllVariables - 11(org.eclipse.jdt.core.tests.eval.SanityTestEvaluationContext)  Time elapsed: 0 s
17:07:34 testEvaluate - 11(org.eclipse.jdt.core.tests.eval.SanityTestEvaluationContext)  Time elapsed: 0.012 s
17:07:34 testEvaluateImports - 11(org.eclipse.jdt.core.tests.eval.SanityTestEvaluationContext)  Time elapsed: 0 s
17:07:34 testEvaluateVariable - 11(org.eclipse.jdt.core.tests.eval.SanityTestEvaluationContext)  Time elapsed: 0.007 s
17:07:34 testEvaluateVariables - 11(org.eclipse.jdt.core.tests.eval.SanityTestEvaluationContext)  Time elapsed: 0.003 s
17:07:34 testGetSetImports - 11(org.eclipse.jdt.core.tests.eval.SanityTestEvaluationContext)  Time elapsed: 0 s
17:07:34 testGetSetPackageName - 11(org.eclipse.jdt.core.tests.eval.SanityTestEvaluationContext)  Time elapsed: 0 s
17:07:34 testNewDeleteVariable - 11(org.eclipse.jdt.core.tests.eval.SanityTestEvaluationContext)  Time elapsed: 0 s
17:07:34 testGetEvaluationType - 11(org.eclipse.jdt.core.tests.eval.SanityTestEvaluationResult)  Time elapsed: 0.005 s
17:07:34 testGetProblems - 11(org.eclipse.jdt.core.tests.eval.SanityTestEvaluationResult)  Time elapsed: 0.003 s
17:07:34 testGetValue - 11(org.eclipse.jdt.core.tests.eval.SanityTestEvaluationResult)  Time elapsed: 0.004 s
17:07:34 testGetValueDisplayString - 11(org.eclipse.jdt.core.tests.eval.SanityTestEvaluationResult)  Time elapsed: 0.004 s
17:07:34 testGetValueTypeName - 11(org.eclipse.jdt.core.tests.eval.SanityTestEvaluationResult)  Time elapsed: 0.003 s
17:07:34 testHasErrors - 11(org.eclipse.jdt.core.tests.eval.SanityTestEvaluationResult)  Time elapsed: 0.004 s
17:07:34 testHasProblems - 11(org.eclipse.jdt.core.tests.eval.SanityTestEvaluationResult)  Time elapsed: 0.004 s
17:07:34 testHasValue - 11(org.eclipse.jdt.core.tests.eval.SanityTestEvaluationResult)  Time elapsed: 0.003 s
17:07:34 testHasWarnings - 11(org.eclipse.jdt.core.tests.eval.SanityTestEvaluationResult)  Time elapsed: 0.004 s
17:07:34 testAllKindOfValues - 11(org.eclipse.jdt.core.tests.eval.VariableTest)  Time elapsed: 0.052 s
17:07:34 testCodeSnippetVarAssign - 11(org.eclipse.jdt.core.tests.eval.VariableTest)  Time elapsed: 0.08 s
17:07:34 testCodeSnippetVarRetrieval - 11(org.eclipse.jdt.core.tests.eval.VariableTest)  Time elapsed: 0.041 s
17:07:34 testImports - 11(org.eclipse.jdt.core.tests.eval.VariableTest)  Time elapsed: 0.032 s
17:07:34 testSeveralVariableInstallations - 11(org.eclipse.jdt.core.tests.eval.VariableTest)  Time elapsed: 0.11 s
17:07:34 testBug345334 - 11(org.eclipse.jdt.core.tests.eval.CodeSnippetTest)  Time elapsed: 0.005 s
17:07:34 testBug464656 - 11(org.eclipse.jdt.core.tests.eval.CodeSnippetTest)  Time elapsed: 0.031 s
17:07:34 testCheckedException - 11(org.eclipse.jdt.core.tests.eval.CodeSnippetTest)  Time elapsed: 0.005 s
17:07:34 testDiamond - 11(org.eclipse.jdt.core.tests.eval.CodeSnippetTest)  Time elapsed: 0.006 s
17:07:34 testEmptyStatement - 11(org.eclipse.jdt.core.tests.eval.CodeSnippetTest)  Time elapsed: 0.006 s
17:07:34 testEvaluateEmptyImport - 11(org.eclipse.jdt.core.tests.eval.CodeSnippetTest)  Time elapsed: 0 s
17:07:34 testEvaluateExistingPackageAndNonExistingTypeImports - 11(org.eclipse.jdt.core.tests.eval.CodeSnippetTest)  Time elapsed: 0 s
17:07:34 testEvaluateNonExistingPackageAndExistingTypeImports - 11(org.eclipse.jdt.core.tests.eval.CodeSnippetTest)  Time elapsed: 0 s
17:07:34 testEvaluateNonExistingPackageImport - 11(org.eclipse.jdt.core.tests.eval.CodeSnippetTest)  Time elapsed: 0 s
17:07:34 testEvaluateNonExistingTypeImport - 11(org.eclipse.jdt.core.tests.eval.CodeSnippetTest)  Time elapsed: 0.001 s
17:07:34 testEvaluateValidPackageAndTypeImports - 11(org.eclipse.jdt.core.tests.eval.CodeSnippetTest)  Time elapsed: 0 s
17:07:34 testEvaluateValidPackageImport - 11(org.eclipse.jdt.core.tests.eval.CodeSnippetTest)  Time elapsed: 0 s
17:07:34 testEvaluateValidTypeImport - 11(org.eclipse.jdt.core.tests.eval.CodeSnippetTest)  Time elapsed: 0 s
17:07:34 testFinallyError - 11(org.eclipse.jdt.core.tests.eval.CodeSnippetTest)  Time elapsed: 0.005 s
17:07:34 testFinallyOneBlock - 11(org.eclipse.jdt.core.tests.eval.CodeSnippetTest)  Time elapsed: 0.003 s
17:07:34 testFinallyTwoBlock - 11(org.eclipse.jdt.core.tests.eval.CodeSnippetTest)  Time elapsed: 0.003 s
17:07:34 testFor89632 - 11(org.eclipse.jdt.core.tests.eval.CodeSnippetTest)  Time elapsed: 0.009 s
17:07:34 testFreeReturnAnonymous - 11(org.eclipse.jdt.core.tests.eval.CodeSnippetTest)  Time elapsed: 0.005 s
17:07:34 testFreeReturnClassDeclaration - 11(org.eclipse.jdt.core.tests.eval.CodeSnippetTest)  Time elapsed: 0.004 s
17:07:34 testFreeReturnExpression - 11(org.eclipse.jdt.core.tests.eval.CodeSnippetTest)  Time elapsed: 0.003 s
17:07:34 testFreeReturnInteger - 11(org.eclipse.jdt.core.tests.eval.CodeSnippetTest)  Time elapsed: 0.003 s
17:07:34 testFreeReturnLocalVar - 11(org.eclipse.jdt.core.tests.eval.CodeSnippetTest)  Time elapsed: 0.004 s
17:07:34 testFreeReturnStatement - 11(org.eclipse.jdt.core.tests.eval.CodeSnippetTest)  Time elapsed: 0.003 s
17:07:34 testImportPackage - 11(org.eclipse.jdt.core.tests.eval.CodeSnippetTest)  Time elapsed: 0.007 s
17:07:34 testImportType - 11(org.eclipse.jdt.core.tests.eval.CodeSnippetTest)  Time elapsed: 0.007 s
17:07:34 testImportTypeAndPackage - 11(org.eclipse.jdt.core.tests.eval.CodeSnippetTest)  Time elapsed: 0.006 s
17:07:34 testInnerClassAnonymous - 11(org.eclipse.jdt.core.tests.eval.CodeSnippetTest)  Time elapsed: 0.006 s
17:07:34 testInnerClassNamed - 11(org.eclipse.jdt.core.tests.eval.CodeSnippetTest)  Time elapsed: 0.004 s
17:07:34 testReturnDisplayStringBoolean - 11(org.eclipse.jdt.core.tests.eval.CodeSnippetTest)  Time elapsed: 0.003 s
17:07:34 testReturnDisplayStringCharacter - 11(org.eclipse.jdt.core.tests.eval.CodeSnippetTest)  Time elapsed: 0.003 s
17:07:34 testReturnDisplayStringDouble - 11(org.eclipse.jdt.core.tests.eval.CodeSnippetTest)  Time elapsed: 0.003 s
17:07:34 testReturnDisplayStringEmptyCodeSnippet - 11(org.eclipse.jdt.core.tests.eval.CodeSnippetTest)  Time elapsed: 0.002 s
17:07:34 testReturnDisplayStringFloat - 11(org.eclipse.jdt.core.tests.eval.CodeSnippetTest)  Time elapsed: 0.003 s
17:07:34 testReturnDisplayStringInteger - 11(org.eclipse.jdt.core.tests.eval.CodeSnippetTest)  Time elapsed: 0.003 s
17:07:34 testReturnDisplayStringLong - 11(org.eclipse.jdt.core.tests.eval.CodeSnippetTest)  Time elapsed: 0.003 s
17:07:34 testReturnDisplayStringNoExplicitReturnedValue - 11(org.eclipse.jdt.core.tests.eval.CodeSnippetTest)  Time elapsed: 0.003 s
17:07:34 testReturnDisplayStringObject - 11(org.eclipse.jdt.core.tests.eval.CodeSnippetTest)  Time elapsed: 0.004 s
17:07:34 testReturnDisplayStringShort - 11(org.eclipse.jdt.core.tests.eval.CodeSnippetTest)  Time elapsed: 0.003 s
17:07:34 testReturnDisplayStringString - 11(org.eclipse.jdt.core.tests.eval.CodeSnippetTest)  Time elapsed: 0.004 s
17:07:34 testReturnDisplayStringVoid - 11(org.eclipse.jdt.core.tests.eval.CodeSnippetTest)  Time elapsed: 0.003 s
17:07:34 testReturnTypeBoolean - 11(org.eclipse.jdt.core.tests.eval.CodeSnippetTest)  Time elapsed: 0.003 s
17:07:34 testReturnTypeBooleanArray - 11(org.eclipse.jdt.core.tests.eval.CodeSnippetTest)  Time elapsed: 0.004 s
17:07:34 testReturnTypeBooleanObject - 11(org.eclipse.jdt.core.tests.eval.CodeSnippetTest)  Time elapsed: 0.003 s
17:07:34 testReturnTypeChar - 11(org.eclipse.jdt.core.tests.eval.CodeSnippetTest)  Time elapsed: 0.004 s
17:07:34 testReturnTypeCharArray - 11(org.eclipse.jdt.core.tests.eval.CodeSnippetTest)  Time elapsed: 0.003 s
17:07:34 testReturnTypeCharacterObject - 11(org.eclipse.jdt.core.tests.eval.CodeSnippetTest)  Time elapsed: 0.003 s
17:07:34 testReturnTypeDouble - 11(org.eclipse.jdt.core.tests.eval.CodeSnippetTest)  Time elapsed: 0.003 s
17:07:34 testReturnTypeDoubleArray - 11(org.eclipse.jdt.core.tests.eval.CodeSnippetTest)  Time elapsed: 0.003 s
17:07:34 testReturnTypeDoubleObject - 11(org.eclipse.jdt.core.tests.eval.CodeSnippetTest)  Time elapsed: 0.004 s
17:07:34 testReturnTypeEmptyCodeSnippet - 11(org.eclipse.jdt.core.tests.eval.CodeSnippetTest)  Time elapsed: 0.002 s
17:07:34 testReturnTypeFloat - 11(org.eclipse.jdt.core.tests.eval.CodeSnippetTest)  Time elapsed: 0.003 s
17:07:34 testReturnTypeFloatArray - 11(org.eclipse.jdt.core.tests.eval.CodeSnippetTest)  Time elapsed: 0.003 s
17:07:34 testReturnTypeFloatObject - 11(org.eclipse.jdt.core.tests.eval.CodeSnippetTest)  Time elapsed: 0.004 s
17:07:34 testReturnTypeInt - 11(org.eclipse.jdt.core.tests.eval.CodeSnippetTest)  Time elapsed: 0.003 s
17:07:34 testReturnTypeIntegerObject - 11(org.eclipse.jdt.core.tests.eval.CodeSnippetTest)  Time elapsed: 0.003 s
17:07:34 testReturnTypeLong - 11(org.eclipse.jdt.core.tests.eval.CodeSnippetTest)  Time elapsed: 0.003 s
17:07:34 testReturnTypeLongArray - 11(org.eclipse.jdt.core.tests.eval.CodeSnippetTest)  Time elapsed: 0.003 s
17:07:34 testReturnTypeLongObject - 11(org.eclipse.jdt.core.tests.eval.CodeSnippetTest)  Time elapsed: 0.004 s
17:07:34 testReturnTypeNoExplicitReturnedValue - 11(org.eclipse.jdt.core.tests.eval.CodeSnippetTest)  Time elapsed: 0.003 s
17:07:34 testReturnTypeObject - 11(org.eclipse.jdt.core.tests.eval.CodeSnippetTest)  Time elapsed: 0.003 s
17:07:34 testReturnTypeObjectArray - 11(org.eclipse.jdt.core.tests.eval.CodeSnippetTest)  Time elapsed: 0.003 s
17:07:34 testReturnTypeShort - 11(org.eclipse.jdt.core.tests.eval.CodeSnippetTest)  Time elapsed: 0.004 s
17:07:34 testReturnTypeShortArray - 11(org.eclipse.jdt.core.tests.eval.CodeSnippetTest)  Time elapsed: 0.003 s
17:07:34 testReturnTypeShortObject - 11(org.eclipse.jdt.core.tests.eval.CodeSnippetTest)  Time elapsed: 0.004 s
17:07:34 testReturnTypeString - 11(org.eclipse.jdt.core.tests.eval.CodeSnippetTest)  Time elapsed: 0.004 s
17:07:34 testReturnTypeStringArray - 11(org.eclipse.jdt.core.tests.eval.CodeSnippetTest)  Time elapsed: 0.004 s
17:07:34 testReturnTypeVoid - 11(org.eclipse.jdt.core.tests.eval.CodeSnippetTest)  Time elapsed: 0.004 s
17:07:34 testReturnTypesIntArray - 11(org.eclipse.jdt.core.tests.eval.CodeSnippetTest)  Time elapsed: 0.004 s
17:07:34 testRunMethodInAnonymous - 11(org.eclipse.jdt.core.tests.eval.CodeSnippetTest)  Time elapsed: 0.206 s
17:07:34 testRunMethodInAnonymous2 - 11(org.eclipse.jdt.core.tests.eval.CodeSnippetTest)  Time elapsed: 0.206 s
17:07:34 testRunMethodInAnonymous3 - 11(org.eclipse.jdt.core.tests.eval.CodeSnippetTest)  Time elapsed: 0.209 s
17:07:34 testRunMethodInAnonymous4 - 11(org.eclipse.jdt.core.tests.eval.CodeSnippetTest)  Time elapsed: 0.206 s
17:07:34 testRunMethodInAnonymous5 - 11(org.eclipse.jdt.core.tests.eval.CodeSnippetTest)  Time elapsed: 0.208 s
17:07:34 testRunMethodInAnonymous6 - 11(org.eclipse.jdt.core.tests.eval.CodeSnippetTest)  Time elapsed: 0.207 s
17:07:34 testRunMethodInAnonymous7 - 11(org.eclipse.jdt.core.tests.eval.CodeSnippetTest)  Time elapsed: 0.21 s
17:07:34 testRunMethodInAnonymous8 - 11(org.eclipse.jdt.core.tests.eval.CodeSnippetTest)  Time elapsed: 0.206 s
17:07:34 testExpressionInInnerClass - 11(org.eclipse.jdt.core.tests.eval.NegativeCodeSnippetTest)  Time elapsed: 0.003 s
17:07:34 testExtraClosingCurlyBracket - 11(org.eclipse.jdt.core.tests.eval.NegativeCodeSnippetTest)  Time elapsed: 0.002 s
17:07:34 testExtraOpenRoundBracket - 11(org.eclipse.jdt.core.tests.eval.NegativeCodeSnippetTest)  Time elapsed: 0.002 s
17:07:34 testExtraSemiColonInExpression - 11(org.eclipse.jdt.core.tests.eval.NegativeCodeSnippetTest)  Time elapsed: 0.001 s
17:07:34 testInvalidField - 11(org.eclipse.jdt.core.tests.eval.NegativeCodeSnippetTest)  Time elapsed: 0.003 s
17:07:34 testInvalidImport - 11(org.eclipse.jdt.core.tests.eval.NegativeCodeSnippetTest)  Time elapsed: 0.004 s
17:07:34 testInvalidUseOfThisInSnippet - 11(org.eclipse.jdt.core.tests.eval.NegativeCodeSnippetTest)  Time elapsed: 0.003 s
17:07:34 testInvalidUseOfThisInSnippet2 - 11(org.eclipse.jdt.core.tests.eval.NegativeCodeSnippetTest)  Time elapsed: 0.002 s
17:07:34 testMissingClosingRoundBracket - 11(org.eclipse.jdt.core.tests.eval.NegativeCodeSnippetTest)  Time elapsed: 0.002 s
17:07:34 testMissingDoubleQuote - 11(org.eclipse.jdt.core.tests.eval.NegativeCodeSnippetTest)  Time elapsed: 0.002 s
17:07:34 testNonLastExpressionStatement - 11(org.eclipse.jdt.core.tests.eval.NegativeCodeSnippetTest)  Time elapsed: 0.001 s
17:07:34 testProblemInExpression - 11(org.eclipse.jdt.core.tests.eval.NegativeCodeSnippetTest)  Time elapsed: 0.001 s
17:07:34 testProblemInExpression2 - 11(org.eclipse.jdt.core.tests.eval.NegativeCodeSnippetTest)  Time elapsed: 0.002 s
17:07:34 testProblemInInnerClass - 11(org.eclipse.jdt.core.tests.eval.NegativeCodeSnippetTest)  Time elapsed: 0.012 s
17:07:34 testProblemInPreviousStatement - 11(org.eclipse.jdt.core.tests.eval.NegativeCodeSnippetTest)  Time elapsed: 0.002 s
17:07:34 testProblemInReturnStatement - 11(org.eclipse.jdt.core.tests.eval.NegativeCodeSnippetTest)  Time elapsed: 0.002 s
17:07:34 testRemoveImport - 11(org.eclipse.jdt.core.tests.eval.NegativeCodeSnippetTest)  Time elapsed: 0.011 s
17:07:34 testRemoveVariable - 11(org.eclipse.jdt.core.tests.eval.NegativeCodeSnippetTest)  Time elapsed: 0.008 s
17:07:34 testUnreachableExpression - 11(org.eclipse.jdt.core.tests.eval.NegativeCodeSnippetTest)  Time elapsed: 0.002 s
17:07:34 testUnusedImport - 11(org.eclipse.jdt.core.tests.eval.NegativeCodeSnippetTest)  Time elapsed: 0.009 s
17:07:34 testWarning - 11(org.eclipse.jdt.core.tests.eval.NegativeCodeSnippetTest)  Time elapsed: 0.005 s
17:07:34 testInitializerProblem - 11(org.eclipse.jdt.core.tests.eval.NegativeVariableTest)  Time elapsed: 0.004 s
17:07:34 testUnknownType - 11(org.eclipse.jdt.core.tests.eval.NegativeVariableTest)  Time elapsed: 0.002 s
17:07:34 test001 - 11(org.eclipse.jdt.core.tests.eval.DebugEvaluationTest)  Time elapsed: 0.138 s
17:07:34 test002 - 11(org.eclipse.jdt.core.tests.eval.DebugEvaluationTest)  Time elapsed: 0.146 s
17:07:34 test003 - 11(org.eclipse.jdt.core.tests.eval.DebugEvaluationTest)  Time elapsed: 0.025 s
17:07:34 test004 - 11(org.eclipse.jdt.core.tests.eval.DebugEvaluationTest)  Time elapsed: 0.121 s
17:07:34 test005 - 11(org.eclipse.jdt.core.tests.eval.DebugEvaluationTest)  Time elapsed: 0.131 s
17:07:34 test006 - 11(org.eclipse.jdt.core.tests.eval.DebugEvaluationTest)  Time elapsed: 0.129 s
17:07:34 test007 - 11(org.eclipse.jdt.core.tests.eval.DebugEvaluationTest)  Time elapsed: 0.129 s
17:07:34 test008 - 11(org.eclipse.jdt.core.tests.eval.DebugEvaluationTest)  Time elapsed: 0.133 s
17:07:34 test009 - 11(org.eclipse.jdt.core.tests.eval.DebugEvaluationTest)  Time elapsed: 0.119 s
17:07:34 test010 - 11(org.eclipse.jdt.core.tests.eval.DebugEvaluationTest)  Time elapsed: 0.132 s
17:07:34 test011 - 11(org.eclipse.jdt.core.tests.eval.DebugEvaluationTest)  Time elapsed: 0.124 s
17:07:34 test016 - 11(org.eclipse.jdt.core.tests.eval.DebugEvaluationTest)  Time elapsed: 0.223 s
17:07:34 test017 - 11(org.eclipse.jdt.core.tests.eval.DebugEvaluationTest)  Time elapsed: 0.117 s
17:07:34 test018 - 11(org.eclipse.jdt.core.tests.eval.DebugEvaluationTest)  Time elapsed: 0.24 s
17:07:34 test019 - 11(org.eclipse.jdt.core.tests.eval.DebugEvaluationTest)  Time elapsed: 0.024 s
17:07:34 test020 - 11(org.eclipse.jdt.core.tests.eval.DebugEvaluationTest)  Time elapsed: 0.129 s
17:07:34 test021 - 11(org.eclipse.jdt.core.tests.eval.DebugEvaluationTest)  Time elapsed: 0.249 s
17:07:34 test022 - 11(org.eclipse.jdt.core.tests.eval.DebugEvaluationTest)  Time elapsed: 0.248 s
17:07:34 test023 - 11(org.eclipse.jdt.core.tests.eval.DebugEvaluationTest)  Time elapsed: 0.251 s
17:07:34 test024 - 11(org.eclipse.jdt.core.tests.eval.DebugEvaluationTest)  Time elapsed: 0.252 s
17:07:34 test025 - 11(org.eclipse.jdt.core.tests.eval.DebugEvaluationTest)  Time elapsed: 0.242 s
17:07:34 test026 - 11(org.eclipse.jdt.core.tests.eval.DebugEvaluationTest)  Time elapsed: 0.129 s
17:07:34 test027 - 11(org.eclipse.jdt.core.tests.eval.DebugEvaluationTest)  Time elapsed: 0.13 s
17:07:34 test028 - 11(org.eclipse.jdt.core.tests.eval.DebugEvaluationTest)  Time elapsed: 0.13 s
17:07:34 test029 - 11(org.eclipse.jdt.core.tests.eval.DebugEvaluationTest)  Time elapsed: 0.133 s
17:07:34 test030 - 11(org.eclipse.jdt.core.tests.eval.DebugEvaluationTest)  Time elapsed: 0.132 s
17:07:34 test031 - 11(org.eclipse.jdt.core.tests.eval.DebugEvaluationTest)  Time elapsed: 0.133 s
17:07:34 test032 - 11(org.eclipse.jdt.core.tests.eval.DebugEvaluationTest)  Time elapsed: 0.028 s
17:07:34 test033 - 11(org.eclipse.jdt.core.tests.eval.DebugEvaluationTest)  Time elapsed: 0.133 s
17:07:34 test034 - 11(org.eclipse.jdt.core.tests.eval.DebugEvaluationTest)  Time elapsed: 0.139 s
17:07:34 test035 - 11(org.eclipse.jdt.core.tests.eval.DebugEvaluationTest)  Time elapsed: 0.134 s
17:07:34 test036 - 11(org.eclipse.jdt.core.tests.eval.DebugEvaluationTest)  Time elapsed: 0.131 s
17:07:34 test037 - 11(org.eclipse.jdt.core.tests.eval.DebugEvaluationTest)  Time elapsed: 0.129 s
17:07:34 test038 - 11(org.eclipse.jdt.core.tests.eval.DebugEvaluationTest)  Time elapsed: 0.131 s
17:07:34 test039 - 11(org.eclipse.jdt.core.tests.eval.DebugEvaluationTest)  Time elapsed: 0.132 s
17:07:34 test040 - 11(org.eclipse.jdt.core.tests.eval.DebugEvaluationTest)  Time elapsed: 0.131 s
17:07:34 test041 - 11(org.eclipse.jdt.core.tests.eval.DebugEvaluationTest)  Time elapsed: 0.14 s
17:07:34 test042 - 11(org.eclipse.jdt.core.tests.eval.DebugEvaluationTest)  Time elapsed: 0.131 s
17:07:34 test043 - 11(org.eclipse.jdt.core.tests.eval.DebugEvaluationTest)  Time elapsed: 0.131 s
17:07:34 test044 - 11(org.eclipse.jdt.core.tests.eval.DebugEvaluationTest)  Time elapsed: 0.13 s
17:07:34 test045 - 11(org.eclipse.jdt.core.tests.eval.DebugEvaluationTest)  Time elapsed: 0.13 s
17:07:34 test046 - 11(org.eclipse.jdt.core.tests.eval.DebugEvaluationTest)  Time elapsed: 0.13 s
17:07:34 test047 - 11(org.eclipse.jdt.core.tests.eval.DebugEvaluationTest)  Time elapsed: 0.139 s
17:07:34 test048 - 11(org.eclipse.jdt.core.tests.eval.DebugEvaluationTest)  Time elapsed: 0.132 s
17:07:34 test049 - 11(org.eclipse.jdt.core.tests.eval.DebugEvaluationTest)  Time elapsed: 0.131 s
17:07:34 test050 - 11(org.eclipse.jdt.core.tests.eval.DebugEvaluationTest)  Time elapsed: 0.131 s
17:07:34 test051 - 11(org.eclipse.jdt.core.tests.eval.DebugEvaluationTest)  Time elapsed: 0.13 s
17:07:34 test052 - 11(org.eclipse.jdt.core.tests.eval.DebugEvaluationTest)  Time elapsed: 0.131 s
17:07:34 test053 - 11(org.eclipse.jdt.core.tests.eval.DebugEvaluationTest)  Time elapsed: 0.133 s
17:07:34 test054 - 11(org.eclipse.jdt.core.tests.eval.DebugEvaluationTest)  Time elapsed: 0.131 s
17:07:34 test055 - 11(org.eclipse.jdt.core.tests.eval.DebugEvaluationTest)  Time elapsed: 0.131 s
17:07:34 test056 - 11(org.eclipse.jdt.core.tests.eval.DebugEvaluationTest)  Time elapsed: 0.135 s
17:07:34 test057 - 11(org.eclipse.jdt.core.tests.eval.DebugEvaluationTest)  Time elapsed: 0.136 s
17:07:34 test058 - 11(org.eclipse.jdt.core.tests.eval.DebugEvaluationTest)  Time elapsed: 0.138 s
17:07:34 test059 - 11(org.eclipse.jdt.core.tests.eval.DebugEvaluationTest)  Time elapsed: 0.136 s
17:07:34 test060 - 11(org.eclipse.jdt.core.tests.eval.DebugEvaluationTest)  Time elapsed: 0.134 s
17:07:34 test061 - 11(org.eclipse.jdt.core.tests.eval.DebugEvaluationTest)  Time elapsed: 0.134 s
17:07:34 test062 - 11(org.eclipse.jdt.core.tests.eval.DebugEvaluationTest)  Time elapsed: 0.133 s
17:07:34 test063 - 11(org.eclipse.jdt.core.tests.eval.DebugEvaluationTest)  Time elapsed: 0.134 s
17:07:34 test065 - 11(org.eclipse.jdt.core.tests.eval.DebugEvaluationTest)  Time elapsed: 0.136 s
17:07:34 test066 - 11(org.eclipse.jdt.core.tests.eval.DebugEvaluationTest)  Time elapsed: 0.135 s
17:07:34 test067 - 11(org.eclipse.jdt.core.tests.eval.DebugEvaluationTest)  Time elapsed: 0.14 s
17:07:34 test068 - 11(org.eclipse.jdt.core.tests.eval.DebugEvaluationTest)  Time elapsed: 0.03 s
17:07:34 test069 - 11(org.eclipse.jdt.core.tests.eval.DebugEvaluationTest)  Time elapsed: 0.027 s
17:07:34 testNegative001 - 11(org.eclipse.jdt.core.tests.eval.DebugEvaluationTest)  Time elapsed: 0.025 s
17:07:34 testNegative002 - 11(org.eclipse.jdt.core.tests.eval.DebugEvaluationTest)  Time elapsed: 0.024 s
17:07:34 testNegative003 - 11(org.eclipse.jdt.core.tests.eval.DebugEvaluationTest)  Time elapsed: 0.024 s
17:07:34 testNegative004 - 11(org.eclipse.jdt.core.tests.eval.DebugEvaluationTest)  Time elapsed: 0.012 s
17:07:34 testNegative005 - 11(org.eclipse.jdt.core.tests.eval.DebugEvaluationTest)  Time elapsed: 0.011 s
17:07:34 
17:07:34 Results:
17:07:34 
17:07:34 Tests run: 40736, Failures: 0, Errors: 0, Skipped: 0
17:07:34 
17:07:36 [INFO] All tests passed!
17:07:36 [INFO] 
17:07:36 [INFO] --- tycho-p2-extras-plugin:1.5.0-SNAPSHOT:compare-version-with-baselines (compare-attached-artifacts-with-release) @ org.eclipse.jdt.core.tests.compiler ---
17:07:36 [INFO] Skipped
17:07:36 [INFO] 
17:07:36 [INFO] --- maven-antrun-plugin:1.8:run (check-skip-api-analysis) @ org.eclipse.jdt.core.tests.compiler ---
17:07:36 [INFO] Executing tasks
17:07:36 
17:07:36 main:
17:07:36 [INFO] Executed tasks
17:07:36 [INFO] 
17:07:36 [INFO] --- tycho-dependency-tools-plugin:1.5.0-SNAPSHOT:list-dependencies (list-dependencies) @ org.eclipse.jdt.core.tests.compiler ---
17:07:36 [INFO] 
17:07:36 [INFO] --- tycho-eclipserun-plugin:1.4.0:eclipse-run (api-analysis) @ org.eclipse.jdt.core.tests.compiler ---
17:07:36 [INFO] Fetching org.eclipse.jdt.core.tests.compiler_3.12.900.v20190604-0810.jar from https://download.eclipse.org/eclipse/updates/4.12/R-4.12-201906051800/plugins/ (2.87MB)
17:07:36 [INFO] Fetching org.eclipse.jdt.core.tests.compiler_3.12.900.v20190604-0810.jar from https://download.eclipse.org/eclipse/updates/4.12/R-4.12-201906051800/plugins/ (2.87MB)
17:07:37 [INFO] Fetching org.eclipse.test.performance_3.13.500.v20190518-1058.jar.pack.gz from https://download.eclipse.org/eclipse/updates/4.12/R-4.12-201906051800/plugins/ (57.03kB)
17:07:37 [INFO] Fetching org.eclipse.test.performance_3.13.500.v20190518-1058.jar.pack.gz from https://download.eclipse.org/eclipse/updates/4.12/R-4.12-201906051800/plugins/ (57.03kB)
17:07:37 [INFO] Toolchain in tycho-eclipserun-plugin: JDK[/opt/public/common/jdk1.8.0_x64-latest/jre]
17:07:37 [INFO] Expected eclipse log file: /jobs/genie.jdt/eclipse.jdt.core-Gerrit/workspace/org.eclipse.jdt.core.tests.compiler/target/eclipserun-work/data/.metadata/.log
17:07:37 [INFO] Command line:
17:07:37 	[/opt/public/common/jdk1.8.0_x64-latest/jre/bin/java, -Xmx2048M, -jar, /jobs/genie.jdt/eclipse.jdt.core-Gerrit/workspace/.repository/p2/osgi/bundle/org.eclipse.equinox.launcher/1.5.400.v20190515-0925/org.eclipse.equinox.launcher-1.5.400.v20190515-0925.jar, -install, /jobs/genie.jdt/eclipse.jdt.core-Gerrit/workspace/org.eclipse.jdt.core.tests.compiler/target/eclipserun-work, -configuration, /jobs/genie.jdt/eclipse.jdt.core-Gerrit/workspace/org.eclipse.jdt.core.tests.compiler/target/eclipserun-work/configuration, -data, /jobs/genie.jdt/eclipse.jdt.core-Gerrit/workspace/org.eclipse.jdt.core.tests.compiler/../target/org.eclipse.jdt.core.tests.compiler-apiAnalyzer-workspace, -application, org.eclipse.pde.api.tools.apiAnalyzer, -project, /jobs/genie.jdt/eclipse.jdt.core-Gerrit/workspace/org.eclipse.jdt.core.tests.compiler, -baseline, default, -dependencyList, /jobs/genie.jdt/eclipse.jdt.core-Gerrit/workspace/org.eclipse.jdt.core.tests.compiler/target/dependencies-list.txt, -failOnError]
17:07:37 Picked up JAVA_TOOL_OPTIONS: -Xmx2G -Djava.io.tmpdir=/tmp/genie.jdt -DforkCount=1
17:07:48 0 API ERRORS
17:07:48 0 API warnings
17:07:50 [INFO] 
17:07:50 [INFO] --------< org.eclipse.jdt:org.eclipse.jdt.compiler.tool.tests >---------
17:07:50 [INFO] Building org.eclipse.jdt.compiler.tool.tests 1.2.500-SNAPSHOT     [8/17]
17:07:50 [INFO] ------------------------[ eclipse-test-plugin ]-------------------------
17:07:50 [INFO] 
17:07:50 [INFO] --- maven-clean-plugin:3.1.0:clean (default-clean) @ org.eclipse.jdt.compiler.tool.tests ---
17:07:50 [INFO] 
17:07:50 [INFO] --- tycho-packaging-plugin:1.5.0-SNAPSHOT:build-qualifier (default-build-qualifier) @ org.eclipse.jdt.compiler.tool.tests ---
17:07:50 [INFO] The project's OSGi version is 1.2.500.v20190113-0810
17:07:50 [INFO] 
17:07:50 [INFO] --- tycho-packaging-plugin:1.5.0-SNAPSHOT:validate-id (default-validate-id) @ org.eclipse.jdt.compiler.tool.tests ---
17:07:50 [INFO] 
17:07:50 [INFO] --- tycho-packaging-plugin:1.5.0-SNAPSHOT:validate-version (default-validate-version) @ org.eclipse.jdt.compiler.tool.tests ---
17:07:50 [INFO] 
17:07:50 [INFO] --- maven-resources-plugin:3.1.0:copy-resources (saveproperties) @ org.eclipse.jdt.compiler.tool.tests ---
17:07:50 [INFO] Using 'UTF-8' encoding to copy filtered resources.
17:07:50 [INFO] skip non existing resourceDirectory /jobs/genie.jdt/eclipse.jdt.core-Gerrit/workspace/org.eclipse.jdt.compiler.tool.tests/saveproperties
17:07:50 [INFO] 
17:07:50 [INFO] --- maven-enforcer-plugin:3.0.0-M2:enforce (enforce-maven) @ org.eclipse.jdt.compiler.tool.tests ---
17:07:50 [INFO] 
17:07:50 [INFO] --- eclipse-cbi-plugin:1.1.7:generate-api-build-xml (default) @ org.eclipse.jdt.compiler.tool.tests ---
17:07:50 [INFO] 
17:07:50 [INFO] --- maven-resources-plugin:3.1.0:resources (default-resources) @ org.eclipse.jdt.compiler.tool.tests ---
17:07:50 [INFO] Using 'UTF-8' encoding to copy filtered resources.
17:07:50 [INFO] skip non existing resourceDirectory /jobs/genie.jdt/eclipse.jdt.core-Gerrit/workspace/org.eclipse.jdt.compiler.tool.tests/src/main/resources
17:07:50 [INFO] 
17:07:50 [INFO] --- maven-resources-plugin:3.1.0:resources (filter-resources) @ org.eclipse.jdt.compiler.tool.tests ---
17:07:50 [INFO] Using 'UTF-8' encoding to copy filtered resources.
17:07:50 [INFO] skip non existing resourceDirectory /jobs/genie.jdt/eclipse.jdt.core-Gerrit/workspace/org.eclipse.jdt.compiler.tool.tests/src/main/resources
17:07:50 [INFO] 
17:07:50 [INFO] --- tycho-compiler-plugin:1.5.0-SNAPSHOT:compile (default-compile) @ org.eclipse.jdt.compiler.tool.tests ---
17:07:50 [INFO] Compiling 6 source files to /jobs/genie.jdt/eclipse.jdt.core-Gerrit/workspace/org.eclipse.jdt.compiler.tool.tests/target/classes
17:07:51 [WARNING] /jobs/genie.jdt/eclipse.jdt.core-Gerrit/workspace/org.eclipse.jdt.compiler.tool.tests/src/org/eclipse/jdt/compiler/tool/tests/CompilerInvocationTests.java:[43] 
17:07:51 	import org.eclipse.jdt.internal.compiler.batch.Main;
17:07:51 	       ^^^^^^^^^^^^^^^^^^^^^^^^^^^^^^^^^^^^^^^^^^^^
17:07:51 Discouraged access: The type 'Main' is not API (restriction on classpath entry '/jobs/genie.jdt/eclipse.jdt.core-Gerrit/workspace/org.eclipse.jdt.core/target/classes')
17:07:51 [WARNING] /jobs/genie.jdt/eclipse.jdt.core-Gerrit/workspace/org.eclipse.jdt.compiler.tool.tests/src/org/eclipse/jdt/compiler/tool/tests/CompilerInvocationTests.java:[44] 
17:07:51 	import org.eclipse.jdt.internal.compiler.classfmt.ClassFileConstants;
17:07:51 	       ^^^^^^^^^^^^^^^^^^^^^^^^^^^^^^^^^^^^^^^^^^^^^^^^^^^^^^^^^^^^^
17:07:51 Discouraged access: The type 'ClassFileConstants' is not API (restriction on classpath entry '/jobs/genie.jdt/eclipse.jdt.core-Gerrit/workspace/org.eclipse.jdt.core/target/classes')
17:07:51 [WARNING] /jobs/genie.jdt/eclipse.jdt.core-Gerrit/workspace/org.eclipse.jdt.compiler.tool.tests/src/org/eclipse/jdt/compiler/tool/tests/CompilerInvocationTests.java:[45] 
17:07:51 	import org.eclipse.jdt.internal.compiler.classfmt.ClassFileReader;
17:07:51 	       ^^^^^^^^^^^^^^^^^^^^^^^^^^^^^^^^^^^^^^^^^^^^^^^^^^^^^^^^^^
17:07:51 Discouraged access: The type 'ClassFileReader' is not API (restriction on classpath entry '/jobs/genie.jdt/eclipse.jdt.core-Gerrit/workspace/org.eclipse.jdt.core/target/classes')
17:07:51 [WARNING] /jobs/genie.jdt/eclipse.jdt.core-Gerrit/workspace/org.eclipse.jdt.compiler.tool.tests/src/org/eclipse/jdt/compiler/tool/tests/CompilerInvocationTests.java:[46] 
17:07:51 	import org.eclipse.jdt.internal.compiler.classfmt.ClassFormatException;
17:07:51 	       ^^^^^^^^^^^^^^^^^^^^^^^^^^^^^^^^^^^^^^^^^^^^^^^^^^^^^^^^^^^^^^^
17:07:51 Discouraged access: The type 'ClassFormatException' is not API (restriction on classpath entry '/jobs/genie.jdt/eclipse.jdt.core-Gerrit/workspace/org.eclipse.jdt.core/target/classes')
17:07:51 [WARNING] /jobs/genie.jdt/eclipse.jdt.core-Gerrit/workspace/org.eclipse.jdt.compiler.tool.tests/src/org/eclipse/jdt/compiler/tool/tests/CompilerInvocationTests.java:[60] 
17:07:51 	return buildUniqueComplianceTestSuite(CompilerInvocationTests.class, ClassFileConstants.JDK1_6);
17:07:51 	                                                                     ^^^^^^^^^^^^^^^^^^^^^^^^^
17:07:51 Discouraged access: The type 'ClassFileConstants' is not API (restriction on classpath entry '/jobs/genie.jdt/eclipse.jdt.core-Gerrit/workspace/org.eclipse.jdt.core/target/classes')
17:07:51 [WARNING] /jobs/genie.jdt/eclipse.jdt.core-Gerrit/workspace/org.eclipse.jdt.compiler.tool.tests/src/org/eclipse/jdt/compiler/tool/tests/CompilerInvocationTests.java:[60] 
17:07:51 	return buildUniqueComplianceTestSuite(CompilerInvocationTests.class, ClassFileConstants.JDK1_6);
17:07:51 	                                                                                        ^^^^^^
17:07:51 Discouraged access: The field 'ClassFileConstants.JDK1_6' is not API (restriction on classpath entry '/jobs/genie.jdt/eclipse.jdt.core-Gerrit/workspace/org.eclipse.jdt.core/target/classes')
17:07:51 [WARNING] /jobs/genie.jdt/eclipse.jdt.core-Gerrit/workspace/org.eclipse.jdt.compiler.tool.tests/src/org/eclipse/jdt/compiler/tool/tests/CompilerInvocationTests.java:[75] 
17:07:51 	ClassFileReader reader = null;
17:07:51 	^^^^^^^^^^^^^^^
17:07:51 Discouraged access: The type 'ClassFileReader' is not API (restriction on classpath entry '/jobs/genie.jdt/eclipse.jdt.core-Gerrit/workspace/org.eclipse.jdt.core/target/classes')
17:07:51 [WARNING] /jobs/genie.jdt/eclipse.jdt.core-Gerrit/workspace/org.eclipse.jdt.compiler.tool.tests/src/org/eclipse/jdt/compiler/tool/tests/CompilerInvocationTests.java:[77] 
17:07:51 	reader = ClassFileReader.read(new File(OUTPUT_DIR, fileNames[i]), true);
17:07:51 	         ^^^^^^^^^^^^^^^
17:07:51 Discouraged access: The type 'ClassFileReader' is not API (restriction on classpath entry '/jobs/genie.jdt/eclipse.jdt.core-Gerrit/workspace/org.eclipse.jdt.core/target/classes')
17:07:51 [WARNING] /jobs/genie.jdt/eclipse.jdt.core-Gerrit/workspace/org.eclipse.jdt.compiler.tool.tests/src/org/eclipse/jdt/compiler/tool/tests/CompilerInvocationTests.java:[77] 
17:07:51 	reader = ClassFileReader.read(new File(OUTPUT_DIR, fileNames[i]), true);
17:07:51 	                         ^^^^
17:07:51 Discouraged access: The method 'ClassFileReader.read(File, boolean)' is not API (restriction on classpath entry '/jobs/genie.jdt/eclipse.jdt.core-Gerrit/workspace/org.eclipse.jdt.core/target/classes')
17:07:51 [WARNING] /jobs/genie.jdt/eclipse.jdt.core-Gerrit/workspace/org.eclipse.jdt.compiler.tool.tests/src/org/eclipse/jdt/compiler/tool/tests/CompilerInvocationTests.java:[78] 
17:07:51 	} catch (ClassFormatException e) {
17:07:51 	         ^^^^^^^^^^^^^^^^^^^^
17:07:51 Discouraged access: The type 'ClassFormatException' is not API (restriction on classpath entry '/jobs/genie.jdt/eclipse.jdt.core-Gerrit/workspace/org.eclipse.jdt.core/target/classes')
17:07:51 [WARNING] /jobs/genie.jdt/eclipse.jdt.core-Gerrit/workspace/org.eclipse.jdt.compiler.tool.tests/src/org/eclipse/jdt/compiler/tool/tests/CompilerInvocationTests.java:[84] 
17:07:51 	assertEquals("Wrong Java version for " + fileNames[i], ClassFileConstants.JDK1_6, reader.getVersion());
17:07:51 	                                                       ^^^^^^^^^^^^^^^^^^^^^^^^^
17:07:51 Discouraged access: The type 'ClassFileConstants' is not API (restriction on classpath entry '/jobs/genie.jdt/eclipse.jdt.core-Gerrit/workspace/org.eclipse.jdt.core/target/classes')
17:07:51 [WARNING] /jobs/genie.jdt/eclipse.jdt.core-Gerrit/workspace/org.eclipse.jdt.compiler.tool.tests/src/org/eclipse/jdt/compiler/tool/tests/CompilerInvocationTests.java:[84] 
17:07:51 	assertEquals("Wrong Java version for " + fileNames[i], ClassFileConstants.JDK1_6, reader.getVersion());
17:07:51 	                                                                          ^^^^^^
17:07:51 Discouraged access: The field 'ClassFileConstants.JDK1_6' is not API (restriction on classpath entry '/jobs/genie.jdt/eclipse.jdt.core-Gerrit/workspace/org.eclipse.jdt.core/target/classes')
17:07:51 [WARNING] /jobs/genie.jdt/eclipse.jdt.core-Gerrit/workspace/org.eclipse.jdt.compiler.tool.tests/src/org/eclipse/jdt/compiler/tool/tests/CompilerInvocationTests.java:[84] 
17:07:51 	assertEquals("Wrong Java version for " + fileNames[i], ClassFileConstants.JDK1_6, reader.getVersion());
17:07:51 	                                                                                         ^^^^^^^^^^
17:07:51 Discouraged access: The method 'ClassFileReader.getVersion()' is not API (restriction on classpath entry '/jobs/genie.jdt/eclipse.jdt.core-Gerrit/workspace/org.eclipse.jdt.core/target/classes')
17:07:51 [WARNING] /jobs/genie.jdt/eclipse.jdt.core-Gerrit/workspace/org.eclipse.jdt.compiler.tool.tests/src/org/eclipse/jdt/compiler/tool/tests/CompilerInvocationTests.java:[520] 
17:07:51 	COMPILER.getStandardFileManager(null /* diagnosticListener */, null /* locale */, null /* charset */);
17:07:51 	         ^^^^^^^^^^^^^^^^^^^^^^
17:07:51 Discouraged access: The method 'EclipseCompiler.getStandardFileManager(DiagnosticListener<? super JavaFileObject>, Locale, Charset)' is not API (restriction on classpath entry '/jobs/genie.jdt/eclipse.jdt.core-Gerrit/workspace/org.eclipse.jdt.compiler.tool/target/classes')
17:07:51 [WARNING] /jobs/genie.jdt/eclipse.jdt.core-Gerrit/workspace/org.eclipse.jdt.compiler.tool.tests/src/org/eclipse/jdt/compiler/tool/tests/CompilerInvocationTests.java:[540] 
17:07:51 	COMPILER.getStandardFileManager(null /* diagnosticListener */, null /* locale */, null /* charset */);
17:07:51 	         ^^^^^^^^^^^^^^^^^^^^^^
17:07:51 Discouraged access: The method 'EclipseCompiler.getStandardFileManager(DiagnosticListener<? super JavaFileObject>, Locale, Charset)' is not API (restriction on classpath entry '/jobs/genie.jdt/eclipse.jdt.core-Gerrit/workspace/org.eclipse.jdt.compiler.tool/target/classes')
17:07:51 [WARNING] /jobs/genie.jdt/eclipse.jdt.core-Gerrit/workspace/org.eclipse.jdt.compiler.tool.tests/src/org/eclipse/jdt/compiler/tool/tests/CompilerInvocationTests.java:[563] 
17:07:51 	COMPILER.getStandardFileManager(null /* diagnosticListener */, null /* locale */, null /* charset */);
17:07:51 	         ^^^^^^^^^^^^^^^^^^^^^^
17:07:51 Discouraged access: The method 'EclipseCompiler.getStandardFileManager(DiagnosticListener<? super JavaFileObject>, Locale, Charset)' is not API (restriction on classpath entry '/jobs/genie.jdt/eclipse.jdt.core-Gerrit/workspace/org.eclipse.jdt.compiler.tool/target/classes')
17:07:51 [WARNING] /jobs/genie.jdt/eclipse.jdt.core-Gerrit/workspace/org.eclipse.jdt.compiler.tool.tests/src/org/eclipse/jdt/compiler/tool/tests/CompilerInvocationTests.java:[584] 
17:07:51 	passed = COMPILER.getStandardFileManager(null /* diagnosticListener */, null /* locale */, null /* charset */).
17:07:51 	                  ^^^^^^^^^^^^^^^^^^^^^^
17:07:51 Discouraged access: The method 'EclipseCompiler.getStandardFileManager(DiagnosticListener<? super JavaFileObject>, Locale, Charset)' is not API (restriction on classpath entry '/jobs/genie.jdt/eclipse.jdt.core-Gerrit/workspace/org.eclipse.jdt.compiler.tool/target/classes')
17:07:51 [WARNING] /jobs/genie.jdt/eclipse.jdt.core-Gerrit/workspace/org.eclipse.jdt.compiler.tool.tests/src/org/eclipse/jdt/compiler/tool/tests/CompilerInvocationTests.java:[689] 
17:07:51 	COMPILER.getStandardFileManager(null /* diagnosticListener */, null /* locale */, null /* charset */),
17:07:51 	         ^^^^^^^^^^^^^^^^^^^^^^
17:07:51 Discouraged access: The method 'EclipseCompiler.getStandardFileManager(DiagnosticListener<? super JavaFileObject>, Locale, Charset)' is not API (restriction on classpath entry '/jobs/genie.jdt/eclipse.jdt.core-Gerrit/workspace/org.eclipse.jdt.compiler.tool/target/classes')
17:07:51 [WARNING] /jobs/genie.jdt/eclipse.jdt.core-Gerrit/workspace/org.eclipse.jdt.compiler.tool.tests/src/org/eclipse/jdt/compiler/tool/tests/CompilerInvocationTests.java:[731] 
17:07:51 	COMPILER.getStandardFileManager(null /* diagnosticListener */, null /* locale */, null /* charset */),
17:07:51 	         ^^^^^^^^^^^^^^^^^^^^^^
17:07:51 Discouraged access: The method 'EclipseCompiler.getStandardFileManager(DiagnosticListener<? super JavaFileObject>, Locale, Charset)' is not API (restriction on classpath entry '/jobs/genie.jdt/eclipse.jdt.core-Gerrit/workspace/org.eclipse.jdt.compiler.tool/target/classes')
17:07:51 [WARNING] /jobs/genie.jdt/eclipse.jdt.core-Gerrit/workspace/org.eclipse.jdt.compiler.tool.tests/src/org/eclipse/jdt/compiler/tool/tests/CompilerInvocationTests.java:[790] 
17:07:51 	COMPILER.getStandardFileManager(null /* diagnosticListener */, null /* locale */, null /* charset */),
17:07:51 	         ^^^^^^^^^^^^^^^^^^^^^^
17:07:51 Discouraged access: The method 'EclipseCompiler.getStandardFileManager(DiagnosticListener<? super JavaFileObject>, Locale, Charset)' is not API (restriction on classpath entry '/jobs/genie.jdt/eclipse.jdt.core-Gerrit/workspace/org.eclipse.jdt.compiler.tool/target/classes')
17:07:51 [WARNING] /jobs/genie.jdt/eclipse.jdt.core-Gerrit/workspace/org.eclipse.jdt.compiler.tool.tests/src/org/eclipse/jdt/compiler/tool/tests/CompilerInvocationTests.java:[827] 
17:07:51 	COMPILER.getStandardFileManager(null /* diagnosticListener */, null /* locale */, null /* charset */),
17:07:51 	         ^^^^^^^^^^^^^^^^^^^^^^
17:07:51 Discouraged access: The method 'EclipseCompiler.getStandardFileManager(DiagnosticListener<? super JavaFileObject>, Locale, Charset)' is not API (restriction on classpath entry '/jobs/genie.jdt/eclipse.jdt.core-Gerrit/workspace/org.eclipse.jdt.compiler.tool/target/classes')
17:07:51 [WARNING] /jobs/genie.jdt/eclipse.jdt.core-Gerrit/workspace/org.eclipse.jdt.compiler.tool.tests/src/org/eclipse/jdt/compiler/tool/tests/CompilerInvocationTests.java:[930] 
17:07:51 	COMPILER.getStandardFileManager(null /* diagnosticListener */, null /* locale */, null /* charset */);
17:07:51 	         ^^^^^^^^^^^^^^^^^^^^^^
17:07:51 Discouraged access: The method 'EclipseCompiler.getStandardFileManager(DiagnosticListener<? super JavaFileObject>, Locale, Charset)' is not API (restriction on classpath entry '/jobs/genie.jdt/eclipse.jdt.core-Gerrit/workspace/org.eclipse.jdt.compiler.tool/target/classes')
17:07:51 [WARNING] /jobs/genie.jdt/eclipse.jdt.core-Gerrit/workspace/org.eclipse.jdt.compiler.tool.tests/src/org/eclipse/jdt/compiler/tool/tests/CompilerInvocationTests.java:[960] 
17:07:51 	COMPILER.getStandardFileManager(null /* diagnosticListener */, null /* locale */, null /* charset */);
17:07:51 	         ^^^^^^^^^^^^^^^^^^^^^^
17:07:51 Discouraged access: The method 'EclipseCompiler.getStandardFileManager(DiagnosticListener<? super JavaFileObject>, Locale, Charset)' is not API (restriction on classpath entry '/jobs/genie.jdt/eclipse.jdt.core-Gerrit/workspace/org.eclipse.jdt.compiler.tool/target/classes')
17:07:51 [WARNING] /jobs/genie.jdt/eclipse.jdt.core-Gerrit/workspace/org.eclipse.jdt.compiler.tool.tests/src/org/eclipse/jdt/compiler/tool/tests/CompilerInvocationTests.java:[992] 
17:07:51 	CompilationTask task = COMPILER.getTask(
17:07:51 	                                ^^^^^^^
17:07:51 Discouraged access: The method 'EclipseCompiler.getTask(Writer, JavaFileManager, DiagnosticListener<? super JavaFileObject>, Iterable<String>, Iterable<String>, Iterable<? extends JavaFileObject>)' is not API (restriction on classpath entry '/jobs/genie.jdt/eclipse.jdt.core-Gerrit/workspace/org.eclipse.jdt.compiler.tool/target/classes')
17:07:51 [WARNING] /jobs/genie.jdt/eclipse.jdt.core-Gerrit/workspace/org.eclipse.jdt.compiler.tool.tests/src/org/eclipse/jdt/compiler/tool/tests/CompilerInvocationTests.java:[994] 
17:07:51 	COMPILER.getStandardFileManager(null /* diagnosticListener */, null /* locale */, null /* charset */), 
17:07:51 	         ^^^^^^^^^^^^^^^^^^^^^^
17:07:51 Discouraged access: The method 'EclipseCompiler.getStandardFileManager(DiagnosticListener<? super JavaFileObject>, Locale, Charset)' is not API (restriction on classpath entry '/jobs/genie.jdt/eclipse.jdt.core-Gerrit/workspace/org.eclipse.jdt.compiler.tool/target/classes')
17:07:51 [WARNING] /jobs/genie.jdt/eclipse.jdt.core-Gerrit/workspace/org.eclipse.jdt.compiler.tool.tests/src/org/eclipse/jdt/compiler/tool/tests/CompilerInvocationTests.java:[1001] 
17:07:51 	resourceAsStream = Main.class.getResourceAsStream("messages.properties");
17:07:51 	                   ^^^^
17:07:51 Discouraged access: The type 'Main' is not API (restriction on classpath entry '/jobs/genie.jdt/eclipse.jdt.core-Gerrit/workspace/org.eclipse.jdt.core/target/classes')
17:07:51 [WARNING] /jobs/genie.jdt/eclipse.jdt.core-Gerrit/workspace/org.eclipse.jdt.compiler.tool.tests/src/org/eclipse/jdt/compiler/tool/tests/CompilerInvocationTests.java:[1021] 
17:07:51 	CompilationTask task = COMPILER.getTask(
17:07:51 	                                ^^^^^^^
17:07:51 Discouraged access: The method 'EclipseCompiler.getTask(Writer, JavaFileManager, DiagnosticListener<? super JavaFileObject>, Iterable<String>, Iterable<String>, Iterable<? extends JavaFileObject>)' is not API (restriction on classpath entry '/jobs/genie.jdt/eclipse.jdt.core-Gerrit/workspace/org.eclipse.jdt.compiler.tool/target/classes')
17:07:51 [WARNING] /jobs/genie.jdt/eclipse.jdt.core-Gerrit/workspace/org.eclipse.jdt.compiler.tool.tests/src/org/eclipse/jdt/compiler/tool/tests/CompilerInvocationTests.java:[1023] 
17:07:51 	COMPILER.getStandardFileManager(null /* diagnosticListener */, null /* locale */, null /* charset */), 
17:07:51 	         ^^^^^^^^^^^^^^^^^^^^^^
17:07:51 Discouraged access: The method 'EclipseCompiler.getStandardFileManager(DiagnosticListener<? super JavaFileObject>, Locale, Charset)' is not API (restriction on classpath entry '/jobs/genie.jdt/eclipse.jdt.core-Gerrit/workspace/org.eclipse.jdt.compiler.tool/target/classes')
17:07:51 [WARNING] /jobs/genie.jdt/eclipse.jdt.core-Gerrit/workspace/org.eclipse.jdt.compiler.tool.tests/src/org/eclipse/jdt/compiler/tool/tests/CompilerToolJava9Tests.java:[53] 
17:07:51 	import org.eclipse.jdt.internal.compiler.classfmt.ClassFileConstants;
17:07:51 	       ^^^^^^^^^^^^^^^^^^^^^^^^^^^^^^^^^^^^^^^^^^^^^^^^^^^^^^^^^^^^^
17:07:51 Discouraged access: The type 'ClassFileConstants' is not API (restriction on classpath entry '/jobs/genie.jdt/eclipse.jdt.core-Gerrit/workspace/org.eclipse.jdt.core/target/classes')
17:07:51 [WARNING] /jobs/genie.jdt/eclipse.jdt.core-Gerrit/workspace/org.eclipse.jdt.compiler.tool.tests/src/org/eclipse/jdt/compiler/tool/tests/CompilerToolJava9Tests.java:[54] 
17:07:51 	import org.eclipse.jdt.internal.compiler.classfmt.ClassFileReader;
17:07:51 	       ^^^^^^^^^^^^^^^^^^^^^^^^^^^^^^^^^^^^^^^^^^^^^^^^^^^^^^^^^^
17:07:51 Discouraged access: The type 'ClassFileReader' is not API (restriction on classpath entry '/jobs/genie.jdt/eclipse.jdt.core-Gerrit/workspace/org.eclipse.jdt.core/target/classes')
17:07:51 [WARNING] /jobs/genie.jdt/eclipse.jdt.core-Gerrit/workspace/org.eclipse.jdt.compiler.tool.tests/src/org/eclipse/jdt/compiler/tool/tests/CompilerToolJava9Tests.java:[55] 
17:07:51 	import org.eclipse.jdt.internal.compiler.classfmt.ClassFormatException;
17:07:51 	       ^^^^^^^^^^^^^^^^^^^^^^^^^^^^^^^^^^^^^^^^^^^^^^^^^^^^^^^^^^^^^^^
17:07:51 Discouraged access: The type 'ClassFormatException' is not API (restriction on classpath entry '/jobs/genie.jdt/eclipse.jdt.core-Gerrit/workspace/org.eclipse.jdt.core/target/classes')
17:07:51 [WARNING] /jobs/genie.jdt/eclipse.jdt.core-Gerrit/workspace/org.eclipse.jdt.compiler.tool.tests/src/org/eclipse/jdt/compiler/tool/tests/CompilerToolJava9Tests.java:[56] 
17:07:51 	import org.eclipse.jdt.internal.compiler.tool.EclipseCompiler;
17:07:51 	       ^^^^^^^^^^^^^^^^^^^^^^^^^^^^^^^^^^^^^^^^^^^^^^^^^^^^^^
17:07:51 Discouraged access: The type 'EclipseCompiler' is not API (restriction on classpath entry '/jobs/genie.jdt/eclipse.jdt.core-Gerrit/workspace/org.eclipse.jdt.compiler.tool/target/classes')
17:07:51 [WARNING] /jobs/genie.jdt/eclipse.jdt.core-Gerrit/workspace/org.eclipse.jdt.compiler.tool.tests/src/org/eclipse/jdt/compiler/tool/tests/CompilerToolJava9Tests.java:[88] 
17:07:51 	ServiceLoader<JavaCompiler> javaCompilerLoader = ServiceLoader.load(JavaCompiler.class, EclipseCompiler.class.getClassLoader());
17:07:51 	                                                                                        ^^^^^^^^^^^^^^^
17:07:51 Discouraged access: The type 'EclipseCompiler' is not API (restriction on classpath entry '/jobs/genie.jdt/eclipse.jdt.core-Gerrit/workspace/org.eclipse.jdt.compiler.tool/target/classes')
17:07:51 [WARNING] /jobs/genie.jdt/eclipse.jdt.core-Gerrit/workspace/org.eclipse.jdt.compiler.tool.tests/src/org/eclipse/jdt/compiler/tool/tests/CompilerToolJava9Tests.java:[90] 
17:07:51 	if (compiler instanceof EclipseCompiler) {
17:07:51 	                        ^^^^^^^^^^^^^^^
17:07:51 Discouraged access: The type 'EclipseCompiler' is not API (restriction on classpath entry '/jobs/genie.jdt/eclipse.jdt.core-Gerrit/workspace/org.eclipse.jdt.compiler.tool/target/classes')
17:07:51 [WARNING] /jobs/genie.jdt/eclipse.jdt.core-Gerrit/workspace/org.eclipse.jdt.compiler.tool.tests/src/org/eclipse/jdt/compiler/tool/tests/CompilerToolJava9Tests.java:[163] 
17:07:51 	if (!(compiler instanceof EclipseCompiler) &&
17:07:51 	                          ^^^^^^^^^^^^^^^
17:07:51 Discouraged access: The type 'EclipseCompiler' is not API (restriction on classpath entry '/jobs/genie.jdt/eclipse.jdt.core-Gerrit/workspace/org.eclipse.jdt.compiler.tool/target/classes')
17:07:51 [WARNING] /jobs/genie.jdt/eclipse.jdt.core-Gerrit/workspace/org.eclipse.jdt.compiler.tool.tests/src/org/eclipse/jdt/compiler/tool/tests/CompilerToolJava9Tests.java:[182] 
17:07:51 	if (!(compiler instanceof EclipseCompiler))
17:07:51 	                          ^^^^^^^^^^^^^^^
17:07:51 Discouraged access: The type 'EclipseCompiler' is not API (restriction on classpath entry '/jobs/genie.jdt/eclipse.jdt.core-Gerrit/workspace/org.eclipse.jdt.compiler.tool/target/classes')
17:07:51 [WARNING] /jobs/genie.jdt/eclipse.jdt.core-Gerrit/workspace/org.eclipse.jdt.compiler.tool.tests/src/org/eclipse/jdt/compiler/tool/tests/CompilerToolJava9Tests.java:[203] 
17:07:51 	if (!(compiler instanceof EclipseCompiler))
17:07:51 	                          ^^^^^^^^^^^^^^^
17:07:51 Discouraged access: The type 'EclipseCompiler' is not API (restriction on classpath entry '/jobs/genie.jdt/eclipse.jdt.core-Gerrit/workspace/org.eclipse.jdt.compiler.tool/target/classes')
17:07:51 [WARNING] /jobs/genie.jdt/eclipse.jdt.core-Gerrit/workspace/org.eclipse.jdt.compiler.tool.tests/src/org/eclipse/jdt/compiler/tool/tests/CompilerToolJava9Tests.java:[295] 
17:07:51 	ClassFileReader reader = null;
17:07:51 	^^^^^^^^^^^^^^^
17:07:51 Discouraged access: The type 'ClassFileReader' is not API (restriction on classpath entry '/jobs/genie.jdt/eclipse.jdt.core-Gerrit/workspace/org.eclipse.jdt.core/target/classes')
17:07:51 [WARNING] /jobs/genie.jdt/eclipse.jdt.core-Gerrit/workspace/org.eclipse.jdt.compiler.tool.tests/src/org/eclipse/jdt/compiler/tool/tests/CompilerToolJava9Tests.java:[297] 
17:07:51 	reader = ClassFileReader.read(new File(tmpFolder, "p/X.class"), true);
17:07:51 	         ^^^^^^^^^^^^^^^
17:07:51 Discouraged access: The type 'ClassFileReader' is not API (restriction on classpath entry '/jobs/genie.jdt/eclipse.jdt.core-Gerrit/workspace/org.eclipse.jdt.core/target/classes')
17:07:51 [WARNING] /jobs/genie.jdt/eclipse.jdt.core-Gerrit/workspace/org.eclipse.jdt.compiler.tool.tests/src/org/eclipse/jdt/compiler/tool/tests/CompilerToolJava9Tests.java:[297] 
17:07:51 	reader = ClassFileReader.read(new File(tmpFolder, "p/X.class"), true);
17:07:51 	                         ^^^^
17:07:51 Discouraged access: The method 'ClassFileReader.read(File, boolean)' is not API (restriction on classpath entry '/jobs/genie.jdt/eclipse.jdt.core-Gerrit/workspace/org.eclipse.jdt.core/target/classes')
17:07:51 [WARNING] /jobs/genie.jdt/eclipse.jdt.core-Gerrit/workspace/org.eclipse.jdt.compiler.tool.tests/src/org/eclipse/jdt/compiler/tool/tests/CompilerToolJava9Tests.java:[298] 
17:07:51 	} catch (ClassFormatException e) {
17:07:51 	         ^^^^^^^^^^^^^^^^^^^^
17:07:51 Discouraged access: The type 'ClassFormatException' is not API (restriction on classpath entry '/jobs/genie.jdt/eclipse.jdt.core-Gerrit/workspace/org.eclipse.jdt.core/target/classes')
17:07:51 [WARNING] /jobs/genie.jdt/eclipse.jdt.core-Gerrit/workspace/org.eclipse.jdt.compiler.tool.tests/src/org/eclipse/jdt/compiler/tool/tests/CompilerToolJava9Tests.java:[305] 
17:07:51 	assertEquals("Wrong value", ClassFileConstants.JDK1_8, reader.getVersion());
17:07:51 	                            ^^^^^^^^^^^^^^^^^^^^^^^^^
17:07:51 Discouraged access: The type 'ClassFileConstants' is not API (restriction on classpath entry '/jobs/genie.jdt/eclipse.jdt.core-Gerrit/workspace/org.eclipse.jdt.core/target/classes')
17:07:51 [WARNING] /jobs/genie.jdt/eclipse.jdt.core-Gerrit/workspace/org.eclipse.jdt.compiler.tool.tests/src/org/eclipse/jdt/compiler/tool/tests/CompilerToolJava9Tests.java:[305] 
17:07:51 	assertEquals("Wrong value", ClassFileConstants.JDK1_8, reader.getVersion());
17:07:51 	                                               ^^^^^^
17:07:51 Discouraged access: The field 'ClassFileConstants.JDK1_8' is not API (restriction on classpath entry '/jobs/genie.jdt/eclipse.jdt.core-Gerrit/workspace/org.eclipse.jdt.core/target/classes')
17:07:51 [WARNING] /jobs/genie.jdt/eclipse.jdt.core-Gerrit/workspace/org.eclipse.jdt.compiler.tool.tests/src/org/eclipse/jdt/compiler/tool/tests/CompilerToolJava9Tests.java:[305] 
17:07:51 	assertEquals("Wrong value", ClassFileConstants.JDK1_8, reader.getVersion());
17:07:51 	                                                              ^^^^^^^^^^
17:07:51 Discouraged access: The method 'ClassFileReader.getVersion()' is not API (restriction on classpath entry '/jobs/genie.jdt/eclipse.jdt.core-Gerrit/workspace/org.eclipse.jdt.core/target/classes')
17:07:51 [WARNING] /jobs/genie.jdt/eclipse.jdt.core-Gerrit/workspace/org.eclipse.jdt.compiler.tool.tests/src/org/eclipse/jdt/compiler/tool/tests/CompilerToolJava9Tests.java:[386] 
17:07:51 	ClassFileReader reader = null;
17:07:51 	^^^^^^^^^^^^^^^
17:07:51 Discouraged access: The type 'ClassFileReader' is not API (restriction on classpath entry '/jobs/genie.jdt/eclipse.jdt.core-Gerrit/workspace/org.eclipse.jdt.core/target/classes')
17:07:51 [WARNING] /jobs/genie.jdt/eclipse.jdt.core-Gerrit/workspace/org.eclipse.jdt.compiler.tool.tests/src/org/eclipse/jdt/compiler/tool/tests/CompilerToolJava9Tests.java:[388] 
17:07:51 	reader = ClassFileReader.read(new File(tmpFolder, "p/X.class"), true);
17:07:51 	         ^^^^^^^^^^^^^^^
17:07:51 Discouraged access: The type 'ClassFileReader' is not API (restriction on classpath entry '/jobs/genie.jdt/eclipse.jdt.core-Gerrit/workspace/org.eclipse.jdt.core/target/classes')
17:07:51 [WARNING] /jobs/genie.jdt/eclipse.jdt.core-Gerrit/workspace/org.eclipse.jdt.compiler.tool.tests/src/org/eclipse/jdt/compiler/tool/tests/CompilerToolJava9Tests.java:[388] 
17:07:51 	reader = ClassFileReader.read(new File(tmpFolder, "p/X.class"), true);
17:07:51 	                         ^^^^
17:07:51 Discouraged access: The method 'ClassFileReader.read(File, boolean)' is not API (restriction on classpath entry '/jobs/genie.jdt/eclipse.jdt.core-Gerrit/workspace/org.eclipse.jdt.core/target/classes')
17:07:51 [WARNING] /jobs/genie.jdt/eclipse.jdt.core-Gerrit/workspace/org.eclipse.jdt.compiler.tool.tests/src/org/eclipse/jdt/compiler/tool/tests/CompilerToolJava9Tests.java:[389] 
17:07:51 	} catch (ClassFormatException e) {
17:07:51 	         ^^^^^^^^^^^^^^^^^^^^
17:07:51 Discouraged access: The type 'ClassFormatException' is not API (restriction on classpath entry '/jobs/genie.jdt/eclipse.jdt.core-Gerrit/workspace/org.eclipse.jdt.core/target/classes')
17:07:51 [WARNING] /jobs/genie.jdt/eclipse.jdt.core-Gerrit/workspace/org.eclipse.jdt.compiler.tool.tests/src/org/eclipse/jdt/compiler/tool/tests/CompilerToolJava9Tests.java:[396] 
17:07:51 	assertEquals("Wrong value", ClassFileConstants.JDK1_8, reader.getVersion());
17:07:51 	                            ^^^^^^^^^^^^^^^^^^^^^^^^^
17:07:51 Discouraged access: The type 'ClassFileConstants' is not API (restriction on classpath entry '/jobs/genie.jdt/eclipse.jdt.core-Gerrit/workspace/org.eclipse.jdt.core/target/classes')
17:07:51 [WARNING] /jobs/genie.jdt/eclipse.jdt.core-Gerrit/workspace/org.eclipse.jdt.compiler.tool.tests/src/org/eclipse/jdt/compiler/tool/tests/CompilerToolJava9Tests.java:[396] 
17:07:51 	assertEquals("Wrong value", ClassFileConstants.JDK1_8, reader.getVersion());
17:07:51 	                                               ^^^^^^
17:07:51 Discouraged access: The field 'ClassFileConstants.JDK1_8' is not API (restriction on classpath entry '/jobs/genie.jdt/eclipse.jdt.core-Gerrit/workspace/org.eclipse.jdt.core/target/classes')
17:07:51 [WARNING] /jobs/genie.jdt/eclipse.jdt.core-Gerrit/workspace/org.eclipse.jdt.compiler.tool.tests/src/org/eclipse/jdt/compiler/tool/tests/CompilerToolJava9Tests.java:[396] 
17:07:51 	assertEquals("Wrong value", ClassFileConstants.JDK1_8, reader.getVersion());
17:07:51 	                                                              ^^^^^^^^^^
17:07:51 Discouraged access: The method 'ClassFileReader.getVersion()' is not API (restriction on classpath entry '/jobs/genie.jdt/eclipse.jdt.core-Gerrit/workspace/org.eclipse.jdt.core/target/classes')
17:07:51 [WARNING] /jobs/genie.jdt/eclipse.jdt.core-Gerrit/workspace/org.eclipse.jdt.compiler.tool.tests/src/org/eclipse/jdt/compiler/tool/tests/CompilerToolJava9Tests.java:[482] 
17:07:51 	if (!(compiler instanceof EclipseCompiler))
17:07:51 	                          ^^^^^^^^^^^^^^^
17:07:51 Discouraged access: The type 'EclipseCompiler' is not API (restriction on classpath entry '/jobs/genie.jdt/eclipse.jdt.core-Gerrit/workspace/org.eclipse.jdt.compiler.tool/target/classes')
17:07:51 [WARNING] /jobs/genie.jdt/eclipse.jdt.core-Gerrit/workspace/org.eclipse.jdt.compiler.tool.tests/src/org/eclipse/jdt/compiler/tool/tests/CompilerToolJava9Tests.java:[502] 
17:07:51 	if (!(compiler instanceof EclipseCompiler))
17:07:51 	                          ^^^^^^^^^^^^^^^
17:07:51 Discouraged access: The type 'EclipseCompiler' is not API (restriction on classpath entry '/jobs/genie.jdt/eclipse.jdt.core-Gerrit/workspace/org.eclipse.jdt.compiler.tool/target/classes')
17:07:51 [WARNING] /jobs/genie.jdt/eclipse.jdt.core-Gerrit/workspace/org.eclipse.jdt.compiler.tool.tests/src/org/eclipse/jdt/compiler/tool/tests/AbstractCompilerToolTest.java:[32] 
17:07:51 	import org.eclipse.jdt.internal.compiler.tool.EclipseCompiler;
17:07:51 	       ^^^^^^^^^^^^^^^^^^^^^^^^^^^^^^^^^^^^^^^^^^^^^^^^^^^^^^
17:07:51 Discouraged access: The type 'EclipseCompiler' is not API (restriction on classpath entry '/jobs/genie.jdt/eclipse.jdt.core-Gerrit/workspace/org.eclipse.jdt.compiler.tool/target/classes')
17:07:51 [WARNING] /jobs/genie.jdt/eclipse.jdt.core-Gerrit/workspace/org.eclipse.jdt.compiler.tool.tests/src/org/eclipse/jdt/compiler/tool/tests/AbstractCompilerToolTest.java:[92] 
17:07:51 	static EclipseCompiler COMPILER = new EclipseCompiler();
17:07:51 	       ^^^^^^^^^^^^^^^
17:07:51 Discouraged access: The type 'EclipseCompiler' is not API (restriction on classpath entry '/jobs/genie.jdt/eclipse.jdt.core-Gerrit/workspace/org.eclipse.jdt.compiler.tool/target/classes')
17:07:51 [WARNING] /jobs/genie.jdt/eclipse.jdt.core-Gerrit/workspace/org.eclipse.jdt.compiler.tool.tests/src/org/eclipse/jdt/compiler/tool/tests/AbstractCompilerToolTest.java:[92] 
17:07:51 	static EclipseCompiler COMPILER = new EclipseCompiler();
17:07:51 	                                      ^^^^^^^^^^^^^^^
17:07:51 Discouraged access: The type 'EclipseCompiler' is not API (restriction on classpath entry '/jobs/genie.jdt/eclipse.jdt.core-Gerrit/workspace/org.eclipse.jdt.compiler.tool/target/classes')
17:07:51 [WARNING] /jobs/genie.jdt/eclipse.jdt.core-Gerrit/workspace/org.eclipse.jdt.compiler.tool.tests/src/org/eclipse/jdt/compiler/tool/tests/AbstractCompilerToolTest.java:[92] 
17:07:51 	static EclipseCompiler COMPILER = new EclipseCompiler();
17:07:51 	                                      ^^^^^^^^^^^^^^^
17:07:51 Discouraged access: The constructor 'EclipseCompiler()' is not API (restriction on classpath entry '/jobs/genie.jdt/eclipse.jdt.core-Gerrit/workspace/org.eclipse.jdt.compiler.tool/target/classes')
17:07:51 [WARNING] /jobs/genie.jdt/eclipse.jdt.core-Gerrit/workspace/org.eclipse.jdt.compiler.tool.tests/src/org/eclipse/jdt/compiler/tool/tests/AbstractCompilerToolTest.java:[104] 
17:07:51 	manager = COMPILER.getStandardFileManager(null, null, null); // will pick defaults up
17:07:51 	                   ^^^^^^^^^^^^^^^^^^^^^^
17:07:51 Discouraged access: The method 'EclipseCompiler.getStandardFileManager(DiagnosticListener<? super JavaFileObject>, Locale, Charset)' is not API (restriction on classpath entry '/jobs/genie.jdt/eclipse.jdt.core-Gerrit/workspace/org.eclipse.jdt.compiler.tool/target/classes')
17:07:51 [WARNING] /jobs/genie.jdt/eclipse.jdt.core-Gerrit/workspace/org.eclipse.jdt.compiler.tool.tests/src/org/eclipse/jdt/compiler/tool/tests/AbstractCompilerToolTest.java:[117] 
17:07:51 	CompilationTask task = COMPILER.getTask(out, arguments.standardJavaFileManager /* carry the null over */, new CompilerInvocationDiagnosticListener(err), arguments.options, null, manager.getJavaFileObjectsFromFiles(files));
17:07:51 	                                ^^^^^^^
17:07:51 Discouraged access: The method 'EclipseCompiler.getTask(Writer, JavaFileManager, DiagnosticListener<? super JavaFileObject>, Iterable<String>, Iterable<String>, Iterable<? extends JavaFileObject>)' is not API (restriction on classpath entry '/jobs/genie.jdt/eclipse.jdt.core-Gerrit/workspace/org.eclipse.jdt.compiler.tool/target/classes')
17:07:51 [WARNING] /jobs/genie.jdt/eclipse.jdt.core-Gerrit/workspace/org.eclipse.jdt.compiler.tool.tests/src/org/eclipse/jdt/compiler/tool/tests/CompilerToolTests.java:[52] 
17:07:51 	import org.eclipse.jdt.internal.compiler.classfmt.ClassFileConstants;
17:07:51 	       ^^^^^^^^^^^^^^^^^^^^^^^^^^^^^^^^^^^^^^^^^^^^^^^^^^^^^^^^^^^^^
17:07:51 Discouraged access: The type 'ClassFileConstants' is not API (restriction on classpath entry '/jobs/genie.jdt/eclipse.jdt.core-Gerrit/workspace/org.eclipse.jdt.core/target/classes')
17:07:51 [WARNING] /jobs/genie.jdt/eclipse.jdt.core-Gerrit/workspace/org.eclipse.jdt.compiler.tool.tests/src/org/eclipse/jdt/compiler/tool/tests/CompilerToolTests.java:[53] 
17:07:51 	import org.eclipse.jdt.internal.compiler.classfmt.ClassFileReader;
17:07:51 	       ^^^^^^^^^^^^^^^^^^^^^^^^^^^^^^^^^^^^^^^^^^^^^^^^^^^^^^^^^^
17:07:51 Discouraged access: The type 'ClassFileReader' is not API (restriction on classpath entry '/jobs/genie.jdt/eclipse.jdt.core-Gerrit/workspace/org.eclipse.jdt.core/target/classes')
17:07:51 [WARNING] /jobs/genie.jdt/eclipse.jdt.core-Gerrit/workspace/org.eclipse.jdt.compiler.tool.tests/src/org/eclipse/jdt/compiler/tool/tests/CompilerToolTests.java:[54] 
17:07:51 	import org.eclipse.jdt.internal.compiler.classfmt.ClassFormatException;
17:07:51 	       ^^^^^^^^^^^^^^^^^^^^^^^^^^^^^^^^^^^^^^^^^^^^^^^^^^^^^^^^^^^^^^^
17:07:51 Discouraged access: The type 'ClassFormatException' is not API (restriction on classpath entry '/jobs/genie.jdt/eclipse.jdt.core-Gerrit/workspace/org.eclipse.jdt.core/target/classes')
17:07:51 [WARNING] /jobs/genie.jdt/eclipse.jdt.core-Gerrit/workspace/org.eclipse.jdt.compiler.tool.tests/src/org/eclipse/jdt/compiler/tool/tests/CompilerToolTests.java:[55] 
17:07:51 	import org.eclipse.jdt.internal.compiler.tool.EclipseCompiler;
17:07:51 	       ^^^^^^^^^^^^^^^^^^^^^^^^^^^^^^^^^^^^^^^^^^^^^^^^^^^^^^
17:07:51 Discouraged access: The type 'EclipseCompiler' is not API (restriction on classpath entry '/jobs/genie.jdt/eclipse.jdt.core-Gerrit/workspace/org.eclipse.jdt.compiler.tool/target/classes')
17:07:51 [WARNING] /jobs/genie.jdt/eclipse.jdt.core-Gerrit/workspace/org.eclipse.jdt.compiler.tool.tests/src/org/eclipse/jdt/compiler/tool/tests/CompilerToolTests.java:[153] 
17:07:51 	ServiceLoader<JavaCompiler> javaCompilerLoader = ServiceLoader.load(JavaCompiler.class, EclipseCompiler.class.getClassLoader());
17:07:51 	                                                                                        ^^^^^^^^^^^^^^^
17:07:51 Discouraged access: The type 'EclipseCompiler' is not API (restriction on classpath entry '/jobs/genie.jdt/eclipse.jdt.core-Gerrit/workspace/org.eclipse.jdt.compiler.tool/target/classes')
17:07:51 [WARNING] /jobs/genie.jdt/eclipse.jdt.core-Gerrit/workspace/org.eclipse.jdt.compiler.tool.tests/src/org/eclipse/jdt/compiler/tool/tests/CompilerToolTests.java:[157] 
17:07:51 	if (javaCompiler instanceof EclipseCompiler) {
17:07:51 	                            ^^^^^^^^^^^^^^^
17:07:51 Discouraged access: The type 'EclipseCompiler' is not API (restriction on classpath entry '/jobs/genie.jdt/eclipse.jdt.core-Gerrit/workspace/org.eclipse.jdt.compiler.tool/target/classes')
17:07:51 [WARNING] /jobs/genie.jdt/eclipse.jdt.core-Gerrit/workspace/org.eclipse.jdt.compiler.tool.tests/src/org/eclipse/jdt/compiler/tool/tests/CompilerToolTests.java:[461] 
17:07:51 	ClassFileReader reader = null;
17:07:51 	^^^^^^^^^^^^^^^
17:07:51 Discouraged access: The type 'ClassFileReader' is not API (restriction on classpath entry '/jobs/genie.jdt/eclipse.jdt.core-Gerrit/workspace/org.eclipse.jdt.core/target/classes')
17:07:51 [WARNING] /jobs/genie.jdt/eclipse.jdt.core-Gerrit/workspace/org.eclipse.jdt.compiler.tool.tests/src/org/eclipse/jdt/compiler/tool/tests/CompilerToolTests.java:[463] 
17:07:51 	reader = ClassFileReader.read(new File(tmpFolder, "p/X.class"), true);
17:07:51 	         ^^^^^^^^^^^^^^^
17:07:51 Discouraged access: The type 'ClassFileReader' is not API (restriction on classpath entry '/jobs/genie.jdt/eclipse.jdt.core-Gerrit/workspace/org.eclipse.jdt.core/target/classes')
17:07:51 [WARNING] /jobs/genie.jdt/eclipse.jdt.core-Gerrit/workspace/org.eclipse.jdt.compiler.tool.tests/src/org/eclipse/jdt/compiler/tool/tests/CompilerToolTests.java:[463] 
17:07:51 	reader = ClassFileReader.read(new File(tmpFolder, "p/X.class"), true);
17:07:51 	                         ^^^^
17:07:51 Discouraged access: The method 'ClassFileReader.read(File, boolean)' is not API (restriction on classpath entry '/jobs/genie.jdt/eclipse.jdt.core-Gerrit/workspace/org.eclipse.jdt.core/target/classes')
17:07:51 [WARNING] /jobs/genie.jdt/eclipse.jdt.core-Gerrit/workspace/org.eclipse.jdt.compiler.tool.tests/src/org/eclipse/jdt/compiler/tool/tests/CompilerToolTests.java:[464] 
17:07:51 	} catch (ClassFormatException e) {
17:07:51 	         ^^^^^^^^^^^^^^^^^^^^
17:07:51 Discouraged access: The type 'ClassFormatException' is not API (restriction on classpath entry '/jobs/genie.jdt/eclipse.jdt.core-Gerrit/workspace/org.eclipse.jdt.core/target/classes')
17:07:51 [WARNING] /jobs/genie.jdt/eclipse.jdt.core-Gerrit/workspace/org.eclipse.jdt.compiler.tool.tests/src/org/eclipse/jdt/compiler/tool/tests/CompilerToolTests.java:[471] 
17:07:51 	assertEquals("Wrong value", ClassFileConstants.getLatestJDKLevel(), reader.getVersion()); // TODO: Fix this for JDK11
17:07:51 	                            ^^^^^^^^^^^^^^^^^^
17:07:51 Discouraged access: The type 'ClassFileConstants' is not API (restriction on classpath entry '/jobs/genie.jdt/eclipse.jdt.core-Gerrit/workspace/org.eclipse.jdt.core/target/classes')
17:07:51 [WARNING] /jobs/genie.jdt/eclipse.jdt.core-Gerrit/workspace/org.eclipse.jdt.compiler.tool.tests/src/org/eclipse/jdt/compiler/tool/tests/CompilerToolTests.java:[471] 
17:07:51 	assertEquals("Wrong value", ClassFileConstants.getLatestJDKLevel(), reader.getVersion()); // TODO: Fix this for JDK11
17:07:51 	                                               ^^^^^^^^^^^^^^^^^
17:07:51 Discouraged access: The method 'ClassFileConstants.getLatestJDKLevel()' is not API (restriction on classpath entry '/jobs/genie.jdt/eclipse.jdt.core-Gerrit/workspace/org.eclipse.jdt.core/target/classes')
17:07:51 [WARNING] /jobs/genie.jdt/eclipse.jdt.core-Gerrit/workspace/org.eclipse.jdt.compiler.tool.tests/src/org/eclipse/jdt/compiler/tool/tests/CompilerToolTests.java:[471] 
17:07:51 	assertEquals("Wrong value", ClassFileConstants.getLatestJDKLevel(), reader.getVersion()); // TODO: Fix this for JDK11
17:07:51 	                                                                           ^^^^^^^^^^
17:07:51 Discouraged access: The method 'ClassFileReader.getVersion()' is not API (restriction on classpath entry '/jobs/genie.jdt/eclipse.jdt.core-Gerrit/workspace/org.eclipse.jdt.core/target/classes')
17:07:51 [WARNING] /jobs/genie.jdt/eclipse.jdt.core-Gerrit/workspace/org.eclipse.jdt.compiler.tool.tests/src/org/eclipse/jdt/compiler/tool/tests/CompilerToolTests.java:[541] 
17:07:51 	ClassFileReader reader = null;
17:07:51 	^^^^^^^^^^^^^^^
17:07:51 Discouraged access: The type 'ClassFileReader' is not API (restriction on classpath entry '/jobs/genie.jdt/eclipse.jdt.core-Gerrit/workspace/org.eclipse.jdt.core/target/classes')
17:07:51 [WARNING] /jobs/genie.jdt/eclipse.jdt.core-Gerrit/workspace/org.eclipse.jdt.compiler.tool.tests/src/org/eclipse/jdt/compiler/tool/tests/CompilerToolTests.java:[543] 
17:07:51 	reader = ClassFileReader.read(outputFile);
17:07:51 	         ^^^^^^^^^^^^^^^
17:07:51 Discouraged access: The type 'ClassFileReader' is not API (restriction on classpath entry '/jobs/genie.jdt/eclipse.jdt.core-Gerrit/workspace/org.eclipse.jdt.core/target/classes')
17:07:51 [WARNING] /jobs/genie.jdt/eclipse.jdt.core-Gerrit/workspace/org.eclipse.jdt.compiler.tool.tests/src/org/eclipse/jdt/compiler/tool/tests/CompilerToolTests.java:[543] 
17:07:51 	reader = ClassFileReader.read(outputFile);
17:07:51 	                         ^^^^
17:07:51 Discouraged access: The method 'ClassFileReader.read(File)' is not API (restriction on classpath entry '/jobs/genie.jdt/eclipse.jdt.core-Gerrit/workspace/org.eclipse.jdt.core/target/classes')
17:07:51 [WARNING] /jobs/genie.jdt/eclipse.jdt.core-Gerrit/workspace/org.eclipse.jdt.compiler.tool.tests/src/org/eclipse/jdt/compiler/tool/tests/CompilerToolTests.java:[544] 
17:07:51 	} catch (ClassFormatException e) {
17:07:51 	         ^^^^^^^^^^^^^^^^^^^^
17:07:51 Discouraged access: The type 'ClassFormatException' is not API (restriction on classpath entry '/jobs/genie.jdt/eclipse.jdt.core-Gerrit/workspace/org.eclipse.jdt.core/target/classes')
17:07:51 [WARNING] /jobs/genie.jdt/eclipse.jdt.core-Gerrit/workspace/org.eclipse.jdt.compiler.tool.tests/src/org/eclipse/jdt/compiler/tool/tests/CompilerToolTests.java:[550] 
17:07:51 	assertEquals("Not a 1.5 .class file", ClassFileConstants.JDK1_5, reader.getVersion());
17:07:51 	                                      ^^^^^^^^^^^^^^^^^^^^^^^^^
17:07:51 Discouraged access: The type 'ClassFileConstants' is not API (restriction on classpath entry '/jobs/genie.jdt/eclipse.jdt.core-Gerrit/workspace/org.eclipse.jdt.core/target/classes')
17:07:51 [WARNING] /jobs/genie.jdt/eclipse.jdt.core-Gerrit/workspace/org.eclipse.jdt.compiler.tool.tests/src/org/eclipse/jdt/compiler/tool/tests/CompilerToolTests.java:[550] 
17:07:51 	assertEquals("Not a 1.5 .class file", ClassFileConstants.JDK1_5, reader.getVersion());
17:07:51 	                                                         ^^^^^^
17:07:51 Discouraged access: The field 'ClassFileConstants.JDK1_5' is not API (restriction on classpath entry '/jobs/genie.jdt/eclipse.jdt.core-Gerrit/workspace/org.eclipse.jdt.core/target/classes')
17:07:51 [WARNING] /jobs/genie.jdt/eclipse.jdt.core-Gerrit/workspace/org.eclipse.jdt.compiler.tool.tests/src/org/eclipse/jdt/compiler/tool/tests/CompilerToolTests.java:[550] 
17:07:51 	assertEquals("Not a 1.5 .class file", ClassFileConstants.JDK1_5, reader.getVersion());
17:07:51 	                                                                        ^^^^^^^^^^
17:07:51 Discouraged access: The method 'ClassFileReader.getVersion()' is not API (restriction on classpath entry '/jobs/genie.jdt/eclipse.jdt.core-Gerrit/workspace/org.eclipse.jdt.core/target/classes')
17:07:51 79 problems (79 warnings)
17:07:51 [INFO] 
17:07:51 [INFO] --- tycho-eclipserun-plugin:1.4.0:eclipse-run (default) @ org.eclipse.jdt.compiler.tool.tests ---
17:07:51 [INFO] 
17:07:51 [INFO] --- maven-resources-plugin:3.1.0:testResources (default-testResources) @ org.eclipse.jdt.compiler.tool.tests ---
17:07:51 [INFO] Using 'UTF-8' encoding to copy filtered resources.
17:07:51 [INFO] skip non existing resourceDirectory /jobs/genie.jdt/eclipse.jdt.core-Gerrit/workspace/org.eclipse.jdt.compiler.tool.tests/src/test/resources
17:07:51 [INFO] 
17:07:51 [INFO] --- tycho-source-plugin:1.5.0-SNAPSHOT:plugin-source (plugin-source) @ org.eclipse.jdt.compiler.tool.tests ---
17:07:51 [INFO] Building jar: /jobs/genie.jdt/eclipse.jdt.core-Gerrit/workspace/org.eclipse.jdt.compiler.tool.tests/target/org.eclipse.jdt.compiler.tool.tests-1.2.500-SNAPSHOT-sources.jar
17:07:51 [INFO] 
17:07:51 [INFO] --- target-platform-configuration:1.5.0-SNAPSHOT:target-platform (default-target-platform) @ org.eclipse.jdt.compiler.tool.tests ---
17:07:51 [INFO] 
17:07:51 [INFO] --- tycho-packaging-plugin:1.5.0-SNAPSHOT:package-plugin (default-package-plugin) @ org.eclipse.jdt.compiler.tool.tests ---
17:07:52 [INFO] Building jar: /jobs/genie.jdt/eclipse.jdt.core-Gerrit/workspace/org.eclipse.jdt.compiler.tool.tests/target/org.eclipse.jdt.compiler.tool.tests-1.2.500-SNAPSHOT.jar
17:07:52 [INFO] 
17:07:52 [INFO] --- tycho-p2-plugin:1.5.0-SNAPSHOT:p2-metadata-default (default-p2-metadata-default) @ org.eclipse.jdt.compiler.tool.tests ---
17:07:52 [WARNING] MavenProject: org.eclipse.jdt:org.eclipse.jdt.compiler.tool.tests:1.2.500-SNAPSHOT @ /jobs/genie.jdt/eclipse.jdt.core-Gerrit/workspace/org.eclipse.jdt.compiler.tool.tests/pom.xml: baseline and build artifacts have same version but different contents
17:07:52    classifier-sources: not present in baseline
17:07:52 
17:07:52 [INFO] MavenProject: org.eclipse.jdt:org.eclipse.jdt.compiler.tool.tests:1.2.500-SNAPSHOT @ /jobs/genie.jdt/eclipse.jdt.core-Gerrit/workspace/org.eclipse.jdt.compiler.tool.tests/pom.xml
17:07:52     The main artifact has been replaced with the baseline version.
17:07:52     The following attached artifacts are not present in the baseline and have been removed: [sources]
17:07:52 
17:07:52 [INFO] 
17:07:52 [INFO] --- tycho-surefire-plugin:1.5.0-SNAPSHOT:test (default-test) @ org.eclipse.jdt.compiler.tool.tests ---
17:07:53 [INFO] Expected eclipse log file: /jobs/genie.jdt/eclipse.jdt.core-Gerrit/workspace/org.eclipse.jdt.compiler.tool.tests/target/work/data/.metadata/.log
17:07:53 [INFO] Command line:
17:07:53 	[/opt/public/common/java/oracle/jdk1.8.0_192_x64/jre/bin/java, -Dosgi.noShutdown=false, -Dosgi.os=linux, -Dosgi.ws=gtk, -Dosgi.arch=x86_64, -Dosgi.clean=true, -jar, /jobs/genie.jdt/eclipse.jdt.core-Gerrit/workspace/.repository/p2/osgi/bundle/org.eclipse.equinox.launcher/1.5.500.v20190715-1310/org.eclipse.equinox.launcher-1.5.500.v20190715-1310.jar, -data, /jobs/genie.jdt/eclipse.jdt.core-Gerrit/workspace/org.eclipse.jdt.compiler.tool.tests/target/work/data, -install, /jobs/genie.jdt/eclipse.jdt.core-Gerrit/workspace/org.eclipse.jdt.compiler.tool.tests/target/work, -configuration, /jobs/genie.jdt/eclipse.jdt.core-Gerrit/workspace/org.eclipse.jdt.compiler.tool.tests/target/work/configuration, -application, org.eclipse.tycho.surefire.osgibooter.headlesstest, -testproperties, /jobs/genie.jdt/eclipse.jdt.core-Gerrit/workspace/org.eclipse.jdt.compiler.tool.tests/target/surefire.properties]
17:07:53 Picked up JAVA_TOOL_OPTIONS: -Xmx2G -Djava.io.tmpdir=/tmp/genie.jdt -DforkCount=1
17:07:55 Running org.eclipse.jdt.compiler.tool.tests.AllTests
17:07:55 reflectNestedClassUseDollar=true based on version=1.8.0_192
17:07:56 CLASS_PATH
17:07:56 /jobs/genie.jdt/eclipse.jdt.core-Gerrit/workspace/.repository/p2/osgi/bundle/org.eclipse.equinox.launcher/1.5.500.v20190715-1310/org.eclipse.equinox.launcher-1.5.500.v20190715-1310.jar
17:07:56 PLATFORM_CLASS_PATH
17:07:56 /opt/public/common/java/oracle/jdk1.8.0_192_x64/jre/lib/jce.jar
17:07:56 /opt/public/common/java/oracle/jdk1.8.0_192_x64/jre/lib/sunrsasign.jar
17:07:56 /opt/public/common/java/oracle/jdk1.8.0_192_x64/jre/lib/charsets.jar
17:07:56 /opt/public/common/java/oracle/jdk1.8.0_192_x64/jre/lib/jsse.jar
17:07:56 /opt/public/common/java/oracle/jdk1.8.0_192_x64/jre/lib/resources.jar
17:07:56 /opt/public/common/java/oracle/jdk1.8.0_192_x64/jre/lib/jfr.jar
17:07:56 /opt/public/common/java/oracle/jdk1.8.0_192_x64/jre/lib/rt.jar
17:07:56 ----------
17:07:56 1. ERROR in /tmp/genie.jdt/X.java (at line 2)
17:07:56 	public class X extends File {}
17:07:56 	                       ^^^^
17:07:56 File cannot be resolved to a type
17:07:56 ----------
17:07:56 1 problem (1 error)
17:07:56 ----------
17:07:56 1. ERROR in /tmp/genie.jdt/X.java (at line 2)
17:07:56 	public class X extends File {}
17:07:56 	                       ^^^^
17:07:56 File cannot be resolved to a type
17:07:56 ----------
17:07:56 1 problem (1 error)
17:07:57 Tests run: 53, Failures: 0, Errors: 0, Skipped: 0, Time elapsed: 2.272 s - in org.eclipse.jdt.compiler.tool.tests.AllTests
17:07:57 testCompilerUnusedVariable(org.eclipse.jdt.compiler.tool.tests.CompilerToolTests)  Time elapsed: 0.287 s
17:07:57 testCompilerOneClassWithSystemCompiler2(org.eclipse.jdt.compiler.tool.tests.CompilerToolTests)  Time elapsed: 0.343 s
17:07:57 testCompilerOneClassWithSystemCompiler(org.eclipse.jdt.compiler.tool.tests.CompilerToolTests)  Time elapsed: 0.09 s
17:07:57 testCompilerOneClassWithEclipseCompiler(org.eclipse.jdt.compiler.tool.tests.CompilerToolTests)  Time elapsed: 0.042 s
17:07:57 testCheckOptions(org.eclipse.jdt.compiler.tool.tests.CompilerToolTests)  Time elapsed: 0.002 s
17:07:57 testSupportedCompilerVersions(org.eclipse.jdt.compiler.tool.tests.CompilerToolTests)  Time elapsed: 0 s
17:07:57 testFileManager2(org.eclipse.jdt.compiler.tool.tests.CompilerToolTests)  Time elapsed: 0.002 s
17:07:57 testCompilerOneClassWithEclipseCompiler2(org.eclipse.jdt.compiler.tool.tests.CompilerToolTests)  Time elapsed: 0.072 s
17:07:57 testCompilerOneClassWithEclipseCompiler3(org.eclipse.jdt.compiler.tool.tests.CompilerToolTests)  Time elapsed: 0.024 s
17:07:57 testCompilerOneClassWithEclipseCompiler4(org.eclipse.jdt.compiler.tool.tests.CompilerToolTests)  Time elapsed: 0.025 s
17:07:57 testCompilerOneClassWithEclipseCompiler5(org.eclipse.jdt.compiler.tool.tests.CompilerToolTests)  Time elapsed: 0.026 s
17:07:57 testCompilerOneClassWithEclipseCompiler6(org.eclipse.jdt.compiler.tool.tests.CompilerToolTests)  Time elapsed: 0 s
17:07:57 testCompilerOneClassWithEclipseCompiler7(org.eclipse.jdt.compiler.tool.tests.CompilerToolTests)  Time elapsed: 0.027 s
17:07:57 testCleanUp(org.eclipse.jdt.compiler.tool.tests.CompilerToolTests)  Time elapsed: 0 s
17:07:57 testCompilerUnusedVariable2(org.eclipse.jdt.compiler.tool.tests.CompilerToolTests)  Time elapsed: 0.037 s
17:07:57 testFileManager(org.eclipse.jdt.compiler.tool.tests.CompilerToolTests)  Time elapsed: 0.002 s
17:07:57 testInferBinaryName(org.eclipse.jdt.compiler.tool.tests.CompilerToolTests)  Time elapsed: 0.001 s
17:07:57 testAsPath(org.eclipse.jdt.compiler.tool.tests.CompilerToolJava9Tests)  Time elapsed: 0 s
17:07:57 testBug533830_1(org.eclipse.jdt.compiler.tool.tests.CompilerToolJava9Tests)  Time elapsed: 0.001 s
17:07:57 testClassOutputLocationForModule_1(org.eclipse.jdt.compiler.tool.tests.CompilerToolJava9Tests)  Time elapsed: 0 s
17:07:57 testClassOutputLocationForModule_2(org.eclipse.jdt.compiler.tool.tests.CompilerToolJava9Tests)  Time elapsed: 0 s
17:07:57 testContains(org.eclipse.jdt.compiler.tool.tests.CompilerToolJava9Tests)  Time elapsed: 0 s
17:07:57 testGetJavaFileObjects(org.eclipse.jdt.compiler.tool.tests.CompilerToolJava9Tests)  Time elapsed: 0 s
17:07:57 testGetJavaFileObjects2(org.eclipse.jdt.compiler.tool.tests.CompilerToolJava9Tests)  Time elapsed: 0 s
17:07:57 testGetLocationForModule1(org.eclipse.jdt.compiler.tool.tests.CompilerToolJava9Tests)  Time elapsed: 0 s
17:07:57 testGetLocationForModule2(org.eclipse.jdt.compiler.tool.tests.CompilerToolJava9Tests)  Time elapsed: 0 s
17:07:57 testGetLocationForModule3(org.eclipse.jdt.compiler.tool.tests.CompilerToolJava9Tests)  Time elapsed: 0 s
17:07:57 testGetServiceLoader(org.eclipse.jdt.compiler.tool.tests.CompilerToolJava9Tests)  Time elapsed: 0 s
17:07:57 testInferModuleName(org.eclipse.jdt.compiler.tool.tests.CompilerToolJava9Tests)  Time elapsed: 0 s
17:07:57 testListLocationsForModules(org.eclipse.jdt.compiler.tool.tests.CompilerToolJava9Tests)  Time elapsed: 0.001 s
17:07:57 testOptionRelease1(org.eclipse.jdt.compiler.tool.tests.CompilerToolJava9Tests)  Time elapsed: 0 s
17:07:57 testOptionRelease2(org.eclipse.jdt.compiler.tool.tests.CompilerToolJava9Tests)  Time elapsed: 0 s
17:07:57 testOptionRelease3(org.eclipse.jdt.compiler.tool.tests.CompilerToolJava9Tests)  Time elapsed: 0 s
17:07:57 testSetLocationAsPaths(org.eclipse.jdt.compiler.tool.tests.CompilerToolJava9Tests)  Time elapsed: 0 s
17:07:57 testSupportedCompilerVersions(org.eclipse.jdt.compiler.tool.tests.CompilerToolJava9Tests)  Time elapsed: 0 s
17:07:57 test001_basic - 1.6(org.eclipse.jdt.compiler.tool.tests.CompilerInvocationTests)  Time elapsed: 0.065 s
17:07:57 test002_dash_d_option - 1.6(org.eclipse.jdt.compiler.tool.tests.CompilerInvocationTests)  Time elapsed: 0.047 s
17:07:57 test003_dash_d_option - 1.6(org.eclipse.jdt.compiler.tool.tests.CompilerInvocationTests)  Time elapsed: 0.046 s
17:07:57 test004_no_dash_d_option - 1.6(org.eclipse.jdt.compiler.tool.tests.CompilerInvocationTests)  Time elapsed: 0.049 s
17:07:57 test005_dash_d_option_custom_file_manager - 1.6(org.eclipse.jdt.compiler.tool.tests.CompilerInvocationTests)  Time elapsed: 0.048 s
17:07:57 test006_no_dash_d_option_custom_file_manager - 1.6(org.eclipse.jdt.compiler.tool.tests.CompilerInvocationTests)  Time elapsed: 0.044 s
17:07:57 test007_options_consumption - 1.6(org.eclipse.jdt.compiler.tool.tests.CompilerInvocationTests)  Time elapsed: 0.001 s
17:07:57 test008_options_consumption - 1.6(org.eclipse.jdt.compiler.tool.tests.CompilerInvocationTests)  Time elapsed: 0 s
17:07:57 test009_options_consumption - 1.6(org.eclipse.jdt.compiler.tool.tests.CompilerInvocationTests)  Time elapsed: 0.001 s
17:07:57 test010_inappropriate_encoding_diagnosis - 1.6(org.eclipse.jdt.compiler.tool.tests.CompilerInvocationTests)  Time elapsed: 0.007 s
17:07:57 test011_inappropriate_encoding_diagnosis - 1.6(org.eclipse.jdt.compiler.tool.tests.CompilerInvocationTests)  Time elapsed: 0.002 s
17:07:57 test012_files_access_read - 1.6(org.eclipse.jdt.compiler.tool.tests.CompilerInvocationTests)  Time elapsed: 0.053 s
17:07:57 test015_files_access_write - 1.6(org.eclipse.jdt.compiler.tool.tests.CompilerInvocationTests)  Time elapsed: 0.028 s
17:07:57 test016_files_access_write - 1.6(org.eclipse.jdt.compiler.tool.tests.CompilerInvocationTests)  Time elapsed: 0.129 s
17:07:57 test017_sourcepath_without_destination - 1.6(org.eclipse.jdt.compiler.tool.tests.CompilerInvocationTests)  Time elapsed: 0.127 s
17:07:57 test019_sourcepath_without_destination - 1.6(org.eclipse.jdt.compiler.tool.tests.CompilerInvocationTests)  Time elapsed: 0.128 s
17:07:57 test021_output_streams - 1.6(org.eclipse.jdt.compiler.tool.tests.CompilerInvocationTests)  Time elapsed: 0.003 s
17:07:57 test022_output_streams - 1.6(org.eclipse.jdt.compiler.tool.tests.CompilerInvocationTests)  Time elapsed: 0.001 s
17:07:57 
17:07:57 Results:
17:07:57 
17:07:57 Tests run: 53, Failures: 0, Errors: 0, Skipped: 0
17:07:57 
17:07:59 [INFO] All tests passed!
17:07:59 [INFO] 
17:07:59 [INFO] --- tycho-p2-extras-plugin:1.5.0-SNAPSHOT:compare-version-with-baselines (compare-attached-artifacts-with-release) @ org.eclipse.jdt.compiler.tool.tests ---
17:07:59 [INFO] Skipped
17:07:59 [INFO] 
17:07:59 [INFO] --- maven-antrun-plugin:1.8:run (check-skip-api-analysis) @ org.eclipse.jdt.compiler.tool.tests ---
17:07:59 [INFO] Executing tasks
17:07:59 
17:07:59 main:
17:07:59 [INFO] Executed tasks
17:07:59 [INFO] 
17:07:59 [INFO] --- tycho-dependency-tools-plugin:1.5.0-SNAPSHOT:list-dependencies (list-dependencies) @ org.eclipse.jdt.compiler.tool.tests ---
17:07:59 [INFO] 
17:07:59 [INFO] --- tycho-eclipserun-plugin:1.4.0:eclipse-run (api-analysis) @ org.eclipse.jdt.compiler.tool.tests ---
17:07:59 [INFO] Fetching org.eclipse.jdt.compiler.tool.tests_1.2.500.v20190113-0810.jar.pack.gz from https://download.eclipse.org/eclipse/updates/4.12/R-4.12-201906051800/plugins/ (112.01kB)
17:07:59 [INFO] Fetching org.eclipse.jdt.compiler.tool.tests_1.2.500.v20190113-0810.jar.pack.gz from https://download.eclipse.org/eclipse/updates/4.12/R-4.12-201906051800/plugins/ (112.01kB)
17:07:59 [INFO] Fetching org.eclipse.jdt.core.compiler.batch_3.18.0.v20190522-0428.jar from https://download.eclipse.org/eclipse/updates/4.12/R-4.12-201906051800/plugins/ (2.74MB)
17:07:59 [INFO] Fetching org.eclipse.jdt.core.compiler.batch_3.18.0.v20190522-0428.jar from https://download.eclipse.org/eclipse/updates/4.12/R-4.12-201906051800/plugins/ (2.74MB)
17:07:59 [INFO] Toolchain in tycho-eclipserun-plugin: JDK[/opt/public/common/jdk1.8.0_x64-latest/jre]
17:07:59 [INFO] Expected eclipse log file: /jobs/genie.jdt/eclipse.jdt.core-Gerrit/workspace/org.eclipse.jdt.compiler.tool.tests/target/eclipserun-work/data/.metadata/.log
17:07:59 [INFO] Command line:
17:07:59 	[/opt/public/common/jdk1.8.0_x64-latest/jre/bin/java, -Xmx2048M, -jar, /jobs/genie.jdt/eclipse.jdt.core-Gerrit/workspace/.repository/p2/osgi/bundle/org.eclipse.equinox.launcher/1.5.400.v20190515-0925/org.eclipse.equinox.launcher-1.5.400.v20190515-0925.jar, -install, /jobs/genie.jdt/eclipse.jdt.core-Gerrit/workspace/org.eclipse.jdt.compiler.tool.tests/target/eclipserun-work, -configuration, /jobs/genie.jdt/eclipse.jdt.core-Gerrit/workspace/org.eclipse.jdt.compiler.tool.tests/target/eclipserun-work/configuration, -data, /jobs/genie.jdt/eclipse.jdt.core-Gerrit/workspace/org.eclipse.jdt.compiler.tool.tests/../target/org.eclipse.jdt.compiler.tool.tests-apiAnalyzer-workspace, -application, org.eclipse.pde.api.tools.apiAnalyzer, -project, /jobs/genie.jdt/eclipse.jdt.core-Gerrit/workspace/org.eclipse.jdt.compiler.tool.tests, -baseline, default, -dependencyList, /jobs/genie.jdt/eclipse.jdt.core-Gerrit/workspace/org.eclipse.jdt.compiler.tool.tests/target/dependencies-list.txt, -failOnError]
17:07:59 Picked up JAVA_TOOL_OPTIONS: -Xmx2G -Djava.io.tmpdir=/tmp/genie.jdt -DforkCount=1
17:08:06 0 API ERRORS
17:08:06 0 API warnings
17:08:09 [INFO] 
17:08:09 [INFO] ---------< org.eclipse.jdt:org.eclipse.jdt.core.tests.builder >---------
17:08:09 [INFO] Building org.eclipse.jdt.core.tests.builder 3.10.700-SNAPSHOT     [9/17]
17:08:09 [INFO] ------------------------[ eclipse-test-plugin ]-------------------------
17:08:09 [INFO] 
17:08:09 [INFO] --- maven-clean-plugin:3.1.0:clean (default-clean) @ org.eclipse.jdt.core.tests.builder ---
17:08:09 [INFO] 
17:08:09 [INFO] --- tycho-packaging-plugin:1.5.0-SNAPSHOT:build-qualifier (default-build-qualifier) @ org.eclipse.jdt.core.tests.builder ---
17:08:09 [INFO] The project's OSGi version is 3.10.700.v20190811-0934
17:08:09 [INFO] 
17:08:09 [INFO] --- tycho-packaging-plugin:1.5.0-SNAPSHOT:validate-id (default-validate-id) @ org.eclipse.jdt.core.tests.builder ---
17:08:09 [INFO] 
17:08:09 [INFO] --- tycho-packaging-plugin:1.5.0-SNAPSHOT:validate-version (default-validate-version) @ org.eclipse.jdt.core.tests.builder ---
17:08:09 [INFO] 
17:08:09 [INFO] --- maven-resources-plugin:3.1.0:copy-resources (saveproperties) @ org.eclipse.jdt.core.tests.builder ---
17:08:09 [INFO] Using 'UTF-8' encoding to copy filtered resources.
17:08:09 [INFO] skip non existing resourceDirectory /jobs/genie.jdt/eclipse.jdt.core-Gerrit/workspace/org.eclipse.jdt.core.tests.builder/saveproperties
17:08:09 [INFO] 
17:08:09 [INFO] --- maven-enforcer-plugin:3.0.0-M2:enforce (enforce-maven) @ org.eclipse.jdt.core.tests.builder ---
17:08:09 [INFO] 
17:08:09 [INFO] --- maven-toolchains-plugin:1.1:toolchain (default) @ org.eclipse.jdt.core.tests.builder ---
17:08:09 [INFO] Required toolchain: jdk [ id='JavaSE-11' ]
17:08:09 [INFO] Found matching toolchain for type jdk: JDK[/opt/public/common/java/openjdk/jdk-11_x64-latest]
17:08:09 [INFO] 
17:08:09 [INFO] --- eclipse-cbi-plugin:1.1.7:generate-api-build-xml (default) @ org.eclipse.jdt.core.tests.builder ---
17:08:09 [INFO] 
17:08:09 [INFO] --- maven-resources-plugin:3.1.0:resources (default-resources) @ org.eclipse.jdt.core.tests.builder ---
17:08:09 [INFO] Using 'UTF-8' encoding to copy filtered resources.
17:08:09 [INFO] skip non existing resourceDirectory /jobs/genie.jdt/eclipse.jdt.core-Gerrit/workspace/org.eclipse.jdt.core.tests.builder/src/main/resources
17:08:09 [INFO] 
17:08:09 [INFO] --- maven-resources-plugin:3.1.0:resources (filter-resources) @ org.eclipse.jdt.core.tests.builder ---
17:08:09 [INFO] Using 'UTF-8' encoding to copy filtered resources.
17:08:09 [INFO] skip non existing resourceDirectory /jobs/genie.jdt/eclipse.jdt.core-Gerrit/workspace/org.eclipse.jdt.core.tests.builder/src/main/resources
17:08:09 [INFO] 
17:08:09 [INFO] --- tycho-compiler-plugin:1.5.0-SNAPSHOT:compile (default-compile) @ org.eclipse.jdt.core.tests.builder ---
17:08:09 [INFO] Compiling 37 source files to /jobs/genie.jdt/eclipse.jdt.core-Gerrit/workspace/org.eclipse.jdt.core.tests.builder/target/classes
17:08:09 [INFO] 
17:08:09 [INFO] --- tycho-eclipserun-plugin:1.4.0:eclipse-run (default) @ org.eclipse.jdt.core.tests.builder ---
17:08:09 [INFO] 
17:08:09 [INFO] --- maven-resources-plugin:3.1.0:testResources (default-testResources) @ org.eclipse.jdt.core.tests.builder ---
17:08:09 [INFO] Using 'UTF-8' encoding to copy filtered resources.
17:08:09 [INFO] skip non existing resourceDirectory /jobs/genie.jdt/eclipse.jdt.core-Gerrit/workspace/org.eclipse.jdt.core.tests.builder/src/test/resources
17:08:09 [INFO] 
17:08:09 [INFO] --- tycho-source-plugin:1.5.0-SNAPSHOT:plugin-source (plugin-source) @ org.eclipse.jdt.core.tests.builder ---
17:08:09 [INFO] Building jar: /jobs/genie.jdt/eclipse.jdt.core-Gerrit/workspace/org.eclipse.jdt.core.tests.builder/target/org.eclipse.jdt.core.tests.builder-3.10.700-SNAPSHOT-sources.jar
17:08:09 [INFO] 
17:08:09 [INFO] --- target-platform-configuration:1.5.0-SNAPSHOT:target-platform (default-target-platform) @ org.eclipse.jdt.core.tests.builder ---
17:08:09 [INFO] 
17:08:09 [INFO] --- tycho-packaging-plugin:1.5.0-SNAPSHOT:package-plugin (default-package-plugin) @ org.eclipse.jdt.core.tests.builder ---
17:08:11 [INFO] Building jar: /jobs/genie.jdt/eclipse.jdt.core-Gerrit/workspace/org.eclipse.jdt.core.tests.builder/target/org.eclipse.jdt.core.tests.builder-3.10.700-SNAPSHOT.jar
17:08:11 [INFO] 
17:08:11 [INFO] --- tycho-p2-plugin:1.5.0-SNAPSHOT:p2-metadata-default (default-p2-metadata-default) @ org.eclipse.jdt.core.tests.builder ---
17:08:11 [WARNING] MavenProject: org.eclipse.jdt:org.eclipse.jdt.core.tests.builder:3.10.700-SNAPSHOT @ /jobs/genie.jdt/eclipse.jdt.core-Gerrit/workspace/org.eclipse.jdt.core.tests.builder/pom.xml: baseline and build artifacts have same version but different contents
17:08:11    classifier-sources: not present in baseline
17:08:11 
17:08:11 [INFO] MavenProject: org.eclipse.jdt:org.eclipse.jdt.core.tests.builder:3.10.700-SNAPSHOT @ /jobs/genie.jdt/eclipse.jdt.core-Gerrit/workspace/org.eclipse.jdt.core.tests.builder/pom.xml
17:08:11     The main artifact has been replaced with the baseline version.
17:08:11     The following attached artifacts are not present in the baseline and have been removed: [sources]
17:08:11 
17:08:11 [INFO] 
17:08:11 [INFO] --- tycho-surefire-plugin:1.5.0-SNAPSHOT:test (default-test) @ org.eclipse.jdt.core.tests.builder ---
17:08:12 [INFO] Toolchain in tycho-surefire-plugin: JDK[/opt/public/common/java/openjdk/jdk-11_x64-latest]
17:08:12 [INFO] Expected eclipse log file: /jobs/genie.jdt/eclipse.jdt.core-Gerrit/workspace/org.eclipse.jdt.core.tests.builder/target/work/data/.metadata/.log
17:08:12 [INFO] Command line:
17:08:12 	[/opt/public/common/java/openjdk/jdk-11_x64-latest/bin/java, -Dosgi.noShutdown=false, -Dosgi.os=linux, -Dosgi.ws=gtk, -Dosgi.arch=x86_64, --add-modules, ALL-SYSTEM, -Dcompliance=1.4,1.7,1.8,11, -Dosgi.clean=true, -jar, /jobs/genie.jdt/eclipse.jdt.core-Gerrit/workspace/.repository/p2/osgi/bundle/org.eclipse.equinox.launcher/1.5.500.v20190715-1310/org.eclipse.equinox.launcher-1.5.500.v20190715-1310.jar, -data, /jobs/genie.jdt/eclipse.jdt.core-Gerrit/workspace/org.eclipse.jdt.core.tests.builder/target/work/data, -install, /jobs/genie.jdt/eclipse.jdt.core-Gerrit/workspace/org.eclipse.jdt.core.tests.builder/target/work, -configuration, /jobs/genie.jdt/eclipse.jdt.core-Gerrit/workspace/org.eclipse.jdt.core.tests.builder/target/work/configuration, -application, org.eclipse.tycho.surefire.osgibooter.headlesstest, -testproperties, /jobs/genie.jdt/eclipse.jdt.core-Gerrit/workspace/org.eclipse.jdt.core.tests.builder/target/surefire.properties]
17:08:12 Picked up JAVA_TOOL_OPTIONS: -Xmx2G -Djava.io.tmpdir=/tmp/genie.jdt -DforkCount=1
17:08:13 Running org.eclipse.jdt.core.tests.builder.BuilderTests
17:08:14 reflectNestedClassUseDollar=true due to isJRE9Plus
17:09:02 Failure while running test org.eclipse.jdt.core.tests.builder.IncrementalTests18#testBug481276a()!!!
17:09:02 Actual output is:
17:09:02 		"Problem : Dead code [ resource : </Project/src/testNullAnnotations/NonNullUtils.java> range : <145,202> category : <90> severity : <1>]\n" + 
17:09:02 		"Problem : Null type mismatch: required \'@NonNull Object @NonNull[]\' but the provided value is null [ resource : </Project/src/testNullAnnotations/Snippet.java> range : <316,323> category : <90> severity : <2>]"
17:09:02 
17:09:02 Expected output is:
17:09:02 		"Problem : Dead code [ resource : </Project/src/testNullAnnotations/NonNullUtils.java> range : <145,202> category : <90> severity : <1>]\n" + 
17:09:02 		"Problem : Null type mismatch (type annotations): required \'@NonNull Object @NonNull[]\' but this expression has type \'@NonNull Object @Nullable[]\' [ resource : </Project/src/testNullAnnotations/Snippet.java> range : <316,323> category : <90> severity : <2>]"
17:09:02 
17:09:11 Problem : A cycle was detected in the build path of project 'P1'. The cycle consists of projects {P1, P2} [ resource : </P1> range : <-1,-1> category : <10> severity : <2>]
17:09:11 Problem : A cycle was detected in the build path of project 'P2'. The cycle consists of projects {P1, P2} [ resource : </P2> range : <-1,-1> category : <10> severity : <2>]
17:09:11 Problem : The project cannot be built until build path errors are resolved [ resource : </P1> range : <-1,-1> category : <10> severity : <2>]
17:09:11 Problem : The project cannot be built until build path errors are resolved [ resource : </P2> range : <-1,-1> category : <10> severity : <2>]
17:09:11 
17:10:26 Tests run: 338, Failures: 1, Errors: 0, Skipped: 0, Time elapsed: 132.413 s <<< FAILURE! - in org.eclipse.jdt.core.tests.builder.BuilderTests
17:10:26 test001(org.eclipse.jdt.core.tests.builder.AbstractMethodTests)  Time elapsed: 1.354 s
17:10:26 test002(org.eclipse.jdt.core.tests.builder.AbstractMethodTests)  Time elapsed: 0.461 s
17:10:26 test003(org.eclipse.jdt.core.tests.builder.AbstractMethodTests)  Time elapsed: 0.181 s
17:10:26 testBuild(org.eclipse.jdt.core.tests.builder.BasicBuildTests)  Time elapsed: 0.202 s
17:10:26 testToDoMarker(org.eclipse.jdt.core.tests.builder.BasicBuildTests)  Time elapsed: 0.189 s
17:10:26 testToDoMarker2(org.eclipse.jdt.core.tests.builder.BasicBuildTests)  Time elapsed: 0.176 s
17:10:26 testTags(org.eclipse.jdt.core.tests.builder.BasicBuildTests)  Time elapsed: 0.152 s
17:10:26 testTags2(org.eclipse.jdt.core.tests.builder.BasicBuildTests)  Time elapsed: 0.141 s
17:10:26 testTags3(org.eclipse.jdt.core.tests.builder.BasicBuildTests)  Time elapsed: 0.19 s
17:10:26 testUnusedImport(org.eclipse.jdt.core.tests.builder.BasicBuildTests)  Time elapsed: 0.177 s
17:10:26 test98667(org.eclipse.jdt.core.tests.builder.BasicBuildTests)  Time elapsed: 0.156 s
17:10:26 testBug164707(org.eclipse.jdt.core.tests.builder.BasicBuildTests)  Time elapsed: 0.085 s
17:10:26 testTags4(org.eclipse.jdt.core.tests.builder.BasicBuildTests)  Time elapsed: 0.158 s
17:10:26 testBug392727(org.eclipse.jdt.core.tests.builder.BasicBuildTests)  Time elapsed: 0.17 s
17:10:26 testbBug386901(org.eclipse.jdt.core.tests.builder.BasicBuildTests)  Time elapsed: 0.175 s
17:10:26 testBug425420(org.eclipse.jdt.core.tests.builder.BasicBuildTests)  Time elapsed: 0.036 s
17:10:26 testBug549942(org.eclipse.jdt.core.tests.builder.BasicBuildTests)  Time elapsed: 0.167 s
17:10:26 testClasspathFileChange(org.eclipse.jdt.core.tests.builder.BuildpathTests)  Time elapsed: 0.336 s
17:10:26 testClosedProject(org.eclipse.jdt.core.tests.builder.BuildpathTests)  Time elapsed: 1.08 s
17:10:26 testCorruptBuilder(org.eclipse.jdt.core.tests.builder.BuildpathTests)  Time elapsed: 0.937 s
17:10:26 testCorruptBuilder2(org.eclipse.jdt.core.tests.builder.BuildpathTests)  Time elapsed: 3.156 s
17:10:26 testChangeExternalFolder(org.eclipse.jdt.core.tests.builder.BuildpathTests)  Time elapsed: 3.379 s
17:10:26 testChangeZIPArchive1(org.eclipse.jdt.core.tests.builder.BuildpathTests)  Time elapsed: 1.14 s
17:10:26 testChangeZIPArchive2(org.eclipse.jdt.core.tests.builder.BuildpathTests)  Time elapsed: 1.166 s
17:10:26 testExternalJarChange(org.eclipse.jdt.core.tests.builder.BuildpathTests)  Time elapsed: 1.151 s
17:10:26 testMissingBuilder(org.eclipse.jdt.core.tests.builder.BuildpathTests)  Time elapsed: 0.221 s
17:10:26 testMissingFieldType(org.eclipse.jdt.core.tests.builder.BuildpathTests)  Time elapsed: 0.216 s
17:10:26 testMissingLibrary1(org.eclipse.jdt.core.tests.builder.BuildpathTests)  Time elapsed: 0.079 s
17:10:26 testMissingLibrary2(org.eclipse.jdt.core.tests.builder.BuildpathTests)  Time elapsed: 1.288 s
17:10:26 testMissingLibrary3(org.eclipse.jdt.core.tests.builder.BuildpathTests)  Time elapsed: 1.947 s
17:10:26 testMissingLibrary4(org.eclipse.jdt.core.tests.builder.BuildpathTests)  Time elapsed: 1.025 s
17:10:26 testIncompatibleJdkLEvelOnProject(org.eclipse.jdt.core.tests.builder.BuildpathTests)  Time elapsed: 2.078 s
17:10:26 testIncompatibleJdkLEvelOnWksp(org.eclipse.jdt.core.tests.builder.BuildpathTests)  Time elapsed: 3.08 s
17:10:26 testMissingProject(org.eclipse.jdt.core.tests.builder.BuildpathTests)  Time elapsed: 4.193 s
17:10:26 testMissingOptionalProject(org.eclipse.jdt.core.tests.builder.BuildpathTests)  Time elapsed: 1.163 s
17:10:26 test0100(org.eclipse.jdt.core.tests.builder.BuildpathTests)  Time elapsed: 0.002 s
17:10:26 testMissingOutputFolder(org.eclipse.jdt.core.tests.builder.BuildpathTests)  Time elapsed: 0.019 s
17:10:26 testFilteredResources(org.eclipse.jdt.core.tests.builder.CopyResourceTests)  Time elapsed: 0.178 s
17:10:26 testSimpleProject(org.eclipse.jdt.core.tests.builder.CopyResourceTests)  Time elapsed: 0.074 s
17:10:26 testProjectWithBin(org.eclipse.jdt.core.tests.builder.CopyResourceTests)  Time elapsed: 0.074 s
17:10:26 testProjectWithSrcBin(org.eclipse.jdt.core.tests.builder.CopyResourceTests)  Time elapsed: 0.074 s
17:10:26 testProjectWith2SrcBin(org.eclipse.jdt.core.tests.builder.CopyResourceTests)  Time elapsed: 0.079 s
17:10:26 testProjectWith2SrcAsBin(org.eclipse.jdt.core.tests.builder.CopyResourceTests)  Time elapsed: 0.07 s
17:10:26 testProjectWith2Src2Bin(org.eclipse.jdt.core.tests.builder.CopyResourceTests)  Time elapsed: 0.078 s
17:10:26 test2ProjectWith1Bin(org.eclipse.jdt.core.tests.builder.CopyResourceTests)  Time elapsed: 0.126 s
17:10:26 testBug154693(org.eclipse.jdt.core.tests.builder.CopyResourceTests)  Time elapsed: 0.087 s
17:10:26 testBug194420(org.eclipse.jdt.core.tests.builder.CopyResourceTests)  Time elapsed: 0.073 s
17:10:26 testAbstractMethod(org.eclipse.jdt.core.tests.builder.DependencyTests)  Time elapsed: 0.135 s
17:10:26 testCaseInvariantType(org.eclipse.jdt.core.tests.builder.DependencyTests)  Time elapsed: 0.149 s
17:10:26 testExactMethodDeleting(org.eclipse.jdt.core.tests.builder.DependencyTests)  Time elapsed: 0.176 s
17:10:26 testExactMethodVisibility(org.eclipse.jdt.core.tests.builder.DependencyTests)  Time elapsed: 0.163 s
17:10:26 testExternalJarChanged(org.eclipse.jdt.core.tests.builder.DependencyTests)  Time elapsed: 2.131 s
17:10:26 testFieldDeleting(org.eclipse.jdt.core.tests.builder.DependencyTests)  Time elapsed: 0.161 s
17:10:26 testFieldVisibility(org.eclipse.jdt.core.tests.builder.DependencyTests)  Time elapsed: 0.159 s
17:10:26 testInterfaceDeleting(org.eclipse.jdt.core.tests.builder.DependencyTests)  Time elapsed: 0.173 s
17:10:26 testMemberTypeDeleting(org.eclipse.jdt.core.tests.builder.DependencyTests)  Time elapsed: 0.147 s
17:10:26 testMemberTypeVisibility(org.eclipse.jdt.core.tests.builder.DependencyTests)  Time elapsed: 0.153 s
17:10:26 testMethodDeleting(org.eclipse.jdt.core.tests.builder.DependencyTests)  Time elapsed: 0.162 s
17:10:26 testMethodVisibility(org.eclipse.jdt.core.tests.builder.DependencyTests)  Time elapsed: 0.177 s
17:10:26 testMissingClassFile(org.eclipse.jdt.core.tests.builder.DependencyTests)  Time elapsed: 0.422 s
17:10:26 testSecondaryTypeDeleting(org.eclipse.jdt.core.tests.builder.DependencyTests)  Time elapsed: 0.142 s
17:10:26 testTypeDeleting(org.eclipse.jdt.core.tests.builder.DependencyTests)  Time elapsed: 0.156 s
17:10:26 testTypeVisibility(org.eclipse.jdt.core.tests.builder.DependencyTests)  Time elapsed: 0.172 s
17:10:26 testTypeVisibility2(org.eclipse.jdt.core.tests.builder.DependencyTests)  Time elapsed: 0.172 s
17:10:26 testTypeVariable(org.eclipse.jdt.core.tests.builder.DependencyTests)  Time elapsed: 0.003 s
17:10:26 test0100(org.eclipse.jdt.core.tests.builder.DependencyTests)  Time elapsed: 0.094 s
17:10:26 testErrors(org.eclipse.jdt.core.tests.builder.ErrorsTests)  Time elapsed: 0.147 s
17:10:26 testRenameToNonJava(org.eclipse.jdt.core.tests.builder.ErrorsTests)  Time elapsed: 0.137 s
17:10:26 test0100(org.eclipse.jdt.core.tests.builder.ErrorsTests)  Time elapsed: 0.131 s
17:10:26 test0101(org.eclipse.jdt.core.tests.builder.ErrorsTests)  Time elapsed: 0.167 s
17:10:26 test0102(org.eclipse.jdt.core.tests.builder.ErrorsTests)  Time elapsed: 0.132 s
17:10:26 test0103(org.eclipse.jdt.core.tests.builder.ErrorsTests)  Time elapsed: 0.122 s
17:10:26 test0104(org.eclipse.jdt.core.tests.builder.ErrorsTests)  Time elapsed: 0.021 s
17:10:26 test0106(org.eclipse.jdt.core.tests.builder.ErrorsTests)  Time elapsed: 0.132 s
17:10:26 test0107(org.eclipse.jdt.core.tests.builder.ErrorsTests)  Time elapsed: 0.129 s
17:10:26 test0108(org.eclipse.jdt.core.tests.builder.ErrorsTests)  Time elapsed: 0.119 s
17:10:26 test0109(org.eclipse.jdt.core.tests.builder.ErrorsTests)  Time elapsed: 0.164 s
17:10:26 test0110(org.eclipse.jdt.core.tests.builder.ErrorsTests)  Time elapsed: 0.181 s
17:10:26 test0111(org.eclipse.jdt.core.tests.builder.ErrorsTests)  Time elapsed: 0.141 s
17:10:26 test0112(org.eclipse.jdt.core.tests.builder.ErrorsTests)  Time elapsed: 0.126 s
17:10:26 testProjectAsClassFolder(org.eclipse.jdt.core.tests.builder.EfficiencyTests)  Time elapsed: 0.157 s
17:10:26 testEfficiency(org.eclipse.jdt.core.tests.builder.EfficiencyTests)  Time elapsed: 0.159 s
17:10:26 testMethodAddition(org.eclipse.jdt.core.tests.builder.EfficiencyTests)  Time elapsed: 0.153 s
17:10:26 testLocalTypeAddition(org.eclipse.jdt.core.tests.builder.EfficiencyTests)  Time elapsed: 0.175 s
17:10:26 testLocalTypeAddition2(org.eclipse.jdt.core.tests.builder.EfficiencyTests)  Time elapsed: 0.134 s
17:10:26 testLocalTypeRemoval(org.eclipse.jdt.core.tests.builder.EfficiencyTests)  Time elapsed: 0.142 s
17:10:26 testLocalTypeRemoval2(org.eclipse.jdt.core.tests.builder.EfficiencyTests)  Time elapsed: 0.141 s
17:10:26 testMissingType001(org.eclipse.jdt.core.tests.builder.EfficiencyTests)  Time elapsed: 0.143 s
17:10:26 testSuccess(org.eclipse.jdt.core.tests.builder.ExecutionTests)  Time elapsed: 0.311 s
17:10:26 testFailure(org.eclipse.jdt.core.tests.builder.ExecutionTests)  Time elapsed: 0.309 s
17:10:26 testAddDuplicateSecondaryType(org.eclipse.jdt.core.tests.builder.IncrementalTests)  Time elapsed: 0.269 s
17:10:26 testDefaultPackage(org.eclipse.jdt.core.tests.builder.IncrementalTests)  Time elapsed: 0.173 s
17:10:26 testDefaultPackage2(org.eclipse.jdt.core.tests.builder.IncrementalTests)  Time elapsed: 0.08 s
17:10:26 testNewJCL(org.eclipse.jdt.core.tests.builder.IncrementalTests)  Time elapsed: 0.022 s
17:10:26 testRenameMainType(org.eclipse.jdt.core.tests.builder.IncrementalTests)  Time elapsed: 0.135 s
17:10:26 testRemoveSecondaryType(org.eclipse.jdt.core.tests.builder.IncrementalTests)  Time elapsed: 0.15 s
17:10:26 testRemoveSecondaryType2(org.eclipse.jdt.core.tests.builder.IncrementalTests)  Time elapsed: 0.161 s
17:10:26 testMoveSecondaryType(org.eclipse.jdt.core.tests.builder.IncrementalTests)  Time elapsed: 0.235 s
17:10:26 testMoveMemberType(org.eclipse.jdt.core.tests.builder.IncrementalTests)  Time elapsed: 0.162 s
17:10:26 testMovePackage(org.eclipse.jdt.core.tests.builder.IncrementalTests)  Time elapsed: 0.178 s
17:10:26 testMovePackage2(org.eclipse.jdt.core.tests.builder.IncrementalTests)  Time elapsed: 0.154 s
17:10:26 testMemberTypeFromClassFile(org.eclipse.jdt.core.tests.builder.IncrementalTests)  Time elapsed: 0.154 s
17:10:26 testMemberTypeOfOtherProject(org.eclipse.jdt.core.tests.builder.IncrementalTests)  Time elapsed: 0.294 s
17:10:26 test$InTypeName(org.eclipse.jdt.core.tests.builder.IncrementalTests)  Time elapsed: 0.276 s
17:10:26 testObjectWithSuperInterfaces(org.eclipse.jdt.core.tests.builder.IncrementalTests)  Time elapsed: 0.132 s
17:10:26 testMemberTypeCollisionWithBinary(org.eclipse.jdt.core.tests.builder.IncrementalTests)  Time elapsed: 0.125 s
17:10:26 testMemberTypeCollisionWithBinary2(org.eclipse.jdt.core.tests.builder.IncrementalTests)  Time elapsed: 0.217 s
17:10:26 test129316(org.eclipse.jdt.core.tests.builder.IncrementalTests)  Time elapsed: 0.104 s
17:10:26 testSecondaryType(org.eclipse.jdt.core.tests.builder.IncrementalTests)  Time elapsed: 0.113 s
17:10:26 testMissingType001(org.eclipse.jdt.core.tests.builder.IncrementalTests)  Time elapsed: 0.126 s
17:10:26 testMissingType002(org.eclipse.jdt.core.tests.builder.IncrementalTests)  Time elapsed: 0.139 s
17:10:26 testMissingType003(org.eclipse.jdt.core.tests.builder.IncrementalTests)  Time elapsed: 0.138 s
17:10:26 testBug334377(org.eclipse.jdt.core.tests.builder.IncrementalTests)  Time elapsed: 0.154 s
17:10:26 testBug364450(org.eclipse.jdt.core.tests.builder.IncrementalTests)  Time elapsed: 1.276 s
17:10:26 testRemovePackageInDependencyProject(org.eclipse.jdt.core.tests.builder.IncrementalTests)  Time elapsed: 0.144 s
17:10:26 testBug526376(org.eclipse.jdt.core.tests.builder.IncrementalTests)  Time elapsed: 0.117 s
17:10:26 test423122(org.eclipse.jdt.core.tests.builder.IncrementalTests18)  Time elapsed: 0.135 s
17:10:26 test423122a(org.eclipse.jdt.core.tests.builder.IncrementalTests18)  Time elapsed: 0.27 s
17:10:26 test427105(org.eclipse.jdt.core.tests.builder.IncrementalTests18)  Time elapsed: 0.142 s
17:10:26 test427105a(org.eclipse.jdt.core.tests.builder.IncrementalTests18)  Time elapsed: 0.135 s
17:10:26 test428071(org.eclipse.jdt.core.tests.builder.IncrementalTests18)  Time elapsed: 0.133 s
17:10:26 test430425(org.eclipse.jdt.core.tests.builder.IncrementalTests18)  Time elapsed: 0.011 s
17:10:26 test435544(org.eclipse.jdt.core.tests.builder.IncrementalTests18)  Time elapsed: 0.187 s
17:10:26 test445049(org.eclipse.jdt.core.tests.builder.IncrementalTests18)  Time elapsed: 0.194 s
17:10:26 testBug442452(org.eclipse.jdt.core.tests.builder.IncrementalTests18)  Time elapsed: 0.095 s
17:10:26 testBug442755(org.eclipse.jdt.core.tests.builder.IncrementalTests18)  Time elapsed: 0.099 s
17:10:26 testBug442755a(org.eclipse.jdt.core.tests.builder.IncrementalTests18)  Time elapsed: 0.096 s
17:10:26 testBug481276a(org.eclipse.jdt.core.tests.builder.IncrementalTests18)  Time elapsed: 0.222 s  <<< FAILURE!
17:10:26 junit.framework.ComparisonFailure: 
17:10:26 Invalid problem(s)!!!.
17:10:26 ----------- Expected ------------
17:10:26 Problem : Dead code [ resource : </Project/src/testNullAnnotations/NonNullUtils.java> range : <145,202> category : <90> severity : <1>]
17:10:26 Problem : Null type mismatch (type annotations): required '@NonNull Object @NonNull[]' but this expression has type '@NonNull Object @Nullable[]' [ resource : </Project/src/testNullAnnotations/Snippet.java> range : <316,323> category : <90> severity : <2>]
17:10:26 ------------ but was ------------
17:10:26 Problem : Dead code [ resource : </Project/src/testNullAnnotations/NonNullUtils.java> range : <145,202> category : <90> severity : <1>]
17:10:26 Problem : Null type mismatch: required '@NonNull Object @NonNull[]' but the provided value is null [ resource : </Project/src/testNullAnnotations/Snippet.java> range : <316,323> category : <90> severity : <2>]
17:10:26 --------- Difference is ----------
17:10:26  expected:<...: Null type mismatch[ (type annotations): required '@NonNull Object @NonNull[]' but this expression has type '@NonNull Object @Nullable[]'] [ resource : </Proj...> but was:<...: Null type mismatch[: required '@NonNull Object @NonNull[]' but the provided value is null] [ resource : </Proj...>
17:10:26 	at org.eclipse.jdt.core.tests.builder.IncrementalTests18.testBug481276a(IncrementalTests18.java:598)
17:10:26 
17:10:26 testBug481276b(org.eclipse.jdt.core.tests.builder.IncrementalTests18)  Time elapsed: 0.189 s
17:10:26 testBug481276c(org.eclipse.jdt.core.tests.builder.IncrementalTests18)  Time elapsed: 0.184 s
17:10:26 testBug483744_remove(org.eclipse.jdt.core.tests.builder.IncrementalTests18)  Time elapsed: 0.198 s
17:10:26 testCompileOnlyDependent(org.eclipse.jdt.core.tests.builder.MultiProjectTests)  Time elapsed: 1.413 s
17:10:26 testCompileOnlyStructuralDependent(org.eclipse.jdt.core.tests.builder.MultiProjectTests)  Time elapsed: 2.012 s
17:10:26 testRemoveField(org.eclipse.jdt.core.tests.builder.MultiProjectTests)  Time elapsed: 3.047 s
17:10:26 testCompileOrder(org.eclipse.jdt.core.tests.builder.MultiProjectTests)  Time elapsed: 1.055 s
17:10:26 testCyclesCleared(org.eclipse.jdt.core.tests.builder.MultiProjectTests)  Time elapsed: 2.031 s
17:10:26 testCycle1(org.eclipse.jdt.core.tests.builder.MultiProjectTests)  Time elapsed: 1.118 s
17:10:26 testCycle2(org.eclipse.jdt.core.tests.builder.MultiProjectTests)  Time elapsed: 0.971 s
17:10:26 testCycle3(org.eclipse.jdt.core.tests.builder.MultiProjectTests)  Time elapsed: 2.056 s
17:10:26 testCycle4(org.eclipse.jdt.core.tests.builder.MultiProjectTests)  Time elapsed: 3.15 s
17:10:26 testCycle5(org.eclipse.jdt.core.tests.builder.MultiProjectTests)  Time elapsed: 1.932 s
17:10:26 testCycle6(org.eclipse.jdt.core.tests.builder.MultiProjectTests)  Time elapsed: 2.072 s
17:10:26 testCycle7(org.eclipse.jdt.core.tests.builder.MultiProjectTests)  Time elapsed: 1.081 s
17:10:26 testExcludePartOfAnotherProject1(org.eclipse.jdt.core.tests.builder.MultiProjectTests)  Time elapsed: 1.028 s
17:10:26 testExcludePartOfAnotherProject2(org.eclipse.jdt.core.tests.builder.MultiProjectTests)  Time elapsed: 2.038 s
17:10:26 testExcludePartOfAnotherProject3(org.eclipse.jdt.core.tests.builder.MultiProjectTests)  Time elapsed: 2.075 s
17:10:26 testIncludePartOfAnotherProject1(org.eclipse.jdt.core.tests.builder.MultiProjectTests)  Time elapsed: 2.119 s
17:10:26 testIncludePartOfAnotherProject2(org.eclipse.jdt.core.tests.builder.MultiProjectTests)  Time elapsed: 2.04 s
17:10:26 testIncludePartOfAnotherProject3(org.eclipse.jdt.core.tests.builder.MultiProjectTests)  Time elapsed: 2.091 s
17:10:26 testIgnoreIfBetterNonAccessibleRule1(org.eclipse.jdt.core.tests.builder.MultiProjectTests)  Time elapsed: 1.047 s
17:10:26 testIgnoreIfBetterNonAccessibleRule2(org.eclipse.jdt.core.tests.builder.MultiProjectTests)  Time elapsed: 1.002 s
17:10:26 testMissingRequiredBinaries(org.eclipse.jdt.core.tests.builder.MultiProjectTests)  Time elapsed: 1.006 s
17:10:26 test100_class_folder_exported(org.eclipse.jdt.core.tests.builder.MultiProjectTests)  Time elapsed: 2.069 s
17:10:26 test101_class_folder_non_exported(org.eclipse.jdt.core.tests.builder.MultiProjectTests)  Time elapsed: 1.026 s
17:10:26 test102_missing_required_binaries(org.eclipse.jdt.core.tests.builder.MultiProjectTests)  Time elapsed: 1.047 s
17:10:26 test103_missing_required_binaries(org.eclipse.jdt.core.tests.builder.MultiProjectTests)  Time elapsed: 2.188 s
17:10:26 test104_missing_required_binaries(org.eclipse.jdt.core.tests.builder.MultiProjectTests)  Time elapsed: 2.032 s
17:10:26 test438923(org.eclipse.jdt.core.tests.builder.MultiProjectTests)  Time elapsed: 0.975 s
17:10:26 test461074(org.eclipse.jdt.core.tests.builder.MultiProjectTests)  Time elapsed: 1.088 s
17:10:26 test461074_error(org.eclipse.jdt.core.tests.builder.MultiProjectTests)  Time elapsed: 1.021 s
17:10:26 test0001(org.eclipse.jdt.core.tests.builder.MultiSourceFolderAndOutputFolderTests)  Time elapsed: 0.073 s
17:10:26 test0002(org.eclipse.jdt.core.tests.builder.MultiSourceFolderAndOutputFolderTests)  Time elapsed: 0.081 s
17:10:26 test0003(org.eclipse.jdt.core.tests.builder.MultiSourceFolderAndOutputFolderTests)  Time elapsed: 0.014 s
17:10:26 test0004(org.eclipse.jdt.core.tests.builder.MultiSourceFolderAndOutputFolderTests)  Time elapsed: 0.012 s
17:10:26 test0005(org.eclipse.jdt.core.tests.builder.MultiSourceFolderAndOutputFolderTests)  Time elapsed: 0.095 s
17:10:26 test0006(org.eclipse.jdt.core.tests.builder.MultiSourceFolderAndOutputFolderTests)  Time elapsed: 0.089 s
17:10:26 test0007(org.eclipse.jdt.core.tests.builder.MultiSourceFolderAndOutputFolderTests)  Time elapsed: 0.084 s
17:10:26 test0008(org.eclipse.jdt.core.tests.builder.MultiSourceFolderAndOutputFolderTests)  Time elapsed: 0.08 s
17:10:26 test0009(org.eclipse.jdt.core.tests.builder.MultiSourceFolderAndOutputFolderTests)  Time elapsed: 0.094 s
17:10:26 test0010(org.eclipse.jdt.core.tests.builder.MultiSourceFolderAndOutputFolderTests)  Time elapsed: 0.14 s
17:10:26 test0011(org.eclipse.jdt.core.tests.builder.MultiSourceFolderAndOutputFolderTests)  Time elapsed: 0.123 s
17:10:26 test0012(org.eclipse.jdt.core.tests.builder.MultiSourceFolderAndOutputFolderTests)  Time elapsed: 0.075 s
17:10:26 testChangeOutputFolder(org.eclipse.jdt.core.tests.builder.OutputFolderTests)  Time elapsed: 0.173 s
17:10:26 testDeleteOutputFolder(org.eclipse.jdt.core.tests.builder.OutputFolderTests)  Time elapsed: 0.07 s
17:10:26 testInvalidOutput(org.eclipse.jdt.core.tests.builder.OutputFolderTests)  Time elapsed: 0.069 s
17:10:26 testSimpleProject(org.eclipse.jdt.core.tests.builder.OutputFolderTests)  Time elapsed: 0.066 s
17:10:26 testProjectWithBin(org.eclipse.jdt.core.tests.builder.OutputFolderTests)  Time elapsed: 0.072 s
17:10:26 testProjectWithSrcBin(org.eclipse.jdt.core.tests.builder.OutputFolderTests)  Time elapsed: 0.074 s
17:10:26 testProjectWith2SrcBin(org.eclipse.jdt.core.tests.builder.OutputFolderTests)  Time elapsed: 0.078 s
17:10:26 testProjectWith2SrcAsBin(org.eclipse.jdt.core.tests.builder.OutputFolderTests)  Time elapsed: 0.087 s
17:10:26 testProjectWith2Src2Bin(org.eclipse.jdt.core.tests.builder.OutputFolderTests)  Time elapsed: 0.075 s
17:10:26 testProjectWith3Src2Bin(org.eclipse.jdt.core.tests.builder.OutputFolderTests)  Time elapsed: 0.074 s
17:10:26 test2ProjectWith1Bin(org.eclipse.jdt.core.tests.builder.OutputFolderTests)  Time elapsed: 0.145 s
17:10:26 testPackageProblem(org.eclipse.jdt.core.tests.builder.PackageTests)  Time elapsed: 0.155 s
17:10:26 testNoPackageProblem(org.eclipse.jdt.core.tests.builder.PackageTests)  Time elapsed: 0.113 s
17:10:26 test001(org.eclipse.jdt.core.tests.builder.PackageTests)  Time elapsed: 0.119 s
17:10:26 test002(org.eclipse.jdt.core.tests.builder.PackageTests)  Time elapsed: 0.133 s
17:10:26 testBoolean(org.eclipse.jdt.core.tests.builder.StaticFinalTests)  Time elapsed: 0.416 s
17:10:26 testByte(org.eclipse.jdt.core.tests.builder.StaticFinalTests)  Time elapsed: 0.419 s
17:10:26 testChar(org.eclipse.jdt.core.tests.builder.StaticFinalTests)  Time elapsed: 0.444 s
17:10:26 testDouble(org.eclipse.jdt.core.tests.builder.StaticFinalTests)  Time elapsed: 0.417 s
17:10:26 testFloat(org.eclipse.jdt.core.tests.builder.StaticFinalTests)  Time elapsed: 0.425 s
17:10:26 testInt(org.eclipse.jdt.core.tests.builder.StaticFinalTests)  Time elapsed: 0.415 s
17:10:26 testLong(org.eclipse.jdt.core.tests.builder.StaticFinalTests)  Time elapsed: 0.411 s
17:10:26 testShort(org.eclipse.jdt.core.tests.builder.StaticFinalTests)  Time elapsed: 0.398 s
17:10:26 testString(org.eclipse.jdt.core.tests.builder.StaticFinalTests)  Time elapsed: 0.421 s
17:10:26 test001(org.eclipse.jdt.core.tests.builder.GetResourcesTests)  Time elapsed: 0.127 s
17:10:26 test002(org.eclipse.jdt.core.tests.builder.GetResourcesTests)  Time elapsed: 0.127 s
17:10:26 test003(org.eclipse.jdt.core.tests.builder.GetResourcesTests)  Time elapsed: 0.125 s
17:10:26 test004(org.eclipse.jdt.core.tests.builder.GetResourcesTests)  Time elapsed: 0.136 s
17:10:26 test005(org.eclipse.jdt.core.tests.builder.GetResourcesTests)  Time elapsed: 0.188 s
17:10:26 test006(org.eclipse.jdt.core.tests.builder.GetResourcesTests)  Time elapsed: 0.144 s
17:10:26 test007(org.eclipse.jdt.core.tests.builder.GetResourcesTests)  Time elapsed: 0.135 s
17:10:26 test008(org.eclipse.jdt.core.tests.builder.GetResourcesTests)  Time elapsed: 0.127 s
17:10:26 test009(org.eclipse.jdt.core.tests.builder.GetResourcesTests)  Time elapsed: 0.072 s
17:10:26 test010(org.eclipse.jdt.core.tests.builder.GetResourcesTests)  Time elapsed: 0.143 s
17:10:26 test011(org.eclipse.jdt.core.tests.builder.GetResourcesTests)  Time elapsed: 0.148 s
17:10:26 test012(org.eclipse.jdt.core.tests.builder.GetResourcesTests)  Time elapsed: 0.135 s
17:10:26 test013(org.eclipse.jdt.core.tests.builder.GetResourcesTests)  Time elapsed: 0.128 s
17:10:26 test014(org.eclipse.jdt.core.tests.builder.GetResourcesTests)  Time elapsed: 0.13 s
17:10:26 test015(org.eclipse.jdt.core.tests.builder.GetResourcesTests)  Time elapsed: 0.115 s
17:10:26 test016(org.eclipse.jdt.core.tests.builder.GetResourcesTests)  Time elapsed: 0.002 s
17:10:26 testIncludes(org.eclipse.jdt.core.tests.builder.FriendDependencyTests)  Time elapsed: 0.002 s
17:10:26 testInternSimpleNames(org.eclipse.jdt.core.tests.builder.FriendDependencyTests)  Time elapsed: 0.002 s
17:10:26 testInternQualifiedNames(org.eclipse.jdt.core.tests.builder.FriendDependencyTests)  Time elapsed: 0.003 s
17:10:26 testGetReferences(org.eclipse.jdt.core.tests.builder.FriendDependencyTests)  Time elapsed: 0.002 s
17:10:26 testStringSetAdd(org.eclipse.jdt.core.tests.builder.FriendDependencyTests)  Time elapsed: 0.002 s
17:10:26 testStringSetclear(org.eclipse.jdt.core.tests.builder.FriendDependencyTests)  Time elapsed: 0.002 s
17:10:26 testStringSetNew(org.eclipse.jdt.core.tests.builder.FriendDependencyTests)  Time elapsed: 0.002 s
17:10:26 testStringSetElementSize(org.eclipse.jdt.core.tests.builder.FriendDependencyTests)  Time elapsed: 0.002 s
17:10:26 testSimpleLookupTableKeyTable(org.eclipse.jdt.core.tests.builder.FriendDependencyTests)  Time elapsed: 0.002 s
17:10:26 testSimpleLookupTableValueTable(org.eclipse.jdt.core.tests.builder.FriendDependencyTests)  Time elapsed: 0.002 s
17:10:26 testJavaModelManagerGetJavaModelManager(org.eclipse.jdt.core.tests.builder.FriendDependencyTests)  Time elapsed: 0.005 s
17:10:26 testJavaModelManagerGetLastBuiltState(org.eclipse.jdt.core.tests.builder.FriendDependencyTests)  Time elapsed: 0.002 s
17:10:26 testInternQualifiedNamesSorts_01(org.eclipse.jdt.core.tests.builder.ReferenceCollectionTest)  Time elapsed: 0.008 s
17:10:26 testInternQualifiedNamesSorts_02(org.eclipse.jdt.core.tests.builder.ReferenceCollectionTest)  Time elapsed: 0.002 s
17:10:26 testInternSimpleNamesSorts_01(org.eclipse.jdt.core.tests.builder.ReferenceCollectionTest)  Time elapsed: 0.002 s
17:10:26 testInternSimpleNamesSorts_02(org.eclipse.jdt.core.tests.builder.ReferenceCollectionTest)  Time elapsed: 0.003 s
17:10:26 testIncludesWithBinarySearch(org.eclipse.jdt.core.tests.builder.ReferenceCollectionTest)  Time elapsed: 0.002 s
17:10:26 testIncludesWithLinearSearch(org.eclipse.jdt.core.tests.builder.ReferenceCollectionTest)  Time elapsed: 0.002 s
17:10:26 testIncludes01(org.eclipse.jdt.core.tests.builder.ReferenceCollectionTest)  Time elapsed: 0.003 s
17:10:26 testIncludes02(org.eclipse.jdt.core.tests.builder.ReferenceCollectionTest)  Time elapsed: 0.002 s
17:10:26 testIncludes03(org.eclipse.jdt.core.tests.builder.ReferenceCollectionTest)  Time elapsed: 0.002 s
17:10:26 testIncludes04(org.eclipse.jdt.core.tests.builder.ReferenceCollectionTest)  Time elapsed: 0.002 s
17:10:26 testIncludesNot(org.eclipse.jdt.core.tests.builder.ReferenceCollectionTest)  Time elapsed: 0.002 s
17:10:26 testAddDependencies(org.eclipse.jdt.core.tests.builder.ReferenceCollectionTest)  Time elapsed: 0.003 s
17:10:26 testRegression01(org.eclipse.jdt.core.tests.builder.ReferenceCollectionTest)  Time elapsed: 0.002 s
17:10:26 testRegression02(org.eclipse.jdt.core.tests.builder.ReferenceCollectionTest)  Time elapsed: 0.002 s
17:10:26 testWriteAndReadState(org.eclipse.jdt.core.tests.builder.StateTest)  Time elapsed: 0.144 s
17:10:26 testWithProjectAsMainDependency(org.eclipse.jdt.core.tests.builder.TestAttributeBuilderTests)  Time elapsed: 0.14 s
17:10:26 testWithProjectAsTestDependency(org.eclipse.jdt.core.tests.builder.TestAttributeBuilderTests)  Time elapsed: 0.143 s
17:10:26 testWithProjectAsMainDependencyWithoutTestCode(org.eclipse.jdt.core.tests.builder.TestAttributeBuilderTests)  Time elapsed: 0.193 s
17:10:26 testWithProjectAsTestDependencyWithoutTestCode(org.eclipse.jdt.core.tests.builder.TestAttributeBuilderTests)  Time elapsed: 0.146 s
17:10:26 testIncrementalBuildMainChange(org.eclipse.jdt.core.tests.builder.TestAttributeBuilderTests)  Time elapsed: 0.147 s
17:10:26 testIncrementalBuildTestChange(org.eclipse.jdt.core.tests.builder.TestAttributeBuilderTests)  Time elapsed: 0.141 s
17:10:26 testIncrementalBuildTestOnlyProject(org.eclipse.jdt.core.tests.builder.TestAttributeBuilderTests)  Time elapsed: 0.067 s
17:10:26 testClasspathEntryTestAttributeChanges(org.eclipse.jdt.core.tests.builder.TestAttributeBuilderTests)  Time elapsed: 0.365 s
17:10:26 testExternalTestJarChanged(org.eclipse.jdt.core.tests.builder.TestAttributeBuilderTests)  Time elapsed: 2.129 s
17:10:26 testBug536868(org.eclipse.jdt.core.tests.builder.TestAttributeBuilderTests)  Time elapsed: 0.156 s
17:10:26 testBug530366(org.eclipse.jdt.core.tests.builder.Bug530366Test)  Time elapsed: 0.187 s
17:10:26 testBug531382(org.eclipse.jdt.core.tests.builder.Bug531382Test)  Time elapsed: 0.176 s
17:10:26 testBug549457(org.eclipse.jdt.core.tests.builder.Bug549457Test)  Time elapsed: 4.4 s
17:10:26 testLeaksOnCleanBuild(org.eclipse.jdt.core.tests.builder.LeakTestsBefore9)  Time elapsed: 0.152 s
17:10:26 testLeaksOnFullBuild(org.eclipse.jdt.core.tests.builder.LeakTestsBefore9)  Time elapsed: 0.134 s
17:10:26 testLeaksOnIncrementalBuild(org.eclipse.jdt.core.tests.builder.LeakTestsBefore9)  Time elapsed: 0.154 s
17:10:26 testAnnotation(org.eclipse.jdt.core.tests.builder.Java50Tests)  Time elapsed: 0.16 s
17:10:26 testHierarchyCycle(org.eclipse.jdt.core.tests.builder.Java50Tests)  Time elapsed: 0.113 s
17:10:26 testHierarchyCycleInstanceof(org.eclipse.jdt.core.tests.builder.Java50Tests)  Time elapsed: 0.108 s
17:10:26 testMissingRequiredBinaries(org.eclipse.jdt.core.tests.builder.Java50Tests)  Time elapsed: 0.301 s
17:10:26 testParameterizedMemberType(org.eclipse.jdt.core.tests.builder.Java50Tests)  Time elapsed: 0.163 s
17:10:26 testParameterizedType1(org.eclipse.jdt.core.tests.builder.Java50Tests)  Time elapsed: 0.118 s
17:10:26 testParameterizedType2(org.eclipse.jdt.core.tests.builder.Java50Tests)  Time elapsed: 0.185 s
17:10:26 testHierarchyNonCycle(org.eclipse.jdt.core.tests.builder.Java50Tests)  Time elapsed: 0.094 s
17:10:26 testHierarchyNonCycle2(org.eclipse.jdt.core.tests.builder.Java50Tests)  Time elapsed: 0.09 s
17:10:26 test001(org.eclipse.jdt.core.tests.builder.PackageInfoTest)  Time elapsed: 0.127 s
17:10:26 test002(org.eclipse.jdt.core.tests.builder.PackageInfoTest)  Time elapsed: 0.383 s
17:10:26 test003(org.eclipse.jdt.core.tests.builder.PackageInfoTest)  Time elapsed: 0.126 s
17:10:26 test004(org.eclipse.jdt.core.tests.builder.PackageInfoTest)  Time elapsed: 0.207 s
17:10:26 test258145(org.eclipse.jdt.core.tests.builder.PackageInfoTest)  Time elapsed: 0.416 s
17:10:26 test323785(org.eclipse.jdt.core.tests.builder.PackageInfoTest)  Time elapsed: 0.13 s
17:10:26 test323785a(org.eclipse.jdt.core.tests.builder.PackageInfoTest)  Time elapsed: 0.135 s
17:10:26 testBug372012(org.eclipse.jdt.core.tests.builder.PackageInfoTest)  Time elapsed: 0.156 s
17:10:26 testBug372012a(org.eclipse.jdt.core.tests.builder.PackageInfoTest)  Time elapsed: 0.211 s
17:10:26 testBug372012b(org.eclipse.jdt.core.tests.builder.PackageInfoTest)  Time elapsed: 0.151 s
17:10:26 testBug372012c(org.eclipse.jdt.core.tests.builder.PackageInfoTest)  Time elapsed: 0.156 s
17:10:26 testBug367836(org.eclipse.jdt.core.tests.builder.PackageInfoTest)  Time elapsed: 0.11 s
17:10:26 testBug374063(org.eclipse.jdt.core.tests.builder.PackageInfoTest)  Time elapsed: 0.193 s
17:10:26 testBug382960(org.eclipse.jdt.core.tests.builder.PackageInfoTest)  Time elapsed: 0.154 s
17:10:26 testBug525469(org.eclipse.jdt.core.tests.builder.PackageInfoTest)  Time elapsed: 0.25 s
17:10:26 testBuildStarting(org.eclipse.jdt.core.tests.builder.ParticipantBuildTests)  Time elapsed: 0.12 s
17:10:26 testDefaultValue(org.eclipse.jdt.core.tests.builder.ParticipantBuildTests)  Time elapsed: 0.301 s
17:10:26 testParticipantProblems(org.eclipse.jdt.core.tests.builder.ParticipantBuildTests)  Time elapsed: 0.119 s
17:10:26 testProcessAnnotationDeclarations(org.eclipse.jdt.core.tests.builder.ParticipantBuildTests)  Time elapsed: 0.12 s
17:10:26 testProcessAnnotationQualifiedReferences(org.eclipse.jdt.core.tests.builder.ParticipantBuildTests)  Time elapsed: 0.119 s
17:10:26 testProcessAnnotationReferences(org.eclipse.jdt.core.tests.builder.ParticipantBuildTests)  Time elapsed: 0.112 s
17:10:26 testResolvedMethod(org.eclipse.jdt.core.tests.builder.ParticipantBuildTests)  Time elapsed: 0.217 s
17:10:26 test1001(org.eclipse.jdt.core.tests.builder.ParticipantBuildTests)  Time elapsed: 0.116 s
17:10:26 test1002(org.eclipse.jdt.core.tests.builder.ParticipantBuildTests)  Time elapsed: 0.112 s
17:10:26 testTypeAnnotationDependency(org.eclipse.jdt.core.tests.builder.AnnotationDependencyTests)  Time elapsed: 0.136 s
17:10:26 testFieldAnnotationDependency(org.eclipse.jdt.core.tests.builder.AnnotationDependencyTests)  Time elapsed: 0.135 s
17:10:26 testMethodAnnotationDependency(org.eclipse.jdt.core.tests.builder.AnnotationDependencyTests)  Time elapsed: 0.135 s
17:10:26 testInnerTypeAnnotationDependency(org.eclipse.jdt.core.tests.builder.AnnotationDependencyTests)  Time elapsed: 0.136 s
17:10:26 testUnrelatedTypeAnnotationDependency(org.eclipse.jdt.core.tests.builder.AnnotationDependencyTests)  Time elapsed: 0.135 s
17:10:26 testPackageInfoDependency(org.eclipse.jdt.core.tests.builder.AnnotationDependencyTests)  Time elapsed: 0.131 s
17:10:26 testTypeAnnotationDependency2(org.eclipse.jdt.core.tests.builder.AnnotationDependencyTests)  Time elapsed: 0.135 s
17:10:26 testTypeAnnotationDependency3(org.eclipse.jdt.core.tests.builder.AnnotationDependencyTests)  Time elapsed: 0.153 s
17:10:26 testTypeAnnotationDependency4(org.eclipse.jdt.core.tests.builder.AnnotationDependencyTests)  Time elapsed: 0.134 s
17:10:26 testTypeAnnotationDependency5(org.eclipse.jdt.core.tests.builder.AnnotationDependencyTests)  Time elapsed: 0.184 s
17:10:26 testTypeAnnotationDependency6(org.eclipse.jdt.core.tests.builder.AnnotationDependencyTests)  Time elapsed: 0.142 s
17:10:26 testTypeAnnotationDependency7(org.eclipse.jdt.core.tests.builder.AnnotationDependencyTests)  Time elapsed: 0.134 s
17:10:26 testTypeAnnotationDependency8(org.eclipse.jdt.core.tests.builder.AnnotationDependencyTests)  Time elapsed: 0.131 s
17:10:26 testTypeAnnotationDependency9(org.eclipse.jdt.core.tests.builder.AnnotationDependencyTests)  Time elapsed: 0.134 s
17:10:26 testTypeAnnotationDependency10(org.eclipse.jdt.core.tests.builder.AnnotationDependencyTests)  Time elapsed: 0.132 s
17:10:26 testTypeAnnotationDependency11(org.eclipse.jdt.core.tests.builder.AnnotationDependencyTests)  Time elapsed: 0.135 s
17:10:26 testTypeAnnotationDependency12(org.eclipse.jdt.core.tests.builder.AnnotationDependencyTests)  Time elapsed: 0.138 s
17:10:26 testTypeAnnotationDependency13(org.eclipse.jdt.core.tests.builder.AnnotationDependencyTests)  Time elapsed: 0.136 s
17:10:26 testTypeAnnotationDependency14(org.eclipse.jdt.core.tests.builder.AnnotationDependencyTests)  Time elapsed: 0.145 s
17:10:26 testTypeAnnotationDependency15(org.eclipse.jdt.core.tests.builder.AnnotationDependencyTests)  Time elapsed: 0.156 s
17:10:26 testTypeAnnotationDependency16(org.eclipse.jdt.core.tests.builder.AnnotationDependencyTests)  Time elapsed: 0.158 s
17:10:26 testTypeAnnotationDependency17(org.eclipse.jdt.core.tests.builder.AnnotationDependencyTests)  Time elapsed: 0.146 s
17:10:26 testTypeAnnotationDependency18(org.eclipse.jdt.core.tests.builder.AnnotationDependencyTests)  Time elapsed: 0.14 s
17:10:26 testTypeAnnotationDependency19(org.eclipse.jdt.core.tests.builder.AnnotationDependencyTests)  Time elapsed: 0.144 s
17:10:26 testTypeAnnotationDependency20(org.eclipse.jdt.core.tests.builder.AnnotationDependencyTests)  Time elapsed: 0.172 s
17:10:26 testTypeAnnotationDependency21(org.eclipse.jdt.core.tests.builder.AnnotationDependencyTests)  Time elapsed: 0.155 s
17:10:26 testTypeAnnotationDependency22(org.eclipse.jdt.core.tests.builder.AnnotationDependencyTests)  Time elapsed: 0.141 s
17:10:26 testTypeAnnotationDependency23(org.eclipse.jdt.core.tests.builder.AnnotationDependencyTests)  Time elapsed: 0.159 s
17:10:26 testTypeAnnotationDependency24(org.eclipse.jdt.core.tests.builder.AnnotationDependencyTests)  Time elapsed: 0.145 s
17:10:26 testTypeAnnotationDependency25(org.eclipse.jdt.core.tests.builder.AnnotationDependencyTests)  Time elapsed: 0.154 s
17:10:26 testTypeAnnotationDependency26(org.eclipse.jdt.core.tests.builder.AnnotationDependencyTests)  Time elapsed: 0.153 s
17:10:26 testTypeAnnotationDependency27(org.eclipse.jdt.core.tests.builder.AnnotationDependencyTests)  Time elapsed: 0.153 s
17:10:26 testParameterAnnotationDependency01(org.eclipse.jdt.core.tests.builder.AnnotationDependencyTests)  Time elapsed: 0.165 s
17:10:26 testReturnAnnotationDependency01(org.eclipse.jdt.core.tests.builder.AnnotationDependencyTests)  Time elapsed: 0.163 s
17:10:26 testReturnAnnotationDependency02(org.eclipse.jdt.core.tests.builder.AnnotationDependencyTests)  Time elapsed: 0.188 s
17:10:26 test411771a(org.eclipse.jdt.core.tests.builder.AnnotationDependencyTests)  Time elapsed: 0.163 s
17:10:26 test411771b(org.eclipse.jdt.core.tests.builder.AnnotationDependencyTests)  Time elapsed: 0.165 s
17:10:26 test411771c(org.eclipse.jdt.core.tests.builder.AnnotationDependencyTests)  Time elapsed: 0.15 s
17:10:26 testCompilerRegression(org.eclipse.jdt.core.tests.builder.Bug544921Test)  Time elapsed: 0.078 s
17:10:26 testBuildLargeFile_01(org.eclipse.jdt.core.tests.builder.Bug544921Test)  Time elapsed: 0.207 s
17:10:26 testBuildLargeFile_02(org.eclipse.jdt.core.tests.builder.Bug544921Test)  Time elapsed: 2.73 s
17:10:26 testBuildLargeFile_03(org.eclipse.jdt.core.tests.builder.Bug544921Test)  Time elapsed: 3.062 s
17:10:26 testBuildLargeFile_04(org.eclipse.jdt.core.tests.builder.Bug544921Test)  Time elapsed: 0.003 s
17:10:26 testBuildLargeFile_05(org.eclipse.jdt.core.tests.builder.Bug544921Test)  Time elapsed: 0.002 s
17:10:26 testBuildLargeFile_08(org.eclipse.jdt.core.tests.builder.Bug544921Test)  Time elapsed: 0.003 s
17:10:26 testBuildLargeFile_10(org.eclipse.jdt.core.tests.builder.Bug544921Test)  Time elapsed: 0.003 s
17:10:26 testLeaksOnCleanBuild(org.eclipse.jdt.core.tests.builder.LeakTestsAfter9)  Time elapsed: 0.168 s
17:10:26 testLeaksOnFullBuild(org.eclipse.jdt.core.tests.builder.LeakTestsAfter9)  Time elapsed: 0.135 s
17:10:26 testLeaksOnIncrementalBuild(org.eclipse.jdt.core.tests.builder.LeakTestsAfter9)  Time elapsed: 0.119 s
17:10:26 testCompilerRegression(org.eclipse.jdt.core.tests.builder.Bug549646Test)  Time elapsed: 0.166 s
17:10:26 
17:10:26 Results:
17:10:26 
17:10:26 Failures: 
17:10:26   IncrementalTests18>TestCase.runTest:964->testBug481276a:598->BuilderTests.expectingProblemsFor:342->BuilderTests.expectingProblemsFor:349->TestCase.assumeEquals:295->TestCase.assertStringEquals:275 Invalid problem(s)!!!.
17:10:26 ----------- Expected ------------
17:10:26 Problem : Dead code [ resource : </Project/src/testNullAnnotations/NonNullUtils.java> range : <145,202> category : <90> severity : <1>]
17:10:26 Problem : Null type mismatch (type annotations): required '@NonNull Object @NonNull[]' but this expression has type '@NonNull Object @Nullable[]' [ resource : </Project/src/testNullAnnotations/Snippet.java> range : <316,323> category : <90> severity : <2>]
17:10:26 ------------ but was ------------
17:10:26 Problem : Dead code [ resource : </Project/src/testNullAnnotations/NonNullUtils.java> range : <145,202> category : <90> severity : <1>]
17:10:26 Problem : Null type mismatch: required '@NonNull Object @NonNull[]' but the provided value is null [ resource : </Project/src/testNullAnnotations/Snippet.java> range : <316,323> category : <90> severity : <2>]
17:10:26 --------- Difference is ----------
17:10:26  expected:<...: Null type mismatch[ (type annotations): required '@NonNull Object @NonNull[]' but this expression has type '@NonNull Object @Nullable[]'] [ resource : </Proj...> but was:<...: Null type mismatch[: required '@NonNull Object @NonNull[]' but the provided value is null] [ resource : </Proj...>
17:10:26 
17:10:26 Tests run: 338, Failures: 1, Errors: 0, Skipped: 0
17:10:26 
17:10:28 [INFO] ------------------------------------------------------------------------
17:10:28 [INFO] Reactor Summary:
17:10:28 [INFO] 
17:10:28 [INFO] eclipse.jdt.core 4.13.0-SNAPSHOT ................... SUCCESS [  9.758 s]
17:10:28 [INFO] org.eclipse.jdt.annotation 2.2.300-SNAPSHOT ........ SUCCESS [ 31.048 s]
17:10:28 [INFO] org.eclipse.jdt.annotation 1.1.400-SNAPSHOT ........ SUCCESS [ 10.968 s]
17:10:28 [INFO] org.eclipse.jdt.core 3.19.0-SNAPSHOT ............... SUCCESS [01:06 min]
17:10:28 [INFO] org.eclipse.jdt.compiler.tool 1.2.600-SNAPSHOT ..... SUCCESS [ 15.328 s]
17:10:28 [INFO] org.eclipse.jdt.compiler.apt 1.3.700-SNAPSHOT ...... SUCCESS [ 26.176 s]
17:10:28 [INFO] org.eclipse.jdt.core.tests.compiler 3.12.950-SNAPSHOT SUCCESS [06:31 min]
17:10:28 [INFO] org.eclipse.jdt.compiler.tool.tests 1.2.500-SNAPSHOT SUCCESS [ 18.595 s]
17:10:28 [INFO] org.eclipse.jdt.core.tests.builder 3.10.700-SNAPSHOT FAILURE [02:19 min]
17:10:28 [INFO] org.eclipse.jdt.compiler.apt.tests 1.1.800-SNAPSHOT  SKIPPED
17:10:28 [INFO] org.eclipse.jdt.core.tests.model 3.10.950-SNAPSHOT . SKIPPED
17:10:28 [INFO] org.eclipse.jdt.core.tests.performance 3.10.600-SNAPSHOT SKIPPED
17:10:28 [INFO] org.eclipse.jdt.apt.core 3.6.500-SNAPSHOT .......... SKIPPED
17:10:28 [INFO] org.eclipse.jdt.apt.pluggable.core 1.2.400-SNAPSHOT  SKIPPED
17:10:28 [INFO] org.eclipse.jdt.apt.ui 3.6.300-SNAPSHOT ............ SKIPPED
17:10:28 [INFO] org.eclipse.jdt.apt.pluggable.tests 3.4.600-SNAPSHOT SKIPPED
17:10:28 [INFO] org.eclipse.jdt.apt.tests 3.4.500-SNAPSHOT ......... SKIPPED
17:10:28 [INFO] ------------------------------------------------------------------------
17:10:28 [INFO] BUILD FAILURE
17:10:28 [INFO] ------------------------------------------------------------------------
17:10:28 [INFO] Total time:  13:36 min
17:10:28 [INFO] Finished at: 2019-08-17T17:10:28-04:00
17:10:28 [INFO] ------------------------------------------------------------------------
17:10:28 [ERROR] Failed to execute goal org.eclipse.tycho:tycho-surefire-plugin:1.5.0-SNAPSHOT:test (default-test) on project org.eclipse.jdt.core.tests.builder: There are test failures.
17:10:28 [ERROR] 
17:10:28 [ERROR] Please refer to /jobs/genie.jdt/eclipse.jdt.core-Gerrit/workspace/org.eclipse.jdt.core.tests.builder/target/surefire-reports for the individual test results.
17:10:28 [ERROR] -> [Help 1]
17:10:28 [ERROR] 
17:10:28 [ERROR] To see the full stack trace of the errors, re-run Maven with the -e switch.
17:10:28 [ERROR] Re-run Maven using the -X switch to enable full debug logging.
17:10:28 [ERROR] 
17:10:28 [ERROR] For more information about the errors and possible solutions, please read the following articles:
17:10:28 [ERROR] [Help 1] http://cwiki.apache.org/confluence/display/MAVEN/MojoFailureException
17:10:28 [ERROR] 
17:10:28 [ERROR] After correcting the problems, you can resume the build with the command
17:10:28 [ERROR]   mvn <goals> -rf :org.eclipse.jdt.core.tests.builder
17:10:30 Build step 'Invoke top-level Maven targets' marked build as failure
17:10:30 Recording test results
17:10:32 Archiving artifacts
17:10:33 Started calculate disk usage of build
17:10:33 Finished Calculation of disk usage of build in 0 seconds
17:10:36 Started calculate disk usage of workspace
17:10:36 Finished Calculation of disk usage of workspace in 0 seconds
17:10:37 Finished: FAILURE