Console Output

08:52:33 Triggered by Gerrit: https://git.eclipse.org/r/c/jdt/eclipse.jdt.core/+/192282
08:52:33 Running as SYSTEM
08:52:34 Agent centos-7-7v38q is provisioned from template centos-7
08:52:34 ---
08:52:34 apiVersion: "v1"
08:52:34 kind: "Pod"
08:52:34 metadata:
08:52:34   annotations: {}
08:52:34   labels:
08:52:34     jenkins: "slave"
08:52:34     jenkins/label-digest: "55a177a28a71a1957f582df488f25d8c2f70df30"
08:52:34     jenkins/label: "migration_jipp-migration_centos-7"
08:52:34   name: "centos-7-7v38q"
08:52:34 spec:
08:52:34   containers:
08:52:34   - env:
08:52:34     - name: "JENKINS_SECRET"
08:52:34       value: "********"
08:52:34     - name: "JENKINS_TUNNEL"
08:52:34       value: "jenkins-discovery.jdt.svc.cluster.local:50000"
08:52:34     - name: "JENKINS_AGENT_NAME"
08:52:34       value: "centos-7-7v38q"
08:52:34     - name: "JENKINS_REMOTING_JAVA_OPTS"
08:52:34       value: "-showversion -XshowSettings:vm -Xmx256m -Dorg.jenkinsci.remoting.engine.JnlpProtocol3.disabled=true\
08:52:34         \ -Dorg.jenkinsci.plugins.gitclient.CliGitAPIImpl.useSETSID=true"
08:52:34     - name: "JAVA_TOOL_OPTIONS"
08:52:34       value: ""
08:52:34     - name: "_JAVA_OPTIONS"
08:52:34       value: ""
08:52:34     - name: "OPENJ9_JAVA_OPTIONS"
08:52:34       value: "-XX:+IgnoreUnrecognizedVMOptions -XX:+IdleTuningCompactOnIdle -XX:+IdleTuningGcOnIdle"
08:52:34     - name: "JENKINS_NAME"
08:52:34       value: "centos-7-7v38q"
08:52:34     - name: "JENKINS_AGENT_WORKDIR"
08:52:34       value: "/home/jenkins/agent"
08:52:34     - name: "JENKINS_URL"
08:52:34       value: "http://jenkins-ui.jdt.svc.cluster.local/jdt/"
08:52:34     image: "docker.io/eclipsecbi/jiro-agent-centos-7:remoting-4.11.2"
08:52:34     imagePullPolicy: "Always"
08:52:34     name: "jnlp"
08:52:34     resources:
08:52:34       limits:
08:52:34         cpu: "2000m"
08:52:34         memory: "4096Mi"
08:52:34       requests:
08:52:34         cpu: "1000m"
08:52:34         memory: "4096Mi"
08:52:34     tty: true
08:52:34     volumeMounts:
08:52:34     - mountPath: "/home/jenkins/.m2/toolchains.xml"
08:52:34       name: "m2-dir"
08:52:34       readOnly: true
08:52:34       subPath: "toolchains.xml"
08:52:34     - mountPath: "/home/jenkins/.mavenrc"
08:52:34       name: "m2-dir"
08:52:34       readOnly: true
08:52:34       subPath: ".mavenrc"
08:52:34     - mountPath: "/opt/tools"
08:52:34       name: "volume-0"
08:52:34       readOnly: false
08:52:34     - mountPath: "/home/jenkins"
08:52:34       name: "volume-2"
08:52:34       readOnly: false
08:52:34     - mountPath: "/home/jenkins/.m2/repository"
08:52:34       name: "volume-3"
08:52:34       readOnly: false
08:52:34     - mountPath: "/home/jenkins/.m2/settings-security.xml"
08:52:34       name: "m2-secret-dir"
08:52:34       readOnly: true
08:52:34       subPath: "settings-security.xml"
08:52:34     - mountPath: "/home/jenkins/.m2/wrapper"
08:52:34       name: "volume-4"
08:52:34       readOnly: false
08:52:34     - mountPath: "/home/jenkins/.m2/settings.xml"
08:52:34       name: "m2-secret-dir"
08:52:34       readOnly: true
08:52:34       subPath: "settings.xml"
08:52:34     - mountPath: "/home/jenkins/.ssh"
08:52:34       name: "volume-1"
08:52:34       readOnly: false
08:52:34       subPath: ""
08:52:34     - mountPath: "/home/jenkins/agent"
08:52:34       name: "workspace-volume"
08:52:34       readOnly: false
08:52:34     workingDir: "/home/jenkins/agent"
08:52:34   nodeSelector:
08:52:34     kubernetes.io/os: "linux"
08:52:34   restartPolicy: "Never"
08:52:34   volumes:
08:52:34   - name: "volume-0"
08:52:34     persistentVolumeClaim:
08:52:34       claimName: "tools-claim-jiro-jdt"
08:52:34       readOnly: true
08:52:34   - name: "m2-secret-dir"
08:52:34     secret:
08:52:34       secretName: "m2-secret-dir"
08:52:34   - emptyDir:
08:52:34       medium: ""
08:52:34     name: "volume-2"
08:52:34   - configMap:
08:52:34       name: "m2-dir"
08:52:34     name: "m2-dir"
08:52:34   - configMap:
08:52:34       name: "known-hosts"
08:52:34     name: "volume-1"
08:52:34   - emptyDir:
08:52:34       medium: ""
08:52:34     name: "workspace-volume"
08:52:34   - emptyDir:
08:52:34       medium: ""
08:52:34     name: "volume-4"
08:52:34   - emptyDir:
08:52:34       medium: ""
08:52:34     name: "volume-3"
08:52:34 
08:52:34 Building remotely on centos-7-7v38q (centos-7 jipp-migration migration) in workspace /home/jenkins/agent/workspace/eclipse.jdt.core-Gerrit
08:52:34 [WS-CLEANUP] Deleting project workspace...
08:52:34 [WS-CLEANUP] Deferred wipeout is used...
08:52:35 The recommended git tool is: NONE
08:52:37 using credential gerrit-http-login
08:52:37 Cloning the remote Git repository
08:52:37 Cloning repository https://git.eclipse.org/r/jdt/eclipse.jdt.core.git
08:52:37  > git init /home/jenkins/agent/workspace/eclipse.jdt.core-Gerrit # timeout=10
08:52:37 Fetching upstream changes from https://git.eclipse.org/r/jdt/eclipse.jdt.core.git
08:52:37  > git --version # timeout=10
08:52:37  > git --version # 'git version 1.8.3.1'
08:52:37 using GIT_ASKPASS to set credentials Gerrit HTTP Login
08:52:37  > git fetch --tags --progress https://git.eclipse.org/r/jdt/eclipse.jdt.core.git +refs/heads/*:refs/remotes/origin/* # timeout=10
08:53:03  > git config remote.origin.url https://git.eclipse.org/r/jdt/eclipse.jdt.core.git # timeout=10
08:53:03  > git config --add remote.origin.fetch +refs/heads/*:refs/remotes/origin/* # timeout=10
08:53:03  > git config remote.origin.url https://git.eclipse.org/r/jdt/eclipse.jdt.core.git # timeout=10
08:53:03 Fetching upstream changes from https://git.eclipse.org/r/jdt/eclipse.jdt.core.git
08:53:03 using GIT_ASKPASS to set credentials Gerrit HTTP Login
08:53:03  > git fetch --tags --progress https://git.eclipse.org/r/jdt/eclipse.jdt.core.git refs/changes/82/192282/1 # timeout=10
08:53:05  > git rev-parse 14df0e75ba68d473d455a352060619f4749a1887^{commit} # timeout=10
08:53:05 JENKINS-19022: warning: possible memory leak due to Git plugin usage; see: https://plugins.jenkins.io/git/#remove-git-plugin-buildsbybranch-builddata-script
08:53:05 Checking out Revision 14df0e75ba68d473d455a352060619f4749a1887 (refs/changes/82/192282/1)
08:53:05  > git config core.sparsecheckout # timeout=10
08:53:05  > git checkout -f 14df0e75ba68d473d455a352060619f4749a1887 # timeout=10
08:53:09 Commit message: "Bug 564875 - [content assist] tweak relevances for substring/subword constructor completion Change-Id: I2449459849335e65eb413c9a0792516fdaac6409 Signed-off-by: Vikas Chandra <Vikas.Chandra@in.ibm.com>"
08:53:09  > git rev-parse FETCH_HEAD^{commit} # timeout=10
08:53:10  > git rev-list --no-walk b5860cd1a0cf7b4737f50e65260cd3551c160112 # timeout=10
08:53:10 [eclipse.jdt.core-Gerrit] $ /bin/bash -x /tmp/jenkins15141275786963387481.sh
08:53:10 + echo 'Path and version of jdk-11_x64-latest:'
08:53:10 Path and version of jdk-11_x64-latest:
08:53:10 + /opt/tools/java/openjdk/jdk-11/latest/bin/java -version
08:53:10 openjdk version "11.0.2" 2019-01-15
08:53:10 OpenJDK Runtime Environment 18.9 (build 11.0.2+9)
08:53:10 OpenJDK 64-Bit Server VM 18.9 (build 11.0.2+9, mixed mode)
08:53:10 + unset JAVA_TOOL_OPTIONS
08:53:10 + echo /opt/tools/java/openjdk/jdk-11/latest/bin:/opt/tools/java/openjdk/jdk-11/latest/bin:/usr/local/sbin:/usr/local/bin:/usr/sbin:/usr/bin:/sbin:/bin
08:53:10 /opt/tools/java/openjdk/jdk-11/latest/bin:/opt/tools/java/openjdk/jdk-11/latest/bin:/usr/local/sbin:/usr/local/bin:/usr/sbin:/usr/bin:/sbin:/bin
08:53:10 + git log -10
08:53:10 commit 14df0e75ba68d473d455a352060619f4749a1887
08:53:10 Author: Vikas Chandra <Vikas.Chandra@in.ibm.com>
08:53:10 Date:   Mon Mar 28 18:22:03 2022 +0530
08:53:10 
08:53:10     Bug 564875 - [content assist] tweak relevances for substring/subword
08:53:10     constructor completion
08:53:10     Change-Id: I2449459849335e65eb413c9a0792516fdaac6409
08:53:10     Signed-off-by: Vikas Chandra <Vikas.Chandra@in.ibm.com>
08:53:10 
08:53:10 commit b5860cd1a0cf7b4737f50e65260cd3551c160112
08:53:10 Author: Jay Arthanareeswaran <jarthana@in.ibm.com>
08:53:10 Date:   Mon Mar 28 11:04:33 2022 +0530
08:53:10 
08:53:10     Bug 579430 - 9 test failures in org.eclipse.jdt.compiler.apt.tests
08:53:10     
08:53:10     Change-Id: I659505c544d27b64eaaadc67a86accc3dad053e9
08:53:10     Signed-off-by: Jay Arthanareeswaran <jarthana@in.ibm.com>
08:53:10     Reviewed-on: https://git.eclipse.org/r/c/jdt/eclipse.jdt.core/+/192276
08:53:10     Tested-by: JDT Bot <jdt-bot@eclipse.org>
08:53:10     Reviewed-by: Sravan Kumar Lakkimsetti <sravankumarl@in.ibm.com>
08:53:10 
08:53:10 commit ce86300363ead18c7997da904b08b7af9065704a
08:53:10 Author: Andrey Loskutov <loskutov@gmx.de>
08:53:10 Date:   Sat Mar 26 09:22:06 2022 +0100
08:53:10 
08:53:10     Bug 578242 - fixed broken javadoc
08:53:10     
08:53:10     Change-Id: I91126033aeb16fa4962525222c0b0568f927148a
08:53:10     Reviewed-on: https://git.eclipse.org/r/c/jdt/eclipse.jdt.core/+/192267
08:53:10     Tested-by: JDT Bot <jdt-bot@eclipse.org>
08:53:10     Reviewed-by: Andrey Loskutov <loskutov@gmx.de>
08:53:10 
08:53:10 commit a5b99904062239a3369d38c56bd932f1f1b5dd6a
08:53:10 Author: Andrey Loskutov <loskutov@gmx.de>
08:53:10 Date:   Sat Mar 26 09:00:15 2022 +0100
08:53:10 
08:53:10     Bug 579375 - NPE in CompilationUnitResolver.getProjectPath(IJavaProject)
08:53:10     
08:53:10     - don't resolve getLocation()
08:53:10     - don't use IPath.toString(), use toOSString() instead
08:53:10     
08:53:10     Change-Id: I39f5e415df42d5c77cbe7ac32c48886d749ef776
08:53:10     Reviewed-on: https://git.eclipse.org/r/c/jdt/eclipse.jdt.core/+/192266
08:53:10     Tested-by: JDT Bot <jdt-bot@eclipse.org>
08:53:10     Reviewed-by: Andrey Loskutov <loskutov@gmx.de>
08:53:10 
08:53:10 commit 06c1e08946f98899d370df3c4d8315b5de83d8f2
08:53:10 Author: Simeon Andreev <simeon.danailov.andreev@gmail.com>
08:53:10 Date:   Fri Mar 25 11:08:13 2022 +0100
08:53:10 
08:53:10     Bug 479451 - Fix fails in ModuleBuilderTests due to new warning marker
08:53:10     
08:53:10     With changes for bug 479451, a new warning marker was introduced for
08:53:10     projects without explicit default encoding.
08:53:10     
08:53:10     This marker causes a few fails in JDT ModuleBuilderTests, where tests
08:53:10     expect a specific set of markers and fail due to the new marker. To fix
08:53:10     this, the change ensures test projects that are "imported" from a
08:53:10     template also have an explicit default encoding. To make sure tests will
08:53:10     not interfere with encoding changes reported by CharsetDeltaJob, the
08:53:10     test waits now on this job too.
08:53:10     
08:53:10     It also turned out, that DeltaProcessor.updateCurrentDeltaAndIndex() had
08:53:10     an issue reporting "close" deltas on projects with explicit encoding set
08:53:10     - instead, it reported content change. This is also fixed now.
08:53:10     
08:53:10     Change-Id: Ia0ec4d19bad2e8495675c4c77d6a7f7e1138e864
08:53:10     Signed-off-by: Simeon Andreev <simeon.danailov.andreev@gmail.com>
08:53:10     Reviewed-on: https://git.eclipse.org/r/c/jdt/eclipse.jdt.core/+/192239
08:53:10     Tested-by: JDT Bot <jdt-bot@eclipse.org>
08:53:10     Reviewed-by: Andrey Loskutov <loskutov@gmx.de>
08:53:10 
08:53:10 commit 854c076154847359df98d22fb312722d0655027c
08:53:10 Author: Snjezana Peco <snjezana.peco@redhat.com>
08:53:10 Date:   Wed Mar 23 21:31:29 2022 +0100
08:53:10 
08:53:10     Bug 579375 - CompilationUnitResolver.getProjectPath(IJavaProject) is not correct
08:53:10     
08:53:10     Change-Id: Ib540ad7114a00d8e3c93aa4e21e269746a30d6a7
08:53:10     Reviewed-on: https://git.eclipse.org/r/c/jdt/eclipse.jdt.core/+/192199
08:53:10     Tested-by: Sravan Kumar Lakkimsetti <sravankumarl@in.ibm.com>
08:53:10     Reviewed-by: Sravan Kumar Lakkimsetti <sravankumarl@in.ibm.com>
08:53:10     Reviewed-by: Jay Arthanareeswaran <jarthana@in.ibm.com>
08:53:10 
08:53:10 commit 3f6dff4588bf86e2acd51d20ac452a993a2a9aee
08:53:10 Author: Jay Arthanareeswaran <jarthana@in.ibm.com>
08:53:10 Date:   Wed Mar 23 17:49:09 2022 +0530
08:53:10 
08:53:10     Bug 577682: [18] Release Activities
08:53:10     
08:53:10     Fix API versions
08:53:10     
08:53:10     Change-Id: Ic4a956b70009d8c27a46a6aac79367c866abae17
08:53:10     Signed-off-by: Jay Arthanareeswaran <jarthana@in.ibm.com>
08:53:10     Reviewed-on: https://git.eclipse.org/r/c/jdt/eclipse.jdt.core/+/192184
08:53:10 
08:53:10 commit b1754bad44aaf79b2977b6721b0705e761e04595
08:53:10 Merge: 7b171df d3a80f1
08:53:10 Author: Jay Arthanareeswaran <jarthana@in.ibm.com>
08:53:10 Date:   Wed Mar 23 17:42:50 2022 +0530
08:53:10 
08:53:10     Bug 577682 - Merge remote-tracking branch 'origin/BETA_JAVA18'
08:53:10     
08:53:10     Change-Id: I45d53d2b43fef947c19c445d18e018fb82fa6b63
08:53:10 
08:53:10 commit d3a80f1f9b2f8ae1a0044470e640c4fd56289a5f
08:53:10 Author: Jay Arthanareeswaran <jarthana@in.ibm.com>
08:53:10 Date:   Mon Mar 21 12:08:15 2022 +0530
08:53:10 
08:53:10     Bug 577723 - [18] Remove JCP disclaimers from code, UI and marketplace
08:53:10     
08:53:10     Change-Id: Icd7556e924425e6f80fd3f1167c38146ebe06153
08:53:10     Signed-off-by: Jay Arthanareeswaran <jarthana@in.ibm.com>
08:53:10     Reviewed-on: https://git.eclipse.org/r/c/jdt/eclipse.jdt.core/+/192080
08:53:10     Tested-by: JDT Bot <jdt-bot@eclipse.org>
08:53:10 
08:53:10 commit fe9a204ea7063751cb7f46b60784e671ae0b750f
08:53:10 Author: Jay Arthanareeswaran <jarthana@in.ibm.com>
08:53:10 Date:   Wed Mar 23 14:22:14 2022 +0530
08:53:10 
08:53:10     Bug 579355 - Adding more tests
08:53:10     
08:53:10     Change-Id: I4a4b9f0c9c9d93072f83b54baddde36dd4e8e1a1
08:53:10     Signed-off-by: Jay Arthanareeswaran <jarthana@in.ibm.com>
08:53:10     Reviewed-on: https://git.eclipse.org/r/c/jdt/eclipse.jdt.core/+/192176
08:53:10     Tested-by: JDT Bot <jdt-bot@eclipse.org>
08:53:10 [eclipse.jdt.core-Gerrit] $ /opt/tools/apache-maven/latest/bin/mvn -f pom.xml -DGERRIT_BRANCH=master -DGERRIT_PATCHSET_REVISION=14df0e75ba68d473d455a352060619f4749a1887 -DGERRIT_HOST=gerrit-local -DGERRIT_CHANGE_OWNER_EMAIL=Vikas.Chandra@in.ibm.com "-DGERRIT_EVENT_ACCOUNT_NAME=Vikas Chandra" -DGERRIT_CHANGE_URL=https://git.eclipse.org/r/c/jdt/eclipse.jdt.core/+/192282 -DGERRIT_PATCHSET_UPLOADER_EMAIL=Vikas.Chandra@in.ibm.com -DGERRIT_EVENT_TYPE=patchset-created -DGERRIT_PROJECT=jdt/eclipse.jdt.core -DGERRIT_CHANGE_NUMBER=192282 -DGERRIT_SCHEME=ssh '-DGERRIT_PATCHSET_UPLOADER=\"Vikas Chandra\" <Vikas.Chandra@in.ibm.com>' -DGERRIT_PORT=29418 -DJAVA_TOOL_OPTIONS= -DGERRIT_CHANGE_PRIVATE_STATE=false -DGERRIT_REFSPEC=refs/changes/82/192282/1 "-DGERRIT_PATCHSET_UPLOADER_NAME=Vikas Chandra" '-DGERRIT_CHANGE_OWNER=\"Vikas Chandra\" <Vikas.Chandra@in.ibm.com>' -DGERRIT_CHANGE_COMMIT_MESSAGE=QnVnIDU2NDg3NSAtIFtjb250ZW50IGFzc2lzdF0gdHdlYWsgcmVsZXZhbmNlcyBmb3Igc3Vic3RyaW5nL3N1YndvcmQKY29uc3RydWN0b3IgY29tcGxldGlvbgpDaGFuZ2UtSWQ6IEkyNDQ5NDU5ODQ5MzM1ZTY1ZWI0MTNjOWEwNzkyNTE2ZmRhYWM2NDA5ClNpZ25lZC1vZmYtYnk6IFZpa2FzIENoYW5kcmEgPFZpa2FzLkNoYW5kcmFAaW4uaWJtLmNvbT4= "-DGERRIT_NAME=Eclipse Gerrit" -DGERRIT_TOPIC= "-DGERRIT_CHANGE_SUBJECT=Bug 564875 - [content assist] tweak relevances for substring/subword constructor completion Change-Id: I2449459849335e65eb413c9a0792516fdaac6409 Signed-off-by: Vikas Chandra <Vikas.Chandra@in.ibm.com>" '-DGERRIT_EVENT_ACCOUNT=\"Vikas Chandra\" <Vikas.Chandra@in.ibm.com>' -DGERRIT_CHANGE_WIP_STATE=false -DGERRIT_CHANGE_ID=I2449459849335e65eb413c9a0792516fdaac6409 -DGERRIT_EVENT_HASH=2116133026 -DGERRIT_VERSION=3.5.1 -DGERRIT_EVENT_ACCOUNT_EMAIL=Vikas.Chandra@in.ibm.com -D_JAVA_OPTIONS= -DGERRIT_PATCHSET_NUMBER=1 "-DGERRIT_CHANGE_OWNER_NAME=Vikas Chandra" -DskipTests=false -Dmaven.repo.local=/home/jenkins/agent/workspace/eclipse.jdt.core-Gerrit/.repository -U clean verify --batch-mode -Pbuild-individual-bundles -Pbree-libs -Ptest-on-javase-17 -Papi-check "-Dtycho.surefire.argLine=--add-modules ALL-SYSTEM -Dcompliance=1.8,11,17 -Djdt.performance.asserts=disabled"
08:53:10 Apache Maven 3.8.4 (9b656c72d54e5bacbed989b64718c159fe39b537)
08:53:10 Maven home: /opt/tools/apache-maven/latest
08:53:10 Java version: 11.0.2, vendor: Oracle Corporation, runtime: /opt/tools/java/openjdk/jdk-11/11.0.2+9
08:53:10 Default locale: en_US, platform encoding: UTF-8
08:53:10 OS name: "linux", version: "5.14.14-200.fc34.x86_64", arch: "amd64", family: "unix"
08:53:11 [INFO] Scanning for projects...
08:53:42 [INFO] Resolving target definition file:/home/jenkins/agent/workspace/eclipse.jdt.core-Gerrit/.repository/org/eclipse/eclipse-sdk-prereqs/4.24.0-SNAPSHOT/eclipse-sdk-prereqs-4.24.0-SNAPSHOT.target for environments=[linux/gtk/x86_64, linux/gtk/ppc64le, linux/gtk/aarch64, win32/win32/x86_64, macosx/cocoa/x86_64, macosx/cocoa/aarch64], include source mode=honor, execution environment=StandardEEResolutionHints [executionEnvironment=OSGi profile 'JavaSE-11' { source level: 11, target level: 11}], remote p2 repository options=org.eclipse.tycho.p2.remote.RemoteAgent@63d75087...
08:53:43 SLF4J: Failed to load class "org.slf4j.impl.StaticLoggerBinder".
08:53:43 SLF4J: Defaulting to no-operation (NOP) logger implementation
08:53:43 SLF4J: See http://www.slf4j.org/codes.html#StaticLoggerBinder for further details.
08:53:44 [INFO] Resolving MavenDependencyRoots = [GroupId = net.bytebuddy, ArtifactId = byte-buddy-agent, Version = 1.12.7, ArtifactType = jar, IncludeDependencyScope = , GroupId = net.bytebuddy, ArtifactId = byte-buddy, Version = 1.12.7, ArtifactType = jar, IncludeDependencyScope = , GroupId = org.assertj, ArtifactId = assertj-core, Version = 3.22.0, ArtifactType = jar, IncludeDependencyScope = , GroupId = org.objenesis, ArtifactId = objenesis, Version = 3.2, ArtifactType = jar, IncludeDependencyScope = , GroupId = org.mockito, ArtifactId = mockito-core, Version = 4.3.1, ArtifactType = jar, IncludeDependencyScope = , GroupId = org.eclipse.jetty, ArtifactId = jetty-http, Version = 10.0.8, ArtifactType = jar, IncludeDependencyScope = , GroupId = org.eclipse.jetty, ArtifactId = jetty-io, Version = 10.0.8, ArtifactType = jar, IncludeDependencyScope = , GroupId = org.eclipse.jetty, ArtifactId = jetty-security, Version = 10.0.8, ArtifactType = jar, IncludeDependencyScope = , GroupId = org.eclipse.jetty, ArtifactId = jetty-server, Version = 10.0.8, ArtifactType = jar, IncludeDependencyScope = , GroupId = org.eclipse.jetty, ArtifactId = jetty-servlet, Version = 10.0.8, ArtifactType = jar, IncludeDependencyScope = , GroupId = org.eclipse.jetty, ArtifactId = jetty-util, Version = 10.0.8, ArtifactType = jar, IncludeDependencyScope = , GroupId = org.eclipse.jetty, ArtifactId = jetty-util-ajax, Version = 10.0.8, ArtifactType = jar, IncludeDependencyScope = , GroupId = jakarta.servlet, ArtifactId = jakarta.servlet-api, Version = 4.0.4, ArtifactType = jar, IncludeDependencyScope = ], IncludeDependencyScope = [compile], MissingManifestStrategy = ERROR, IncludeSource = true...
08:53:49 [WARNING] Missing POM for org.objenesis:objenesis-test:jar:3.2
08:53:52 [WARNING] Missing POM for org.eclipse.jetty.tests:jetty-http-tools:jar:10.0.8
08:53:55 [INFO] Fetching p2.index from https://download.eclipse.org/eclipse/updates/4.24-I-builds/ (128B)
08:53:55 [INFO] Adding repository https://download.eclipse.org/eclipse/updates/4.24-I-builds
08:53:55 [INFO] Fetching compositeContent.jar from https://download.eclipse.org/eclipse/updates/4.24-I-builds/ (462B)
08:53:55 [INFO] Fetching content.jar from https://download.eclipse.org/eclipse/updates/4.24-I-builds/categories/ (1.46kB)
08:53:55 [INFO] Fetching p2.index from https://download.eclipse.org/eclipse/updates/4.24-I-builds/I20220324-0140/ (172B)
08:53:55 [INFO] Fetching content.xml from https://download.eclipse.org/eclipse/updates/4.24-I-builds/I20220324-0140/
08:53:56 [INFO] Fetching p2.index from https://download.eclipse.org/eclipse/updates/4.24-I-builds/I20220324-1800/ (172B)
08:53:56 [INFO] Fetching content.xml from https://download.eclipse.org/eclipse/updates/4.24-I-builds/I20220324-1800/
08:53:56 [INFO] Fetching p2.index from https://download.eclipse.org/eclipse/updates/4.24-I-builds/I20220325-1800/ (172B)
08:53:56 [INFO] Fetching content.xml from https://download.eclipse.org/eclipse/updates/4.24-I-builds/I20220325-1800/
08:53:57 [INFO] Fetching p2.index from https://download.eclipse.org/eclipse/updates/4.24-I-builds/I20220326-1800/ (172B)
08:53:57 [INFO] Fetching content.xml from https://download.eclipse.org/eclipse/updates/4.24-I-builds/I20220326-1800/
08:53:57 [INFO] Fetching p2.index from https://download.eclipse.org/eclipse/updates/4.24-I-builds/I20220327-1800/ (172B)
08:53:57 [INFO] Fetching content.xml from https://download.eclipse.org/eclipse/updates/4.24-I-builds/I20220327-1800/
08:53:57 [INFO] Resolving dependencies of MavenProject: org.eclipse.jdt:org.eclipse.jdt.annotation:2.2.600-SNAPSHOT @ /home/jenkins/agent/workspace/eclipse.jdt.core-Gerrit/org.eclipse.jdt.annotation/pom.xml
08:53:57 [INFO] Resolving dependencies of MavenProject: org.eclipse.jdt:org.eclipse.jdt.annotation:1.2.0-SNAPSHOT @ /home/jenkins/agent/workspace/eclipse.jdt.core-Gerrit/org.eclipse.jdt.annotation_v1/pom.xml
08:53:58 [INFO] Resolving dependencies of MavenProject: org.eclipse.jdt:org.eclipse.jdt.compiler.tool:1.3.150-SNAPSHOT @ /home/jenkins/agent/workspace/eclipse.jdt.core-Gerrit/org.eclipse.jdt.compiler.tool/pom.xml
08:53:59 [INFO] Fetching org.eclipse.osgi_3.17.300.v20220324-1808.jar from https://download.eclipse.org/eclipse/updates/4.24-I-builds/I20220324-1800/plugins/ (1.46MB)
08:53:59 [INFO] Fetching org.apache.ant_1.10.12.v20211102-1452.jar from https://download.eclipse.org/eclipse/updates/4.24-I-builds/I20220324-0140/plugins/ (2.96MB)
08:53:59 [INFO] Fetching org.eclipse.core.commands_3.10.100.v20210722-1426.jar from https://download.eclipse.org/eclipse/updates/4.24-I-builds/I20220324-0140/plugins/ (114.56kB)
08:53:59 [INFO] Fetching org.eclipse.equinox.common_3.16.100.v20220315-2327.jar from https://download.eclipse.org/eclipse/updates/4.24-I-builds/I20220324-0140/plugins/ (144.55kB)
08:53:59 [INFO] Fetching org.eclipse.core.contenttype_3.8.100.v20210910-0640.jar from https://download.eclipse.org/eclipse/updates/4.24-I-builds/I20220324-0140/plugins/ (100.02kB)
08:53:59 [INFO] Fetching org.eclipse.equinox.preferences_3.9.100.v20211021-1418.jar from https://download.eclipse.org/eclipse/updates/4.24-I-builds/I20220324-0140/plugins/ (136.29kB)
08:53:59 [INFO] Fetching org.eclipse.equinox.registry_3.11.100.v20211021-1418.jar from https://download.eclipse.org/eclipse/updates/4.24-I-builds/I20220324-0140/plugins/ (194.4kB)
08:53:59 [INFO] Fetching org.eclipse.core.expressions_3.8.100.v20210910-0640.jar from https://download.eclipse.org/eclipse/updates/4.24-I-builds/I20220324-0140/plugins/ (92.12kB)
08:53:59 [INFO] Fetching org.eclipse.core.runtime_3.25.0.v20220316-0754.jar from https://download.eclipse.org/eclipse/updates/4.24-I-builds/I20220324-0140/plugins/ (70.8kB)
08:53:59 [INFO] Fetching org.eclipse.core.filesystem_1.9.300.v20220121-1426.jar from https://download.eclipse.org/eclipse/updates/4.24-I-builds/I20220324-0140/plugins/ (69.81kB)
08:53:59 [INFO] Fetching org.eclipse.core.jobs_3.12.200.v20220323-0628.jar from https://download.eclipse.org/eclipse/updates/4.24-I-builds/I20220324-0140/plugins/ (108.8kB)
08:53:59 [INFO] Fetching org.eclipse.core.resources_3.17.0.v20220325-2131.jar from https://download.eclipse.org/eclipse/updates/4.24-I-builds/I20220325-1800/plugins/ (888.03kB)
08:53:59 [INFO] Fetching org.eclipse.equinox.app_1.6.100.v20211021-1418.jar from https://download.eclipse.org/eclipse/updates/4.24-I-builds/I20220324-0140/plugins/ (89.14kB)
08:53:59 [INFO] Fetching org.eclipse.text_3.12.0.v20210512-1644.jar from https://download.eclipse.org/eclipse/updates/4.24-I-builds/I20220324-0140/plugins/ (288.46kB)
08:53:59 [INFO] Resolving dependencies of MavenProject: org.eclipse.jdt:org.eclipse.jdt.core:3.30.0-SNAPSHOT @ /home/jenkins/agent/workspace/eclipse.jdt.core-Gerrit/org.eclipse.jdt.core/pom.xml
08:54:00 [INFO] Fetching org.eclipse.compare.core_3.6.1000.v20201020-1107.jar from https://download.eclipse.org/eclipse/updates/4.24-I-builds/I20220324-0140/plugins/ (66.43kB)
08:54:00 [INFO] Fetching org.eclipse.team.core_3.9.300.v20220204-0611.jar from https://download.eclipse.org/eclipse/updates/4.24-I-builds/I20220324-0140/plugins/ (401.7kB)
08:54:00 [INFO] Resolving dependencies of MavenProject: org.eclipse.jdt:org.eclipse.jdt.core.formatterapp:1.1.0-SNAPSHOT @ /home/jenkins/agent/workspace/eclipse.jdt.core-Gerrit/org.eclipse.jdt.core.formatterapp/pom.xml
08:54:00 [INFO] Resolving dependencies of MavenProject: org.eclipse.jdt:org.eclipse.jdt.compiler.tool.tests:1.3.150-SNAPSHOT @ /home/jenkins/agent/workspace/eclipse.jdt.core-Gerrit/org.eclipse.jdt.compiler.tool.tests/pom.xml
08:54:00 [INFO] Fetching com.ibm.icu_67.1.0.v20200706-1749.jar from https://download.eclipse.org/eclipse/updates/4.24-I-builds/I20220324-0140/plugins/ (12.94MB)
08:54:01 [INFO] Fetching com.sun.jna_5.8.0.v20210503-0343.jar from https://download.eclipse.org/eclipse/updates/4.24-I-builds/I20220324-0140/plugins/ (1.68MB)
08:54:01 [INFO] Fetching com.sun.jna.platform_5.8.0.v20210406-1004.jar from https://download.eclipse.org/eclipse/updates/4.24-I-builds/I20220324-0140/plugins/ (1.41MB)
08:54:02 [INFO] Fetching javax.annotation_1.3.5.v20200909-1856.jar from https://download.eclipse.org/eclipse/updates/4.24-I-builds/I20220324-0140/plugins/ (46.27kB)
08:54:02 [INFO] Fetching org.apache.batik.constants_1.14.0.v20210324-0332.jar from https://download.eclipse.org/eclipse/updates/4.24-I-builds/I20220324-0140/plugins/ (20.34kB)
08:54:02 [INFO] Fetching org.apache.batik.css_1.14.0.v20210324-0332.jar from https://download.eclipse.org/eclipse/updates/4.24-I-builds/I20220324-0140/plugins/ (353.59kB)
08:54:02 [INFO] Fetching org.apache.batik.util_1.14.0.v20210324-0332.jar from https://download.eclipse.org/eclipse/updates/4.24-I-builds/I20220324-0140/plugins/ (144.34kB)
08:54:02 [INFO] Fetching org.apache.batik.i18n_1.14.0.v20210324-0332.jar from https://download.eclipse.org/eclipse/updates/4.24-I-builds/I20220324-0140/plugins/ (23.5kB)
08:54:02 [INFO] Fetching org.apache.xmlgraphics_2.6.0.v20210409-0748.jar from https://download.eclipse.org/eclipse/updates/4.24-I-builds/I20220324-0140/plugins/ (703.81kB)
08:54:02 [INFO] Fetching org.w3c.dom.svg_1.1.0.v201011041433.jar from https://download.eclipse.org/eclipse/updates/4.24-I-builds/I20220324-0140/plugins/ (95.26kB)
08:54:02 [INFO] Fetching org.w3c.dom.events_3.0.0.draft20060413_v201105210656.jar from https://download.eclipse.org/eclipse/updates/4.24-I-builds/I20220324-0140/plugins/ (15.35kB)
08:54:02 [INFO] Fetching org.w3c.css.sac_1.3.1.v200903091627.jar from https://download.eclipse.org/eclipse/updates/4.24-I-builds/I20220324-0140/plugins/ (35.59kB)
08:54:02 [INFO] Fetching org.apache.commons.io_2.8.0.v20210415-0900.jar from https://download.eclipse.org/eclipse/updates/4.24-I-builds/I20220324-0140/plugins/ (302.53kB)
08:54:02 [INFO] Fetching org.apache.commons.logging_1.2.0.v20180409-1502.jar from https://download.eclipse.org/eclipse/updates/4.24-I-builds/I20220324-0140/plugins/ (71.45kB)
08:54:02 [INFO] Fetching org.apache.felix.scr_2.1.24.v20200924-1939.jar from https://download.eclipse.org/eclipse/updates/4.24-I-builds/I20220324-0140/plugins/ (411.93kB)
08:54:02 [INFO] Fetching org.eclipse.osgi.services_3.10.200.v20210723-0643.jar from https://download.eclipse.org/eclipse/updates/4.24-I-builds/I20220324-0140/plugins/ (126.4kB)
08:54:02 [INFO] Fetching org.eclipse.osgi.util_3.6.100.v20210723-1119.jar from https://download.eclipse.org/eclipse/updates/4.24-I-builds/I20220324-0140/plugins/ (72.7kB)
08:54:02 [INFO] Fetching org.bouncycastle.bcpg_1.70.0.v20220105-1522.jar from https://download.eclipse.org/eclipse/updates/4.24-I-builds/I20220324-0140/plugins/ (359.18kB)
08:54:02 [INFO] Fetching org.bouncycastle.bcprov_1.70.0.v20220105-1522.jar from https://download.eclipse.org/eclipse/updates/4.24-I-builds/I20220324-0140/plugins/ (5.58MB)
08:54:02 [INFO] Fetching org.eclipse.compare_3.8.300.v20220121-1000.jar from https://download.eclipse.org/eclipse/updates/4.24-I-builds/I20220324-0140/plugins/ (804.8kB)
08:54:03 [INFO] Fetching org.eclipse.ui_3.201.0.v20220124-1108.jar from https://download.eclipse.org/eclipse/updates/4.24-I-builds/I20220324-0140/plugins/ (432.55kB)
08:54:03 [INFO] Fetching org.eclipse.jface.text_3.20.100.v20220317-1324.jar from https://download.eclipse.org/eclipse/updates/4.24-I-builds/I20220324-0140/plugins/ (1.03MB)
08:54:03 [INFO] Fetching org.eclipse.ui.ide_3.19.0.v20220325-1019.jar from https://download.eclipse.org/eclipse/updates/4.24-I-builds/I20220325-1800/plugins/ (2.41MB)
08:54:03 [INFO] Fetching org.eclipse.ui.views_3.11.100.v20210816-0811.jar from https://download.eclipse.org/eclipse/updates/4.24-I-builds/I20220324-0140/plugins/ (105.57kB)
08:54:03 [INFO] Fetching org.eclipse.ui.workbench.texteditor_3.16.500.v20220325-1244.jar from https://download.eclipse.org/eclipse/updates/4.24-I-builds/I20220325-1800/plugins/ (688.67kB)
08:54:03 [INFO] Fetching org.eclipse.ui.editors_3.14.300.v20210913-0815.jar from https://download.eclipse.org/eclipse/updates/4.24-I-builds/I20220324-0140/plugins/ (618.79kB)
08:54:03 [INFO] Fetching org.eclipse.ui.forms_3.11.300.v20211022-1451.jar from https://download.eclipse.org/eclipse/updates/4.24-I-builds/I20220324-0140/plugins/ (330.12kB)
08:54:03 [INFO] Fetching org.eclipse.core.databinding_1.11.0.v20220118-1028.jar from https://download.eclipse.org/eclipse/updates/4.24-I-builds/I20220324-0140/plugins/ (287.81kB)
08:54:03 [INFO] Fetching org.eclipse.core.databinding.observable_1.12.0.v20211231-1006.jar from https://download.eclipse.org/eclipse/updates/4.24-I-builds/I20220324-0140/plugins/ (313kB)
08:54:03 [INFO] Fetching org.eclipse.core.databinding.property_1.9.0.v20210619-1129.jar from https://download.eclipse.org/eclipse/updates/4.24-I-builds/I20220324-0140/plugins/ (163.08kB)
08:54:03 [INFO] Fetching org.eclipse.core.filebuffers_3.7.200.v20220202-1008.jar from https://download.eclipse.org/eclipse/updates/4.24-I-builds/I20220324-0140/plugins/ (115.6kB)
08:54:03 [INFO] Fetching org.eclipse.core.net_1.3.1200.v20220312-1450.jar from https://download.eclipse.org/eclipse/updates/4.24-I-builds/I20220324-0140/plugins/ (47.62kB)
08:54:03 [INFO] Fetching org.eclipse.equinox.security_1.3.900.v20220108-1321.jar from https://download.eclipse.org/eclipse/updates/4.24-I-builds/I20220324-0140/plugins/ (113.21kB)
08:54:03 [INFO] Fetching org.eclipse.core.variables_3.5.100.v20210721-1355.jar from https://download.eclipse.org/eclipse/updates/4.24-I-builds/I20220324-0140/plugins/ (35.64kB)
08:54:03 [INFO] Fetching org.eclipse.debug.core_3.19.100.v20220324-0630.jar from https://download.eclipse.org/eclipse/updates/4.24-I-builds/I20220324-1800/plugins/ (397.87kB)
08:54:03 [INFO] Fetching org.eclipse.e4.core.commands_1.0.100.v20211204-1536.jar from https://download.eclipse.org/eclipse/updates/4.24-I-builds/I20220324-0140/plugins/ (25.92kB)
08:54:03 [INFO] Fetching org.eclipse.e4.core.di_1.8.100.v20210910-0640.jar from https://download.eclipse.org/eclipse/updates/4.24-I-builds/I20220324-0140/plugins/ (52.48kB)
08:54:03 [INFO] Fetching javax.inject_1.0.0.v20091030.jar from https://download.eclipse.org/eclipse/updates/4.24-I-builds/I20220324-0140/plugins/ (14.07kB)
08:54:03 [INFO] Fetching org.eclipse.e4.core.contexts_1.9.100.v20211011-1349.jar from https://download.eclipse.org/eclipse/updates/4.24-I-builds/I20220324-0140/plugins/ (55.13kB)
08:54:03 [INFO] Fetching org.eclipse.e4.core.services_2.3.100.v20210910-0640.jar from https://download.eclipse.org/eclipse/updates/4.24-I-builds/I20220324-0140/plugins/ (69.65kB)
08:54:03 [INFO] Fetching org.eclipse.e4.core.di.annotations_1.7.100.v20210910-0640.jar from https://download.eclipse.org/eclipse/updates/4.24-I-builds/I20220324-0140/plugins/ (12kB)
08:54:03 [INFO] Fetching org.eclipse.e4.core.di.extensions_0.17.100.v20210910-0640.jar from https://download.eclipse.org/eclipse/updates/4.24-I-builds/I20220324-0140/plugins/ (11.14kB)
08:54:04 [INFO] Fetching org.eclipse.e4.core.di.extensions.supplier_0.16.300.v20220309-0649.jar from https://download.eclipse.org/eclipse/updates/4.24-I-builds/I20220324-0140/plugins/ (40.45kB)
08:54:04 [INFO] Fetching org.eclipse.e4.emf.xpath_0.3.0.v20210722-1426.jar from https://download.eclipse.org/eclipse/updates/4.24-I-builds/I20220324-0140/plugins/ (51.03kB)
08:54:04 [INFO] Fetching org.apache.commons.jxpath_1.3.0.v200911051830.jar from https://download.eclipse.org/eclipse/updates/4.24-I-builds/I20220324-0140/plugins/ (317.8kB)
08:54:04 [INFO] Fetching org.eclipse.emf.ecore_2.26.0.v20220123-0838.jar from https://download.eclipse.org/eclipse/updates/4.24-I-builds/I20220324-0140/plugins/ (1.26MB)
08:54:04 [INFO] Fetching org.eclipse.e4.ui.bindings_0.13.100.v20210722-1426.jar from https://download.eclipse.org/eclipse/updates/4.24-I-builds/I20220324-0140/plugins/ (45.85kB)
08:54:04 [INFO] Fetching org.eclipse.swt_3.119.100.v20220326-2203.jar from https://download.eclipse.org/eclipse/updates/4.24-I-builds/I20220326-1800/plugins/ (16.98kB)
08:54:04 [INFO] Fetching org.eclipse.e4.ui.services_1.5.0.v20210115-1333.jar from https://download.eclipse.org/eclipse/updates/4.24-I-builds/I20220324-0140/plugins/ (24.31kB)
08:54:04 [INFO] Fetching org.eclipse.jface_3.25.0.v20220218-1636.jar from https://download.eclipse.org/eclipse/updates/4.24-I-builds/I20220324-0140/plugins/ (1.11MB)
08:54:04 [INFO] Fetching org.eclipse.e4.ui.css.core_0.13.200.v20211022-1402.jar from https://download.eclipse.org/eclipse/updates/4.24-I-builds/I20220324-0140/plugins/ (213.89kB)
08:54:04 [INFO] Fetching org.eclipse.e4.ui.css.swt_0.14.400.v20211026-1534.jar from https://download.eclipse.org/eclipse/updates/4.24-I-builds/I20220324-0140/plugins/ (203.91kB)
08:54:04 [INFO] Fetching org.eclipse.e4.ui.css.swt.theme_0.13.100.v20220310-1056.jar from https://download.eclipse.org/eclipse/updates/4.24-I-builds/I20220324-0140/plugins/ (28.11kB)
08:54:04 [INFO] Fetching org.eclipse.e4.ui.di_1.4.0.v20210621-1133.jar from https://download.eclipse.org/eclipse/updates/4.24-I-builds/I20220324-0140/plugins/ (16.41kB)
08:54:04 [INFO] Fetching org.eclipse.e4.ui.dialogs_1.3.200.v20211210-1500.jar from https://download.eclipse.org/eclipse/updates/4.24-I-builds/I20220324-0140/plugins/ (56.73kB)
08:54:04 [INFO] Fetching org.eclipse.e4.ui.ide_3.16.100.v20220310-1350.jar from https://download.eclipse.org/eclipse/updates/4.24-I-builds/I20220324-0140/plugins/ (11.51kB)
08:54:04 [INFO] Fetching org.eclipse.e4.ui.model.workbench_2.2.0.v20210727-1533.jar from https://download.eclipse.org/eclipse/updates/4.24-I-builds/I20220324-0140/plugins/ (394.73kB)
08:54:04 [INFO] Fetching org.eclipse.equinox.event_1.6.100.v20211021-1418.jar from https://download.eclipse.org/eclipse/updates/4.24-I-builds/I20220324-0140/plugins/ (33.33kB)
08:54:04 [INFO] Fetching org.eclipse.e4.ui.widgets_1.3.0.v20210621-1136.jar from https://download.eclipse.org/eclipse/updates/4.24-I-builds/I20220324-0140/plugins/ (13.3kB)
08:54:04 [INFO] Fetching org.eclipse.e4.ui.workbench_1.13.100.v20211019-0756.jar from https://download.eclipse.org/eclipse/updates/4.24-I-builds/I20220324-0140/plugins/ (260.38kB)
08:54:04 [INFO] Fetching org.eclipse.emf.ecore.change_2.14.0.v20190528-0725.jar from https://download.eclipse.org/eclipse/updates/4.24-I-builds/I20220324-0140/plugins/ (87.54kB)
08:54:04 [INFO] Fetching org.eclipse.emf.ecore.xmi_2.16.0.v20190528-0725.jar from https://download.eclipse.org/eclipse/updates/4.24-I-builds/I20220324-0140/plugins/ (229.56kB)
08:54:04 [INFO] Fetching org.eclipse.e4.ui.workbench.addons.swt_1.4.400.v20211102-0453.jar from https://download.eclipse.org/eclipse/updates/4.24-I-builds/I20220324-0140/plugins/ (118.14kB)
08:54:04 [INFO] Fetching org.eclipse.e4.ui.workbench.renderers.swt_0.15.500.v20220323-0940.jar from https://download.eclipse.org/eclipse/updates/4.24-I-builds/I20220324-0140/plugins/ (251.65kB)
08:54:04 [INFO] Fetching org.eclipse.e4.ui.workbench.swt_0.16.400.v20220222-1128.jar from https://download.eclipse.org/eclipse/updates/4.24-I-builds/I20220324-0140/plugins/ (147.16kB)
08:54:04 [INFO] Fetching org.eclipse.jface.databinding_1.13.0.v20210619-1146.jar from https://download.eclipse.org/eclipse/updates/4.24-I-builds/I20220324-0140/plugins/ (295.36kB)
08:54:04 [INFO] Fetching org.eclipse.e4.ui.workbench3_0.16.0.v20210619-0956.jar from https://download.eclipse.org/eclipse/updates/4.24-I-builds/I20220324-0140/plugins/ (21.08kB)
08:54:04 [INFO] Fetching org.eclipse.urischeme_1.2.100.v20211001-1648.jar from https://download.eclipse.org/eclipse/updates/4.24-I-builds/I20220324-0140/plugins/ (51.9kB)
08:54:04 [INFO] Fetching org.eclipse.emf.common_2.24.0.v20220123-0838.jar from https://download.eclipse.org/eclipse/updates/4.24-I-builds/I20220324-0140/plugins/ (367.53kB)
08:54:04 [INFO] Fetching org.eclipse.equinox.bidi_1.4.100.v20211021-1418.jar from https://download.eclipse.org/eclipse/updates/4.24-I-builds/I20220324-0140/plugins/ (50.74kB)
08:54:04 [INFO] Fetching org.eclipse.equinox.launcher_1.6.400.v20210924-0641.jar from https://download.eclipse.org/eclipse/updates/4.24-I-builds/I20220324-0140/plugins/ (52.65kB)
08:54:04 [INFO] Fetching org.eclipse.equinox.p2.artifact.repository_1.4.400.v20220223-1131.jar from https://download.eclipse.org/eclipse/updates/4.24-I-builds/I20220324-0140/plugins/ (170.85kB)
08:54:04 [INFO] Fetching org.eclipse.equinox.p2.metadata_2.6.200.v20220324-1313.jar from https://download.eclipse.org/eclipse/updates/4.24-I-builds/I20220324-1800/plugins/ (360.26kB)
08:54:04 [INFO] Fetching org.tukaani.xz_1.9.0.v20210624-1259.jar from https://download.eclipse.org/eclipse/updates/4.24-I-builds/I20220324-0140/plugins/ (131.39kB)
08:54:04 [INFO] Fetching org.eclipse.equinox.p2.core_2.9.100.v20220310-1733.jar from https://download.eclipse.org/eclipse/updates/4.24-I-builds/I20220324-0140/plugins/ (76.94kB)
08:54:04 [INFO] Fetching org.eclipse.equinox.p2.jarprocessor_1.2.300.v20220307-1946.jar from https://download.eclipse.org/eclipse/updates/4.24-I-builds/I20220324-0140/plugins/ (74.12kB)
08:54:04 [INFO] Fetching org.eclipse.equinox.p2.repository_2.6.100.v20220327-0641.jar from https://download.eclipse.org/eclipse/updates/4.24-I-builds/I20220327-1800/plugins/ (173.62kB)
08:54:04 [INFO] Fetching org.eclipse.equinox.p2.engine_2.7.300.v20220209-1714.jar from https://download.eclipse.org/eclipse/updates/4.24-I-builds/I20220324-0140/plugins/ (218.82kB)
08:54:04 [INFO] Fetching org.eclipse.equinox.p2.metadata.repository_1.4.0.v20210315-2228.jar from https://download.eclipse.org/eclipse/updates/4.24-I-builds/I20220324-0140/plugins/ (130.72kB)
08:54:04 [INFO] Fetching org.eclipse.help_3.9.100.v20210721-0601.jar from https://download.eclipse.org/eclipse/updates/4.24-I-builds/I20220324-0140/plugins/ (270.25kB)
08:54:05 [INFO] Fetching org.junit_4.13.2.v20211018-1956.jar from https://download.eclipse.org/eclipse/updates/4.24-I-builds/I20220324-0140/plugins/ (421.77kB)
08:54:05 [INFO] Fetching org.eclipse.test.performance_3.18.0.v20210623-0710.jar from https://download.eclipse.org/eclipse/updates/4.24-I-builds/I20220324-0140/plugins/ (111.48kB)
08:54:05 [INFO] Fetching org.eclipse.jdt.debug_3.19.200.v20220325-0856.jar from https://download.eclipse.org/eclipse/updates/4.24-I-builds/I20220325-1800/plugins/ (911.03kB)
08:54:05 [INFO] Fetching org.eclipse.ltk.core.refactoring_3.12.100.v20210926-1112.jar from https://download.eclipse.org/eclipse/updates/4.24-I-builds/I20220324-0140/plugins/ (341.2kB)
08:54:05 [INFO] Fetching org.eclipse.ltk.ui.refactoring_3.12.0.v20210618-1953.jar from https://download.eclipse.org/eclipse/updates/4.24-I-builds/I20220324-0140/plugins/ (468.75kB)
08:54:05 [INFO] Fetching org.eclipse.ui.navigator_3.10.200.v20211009-1706.jar from https://download.eclipse.org/eclipse/updates/4.24-I-builds/I20220324-0140/plugins/ (423.11kB)
08:54:05 [INFO] Fetching org.eclipse.team.ui_3.9.300.v20220314-0834.jar from https://download.eclipse.org/eclipse/updates/4.24-I-builds/I20220324-0140/plugins/ (1.42MB)
08:54:05 [INFO] Fetching org.eclipse.swt.gtk.linux.x86_64_3.119.100.v20220326-2203.jar from https://download.eclipse.org/eclipse/updates/4.24-I-builds/I20220326-1800/plugins/ (2.07MB)
08:54:05 [INFO] Fetching org.junit.jupiter.api_5.8.1.v20211018-1956.jar from https://download.eclipse.org/eclipse/updates/4.24-I-builds/I20220324-0140/plugins/ (219.09kB)
08:54:05 [INFO] Fetching org.eclipse.ui.workbench_3.125.100.v20220310-1555.jar from https://download.eclipse.org/eclipse/updates/4.24-I-builds/I20220324-0140/plugins/ (3.49MB)
08:54:05 [INFO] Fetching org.eclipse.ui.navigator.resources_3.8.400.v20220203-1803.jar from https://download.eclipse.org/eclipse/updates/4.24-I-builds/I20220324-0140/plugins/ (172.29kB)
08:54:06 [INFO] Fetching org.eclipse.ui.ide.application_1.4.400.v20220326-0710.jar from https://download.eclipse.org/eclipse/updates/4.24-I-builds/I20220326-1800/plugins/ (113.08kB)
08:54:06 [INFO] Fetching org.eclipse.ui.views.properties.tabbed_3.9.100.v20201223-1348.jar from https://download.eclipse.org/eclipse/updates/4.24-I-builds/I20220324-0140/plugins/ (107.15kB)
08:54:06 [INFO] Fetching org.hamcrest.core_1.3.0.v20180420-1519.jar from https://download.eclipse.org/eclipse/updates/4.24-I-builds/I20220324-0140/plugins/ (65.43kB)
08:54:06 [INFO] Fetching org.opentest4j_1.2.0.v20211018-1956.jar from https://download.eclipse.org/eclipse/updates/4.24-I-builds/I20220324-0140/plugins/ (21.6kB)
08:54:06 [INFO] Fetching org.w3c.dom.smil_1.0.1.v200903091627.jar from https://download.eclipse.org/eclipse/updates/4.24-I-builds/I20220324-0140/plugins/ (21.23kB)
08:54:06 [INFO] Fetching org.eclipse.swt.gtk.linux.ppc64le_3.119.100.v20220326-2203.jar from https://download.eclipse.org/eclipse/updates/4.24-I-builds/I20220326-1800/plugins/ (2.08MB)
08:54:06 [INFO] Fetching org.eclipse.swt.gtk.linux.aarch64_3.119.100.v20220326-2203.jar from https://download.eclipse.org/eclipse/updates/4.24-I-builds/I20220326-1800/plugins/ (2.06MB)
08:54:06 [INFO] Fetching org.eclipse.swt.win32.win32.x86_64_3.119.100.v20220326-2203.jar from https://download.eclipse.org/eclipse/updates/4.24-I-builds/I20220326-1800/plugins/ (2.47MB)
08:54:06 [INFO] Fetching org.eclipse.swt.cocoa.macosx.x86_64_3.119.100.v20220326-2203.jar from https://download.eclipse.org/eclipse/updates/4.24-I-builds/I20220326-1800/plugins/ (2.15MB)
08:54:06 [INFO] Fetching org.eclipse.swt.cocoa.macosx.aarch64_3.119.100.v20220326-2203.jar from https://download.eclipse.org/eclipse/updates/4.24-I-builds/I20220326-1800/plugins/ (2.14MB)
08:54:07 [INFO] Resolving dependencies of MavenProject: org.eclipse.jdt:org.eclipse.jdt.core.tests.builder:3.11.200-SNAPSHOT @ /home/jenkins/agent/workspace/eclipse.jdt.core-Gerrit/org.eclipse.jdt.core.tests.builder/pom.xml
08:54:07 [INFO] Resolving dependencies of MavenProject: org.eclipse.jdt:org.eclipse.jdt.core.tests.compiler:3.12.1900-SNAPSHOT @ /home/jenkins/agent/workspace/eclipse.jdt.core-Gerrit/org.eclipse.jdt.core.tests.compiler/pom.xml
08:54:07 [INFO] Resolving dependencies of MavenProject: org.eclipse.jdt:org.eclipse.jdt.core.tests.model:3.11.200-SNAPSHOT @ /home/jenkins/agent/workspace/eclipse.jdt.core-Gerrit/org.eclipse.jdt.core.tests.model/pom.xml
08:54:08 [INFO] Fetching org.eclipse.jdt.launching_3.19.600.v20220323-0944.jar from https://download.eclipse.org/eclipse/updates/4.24-I-builds/I20220324-0140/plugins/ (563.67kB)
08:54:08 [INFO] Resolving dependencies of MavenProject: org.eclipse.jdt:org.eclipse.jdt.core.tests.performance:3.11.50-SNAPSHOT @ /home/jenkins/agent/workspace/eclipse.jdt.core-Gerrit/org.eclipse.jdt.core.tests.performance/pom.xml
08:54:08 [INFO] Fetching org.eclipse.jdt.core.tests.binaries_1.0.250.v20210713-1056.jar from https://download.eclipse.org/eclipse/updates/4.24-I-builds/I20220324-0140/plugins/ (33.26MB)
08:54:09 [INFO] Fetching org.eclipse.jdt.core.tests.binaries_1.0.250.v20210713-1056.jar from https://download.eclipse.org/eclipse/updates/4.24-I-builds/I20220324-0140/plugins/ (15.25MB of 33.26MB at 15.24MB/s)
08:54:10 [INFO] Fetching org.eclipse.jdt.core.tests.binaries_1.0.250.v20210713-1056.jar from https://download.eclipse.org/eclipse/updates/4.24-I-builds/I20220324-0140/plugins/ (29.77MB of 33.26MB at 14.88MB/s)
08:54:11 [INFO] Resolving dependencies of MavenProject: org.eclipse.jdt:org.eclipse.jdt.apt.core:3.7.50-SNAPSHOT @ /home/jenkins/agent/workspace/eclipse.jdt.core-Gerrit/org.eclipse.jdt.apt.core/pom.xml
08:54:11 [INFO] Resolving dependencies of MavenProject: org.eclipse.jdt:org.eclipse.jdt.apt.pluggable.core:1.3.0-SNAPSHOT @ /home/jenkins/agent/workspace/eclipse.jdt.core-Gerrit/org.eclipse.jdt.apt.pluggable.core/pom.xml
08:54:11 [INFO] Resolving dependencies of MavenProject: org.eclipse.jdt:org.eclipse.jdt.apt.ui:3.7.0-SNAPSHOT @ /home/jenkins/agent/workspace/eclipse.jdt.core-Gerrit/org.eclipse.jdt.apt.ui/pom.xml
08:54:11 [INFO] Fetching org.eclipse.debug.ui_3.16.100.v20220314-1449.jar from https://download.eclipse.org/eclipse/updates/4.24-I-builds/I20220324-0140/plugins/ (2.97MB)
08:54:11 [INFO] Fetching org.eclipse.ui.console_3.11.200.v20220324-0630.jar from https://download.eclipse.org/eclipse/updates/4.24-I-builds/I20220324-1800/plugins/ (208.46kB)
08:54:11 [INFO] Fetching org.eclipse.jdt.ui_3.26.100.v20220326-0314.jar from https://download.eclipse.org/eclipse/updates/4.24-I-builds/I20220326-1800/plugins/ (11.17MB)
08:54:12 [INFO] Fetching org.eclipse.jdt.core.manipulation_1.16.100.v20220326-0314.jar from https://download.eclipse.org/eclipse/updates/4.24-I-builds/I20220326-1800/plugins/ (1.93MB)
08:54:13 [INFO] Fetching org.eclipse.search_3.14.100.v20220120-1549.jar from https://download.eclipse.org/eclipse/updates/4.24-I-builds/I20220324-0140/plugins/ (489.96kB)
08:54:13 [INFO] Resolving dependencies of MavenProject: org.eclipse.jdt:org.eclipse.jdt.compiler.apt:1.4.100-SNAPSHOT @ /home/jenkins/agent/workspace/eclipse.jdt.core-Gerrit/org.eclipse.jdt.compiler.apt/pom.xml
08:54:13 [INFO] Resolving dependencies of MavenProject: org.eclipse.jdt:org.eclipse.jdt.apt.pluggable.tests:3.5.0-SNAPSHOT @ /home/jenkins/agent/workspace/eclipse.jdt.core-Gerrit/org.eclipse.jdt.apt.pluggable.tests/pom.xml
08:54:13 [INFO] Resolving dependencies of MavenProject: org.eclipse.jdt:org.eclipse.jdt.apt.tests:3.5.50-SNAPSHOT @ /home/jenkins/agent/workspace/eclipse.jdt.core-Gerrit/org.eclipse.jdt.apt.tests/pom.xml
08:54:13 [INFO] Fetching org.eclipse.ant.core_3.6.400.v20220317-1003.jar from https://download.eclipse.org/eclipse/updates/4.24-I-builds/I20220324-0140/plugins/ (107.39kB)
08:54:13 [INFO] Fetching org.eclipse.equinox.frameworkadmin_2.2.0.v20210315-2042.jar from https://download.eclipse.org/eclipse/updates/4.24-I-builds/I20220324-0140/plugins/ (36.06kB)
08:54:13 [INFO] Fetching org.eclipse.equinox.frameworkadmin.equinox_1.2.200.v20220315-2155.jar from https://download.eclipse.org/eclipse/updates/4.24-I-builds/I20220324-0140/plugins/ (69.13kB)
08:54:13 [INFO] Fetching org.eclipse.equinox.p2.director_2.5.200.v20220127-1112.jar from https://download.eclipse.org/eclipse/updates/4.24-I-builds/I20220324-0140/plugins/ (110.36kB)
08:54:13 [INFO] Fetching org.sat4j.core_2.3.5.v201308161310.jar from https://download.eclipse.org/eclipse/updates/4.24-I-builds/I20220324-0140/plugins/ (367.35kB)
08:54:13 [INFO] Fetching org.sat4j.pb_2.3.5.v201404071733.jar from https://download.eclipse.org/eclipse/updates/4.24-I-builds/I20220324-0140/plugins/ (244.03kB)
08:54:13 [INFO] Fetching org.eclipse.equinox.simpleconfigurator_1.4.0.v20210315-2228.jar from https://download.eclipse.org/eclipse/updates/4.24-I-builds/I20220324-0140/plugins/ (45.48kB)
08:54:13 [INFO] Fetching org.eclipse.equinox.p2.director.app_1.2.100.v20211220-1825.jar from https://download.eclipse.org/eclipse/updates/4.24-I-builds/I20220324-0140/plugins/ (58.07kB)
08:54:13 [INFO] Fetching org.eclipse.equinox.p2.garbagecollector_1.2.0.v20210316-1209.jar from https://download.eclipse.org/eclipse/updates/4.24-I-builds/I20220324-0140/plugins/ (24.82kB)
08:54:13 [INFO] Fetching org.eclipse.equinox.p2.publisher_1.7.0.v20220127-1312.jar from https://download.eclipse.org/eclipse/updates/4.24-I-builds/I20220324-0140/plugins/ (102.07kB)
08:54:13 [INFO] Fetching org.eclipse.equinox.p2.publisher.eclipse_1.4.2.v20220127-1658.jar from https://download.eclipse.org/eclipse/updates/4.24-I-builds/I20220324-0140/plugins/ (242.66kB)
08:54:13 [INFO] Fetching org.eclipse.equinox.simpleconfigurator.manipulator_2.2.0.v20210315-2228.jar from https://download.eclipse.org/eclipse/updates/4.24-I-builds/I20220324-0140/plugins/ (26.34kB)
08:54:14 [INFO] Fetching org.eclipse.equinox.p2.repository.tools_2.3.0.v20210325-0750.jar from https://download.eclipse.org/eclipse/updates/4.24-I-builds/I20220324-0140/plugins/ (248.88kB)
08:54:14 [INFO] Fetching org.eclipse.equinox.p2.touchpoint.eclipse_2.3.100.v20210615-1334.jar from https://download.eclipse.org/eclipse/updates/4.24-I-builds/I20220324-0140/plugins/ (129.25kB)
08:54:14 [INFO] Fetching org.eclipse.pde.core_3.15.200.v20220323-0818.jar from https://download.eclipse.org/eclipse/updates/4.24-I-builds/I20220324-0140/plugins/ (1.35MB)
08:54:14 [INFO] Fetching org.eclipse.pde.build_3.11.200.v20220323-1307.jar from https://download.eclipse.org/eclipse/updates/4.24-I-builds/I20220324-0140/plugins/ (477.26kB)
08:54:14 [INFO] Resolving dependencies of MavenProject: org.eclipse.jdt:org.eclipse.jdt.compiler.apt.tests:1.2.150-SNAPSHOT @ /home/jenkins/agent/workspace/eclipse.jdt.core-Gerrit/org.eclipse.jdt.compiler.apt.tests/pom.xml
08:54:14 [INFO] ------------------------------------------------------------------------
08:54:14 [INFO] Reactor Build Order:
08:54:14 [INFO] 
08:54:14 [INFO] eclipse.jdt.core                                                   [pom]
08:54:14 [INFO] org.eclipse.jdt.annotation                              [eclipse-plugin]
08:54:14 [INFO] org.eclipse.jdt.annotation                              [eclipse-plugin]
08:54:14 [INFO] org.eclipse.jdt.core                                    [eclipse-plugin]
08:54:14 [INFO] org.eclipse.jdt.compiler.tool                           [eclipse-plugin]
08:54:14 [INFO] org.eclipse.jdt.core.formatterapp                       [eclipse-plugin]
08:54:14 [INFO] org.eclipse.jdt.compiler.apt                            [eclipse-plugin]
08:54:14 [INFO] org.eclipse.jdt.core.tests.compiler                [eclipse-test-plugin]
08:54:14 [INFO] org.eclipse.jdt.compiler.tool.tests                [eclipse-test-plugin]
08:54:14 [INFO] org.eclipse.jdt.core.tests.builder                 [eclipse-test-plugin]
08:54:14 [INFO] org.eclipse.jdt.compiler.apt.tests                 [eclipse-test-plugin]
08:54:14 [INFO] org.eclipse.jdt.core.tests.model                   [eclipse-test-plugin]
08:54:14 [INFO] org.eclipse.jdt.core.tests.performance             [eclipse-test-plugin]
08:54:14 [INFO] org.eclipse.jdt.apt.core                                [eclipse-plugin]
08:54:14 [INFO] org.eclipse.jdt.apt.pluggable.core                      [eclipse-plugin]
08:54:14 [INFO] org.eclipse.jdt.apt.ui                                  [eclipse-plugin]
08:54:14 [INFO] org.eclipse.jdt.apt.pluggable.tests                [eclipse-test-plugin]
08:54:14 [INFO] org.eclipse.jdt.apt.tests                          [eclipse-test-plugin]
08:54:14 [INFO] 
08:54:14 [INFO] ------------------< org.eclipse.jdt:eclipse.jdt.core >------------------
08:54:14 [INFO] Building eclipse.jdt.core 4.24.0-SNAPSHOT                         [1/18]
08:54:14 [INFO] --------------------------------[ pom ]---------------------------------
08:54:14 [INFO] 
08:54:14 [INFO] --- maven-clean-plugin:3.1.0:clean (default-clean) @ eclipse.jdt.core ---
08:54:16 [INFO] 
08:54:16 [INFO] --- maven-resources-plugin:3.2.0:copy-resources (saveproperties) @ eclipse.jdt.core ---
08:54:20 [INFO] Using 'UTF-8' encoding to copy filtered resources.
08:54:20 [INFO] Using 'UTF-8' encoding to copy filtered properties files.
08:54:20 [INFO] skip non existing resourceDirectory /home/jenkins/agent/workspace/eclipse.jdt.core-Gerrit/saveproperties
08:54:20 [INFO] 
08:54:20 [INFO] --- maven-enforcer-plugin:3.0.0:enforce (enforce-maven) @ eclipse.jdt.core ---
08:54:23 [INFO] 
08:54:23 [INFO] --- maven-resources-plugin:3.2.0:resources (filter-resources) @ eclipse.jdt.core ---
08:54:23 [INFO] Using 'UTF-8' encoding to copy filtered resources.
08:54:23 [INFO] Using 'UTF-8' encoding to copy filtered properties files.
08:54:23 [INFO] skip non existing resourceDirectory /home/jenkins/agent/workspace/eclipse.jdt.core-Gerrit/src/main/resources
08:54:23 [INFO] 
08:54:23 [INFO] --- tycho-source-plugin:3.0.0-SNAPSHOT:plugin-source (plugin-source) @ eclipse.jdt.core ---
08:54:23 [INFO] 
08:54:23 [INFO] --- tycho-p2-extras-plugin:3.0.0-SNAPSHOT:compare-version-with-baselines (compare-attached-artifacts-with-release) @ eclipse.jdt.core ---
08:54:23 [INFO] Skipped
08:54:23 [INFO] 
08:54:23 [INFO] --- maven-antrun-plugin:3.0.0:run (check-skip-api-analysis) @ eclipse.jdt.core ---
08:54:25 [INFO] Executing tasks
08:54:25 [INFO] Executed tasks
08:54:25 [INFO] 
08:54:25 [INFO] --- tycho-dependency-tools-plugin:3.0.0-SNAPSHOT:list-dependencies (list-dependencies) @ eclipse.jdt.core ---
08:54:25 [INFO] Skipped
08:54:25 [INFO] 
08:54:25 [INFO] --- tycho-eclipserun-plugin:3.0.0-SNAPSHOT:eclipse-run (api-analysis) @ eclipse.jdt.core ---
08:54:25 [INFO] 
08:54:25 [INFO] -------------< org.eclipse.jdt:org.eclipse.jdt.annotation >-------------
08:54:25 [INFO] Building org.eclipse.jdt.annotation 2.2.600-SNAPSHOT              [2/18]
08:54:25 [INFO] ---------------------------[ eclipse-plugin ]---------------------------
08:54:25 [INFO] 
08:54:25 [INFO] --- maven-clean-plugin:3.1.0:clean (default-clean) @ org.eclipse.jdt.annotation ---
08:54:25 [INFO] 
08:54:25 [INFO] --- tycho-packaging-plugin:3.0.0-SNAPSHOT:build-qualifier (default-build-qualifier) @ org.eclipse.jdt.annotation ---
08:54:29 [INFO] The project's OSGi version is 2.2.600.v20200408-1511
08:54:29 [INFO] 
08:54:29 [INFO] --- tycho-packaging-plugin:3.0.0-SNAPSHOT:validate-id (default-validate-id) @ org.eclipse.jdt.annotation ---
08:54:29 [INFO] 
08:54:29 [INFO] --- tycho-packaging-plugin:3.0.0-SNAPSHOT:validate-version (default-validate-version) @ org.eclipse.jdt.annotation ---
08:54:29 [INFO] 
08:54:29 [INFO] --- maven-resources-plugin:3.2.0:copy-resources (saveproperties) @ org.eclipse.jdt.annotation ---
08:54:29 [INFO] Using 'UTF-8' encoding to copy filtered resources.
08:54:29 [INFO] Using 'UTF-8' encoding to copy filtered properties files.
08:54:29 [INFO] skip non existing resourceDirectory /home/jenkins/agent/workspace/eclipse.jdt.core-Gerrit/org.eclipse.jdt.annotation/saveproperties
08:54:29 [INFO] 
08:54:29 [INFO] --- maven-enforcer-plugin:3.0.0:enforce (enforce-maven) @ org.eclipse.jdt.annotation ---
08:54:29 [INFO] 
08:54:29 [INFO] --- maven-antrun-plugin:3.0.0:run (check-has-apiTools-nature) @ org.eclipse.jdt.annotation ---
08:54:29 [INFO] Executing tasks
08:54:29 [INFO] Executed tasks
08:54:29 [INFO] 
08:54:29 [INFO] --- target-platform-configuration:3.0.0-SNAPSHOT:target-platform (default-target-platform) @ org.eclipse.jdt.annotation ---
08:54:30 [INFO] 
08:54:30 [INFO] --- tycho-compiler-plugin:3.0.0-SNAPSHOT:validate-classpath (default-validate-classpath) @ org.eclipse.jdt.annotation ---
08:54:30 [INFO] Resolving class path of org.eclipse.jdt.annotation...
08:54:30 [INFO] 
08:54:30 [INFO] --- maven-resources-plugin:3.2.0:resources (default-resources) @ org.eclipse.jdt.annotation ---
08:54:30 [INFO] Using 'UTF-8' encoding to copy filtered resources.
08:54:30 [INFO] Using 'UTF-8' encoding to copy filtered properties files.
08:54:30 [INFO] skip non existing resourceDirectory /home/jenkins/agent/workspace/eclipse.jdt.core-Gerrit/org.eclipse.jdt.annotation/src/main/resources
08:54:30 [INFO] 
08:54:30 [INFO] --- maven-resources-plugin:3.2.0:resources (filter-resources) @ org.eclipse.jdt.annotation ---
08:54:30 [INFO] Using 'UTF-8' encoding to copy filtered resources.
08:54:30 [INFO] Using 'UTF-8' encoding to copy filtered properties files.
08:54:30 [INFO] skip non existing resourceDirectory /home/jenkins/agent/workspace/eclipse.jdt.core-Gerrit/org.eclipse.jdt.annotation/src/main/resources
08:54:30 [INFO] 
08:54:30 [INFO] --- tycho-compiler-plugin:3.0.0-SNAPSHOT:compile (default-compile) @ org.eclipse.jdt.annotation ---
08:54:31 [INFO] Compiling 6 source files to /home/jenkins/agent/workspace/eclipse.jdt.core-Gerrit/org.eclipse.jdt.annotation/target/classes
08:54:32 [INFO] 
08:54:32 [INFO] --- tycho-eclipserun-plugin:3.0.0-SNAPSHOT:eclipse-run (build-.api_description) @ org.eclipse.jdt.annotation ---
08:54:33 [INFO] Fetching org.eclipse.jdt.core_3.30.0.v20220326-0854.jar from https://download.eclipse.org/eclipse/updates/4.24-I-builds/I20220326-1800/plugins/ (6.7MB)
08:54:33 [INFO] Fetching org.eclipse.osgi.compatibility.state_1.2.600.v20220207-1403.jar from https://download.eclipse.org/eclipse/updates/4.24-I-builds/I20220324-0140/plugins/ (249.4kB)
08:54:33 [INFO] Fetching org.eclipse.pde.api.tools_1.2.900.v20220323-1307.jar from https://download.eclipse.org/eclipse/updates/4.24-I-builds/I20220324-0140/plugins/ (945.27kB)
08:54:34 [INFO] Fetching org.objectweb.asm_9.2.0.v20210813-1119.jar from https://download.eclipse.org/eclipse/updates/4.24-I-builds/I20220324-0140/plugins/ (130.43kB)
08:54:34 [INFO] Fetching org.objectweb.asm.tree_9.2.0.v20210813-1119.jar from https://download.eclipse.org/eclipse/updates/4.24-I-builds/I20220324-0140/plugins/ (64.52kB)
08:54:34 [INFO] Toolchain in tycho-eclipserun-plugin: JDK[/opt/tools/java/openjdk/jdk-11/latest]
08:54:34 [INFO] Expected eclipse log file: /home/jenkins/agent/workspace/eclipse.jdt.core-Gerrit/org.eclipse.jdt.annotation/target/apigeneration-workspace/data/.metadata/.log
08:54:34 [INFO] Command line:
08:54:34 	[/opt/tools/java/openjdk/jdk-11/latest/bin/java, -jar, /home/jenkins/agent/workspace/eclipse.jdt.core-Gerrit/.repository/p2/osgi/bundle/org.eclipse.equinox.launcher/1.6.400.v20210924-0641/org.eclipse.equinox.launcher-1.6.400.v20210924-0641.jar, -install, /home/jenkins/agent/workspace/eclipse.jdt.core-Gerrit/org.eclipse.jdt.annotation/target/apigeneration-workspace, -configuration, /home/jenkins/agent/workspace/eclipse.jdt.core-Gerrit/org.eclipse.jdt.annotation/target/apigeneration-workspace/configuration, -data, /home/jenkins/agent/workspace/eclipse.jdt.core-Gerrit/org.eclipse.jdt.annotation/target/apigeneration-workspace/data, -application, org.eclipse.pde.api.tools.apiGeneration, -projectName, org.eclipse.jdt.annotation_2.2.600.v20200408-1511, -project, /home/jenkins/agent/workspace/eclipse.jdt.core-Gerrit/org.eclipse.jdt.annotation, -binary, /home/jenkins/agent/workspace/eclipse.jdt.core-Gerrit/org.eclipse.jdt.annotation/target/classes, -target, /home/jenkins/agent/workspace/eclipse.jdt.core-Gerrit/org.eclipse.jdt.annotation/target]
08:54:37 [INFO] 
08:54:37 [INFO] --- maven-resources-plugin:3.2.0:testResources (default-testResources) @ org.eclipse.jdt.annotation ---
08:54:37 [INFO] Using 'UTF-8' encoding to copy filtered resources.
08:54:37 [INFO] Using 'UTF-8' encoding to copy filtered properties files.
08:54:37 [INFO] skip non existing resourceDirectory /home/jenkins/agent/workspace/eclipse.jdt.core-Gerrit/org.eclipse.jdt.annotation/src/test/resources
08:54:37 [INFO] 
08:54:37 [INFO] --- tycho-compiler-plugin:3.0.0-SNAPSHOT:testCompile (default-testCompile) @ org.eclipse.jdt.annotation ---
08:54:37 [INFO] 
08:54:37 [INFO] --- maven-surefire-plugin:3.0.0-M5:test (default-test) @ org.eclipse.jdt.annotation ---
08:54:40 [INFO] No tests to run.
08:54:40 [INFO] 
08:54:40 [INFO] --- tycho-packaging-plugin:3.0.0-SNAPSHOT:update-consumer-pom (default-update-consumer-pom) @ org.eclipse.jdt.annotation ---
08:54:40 [INFO] 
08:54:40 [INFO] --- tycho-source-plugin:3.0.0-SNAPSHOT:plugin-source (plugin-source) @ org.eclipse.jdt.annotation ---
08:54:40 [INFO] Building jar: /home/jenkins/agent/workspace/eclipse.jdt.core-Gerrit/org.eclipse.jdt.annotation/target/org.eclipse.jdt.annotation-2.2.600-SNAPSHOT-sources.jar
08:54:40 [INFO] 
08:54:40 [INFO] --- tycho-packaging-plugin:3.0.0-SNAPSHOT:package-plugin (default-package-plugin) @ org.eclipse.jdt.annotation ---
08:54:40 [INFO] Building jar: /home/jenkins/agent/workspace/eclipse.jdt.core-Gerrit/org.eclipse.jdt.annotation/target/org.eclipse.jdt.annotation-2.2.600-SNAPSHOT.jar
08:54:40 [INFO] 
08:54:40 [INFO] --- tycho-p2-plugin:3.0.0-SNAPSHOT:p2-metadata-default (default-p2-metadata-default) @ org.eclipse.jdt.annotation ---
08:54:41 [INFO] MavenProject: org.eclipse.jdt:org.eclipse.jdt.annotation:2.2.600-SNAPSHOT @ /home/jenkins/agent/workspace/eclipse.jdt.core-Gerrit/org.eclipse.jdt.annotation/pom.xml
08:54:41     The main artifact has been replaced with the baseline version.
08:54:41     The following attached artifacts have been replaced with the baseline version: [sources]
08:54:41 
08:54:41 [INFO] 
08:54:41 [INFO] --- tycho-surefire-plugin:3.0.0-SNAPSHOT:integration-test (default-integration-test) @ org.eclipse.jdt.annotation ---
08:54:41 [INFO] 
08:54:41 [INFO] --- maven-failsafe-plugin:2.22.2:verify (default-verify) @ org.eclipse.jdt.annotation ---
08:54:42 [INFO] No tests to run.
08:54:42 [INFO] 
08:54:42 [INFO] --- tycho-p2-extras-plugin:3.0.0-SNAPSHOT:compare-version-with-baselines (compare-attached-artifacts-with-release) @ org.eclipse.jdt.annotation ---
08:54:42 [INFO] Skipped
08:54:42 [INFO] 
08:54:42 [INFO] --- maven-antrun-plugin:3.0.0:run (check-skip-api-analysis) @ org.eclipse.jdt.annotation ---
08:54:43 [INFO] Executing tasks
08:54:43 [INFO] Executed tasks
08:54:43 [INFO] 
08:54:43 [INFO] --- tycho-dependency-tools-plugin:3.0.0-SNAPSHOT:list-dependencies (list-dependencies) @ org.eclipse.jdt.annotation ---
08:54:43 [INFO] 
08:54:43 [INFO] --- tycho-eclipserun-plugin:3.0.0-SNAPSHOT:eclipse-run (api-analysis) @ org.eclipse.jdt.annotation ---
08:54:43 [INFO] Fetching org.eclipse.ecf_3.10.0.v20210925-0032.jar from https://download.eclipse.org/eclipse/updates/4.24-I-builds/I20220324-0140/plugins/ (127.97kB)
08:54:43 [INFO] Fetching org.eclipse.ecf.identity_3.9.402.v20210409-2301.jar from https://download.eclipse.org/eclipse/updates/4.24-I-builds/I20220324-0140/plugins/ (64.2kB)
08:54:43 [INFO] Fetching org.eclipse.equinox.concurrent_1.2.100.v20211021-1418.jar from https://download.eclipse.org/eclipse/updates/4.24-I-builds/I20220324-0140/plugins/ (26.38kB)
08:54:43 [INFO] Fetching org.eclipse.ecf.filetransfer_5.1.102.v20210409-2301.jar from https://download.eclipse.org/eclipse/updates/4.24-I-builds/I20220324-0140/plugins/ (52.52kB)
08:54:43 [INFO] Fetching org.eclipse.ecf.provider.filetransfer_3.2.800.v20220215-0126.jar from https://download.eclipse.org/eclipse/updates/4.24-I-builds/I20220324-0140/plugins/ (129.12kB)
08:54:43 [INFO] Fetching org.eclipse.ecf.provider.filetransfer.ssl_1.0.201.v20210409-2301.jar from https://download.eclipse.org/eclipse/updates/4.24-I-builds/I20220324-0140/plugins/ (9.69kB)
08:54:43 [INFO] Fetching org.eclipse.equinox.p2.touchpoint.natives_1.4.300.v20220210-1319.jar from https://download.eclipse.org/eclipse/updates/4.24-I-builds/I20220324-0140/plugins/ (85.88kB)
08:54:43 [INFO] Fetching org.eclipse.equinox.p2.transport.ecf_1.3.300.v20220309-1957.jar from https://download.eclipse.org/eclipse/updates/4.24-I-builds/I20220324-0140/plugins/ (45.22kB)
08:54:43 [INFO] Toolchain in tycho-eclipserun-plugin: JDK[/opt/tools/java/openjdk/jdk-11/latest]
08:54:43 [INFO] Expected eclipse log file: /home/jenkins/agent/workspace/eclipse.jdt.core-Gerrit/apiAnalyzer-workspace/data/.metadata/.log
08:54:43 [INFO] Command line:
08:54:43 	[/opt/tools/java/openjdk/jdk-11/latest/bin/java, -Xmx2048M, -Dp2.RepositoryPreferences.retryOnSocketTimeout=true, -Dp2.RepositoryPreferences.connectionRetryCount=3, -Dp2.RepositoryPreferences.connectionMsRetryDelay=500, -Dorg.eclipse.ecf.provider.filetransfer.retrieve.readTimeout=10000, -jar, /home/jenkins/agent/workspace/eclipse.jdt.core-Gerrit/.repository/p2/osgi/bundle/org.eclipse.equinox.launcher/1.6.400.v20210924-0641/org.eclipse.equinox.launcher-1.6.400.v20210924-0641.jar, -install, /home/jenkins/agent/workspace/eclipse.jdt.core-Gerrit/apiAnalyzer-workspace, -configuration, /home/jenkins/agent/workspace/eclipse.jdt.core-Gerrit/apiAnalyzer-workspace/configuration, -data, /home/jenkins/agent/workspace/eclipse.jdt.core-Gerrit/apiAnalyzer-workspace/data, -application, org.eclipse.pde.api.tools.apiAnalyzer, -project, /home/jenkins/agent/workspace/eclipse.jdt.core-Gerrit/org.eclipse.jdt.annotation, -baseline, /home/jenkins/agent/workspace/eclipse.jdt.core-Gerrit/org.eclipse.jdt.annotation/target/org.eclipse.jdt.annotation-apiBaseline.target, -dependencyList, /home/jenkins/agent/workspace/eclipse.jdt.core-Gerrit/org.eclipse.jdt.annotation/target/dependencies-list.txt, -failOnError]
08:55:11 0 API ERRORS
08:55:11 0 API warnings
08:55:11 [INFO] 
08:55:11 [INFO] -------------< org.eclipse.jdt:org.eclipse.jdt.annotation >-------------
08:55:11 [INFO] Building org.eclipse.jdt.annotation 1.2.0-SNAPSHOT                [3/18]
08:55:11 [INFO] ---------------------------[ eclipse-plugin ]---------------------------
08:55:11 [INFO] 
08:55:11 [INFO] --- maven-clean-plugin:3.1.0:clean (default-clean) @ org.eclipse.jdt.annotation ---
08:55:11 [INFO] 
08:55:11 [INFO] --- tycho-packaging-plugin:3.0.0-SNAPSHOT:build-qualifier (default-build-qualifier) @ org.eclipse.jdt.annotation ---
08:55:12 [INFO] The project's OSGi version is 1.2.0.v20210519-0438
08:55:12 [INFO] 
08:55:12 [INFO] --- tycho-packaging-plugin:3.0.0-SNAPSHOT:validate-id (default-validate-id) @ org.eclipse.jdt.annotation ---
08:55:12 [INFO] 
08:55:12 [INFO] --- tycho-packaging-plugin:3.0.0-SNAPSHOT:validate-version (default-validate-version) @ org.eclipse.jdt.annotation ---
08:55:12 [INFO] 
08:55:12 [INFO] --- maven-resources-plugin:3.2.0:copy-resources (saveproperties) @ org.eclipse.jdt.annotation ---
08:55:12 [INFO] Using 'UTF-8' encoding to copy filtered resources.
08:55:12 [INFO] Using 'UTF-8' encoding to copy filtered properties files.
08:55:12 [INFO] skip non existing resourceDirectory /home/jenkins/agent/workspace/eclipse.jdt.core-Gerrit/org.eclipse.jdt.annotation_v1/saveproperties
08:55:12 [INFO] 
08:55:12 [INFO] --- maven-enforcer-plugin:3.0.0:enforce (enforce-maven) @ org.eclipse.jdt.annotation ---
08:55:12 [INFO] 
08:55:12 [INFO] --- maven-antrun-plugin:3.0.0:run (check-has-apiTools-nature) @ org.eclipse.jdt.annotation ---
08:55:12 [INFO] Executing tasks
08:55:12 [INFO] Executed tasks
08:55:12 [INFO] 
08:55:12 [INFO] --- target-platform-configuration:3.0.0-SNAPSHOT:target-platform (default-target-platform) @ org.eclipse.jdt.annotation ---
08:55:12 [INFO] 
08:55:12 [INFO] --- tycho-compiler-plugin:3.0.0-SNAPSHOT:validate-classpath (default-validate-classpath) @ org.eclipse.jdt.annotation ---
08:55:12 [INFO] Resolving class path of org.eclipse.jdt.annotation...
08:55:12 [INFO] 
08:55:12 [INFO] --- maven-resources-plugin:3.2.0:resources (default-resources) @ org.eclipse.jdt.annotation ---
08:55:12 [INFO] Using 'UTF-8' encoding to copy filtered resources.
08:55:12 [INFO] Using 'UTF-8' encoding to copy filtered properties files.
08:55:12 [INFO] skip non existing resourceDirectory /home/jenkins/agent/workspace/eclipse.jdt.core-Gerrit/org.eclipse.jdt.annotation_v1/src/main/resources
08:55:12 [INFO] 
08:55:12 [INFO] --- maven-resources-plugin:3.2.0:resources (filter-resources) @ org.eclipse.jdt.annotation ---
08:55:12 [INFO] Using 'UTF-8' encoding to copy filtered resources.
08:55:12 [INFO] Using 'UTF-8' encoding to copy filtered properties files.
08:55:12 [INFO] skip non existing resourceDirectory /home/jenkins/agent/workspace/eclipse.jdt.core-Gerrit/org.eclipse.jdt.annotation_v1/src/main/resources
08:55:12 [INFO] 
08:55:12 [INFO] --- tycho-compiler-plugin:3.0.0-SNAPSHOT:compile (default-compile) @ org.eclipse.jdt.annotation ---
08:55:12 [INFO] Compiling 4 source files to /home/jenkins/agent/workspace/eclipse.jdt.core-Gerrit/org.eclipse.jdt.annotation_v1/target/classes
08:55:12 [INFO] 
08:55:12 [INFO] --- tycho-eclipserun-plugin:3.0.0-SNAPSHOT:eclipse-run (build-.api_description) @ org.eclipse.jdt.annotation ---
08:55:12 [INFO] Toolchain in tycho-eclipserun-plugin: JDK[/opt/tools/java/openjdk/jdk-11/latest]
08:55:12 [INFO] Expected eclipse log file: /home/jenkins/agent/workspace/eclipse.jdt.core-Gerrit/org.eclipse.jdt.annotation_v1/target/apigeneration-workspace/data/.metadata/.log
08:55:12 [INFO] Command line:
08:55:12 	[/opt/tools/java/openjdk/jdk-11/latest/bin/java, -jar, /home/jenkins/agent/workspace/eclipse.jdt.core-Gerrit/.repository/p2/osgi/bundle/org.eclipse.equinox.launcher/1.6.400.v20210924-0641/org.eclipse.equinox.launcher-1.6.400.v20210924-0641.jar, -install, /home/jenkins/agent/workspace/eclipse.jdt.core-Gerrit/org.eclipse.jdt.annotation_v1/target/apigeneration-workspace, -configuration, /home/jenkins/agent/workspace/eclipse.jdt.core-Gerrit/org.eclipse.jdt.annotation_v1/target/apigeneration-workspace/configuration, -data, /home/jenkins/agent/workspace/eclipse.jdt.core-Gerrit/org.eclipse.jdt.annotation_v1/target/apigeneration-workspace/data, -application, org.eclipse.pde.api.tools.apiGeneration, -projectName, org.eclipse.jdt.annotation_1.2.0.v20210519-0438, -project, /home/jenkins/agent/workspace/eclipse.jdt.core-Gerrit/org.eclipse.jdt.annotation_v1, -binary, /home/jenkins/agent/workspace/eclipse.jdt.core-Gerrit/org.eclipse.jdt.annotation_v1/target/classes, -target, /home/jenkins/agent/workspace/eclipse.jdt.core-Gerrit/org.eclipse.jdt.annotation_v1/target]
08:55:15 [INFO] 
08:55:15 [INFO] --- maven-resources-plugin:3.2.0:testResources (default-testResources) @ org.eclipse.jdt.annotation ---
08:55:15 [INFO] Using 'UTF-8' encoding to copy filtered resources.
08:55:15 [INFO] Using 'UTF-8' encoding to copy filtered properties files.
08:55:15 [INFO] skip non existing resourceDirectory /home/jenkins/agent/workspace/eclipse.jdt.core-Gerrit/org.eclipse.jdt.annotation_v1/src/test/resources
08:55:15 [INFO] 
08:55:15 [INFO] --- tycho-compiler-plugin:3.0.0-SNAPSHOT:testCompile (default-testCompile) @ org.eclipse.jdt.annotation ---
08:55:15 [INFO] 
08:55:15 [INFO] --- maven-surefire-plugin:3.0.0-M5:test (default-test) @ org.eclipse.jdt.annotation ---
08:55:15 [INFO] No tests to run.
08:55:15 [INFO] 
08:55:15 [INFO] --- tycho-packaging-plugin:3.0.0-SNAPSHOT:update-consumer-pom (default-update-consumer-pom) @ org.eclipse.jdt.annotation ---
08:55:15 [INFO] 
08:55:15 [INFO] --- tycho-source-plugin:3.0.0-SNAPSHOT:plugin-source (plugin-source) @ org.eclipse.jdt.annotation ---
08:55:15 [INFO] Building jar: /home/jenkins/agent/workspace/eclipse.jdt.core-Gerrit/org.eclipse.jdt.annotation_v1/target/org.eclipse.jdt.annotation-1.2.0-SNAPSHOT-sources.jar
08:55:15 [INFO] 
08:55:15 [INFO] --- tycho-packaging-plugin:3.0.0-SNAPSHOT:package-plugin (default-package-plugin) @ org.eclipse.jdt.annotation ---
08:55:15 [INFO] Building jar: /home/jenkins/agent/workspace/eclipse.jdt.core-Gerrit/org.eclipse.jdt.annotation_v1/target/org.eclipse.jdt.annotation-1.2.0-SNAPSHOT.jar
08:55:15 [INFO] 
08:55:15 [INFO] --- tycho-p2-plugin:3.0.0-SNAPSHOT:p2-metadata-default (default-p2-metadata-default) @ org.eclipse.jdt.annotation ---
08:55:15 [INFO] MavenProject: org.eclipse.jdt:org.eclipse.jdt.annotation:1.2.0-SNAPSHOT @ /home/jenkins/agent/workspace/eclipse.jdt.core-Gerrit/org.eclipse.jdt.annotation_v1/pom.xml
08:55:15     The main artifact has been replaced with the baseline version.
08:55:15     The following attached artifacts have been replaced with the baseline version: [sources]
08:55:15 
08:55:15 [INFO] 
08:55:15 [INFO] --- tycho-surefire-plugin:3.0.0-SNAPSHOT:integration-test (default-integration-test) @ org.eclipse.jdt.annotation ---
08:55:15 [INFO] 
08:55:15 [INFO] --- maven-failsafe-plugin:2.22.2:verify (default-verify) @ org.eclipse.jdt.annotation ---
08:55:15 [INFO] No tests to run.
08:55:15 [INFO] 
08:55:15 [INFO] --- tycho-p2-extras-plugin:3.0.0-SNAPSHOT:compare-version-with-baselines (compare-attached-artifacts-with-release) @ org.eclipse.jdt.annotation ---
08:55:15 [INFO] Skipped
08:55:15 [INFO] 
08:55:15 [INFO] --- maven-antrun-plugin:3.0.0:run (check-skip-api-analysis) @ org.eclipse.jdt.annotation ---
08:55:16 [INFO] Skipping Antrun execution
08:55:16 [INFO] 
08:55:16 [INFO] --- tycho-dependency-tools-plugin:3.0.0-SNAPSHOT:list-dependencies (list-dependencies) @ org.eclipse.jdt.annotation ---
08:55:16 [INFO] Skipped
08:55:16 [INFO] 
08:55:16 [INFO] --- tycho-eclipserun-plugin:3.0.0-SNAPSHOT:eclipse-run (api-analysis) @ org.eclipse.jdt.annotation ---
08:55:16 [INFO] 
08:55:16 [INFO] ----------------< org.eclipse.jdt:org.eclipse.jdt.core >----------------
08:55:16 [INFO] Building org.eclipse.jdt.core 3.30.0-SNAPSHOT                     [4/18]
08:55:16 [INFO] ---------------------------[ eclipse-plugin ]---------------------------
08:55:16 [INFO] 
08:55:16 [INFO] --- maven-clean-plugin:3.1.0:clean (default-clean) @ org.eclipse.jdt.core ---
08:55:16 [INFO] 
08:55:16 [INFO] --- tycho-packaging-plugin:3.0.0-SNAPSHOT:build-qualifier (default-build-qualifier) @ org.eclipse.jdt.core ---
08:55:16 [INFO] The project's OSGi version is 3.30.0.v20220328-1252
08:55:16 [INFO] 
08:55:16 [INFO] --- tycho-packaging-plugin:3.0.0-SNAPSHOT:validate-id (default-validate-id) @ org.eclipse.jdt.core ---
08:55:16 [INFO] 
08:55:16 [INFO] --- tycho-packaging-plugin:3.0.0-SNAPSHOT:validate-version (default-validate-version) @ org.eclipse.jdt.core ---
08:55:16 [INFO] 
08:55:16 [INFO] --- maven-resources-plugin:3.2.0:copy-resources (saveproperties) @ org.eclipse.jdt.core ---
08:55:16 [INFO] Using 'UTF-8' encoding to copy filtered resources.
08:55:16 [INFO] Using 'UTF-8' encoding to copy filtered properties files.
08:55:16 [INFO] skip non existing resourceDirectory /home/jenkins/agent/workspace/eclipse.jdt.core-Gerrit/org.eclipse.jdt.core/saveproperties
08:55:16 [INFO] 
08:55:16 [INFO] --- build-helper-maven-plugin:3.2.0:regex-property (compiler-message-properties) @ org.eclipse.jdt.core ---
08:55:20 [INFO] No match to regex '\\' found in '/home/jenkins/agent/workspace/eclipse.jdt.core-Gerrit/org.eclipse.jdt.core/batch/org/eclipse/jdt/internal/compiler/batch/messages.properties'. The initial value '/home/jenkins/agent/workspace/eclipse.jdt.core-Gerrit/org.eclipse.jdt.core/batch/org/eclipse/jdt/internal/compiler/batch/messages.properties' is left as-is...
08:55:20 [INFO] 
08:55:20 [INFO] --- maven-enforcer-plugin:3.0.0:enforce (enforce-maven) @ org.eclipse.jdt.core ---
08:55:20 [INFO] 
08:55:20 [INFO] --- maven-enforcer-plugin:3.0.0:enforce (no-tabs-in-compiler-messages) @ org.eclipse.jdt.core ---
08:55:20 [INFO] 
08:55:20 [INFO] --- maven-antrun-plugin:3.0.0:run (check-has-apiTools-nature) @ org.eclipse.jdt.core ---
08:55:20 [INFO] Executing tasks
08:55:20 [INFO] Executed tasks
08:55:20 [INFO] 
08:55:20 [INFO] --- target-platform-configuration:3.0.0-SNAPSHOT:target-platform (default-target-platform) @ org.eclipse.jdt.core ---
08:55:20 [INFO] 
08:55:20 [INFO] --- tycho-compiler-plugin:3.0.0-SNAPSHOT:validate-classpath (default-validate-classpath) @ org.eclipse.jdt.core ---
08:55:20 [INFO] Resolving class path of org.eclipse.jdt.core...
08:55:21 [INFO] Fetching org.eclipse.core.filesystem.win32.x86_64_1.4.200.v20190812-0909.jar from https://download.eclipse.org/eclipse/updates/4.24-I-builds/I20220324-0140/plugins/ (37.47kB)
08:55:21 [INFO] Fetching org.eclipse.core.filesystem.linux.aarch64_1.4.100.v20200805-0859.jar from https://download.eclipse.org/eclipse/updates/4.24-I-builds/I20220324-0140/plugins/ (11.16kB)
08:55:21 [INFO] Fetching org.eclipse.core.filesystem.macosx_1.3.300.v20210427-1937.jar from https://download.eclipse.org/eclipse/updates/4.24-I-builds/I20220324-0140/plugins/ (25.6kB)
08:55:21 [INFO] Fetching org.eclipse.ant.optional.junit_3.3.300.v20180822-0818.jar from https://download.eclipse.org/eclipse/updates/4.24-I-builds/I20220324-0140/plugins/ (7.51kB)
08:55:21 [INFO] Fetching org.eclipse.equinox.transforms.hook_1.3.100.v20211021-1418.jar from https://download.eclipse.org/eclipse/updates/4.24-I-builds/I20220324-0140/plugins/ (29.95kB)
08:55:21 [INFO] Fetching org.eclipse.core.filesystem.linux.x86_64_1.2.300.v20180828-0158.jar from https://download.eclipse.org/eclipse/updates/4.24-I-builds/I20220324-0140/plugins/ (11.32kB)
08:55:21 [INFO] Fetching org.eclipse.equinox.weaving.hook_1.3.100.v20211021-1418.jar from https://download.eclipse.org/eclipse/updates/4.24-I-builds/I20220324-0140/plugins/ (51.11kB)
08:55:21 [INFO] Fetching org.eclipse.core.filesystem.linux.ppc64le_1.4.100.v20180828-0158.jar from https://download.eclipse.org/eclipse/updates/4.24-I-builds/I20220324-0140/plugins/ (11.11kB)
08:55:21 [INFO] Fetching org.eclipse.core.resources.win32.x86_64_3.5.400.v20190812-0909.jar from https://download.eclipse.org/eclipse/updates/4.24-I-builds/I20220324-0140/plugins/ (57.74kB)
08:55:21 [INFO] Fetching org.eclipse.equinox.region_1.5.200.v20211021-1418.jar from https://download.eclipse.org/eclipse/updates/4.24-I-builds/I20220324-0140/plugins/ (77.37kB)
08:55:21 [INFO] 
08:55:21 [INFO] --- maven-resources-plugin:3.2.0:resources (default-resources) @ org.eclipse.jdt.core ---
08:55:21 [INFO] Using 'UTF-8' encoding to copy filtered resources.
08:55:21 [INFO] Using 'UTF-8' encoding to copy filtered properties files.
08:55:21 [INFO] skip non existing resourceDirectory /home/jenkins/agent/workspace/eclipse.jdt.core-Gerrit/org.eclipse.jdt.core/src/main/resources
08:55:21 [INFO] 
08:55:21 [INFO] --- maven-resources-plugin:3.2.0:resources (filter-resources) @ org.eclipse.jdt.core ---
08:55:21 [INFO] Using 'UTF-8' encoding to copy filtered resources.
08:55:21 [INFO] Using 'UTF-8' encoding to copy filtered properties files.
08:55:21 [INFO] skip non existing resourceDirectory /home/jenkins/agent/workspace/eclipse.jdt.core-Gerrit/org.eclipse.jdt.core/src/main/resources
08:55:21 [INFO] 
08:55:21 [INFO] --- tycho-compiler-plugin:3.0.0-SNAPSHOT:compile (default-compile) @ org.eclipse.jdt.core ---
08:55:21 [INFO] Compiling 1514 source files to /home/jenkins/agent/workspace/eclipse.jdt.core-Gerrit/org.eclipse.jdt.core/target/classes
08:55:34 [INFO] Compiling 4 source files to /home/jenkins/agent/workspace/eclipse.jdt.core-Gerrit/org.eclipse.jdt.core/target/jdtCompilerAdapter.jar-classes
08:55:34 [INFO] 
08:55:34 [INFO] --- tycho-eclipserun-plugin:3.0.0-SNAPSHOT:eclipse-run (build-.api_description) @ org.eclipse.jdt.core ---
08:55:34 [INFO] Toolchain in tycho-eclipserun-plugin: JDK[/opt/tools/java/openjdk/jdk-11/latest]
08:55:34 [INFO] Expected eclipse log file: /home/jenkins/agent/workspace/eclipse.jdt.core-Gerrit/org.eclipse.jdt.core/target/apigeneration-workspace/data/.metadata/.log
08:55:34 [INFO] Command line:
08:55:34 	[/opt/tools/java/openjdk/jdk-11/latest/bin/java, -jar, /home/jenkins/agent/workspace/eclipse.jdt.core-Gerrit/.repository/p2/osgi/bundle/org.eclipse.equinox.launcher/1.6.400.v20210924-0641/org.eclipse.equinox.launcher-1.6.400.v20210924-0641.jar, -install, /home/jenkins/agent/workspace/eclipse.jdt.core-Gerrit/org.eclipse.jdt.core/target/apigeneration-workspace, -configuration, /home/jenkins/agent/workspace/eclipse.jdt.core-Gerrit/org.eclipse.jdt.core/target/apigeneration-workspace/configuration, -data, /home/jenkins/agent/workspace/eclipse.jdt.core-Gerrit/org.eclipse.jdt.core/target/apigeneration-workspace/data, -application, org.eclipse.pde.api.tools.apiGeneration, -projectName, org.eclipse.jdt.core_3.30.0.v20220328-1252, -project, /home/jenkins/agent/workspace/eclipse.jdt.core-Gerrit/org.eclipse.jdt.core, -binary, /home/jenkins/agent/workspace/eclipse.jdt.core-Gerrit/org.eclipse.jdt.core/target/classes:/home/jenkins/agent/workspace/eclipse.jdt.core-Gerrit/org.eclipse.jdt.core/target/jdtCompilerAdapter.jar-classes, -target, /home/jenkins/agent/workspace/eclipse.jdt.core-Gerrit/org.eclipse.jdt.core/target]
08:55:44 [INFO] 
08:55:44 [INFO] --- maven-resources-plugin:3.2.0:testResources (default-testResources) @ org.eclipse.jdt.core ---
08:55:44 [INFO] Using 'UTF-8' encoding to copy filtered resources.
08:55:44 [INFO] Using 'UTF-8' encoding to copy filtered properties files.
08:55:44 [INFO] skip non existing resourceDirectory /home/jenkins/agent/workspace/eclipse.jdt.core-Gerrit/org.eclipse.jdt.core/src/test/resources
08:55:44 [INFO] 
08:55:44 [INFO] --- tycho-compiler-plugin:3.0.0-SNAPSHOT:testCompile (default-testCompile) @ org.eclipse.jdt.core ---
08:55:44 [INFO] 
08:55:44 [INFO] --- maven-surefire-plugin:3.0.0-M5:test (default-test) @ org.eclipse.jdt.core ---
08:55:44 [INFO] No tests to run.
08:55:44 [INFO] 
08:55:44 [INFO] --- tycho-packaging-plugin:3.0.0-SNAPSHOT:update-consumer-pom (default-update-consumer-pom) @ org.eclipse.jdt.core ---
08:55:44 [INFO] 
08:55:44 [INFO] --- tycho-source-plugin:3.0.0-SNAPSHOT:plugin-source (plugin-source) @ org.eclipse.jdt.core ---
08:55:44 [INFO] Building jar: /home/jenkins/agent/workspace/eclipse.jdt.core-Gerrit/org.eclipse.jdt.core/target/org.eclipse.jdt.core-3.30.0-SNAPSHOT-sources.jar
08:55:44 [INFO] 
08:55:44 [INFO] --- maven-antrun-plugin:3.0.0:run (default) @ org.eclipse.jdt.core ---
08:55:44 [INFO] Executing tasks
08:55:45 [INFO] Executed tasks
08:55:45 [INFO] 
08:55:45 [INFO] --- tycho-packaging-plugin:3.0.0-SNAPSHOT:package-plugin (default-package-plugin) @ org.eclipse.jdt.core ---
08:55:45 [INFO] Building jar: /home/jenkins/agent/workspace/eclipse.jdt.core-Gerrit/org.eclipse.jdt.core/jdtCompilerAdapter.jar
08:55:45 [INFO] Building jar: /home/jenkins/agent/workspace/eclipse.jdt.core-Gerrit/org.eclipse.jdt.core/target/org.eclipse.jdt.core-3.30.0-SNAPSHOT.jar
08:55:45 [INFO] 
08:55:45 [INFO] --- tycho-p2-plugin:3.0.0-SNAPSHOT:p2-metadata-default (default-p2-metadata-default) @ org.eclipse.jdt.core ---
08:55:45 [INFO] No baseline version MavenProject: org.eclipse.jdt:org.eclipse.jdt.core:3.30.0-SNAPSHOT @ /home/jenkins/agent/workspace/eclipse.jdt.core-Gerrit/org.eclipse.jdt.core/pom.xml
08:55:45 [INFO] 
08:55:45 [INFO] --- maven-resources-plugin:3.2.0:copy-resources (copy-batch-compiler-source) @ org.eclipse.jdt.core ---
08:55:45 [INFO] Using 'UTF-8' encoding to copy filtered resources.
08:55:45 [INFO] Using 'UTF-8' encoding to copy filtered properties files.
08:55:45 [INFO] Copying 1 resource
08:55:45 [INFO] 
08:55:45 [INFO] --- tycho-custom-bundle-plugin:3.0.0-SNAPSHOT:custom-bundle (antadapter) @ org.eclipse.jdt.core ---
08:55:45 [INFO] Building jar: /home/jenkins/agent/workspace/eclipse.jdt.core-Gerrit/org.eclipse.jdt.core/target/org.eclipse.jdt.core-3.30.0-SNAPSHOT-antadapter.jar
08:55:45 [INFO] 
08:55:45 [INFO] --- tycho-custom-bundle-plugin:3.0.0-SNAPSHOT:custom-bundle (batch-compiler-src) @ org.eclipse.jdt.core ---
08:55:45 [INFO] Building jar: /home/jenkins/agent/workspace/eclipse.jdt.core-Gerrit/org.eclipse.jdt.core/target/org.eclipse.jdt.core-3.30.0-SNAPSHOT-batch-compiler-src.jar
08:55:46 [INFO] 
08:55:46 [INFO] --- tycho-custom-bundle-plugin:3.0.0-SNAPSHOT:custom-bundle (batch-compiler) @ org.eclipse.jdt.core ---
08:55:46 [INFO] Building jar: /home/jenkins/agent/workspace/eclipse.jdt.core-Gerrit/org.eclipse.jdt.core/target/org.eclipse.jdt.core-3.30.0-SNAPSHOT-batch-compiler.jar
08:55:46 [INFO] 
08:55:46 [INFO] --- tycho-p2-plugin:3.0.0-SNAPSHOT:p2-metadata (attached-p2-metadata) @ org.eclipse.jdt.core ---
08:55:46 [INFO] No baseline version MavenProject: org.eclipse.jdt:org.eclipse.jdt.core:3.30.0-SNAPSHOT @ /home/jenkins/agent/workspace/eclipse.jdt.core-Gerrit/org.eclipse.jdt.core/pom.xml
08:55:46 [WARNING] artifact org.eclipse.jdt:org.eclipse.jdt.core:xml:p2metadata:3.30.0-SNAPSHOT already attached, replace previous instance
08:55:46 [WARNING] artifact org.eclipse.jdt:org.eclipse.jdt.core:xml:p2artifacts:3.30.0-SNAPSHOT already attached, replace previous instance
08:55:46 [INFO] 
08:55:46 [INFO] --- tycho-surefire-plugin:3.0.0-SNAPSHOT:integration-test (default-integration-test) @ org.eclipse.jdt.core ---
08:55:46 [INFO] 
08:55:46 [INFO] --- maven-failsafe-plugin:2.22.2:verify (default-verify) @ org.eclipse.jdt.core ---
08:55:46 [INFO] No tests to run.
08:55:46 [INFO] 
08:55:46 [INFO] --- tycho-p2-extras-plugin:3.0.0-SNAPSHOT:compare-version-with-baselines (compare-attached-artifacts-with-release) @ org.eclipse.jdt.core ---
08:55:46 [INFO] Skipped
08:55:46 [INFO] 
08:55:46 [INFO] --- maven-antrun-plugin:3.0.0:run (check-skip-api-analysis) @ org.eclipse.jdt.core ---
08:55:46 [INFO] Executing tasks
08:55:46 [INFO] Executed tasks
08:55:46 [INFO] 
08:55:46 [INFO] --- tycho-dependency-tools-plugin:3.0.0-SNAPSHOT:list-dependencies (list-dependencies) @ org.eclipse.jdt.core ---
08:55:46 [INFO] 
08:55:46 [INFO] --- tycho-eclipserun-plugin:3.0.0-SNAPSHOT:eclipse-run (api-analysis) @ org.eclipse.jdt.core ---
08:55:46 [INFO] Toolchain in tycho-eclipserun-plugin: JDK[/opt/tools/java/openjdk/jdk-11/latest]
08:55:46 [INFO] Expected eclipse log file: /home/jenkins/agent/workspace/eclipse.jdt.core-Gerrit/apiAnalyzer-workspace/data/.metadata/.log
08:55:46 [INFO] Command line:
08:55:46 	[/opt/tools/java/openjdk/jdk-11/latest/bin/java, -Xmx2048M, -Dp2.RepositoryPreferences.retryOnSocketTimeout=true, -Dp2.RepositoryPreferences.connectionRetryCount=3, -Dp2.RepositoryPreferences.connectionMsRetryDelay=500, -Dorg.eclipse.ecf.provider.filetransfer.retrieve.readTimeout=10000, -jar, /home/jenkins/agent/workspace/eclipse.jdt.core-Gerrit/.repository/p2/osgi/bundle/org.eclipse.equinox.launcher/1.6.400.v20210924-0641/org.eclipse.equinox.launcher-1.6.400.v20210924-0641.jar, -install, /home/jenkins/agent/workspace/eclipse.jdt.core-Gerrit/apiAnalyzer-workspace, -configuration, /home/jenkins/agent/workspace/eclipse.jdt.core-Gerrit/apiAnalyzer-workspace/configuration, -data, /home/jenkins/agent/workspace/eclipse.jdt.core-Gerrit/apiAnalyzer-workspace/data, -application, org.eclipse.pde.api.tools.apiAnalyzer, -project, /home/jenkins/agent/workspace/eclipse.jdt.core-Gerrit/org.eclipse.jdt.core, -baseline, /home/jenkins/agent/workspace/eclipse.jdt.core-Gerrit/org.eclipse.jdt.core/target/org.eclipse.jdt.core-apiBaseline.target, -dependencyList, /home/jenkins/agent/workspace/eclipse.jdt.core-Gerrit/org.eclipse.jdt.core/target/dependencies-list.txt, -failOnError]
08:56:27 Build was aborted
08:56:27 Aborted by new patch set.
08:56:27 [AcuCobol] Sleeping for 5 seconds due to JENKINS-32191...
08:56:27 [INFO] ------------------------------------------------------------------------
08:56:27 [INFO] Reactor Summary:
08:56:27 [INFO] 
08:56:27 [INFO] eclipse.jdt.core 4.24.0-SNAPSHOT ................... SUCCESS [ 11.446 s]
08:56:27 [INFO] org.eclipse.jdt.annotation 2.2.600-SNAPSHOT ........ SUCCESS [ 46.097 s]
08:56:27 [INFO] org.eclipse.jdt.annotation 1.2.0-SNAPSHOT .......... SUCCESS [  4.090 s]
08:56:27 [INFO] org.eclipse.jdt.core 3.30.0-SNAPSHOT ............... FAILURE [01:11 min]
08:56:27 [INFO] org.eclipse.jdt.compiler.tool 1.3.150-SNAPSHOT ..... SKIPPED
08:56:27 [INFO] org.eclipse.jdt.core.formatterapp 1.1.0-SNAPSHOT ... SKIPPED
08:56:27 [INFO] org.eclipse.jdt.compiler.apt 1.4.100-SNAPSHOT ...... SKIPPED
08:56:27 [INFO] org.eclipse.jdt.core.tests.compiler 3.12.1900-SNAPSHOT SKIPPED
08:56:27 [INFO] org.eclipse.jdt.compiler.tool.tests 1.3.150-SNAPSHOT SKIPPED
08:56:27 [INFO] org.eclipse.jdt.core.tests.builder 3.11.200-SNAPSHOT SKIPPED
08:56:27 [INFO] org.eclipse.jdt.compiler.apt.tests 1.2.150-SNAPSHOT  SKIPPED
08:56:27 [INFO] org.eclipse.jdt.core.tests.model 3.11.200-SNAPSHOT . SKIPPED
08:56:27 [INFO] org.eclipse.jdt.core.tests.performance 3.11.50-SNAPSHOT SKIPPED
08:56:27 [INFO] org.eclipse.jdt.apt.core 3.7.50-SNAPSHOT ........... SKIPPED
08:56:27 [INFO] org.eclipse.jdt.apt.pluggable.core 1.3.0-SNAPSHOT .. SKIPPED
08:56:27 [INFO] org.eclipse.jdt.apt.ui 3.7.0-SNAPSHOT .............. SKIPPED
08:56:27 [INFO] org.eclipse.jdt.apt.pluggable.tests 3.5.0-SNAPSHOT . SKIPPED
08:56:27 [INFO] org.eclipse.jdt.apt.tests 3.5.50-SNAPSHOT .......... SKIPPED
08:56:27 [INFO] ------------------------------------------------------------------------
08:56:27 [INFO] BUILD FAILURE
08:56:27 [INFO] ------------------------------------------------------------------------
08:56:27 [INFO] Total time:  03:15 min
08:56:27 [INFO] Finished at: 2022-03-28T12:56:27Z
08:56:27 [INFO] ------------------------------------------------------------------------
08:56:27 [ERROR] Failed to execute goal org.eclipse.tycho.extras:tycho-eclipserun-plugin:3.0.0-SNAPSHOT:eclipse-run (api-analysis) on project org.eclipse.jdt.core: Error while executing platform: Error while executing platform: return code=143, see content of /home/jenkins/agent/workspace/eclipse.jdt.core-Gerrit/apiAnalyzer-workspace/data/.metadata/.logfor more details. -> [Help 1]
08:56:27 [ERROR] 
08:56:27 [ERROR] To see the full stack trace of the errors, re-run Maven with the -e switch.
08:56:27 [ERROR] Re-run Maven using the -X switch to enable full debug logging.
08:56:27 [ERROR] 
08:56:27 [ERROR] For more information about the errors and possible solutions, please read the following articles:
08:56:27 [ERROR] [Help 1] http://cwiki.apache.org/confluence/display/MAVEN/MojoExecutionException
08:56:27 [ERROR] 
08:56:27 [ERROR] After correcting the problems, you can resume the build with the command
08:56:27 [ERROR]   mvn <args> -rf :org.eclipse.jdt.core
08:56:32 [AcuCobol] Parsing console log (workspace: '/home/jenkins/agent/workspace/eclipse.jdt.core-Gerrit')
08:56:32 [AcuCobol] -> found 0 issues (skipped 0 duplicates)
08:56:32 [AcuCobol] Parsing console log (workspace: '/home/jenkins/agent/workspace/eclipse.jdt.core-Gerrit')
08:56:32 [AcuCobol] -> found 0 issues (skipped 0 duplicates)
08:56:32 [AcuCobol] Successfully parsed console log
08:56:32 [AcuCobol] -> found 0 issues (skipped 0 duplicates)
08:56:32 [AcuCobol] Parsing console log (workspace: '/home/jenkins/agent/workspace/eclipse.jdt.core-Gerrit')
08:56:32 [AcuCobol] Skipping post processing
08:56:32 [AcuCobol] No filter has been set, publishing all 0 issues
08:56:32 [AcuCobol] Repository miner is not configured, skipping repository mining
08:56:32 [AcuCobol] Reference build recorder is not configured
08:56:32 [AcuCobol] Obtaining reference build from same job (eclipse.jdt.core-Gerrit)
08:56:32 [AcuCobol] Using reference build 'eclipse.jdt.core-Gerrit #6023' to compute new, fixed, and outstanding issues
08:56:32 [AcuCobol] Issues delta (vs. reference build): outstanding: 0, new: 0, fixed: 0
08:56:32 [AcuCobol] Evaluating quality gates
08:56:32 [AcuCobol] -> PASSED - New (any severity): 0 - Quality QualityGate: 1
08:56:32 [AcuCobol] -> PASSED - Delta (any severity): 0 - Quality QualityGate: 1
08:56:32 [AcuCobol] -> All quality gates have been passed
08:56:32 [AcuCobol] Health report is disabled - skipping
08:56:32 [AcuCobol] Created analysis result for 0 issues (found 0 new issues, fixed 0 issues)
08:56:32 [AcuCobol] Attaching ResultAction with ID 'acu-cobol' to build 'eclipse.jdt.core-Gerrit #6024'.
08:56:32 [Checks API] No suitable checks publisher found.
08:56:32 Recording test results
08:56:32 ERROR: Step ‘Publish JUnit test result report’ failed: No test report files were found. Configuration error?
08:56:32 Archiving artifacts
08:56:33 Finished: ABORTED