FailedConsole Output

Skipping 5,319 KB.. Full Log
e.jdt.core.tests.compiler.parser.AnnotationCompletionParserTest)  Time elapsed: 0.001 s
23:40:06 test0027 - 11(org.eclipse.jdt.core.tests.compiler.parser.AnnotationCompletionParserTest)  Time elapsed: 0 s
23:40:06 test0028_Diet - 11(org.eclipse.jdt.core.tests.compiler.parser.AnnotationCompletionParserTest)  Time elapsed: 0 s
23:40:06 test0028_Method - 11(org.eclipse.jdt.core.tests.compiler.parser.AnnotationCompletionParserTest)  Time elapsed: 0 s
23:40:06 test0029_Diet - 11(org.eclipse.jdt.core.tests.compiler.parser.AnnotationCompletionParserTest)  Time elapsed: 0.001 s
23:40:06 test0029_Method - 11(org.eclipse.jdt.core.tests.compiler.parser.AnnotationCompletionParserTest)  Time elapsed: 0 s
23:40:06 test0030 - 11(org.eclipse.jdt.core.tests.compiler.parser.AnnotationCompletionParserTest)  Time elapsed: 0 s
23:40:06 test0031 - 11(org.eclipse.jdt.core.tests.compiler.parser.AnnotationCompletionParserTest)  Time elapsed: 0.001 s
23:40:06 test0032 - 11(org.eclipse.jdt.core.tests.compiler.parser.AnnotationCompletionParserTest)  Time elapsed: 0 s
23:40:06 test0033 - 11(org.eclipse.jdt.core.tests.compiler.parser.AnnotationCompletionParserTest)  Time elapsed: 0 s
23:40:06 test0034_Diet - 11(org.eclipse.jdt.core.tests.compiler.parser.AnnotationCompletionParserTest)  Time elapsed: 0 s
23:40:06 test0034_Method - 11(org.eclipse.jdt.core.tests.compiler.parser.AnnotationCompletionParserTest)  Time elapsed: 0.001 s
23:40:06 test0035_Diet - 11(org.eclipse.jdt.core.tests.compiler.parser.AnnotationCompletionParserTest)  Time elapsed: 0 s
23:40:06 test0035_Method - 11(org.eclipse.jdt.core.tests.compiler.parser.AnnotationCompletionParserTest)  Time elapsed: 0 s
23:40:06 test0036 - 11(org.eclipse.jdt.core.tests.compiler.parser.AnnotationCompletionParserTest)  Time elapsed: 0.001 s
23:40:06 test0037 - 11(org.eclipse.jdt.core.tests.compiler.parser.AnnotationCompletionParserTest)  Time elapsed: 0 s
23:40:06 test0038 - 11(org.eclipse.jdt.core.tests.compiler.parser.AnnotationCompletionParserTest)  Time elapsed: 0 s
23:40:06 test0039 - 11(org.eclipse.jdt.core.tests.compiler.parser.AnnotationCompletionParserTest)  Time elapsed: 0 s
23:40:06 test0040_Diet - 11(org.eclipse.jdt.core.tests.compiler.parser.AnnotationCompletionParserTest)  Time elapsed: 0.001 s
23:40:06 test0040_Method - 11(org.eclipse.jdt.core.tests.compiler.parser.AnnotationCompletionParserTest)  Time elapsed: 0 s
23:40:06 test0041_Diet - 11(org.eclipse.jdt.core.tests.compiler.parser.AnnotationCompletionParserTest)  Time elapsed: 0 s
23:40:06 test0041_Method - 11(org.eclipse.jdt.core.tests.compiler.parser.AnnotationCompletionParserTest)  Time elapsed: 0 s
23:40:06 test0042 - 11(org.eclipse.jdt.core.tests.compiler.parser.AnnotationCompletionParserTest)  Time elapsed: 0.001 s
23:40:06 test0043 - 11(org.eclipse.jdt.core.tests.compiler.parser.AnnotationCompletionParserTest)  Time elapsed: 0 s
23:40:06 test0044 - 11(org.eclipse.jdt.core.tests.compiler.parser.AnnotationCompletionParserTest)  Time elapsed: 0 s
23:40:06 test0045 - 11(org.eclipse.jdt.core.tests.compiler.parser.AnnotationCompletionParserTest)  Time elapsed: 0.001 s
23:40:06 test0046_Diet - 11(org.eclipse.jdt.core.tests.compiler.parser.AnnotationCompletionParserTest)  Time elapsed: 0 s
23:40:06 test0046_Method - 11(org.eclipse.jdt.core.tests.compiler.parser.AnnotationCompletionParserTest)  Time elapsed: 0 s
23:40:06 test0047_Diet - 11(org.eclipse.jdt.core.tests.compiler.parser.AnnotationCompletionParserTest)  Time elapsed: 0 s
23:40:06 test0047_Method - 11(org.eclipse.jdt.core.tests.compiler.parser.AnnotationCompletionParserTest)  Time elapsed: 0.001 s
23:40:06 test0048 - 11(org.eclipse.jdt.core.tests.compiler.parser.AnnotationCompletionParserTest)  Time elapsed: 0 s
23:40:06 test0049 - 11(org.eclipse.jdt.core.tests.compiler.parser.AnnotationCompletionParserTest)  Time elapsed: 0 s
23:40:06 test0050 - 11(org.eclipse.jdt.core.tests.compiler.parser.AnnotationCompletionParserTest)  Time elapsed: 0.001 s
23:40:06 test0051 - 11(org.eclipse.jdt.core.tests.compiler.parser.AnnotationCompletionParserTest)  Time elapsed: 0 s
23:40:06 test0052_Diet - 11(org.eclipse.jdt.core.tests.compiler.parser.AnnotationCompletionParserTest)  Time elapsed: 0 s
23:40:06 test0052_Method - 11(org.eclipse.jdt.core.tests.compiler.parser.AnnotationCompletionParserTest)  Time elapsed: 0 s
23:40:06 test0053_Diet - 11(org.eclipse.jdt.core.tests.compiler.parser.AnnotationCompletionParserTest)  Time elapsed: 0.001 s
23:40:06 test0053_Method - 11(org.eclipse.jdt.core.tests.compiler.parser.AnnotationCompletionParserTest)  Time elapsed: 0 s
23:40:06 test0054 - 11(org.eclipse.jdt.core.tests.compiler.parser.AnnotationCompletionParserTest)  Time elapsed: 0 s
23:40:06 test0055 - 11(org.eclipse.jdt.core.tests.compiler.parser.AnnotationCompletionParserTest)  Time elapsed: 0.001 s
23:40:06 test0056 - 11(org.eclipse.jdt.core.tests.compiler.parser.AnnotationCompletionParserTest)  Time elapsed: 0 s
23:40:06 test0057 - 11(org.eclipse.jdt.core.tests.compiler.parser.AnnotationCompletionParserTest)  Time elapsed: 0 s
23:40:06 test0058_Diet - 11(org.eclipse.jdt.core.tests.compiler.parser.AnnotationCompletionParserTest)  Time elapsed: 0 s
23:40:06 test0058_Method - 11(org.eclipse.jdt.core.tests.compiler.parser.AnnotationCompletionParserTest)  Time elapsed: 0.001 s
23:40:06 test0059_Diet - 11(org.eclipse.jdt.core.tests.compiler.parser.AnnotationCompletionParserTest)  Time elapsed: 0 s
23:40:06 test0059_Method - 11(org.eclipse.jdt.core.tests.compiler.parser.AnnotationCompletionParserTest)  Time elapsed: 0 s
23:40:06 test0060 - 11(org.eclipse.jdt.core.tests.compiler.parser.AnnotationCompletionParserTest)  Time elapsed: 0 s
23:40:06 test0061 - 11(org.eclipse.jdt.core.tests.compiler.parser.AnnotationCompletionParserTest)  Time elapsed: 0.001 s
23:40:06 test0062 - 11(org.eclipse.jdt.core.tests.compiler.parser.AnnotationCompletionParserTest)  Time elapsed: 0 s
23:40:06 test0063 - 11(org.eclipse.jdt.core.tests.compiler.parser.AnnotationCompletionParserTest)  Time elapsed: 0 s
23:40:06 test0064_Diet - 11(org.eclipse.jdt.core.tests.compiler.parser.AnnotationCompletionParserTest)  Time elapsed: 0 s
23:40:06 test0064_Method - 11(org.eclipse.jdt.core.tests.compiler.parser.AnnotationCompletionParserTest)  Time elapsed: 0 s
23:40:06 test0065_Diet - 11(org.eclipse.jdt.core.tests.compiler.parser.AnnotationCompletionParserTest)  Time elapsed: 0 s
23:40:06 test0065_Method - 11(org.eclipse.jdt.core.tests.compiler.parser.AnnotationCompletionParserTest)  Time elapsed: 0.001 s
23:40:06 test0066 - 11(org.eclipse.jdt.core.tests.compiler.parser.AnnotationCompletionParserTest)  Time elapsed: 0 s
23:40:06 test0067 - 11(org.eclipse.jdt.core.tests.compiler.parser.AnnotationCompletionParserTest)  Time elapsed: 0 s
23:40:06 test0068 - 11(org.eclipse.jdt.core.tests.compiler.parser.AnnotationCompletionParserTest)  Time elapsed: 0.001 s
23:40:06 test0069 - 11(org.eclipse.jdt.core.tests.compiler.parser.AnnotationCompletionParserTest)  Time elapsed: 0 s
23:40:06 test0070_Diet - 11(org.eclipse.jdt.core.tests.compiler.parser.AnnotationCompletionParserTest)  Time elapsed: 0 s
23:40:06 test0070_Method - 11(org.eclipse.jdt.core.tests.compiler.parser.AnnotationCompletionParserTest)  Time elapsed: 0.001 s
23:40:06 test0071_Diet - 11(org.eclipse.jdt.core.tests.compiler.parser.AnnotationCompletionParserTest)  Time elapsed: 0 s
23:40:06 test0071_Method - 11(org.eclipse.jdt.core.tests.compiler.parser.AnnotationCompletionParserTest)  Time elapsed: 0 s
23:40:06 test0072 - 11(org.eclipse.jdt.core.tests.compiler.parser.AnnotationCompletionParserTest)  Time elapsed: 0 s
23:40:06 test0073 - 11(org.eclipse.jdt.core.tests.compiler.parser.AnnotationCompletionParserTest)  Time elapsed: 0.001 s
23:40:06 test0074 - 11(org.eclipse.jdt.core.tests.compiler.parser.AnnotationCompletionParserTest)  Time elapsed: 0 s
23:40:06 test0075 - 11(org.eclipse.jdt.core.tests.compiler.parser.AnnotationCompletionParserTest)  Time elapsed: 0 s
23:40:06 test0076 - 11(org.eclipse.jdt.core.tests.compiler.parser.AnnotationCompletionParserTest)  Time elapsed: 0.001 s
23:40:06 test0078 - 11(org.eclipse.jdt.core.tests.compiler.parser.AnnotationCompletionParserTest)  Time elapsed: 0 s
23:40:06 test0079 - 11(org.eclipse.jdt.core.tests.compiler.parser.AnnotationCompletionParserTest)  Time elapsed: 0 s
23:40:06 test0080 - 11(org.eclipse.jdt.core.tests.compiler.parser.AnnotationCompletionParserTest)  Time elapsed: 0 s
23:40:06 test0081 - 11(org.eclipse.jdt.core.tests.compiler.parser.AnnotationCompletionParserTest)  Time elapsed: 0.001 s
23:40:06 test0082 - 11(org.eclipse.jdt.core.tests.compiler.parser.AnnotationCompletionParserTest)  Time elapsed: 0 s
23:40:06 test0083 - 11(org.eclipse.jdt.core.tests.compiler.parser.AnnotationCompletionParserTest)  Time elapsed: 0 s
23:40:06 test0084 - 11(org.eclipse.jdt.core.tests.compiler.parser.AnnotationCompletionParserTest)  Time elapsed: 0 s
23:40:06 test0085 - 11(org.eclipse.jdt.core.tests.compiler.parser.AnnotationCompletionParserTest)  Time elapsed: 0.001 s
23:40:06 test0086 - 11(org.eclipse.jdt.core.tests.compiler.parser.AnnotationCompletionParserTest)  Time elapsed: 0 s
23:40:06 test0087 - 11(org.eclipse.jdt.core.tests.compiler.parser.AnnotationCompletionParserTest)  Time elapsed: 0 s
23:40:06 test0088 - 11(org.eclipse.jdt.core.tests.compiler.parser.AnnotationCompletionParserTest)  Time elapsed: 0 s
23:40:06 test0089 - 11(org.eclipse.jdt.core.tests.compiler.parser.AnnotationCompletionParserTest)  Time elapsed: 0.001 s
23:40:06 test0090 - 11(org.eclipse.jdt.core.tests.compiler.parser.AnnotationCompletionParserTest)  Time elapsed: 0 s
23:40:06 test0091 - 11(org.eclipse.jdt.core.tests.compiler.parser.AnnotationCompletionParserTest)  Time elapsed: 0 s
23:40:06 test0092 - 11(org.eclipse.jdt.core.tests.compiler.parser.AnnotationCompletionParserTest)  Time elapsed: 0 s
23:40:06 test0093 - 11(org.eclipse.jdt.core.tests.compiler.parser.AnnotationCompletionParserTest)  Time elapsed: 0.001 s
23:40:06 test0094 - 11(org.eclipse.jdt.core.tests.compiler.parser.AnnotationCompletionParserTest)  Time elapsed: 0 s
23:40:06 test0095 - 11(org.eclipse.jdt.core.tests.compiler.parser.AnnotationCompletionParserTest)  Time elapsed: 0 s
23:40:06 test0096 - 11(org.eclipse.jdt.core.tests.compiler.parser.AnnotationCompletionParserTest)  Time elapsed: 0.001 s
23:40:06 test0097 - 11(org.eclipse.jdt.core.tests.compiler.parser.AnnotationCompletionParserTest)  Time elapsed: 0 s
23:40:06 test0098 - 11(org.eclipse.jdt.core.tests.compiler.parser.AnnotationCompletionParserTest)  Time elapsed: 0 s
23:40:06 test0099 - 11(org.eclipse.jdt.core.tests.compiler.parser.AnnotationCompletionParserTest)  Time elapsed: 0 s
23:40:06 test0100 - 11(org.eclipse.jdt.core.tests.compiler.parser.AnnotationCompletionParserTest)  Time elapsed: 0.001 s
23:40:06 test0101 - 11(org.eclipse.jdt.core.tests.compiler.parser.AnnotationCompletionParserTest)  Time elapsed: 0 s
23:40:06 test0102 - 11(org.eclipse.jdt.core.tests.compiler.parser.AnnotationCompletionParserTest)  Time elapsed: 0 s
23:40:06 test0103 - 11(org.eclipse.jdt.core.tests.compiler.parser.AnnotationCompletionParserTest)  Time elapsed: 0 s
23:40:06 test0104 - 11(org.eclipse.jdt.core.tests.compiler.parser.AnnotationCompletionParserTest)  Time elapsed: 0.001 s
23:40:06 test0105_Diet - 11(org.eclipse.jdt.core.tests.compiler.parser.AnnotationCompletionParserTest)  Time elapsed: 0 s
23:40:06 test0105_Method - 11(org.eclipse.jdt.core.tests.compiler.parser.AnnotationCompletionParserTest)  Time elapsed: 0 s
23:40:06 test0106_Diet - 11(org.eclipse.jdt.core.tests.compiler.parser.AnnotationCompletionParserTest)  Time elapsed: 0 s
23:40:06 test0106_Method - 11(org.eclipse.jdt.core.tests.compiler.parser.AnnotationCompletionParserTest)  Time elapsed: 0.001 s
23:40:06 test0107_Diet - 11(org.eclipse.jdt.core.tests.compiler.parser.AnnotationCompletionParserTest)  Time elapsed: 0 s
23:40:06 test0107_Method - 11(org.eclipse.jdt.core.tests.compiler.parser.AnnotationCompletionParserTest)  Time elapsed: 0 s
23:40:06 test0108_Diet - 11(org.eclipse.jdt.core.tests.compiler.parser.AnnotationCompletionParserTest)  Time elapsed: 0 s
23:40:06 test0108_Method - 11(org.eclipse.jdt.core.tests.compiler.parser.AnnotationCompletionParserTest)  Time elapsed: 0.001 s
23:40:06 test0109_Diet - 11(org.eclipse.jdt.core.tests.compiler.parser.AnnotationCompletionParserTest)  Time elapsed: 0 s
23:40:06 test0109_Method - 11(org.eclipse.jdt.core.tests.compiler.parser.AnnotationCompletionParserTest)  Time elapsed: 0 s
23:40:06 test0110_Diet - 11(org.eclipse.jdt.core.tests.compiler.parser.AnnotationCompletionParserTest)  Time elapsed: 0 s
23:40:06 test0110_Method - 11(org.eclipse.jdt.core.tests.compiler.parser.AnnotationCompletionParserTest)  Time elapsed: 0 s
23:40:06 test0111_Diet - 11(org.eclipse.jdt.core.tests.compiler.parser.AnnotationCompletionParserTest)  Time elapsed: 0.001 s
23:40:06 test0111_Method - 11(org.eclipse.jdt.core.tests.compiler.parser.AnnotationCompletionParserTest)  Time elapsed: 0 s
23:40:06 test0112_Diet - 11(org.eclipse.jdt.core.tests.compiler.parser.AnnotationCompletionParserTest)  Time elapsed: 0 s
23:40:06 test0112_Method - 11(org.eclipse.jdt.core.tests.compiler.parser.AnnotationCompletionParserTest)  Time elapsed: 0 s
23:40:06 test0113_Diet - 11(org.eclipse.jdt.core.tests.compiler.parser.AnnotationCompletionParserTest)  Time elapsed: 0.001 s
23:40:06 test0113_Method - 11(org.eclipse.jdt.core.tests.compiler.parser.AnnotationCompletionParserTest)  Time elapsed: 0 s
23:40:06 test0114_Diet - 11(org.eclipse.jdt.core.tests.compiler.parser.AnnotationCompletionParserTest)  Time elapsed: 0 s
23:40:06 test0114_Method - 11(org.eclipse.jdt.core.tests.compiler.parser.AnnotationCompletionParserTest)  Time elapsed: 0 s
23:40:06 test0115 - 11(org.eclipse.jdt.core.tests.compiler.parser.AnnotationCompletionParserTest)  Time elapsed: 0.001 s
23:40:06 test0116 - 11(org.eclipse.jdt.core.tests.compiler.parser.AnnotationCompletionParserTest)  Time elapsed: 0 s
23:40:06 test0117 - 11(org.eclipse.jdt.core.tests.compiler.parser.AnnotationCompletionParserTest)  Time elapsed: 0 s
23:40:06 test0118 - 11(org.eclipse.jdt.core.tests.compiler.parser.AnnotationCompletionParserTest)  Time elapsed: 0 s
23:40:06 test0119_Diet - 11(org.eclipse.jdt.core.tests.compiler.parser.AnnotationCompletionParserTest)  Time elapsed: 0.001 s
23:40:06 test0119_Method - 11(org.eclipse.jdt.core.tests.compiler.parser.AnnotationCompletionParserTest)  Time elapsed: 0 s
23:40:06 test0120_Diet - 11(org.eclipse.jdt.core.tests.compiler.parser.AnnotationCompletionParserTest)  Time elapsed: 0 s
23:40:06 test0120_Method - 11(org.eclipse.jdt.core.tests.compiler.parser.AnnotationCompletionParserTest)  Time elapsed: 0.001 s
23:40:06 test0121 - 11(org.eclipse.jdt.core.tests.compiler.parser.AnnotationCompletionParserTest)  Time elapsed: 0 s
23:40:06 test0122 - 11(org.eclipse.jdt.core.tests.compiler.parser.AnnotationCompletionParserTest)  Time elapsed: 0 s
23:40:06 test0123 - 11(org.eclipse.jdt.core.tests.compiler.parser.AnnotationCompletionParserTest)  Time elapsed: 0 s
23:40:06 test0124 - 11(org.eclipse.jdt.core.tests.compiler.parser.AnnotationCompletionParserTest)  Time elapsed: 0.001 s
23:40:06 test0125 - 11(org.eclipse.jdt.core.tests.compiler.parser.AnnotationCompletionParserTest)  Time elapsed: 0 s
23:40:06 test0126 - 11(org.eclipse.jdt.core.tests.compiler.parser.AnnotationCompletionParserTest)  Time elapsed: 0 s
23:40:06 test0127 - 11(org.eclipse.jdt.core.tests.compiler.parser.AnnotationCompletionParserTest)  Time elapsed: 0 s
23:40:06 test0128 - 11(org.eclipse.jdt.core.tests.compiler.parser.AnnotationCompletionParserTest)  Time elapsed: 0.001 s
23:40:06 test0129 - 11(org.eclipse.jdt.core.tests.compiler.parser.AnnotationCompletionParserTest)  Time elapsed: 0 s
23:40:06 test0001 - 11(org.eclipse.jdt.core.tests.compiler.parser.GenericsSelectionTest)  Time elapsed: 0 s
23:40:06 test0002 - 11(org.eclipse.jdt.core.tests.compiler.parser.GenericsSelectionTest)  Time elapsed: 0 s
23:40:06 test0003 - 11(org.eclipse.jdt.core.tests.compiler.parser.GenericsSelectionTest)  Time elapsed: 0 s
23:40:06 test0004 - 11(org.eclipse.jdt.core.tests.compiler.parser.GenericsSelectionTest)  Time elapsed: 0 s
23:40:06 test0005 - 11(org.eclipse.jdt.core.tests.compiler.parser.GenericsSelectionTest)  Time elapsed: 0 s
23:40:06 test0006 - 11(org.eclipse.jdt.core.tests.compiler.parser.GenericsSelectionTest)  Time elapsed: 0 s
23:40:06 test0007 - 11(org.eclipse.jdt.core.tests.compiler.parser.GenericsSelectionTest)  Time elapsed: 0.001 s
23:40:06 test0008 - 11(org.eclipse.jdt.core.tests.compiler.parser.GenericsSelectionTest)  Time elapsed: 0 s
23:40:06 test0009 - 11(org.eclipse.jdt.core.tests.compiler.parser.GenericsSelectionTest)  Time elapsed: 0 s
23:40:06 test0010 - 11(org.eclipse.jdt.core.tests.compiler.parser.GenericsSelectionTest)  Time elapsed: 0 s
23:40:06 test0011 - 11(org.eclipse.jdt.core.tests.compiler.parser.GenericsSelectionTest)  Time elapsed: 0 s
23:40:06 test0012 - 11(org.eclipse.jdt.core.tests.compiler.parser.GenericsSelectionTest)  Time elapsed: 0.001 s
23:40:06 test0013 - 11(org.eclipse.jdt.core.tests.compiler.parser.GenericsSelectionTest)  Time elapsed: 0 s
23:40:06 test0014 - 11(org.eclipse.jdt.core.tests.compiler.parser.GenericsSelectionTest)  Time elapsed: 0 s
23:40:06 test0015 - 11(org.eclipse.jdt.core.tests.compiler.parser.GenericsSelectionTest)  Time elapsed: 0 s
23:40:06 test0016 - 11(org.eclipse.jdt.core.tests.compiler.parser.GenericsSelectionTest)  Time elapsed: 0 s
23:40:06 test0017 - 11(org.eclipse.jdt.core.tests.compiler.parser.GenericsSelectionTest)  Time elapsed: 0.001 s
23:40:06 test0018 - 11(org.eclipse.jdt.core.tests.compiler.parser.GenericsSelectionTest)  Time elapsed: 0 s
23:40:06 test0019 - 11(org.eclipse.jdt.core.tests.compiler.parser.GenericsSelectionTest)  Time elapsed: 0 s
23:40:06 test0020 - 11(org.eclipse.jdt.core.tests.compiler.parser.GenericsSelectionTest)  Time elapsed: 0.001 s
23:40:06 test0021 - 11(org.eclipse.jdt.core.tests.compiler.parser.GenericsSelectionTest)  Time elapsed: 0 s
23:40:06 test0022 - 11(org.eclipse.jdt.core.tests.compiler.parser.GenericsSelectionTest)  Time elapsed: 0 s
23:40:06 test0023 - 11(org.eclipse.jdt.core.tests.compiler.parser.GenericsSelectionTest)  Time elapsed: 0 s
23:40:06 test0024 - 11(org.eclipse.jdt.core.tests.compiler.parser.GenericsSelectionTest)  Time elapsed: 0.001 s
23:40:06 test0001 - 11(org.eclipse.jdt.core.tests.compiler.parser.AnnotationSelectionTest)  Time elapsed: 0 s
23:40:06 test0002 - 11(org.eclipse.jdt.core.tests.compiler.parser.AnnotationSelectionTest)  Time elapsed: 0 s
23:40:06 test0003 - 11(org.eclipse.jdt.core.tests.compiler.parser.AnnotationSelectionTest)  Time elapsed: 0 s
23:40:06 test0004 - 11(org.eclipse.jdt.core.tests.compiler.parser.AnnotationSelectionTest)  Time elapsed: 0.001 s
23:40:06 test0006 - 11(org.eclipse.jdt.core.tests.compiler.parser.AnnotationSelectionTest)  Time elapsed: 0 s
23:40:06 test0007 - 11(org.eclipse.jdt.core.tests.compiler.parser.AnnotationSelectionTest)  Time elapsed: 0 s
23:40:06 test0008 - 11(org.eclipse.jdt.core.tests.compiler.parser.AnnotationSelectionTest)  Time elapsed: 0.001 s
23:40:06 test0009 - 11(org.eclipse.jdt.core.tests.compiler.parser.AnnotationSelectionTest)  Time elapsed: 0 s
23:40:06 test0010 - 11(org.eclipse.jdt.core.tests.compiler.parser.AnnotationSelectionTest)  Time elapsed: 0 s
23:40:06 test0011 - 11(org.eclipse.jdt.core.tests.compiler.parser.AnnotationSelectionTest)  Time elapsed: 0 s
23:40:06 test0012 - 11(org.eclipse.jdt.core.tests.compiler.parser.AnnotationSelectionTest)  Time elapsed: 0.001 s
23:40:06 test0013 - 11(org.eclipse.jdt.core.tests.compiler.parser.AnnotationSelectionTest)  Time elapsed: 0 s
23:40:06 test0014 - 11(org.eclipse.jdt.core.tests.compiler.parser.AnnotationSelectionTest)  Time elapsed: 0 s
23:40:06 test0015 - 11(org.eclipse.jdt.core.tests.compiler.parser.AnnotationSelectionTest)  Time elapsed: 0 s
23:40:06 test0016 - 11(org.eclipse.jdt.core.tests.compiler.parser.AnnotationSelectionTest)  Time elapsed: 0.001 s
23:40:06 test0017 - 11(org.eclipse.jdt.core.tests.compiler.parser.AnnotationSelectionTest)  Time elapsed: 0 s
23:40:06 test0001 - 11(org.eclipse.jdt.core.tests.compiler.parser.EnumSelectionTest)  Time elapsed: 0 s
23:40:06 test0001 - 11(org.eclipse.jdt.core.tests.compiler.parser.GenericDietRecoveryTest)  Time elapsed: 0.002 s
23:40:06 test0002 - 11(org.eclipse.jdt.core.tests.compiler.parser.GenericDietRecoveryTest)  Time elapsed: 0.002 s
23:40:06 test0003 - 11(org.eclipse.jdt.core.tests.compiler.parser.GenericDietRecoveryTest)  Time elapsed: 0.002 s
23:40:06 test0004 - 11(org.eclipse.jdt.core.tests.compiler.parser.GenericDietRecoveryTest)  Time elapsed: 0.002 s
23:40:06 test0005 - 11(org.eclipse.jdt.core.tests.compiler.parser.GenericDietRecoveryTest)  Time elapsed: 0.004 s
23:40:06 test0006 - 11(org.eclipse.jdt.core.tests.compiler.parser.GenericDietRecoveryTest)  Time elapsed: 0.004 s
23:40:06 test0007 - 11(org.eclipse.jdt.core.tests.compiler.parser.GenericDietRecoveryTest)  Time elapsed: 0.003 s
23:40:06 test0008 - 11(org.eclipse.jdt.core.tests.compiler.parser.GenericDietRecoveryTest)  Time elapsed: 0.004 s
23:40:06 test0009 - 11(org.eclipse.jdt.core.tests.compiler.parser.GenericDietRecoveryTest)  Time elapsed: 0.003 s
23:40:06 test0010 - 11(org.eclipse.jdt.core.tests.compiler.parser.GenericDietRecoveryTest)  Time elapsed: 0.003 s
23:40:06 test0011 - 11(org.eclipse.jdt.core.tests.compiler.parser.GenericDietRecoveryTest)  Time elapsed: 0.002 s
23:40:06 test0012 - 11(org.eclipse.jdt.core.tests.compiler.parser.GenericDietRecoveryTest)  Time elapsed: 0.003 s
23:40:06 test0013 - 11(org.eclipse.jdt.core.tests.compiler.parser.GenericDietRecoveryTest)  Time elapsed: 0.002 s
23:40:06 test0014 - 11(org.eclipse.jdt.core.tests.compiler.parser.GenericDietRecoveryTest)  Time elapsed: 0.004 s
23:40:06 test0015 - 11(org.eclipse.jdt.core.tests.compiler.parser.GenericDietRecoveryTest)  Time elapsed: 0.003 s
23:40:06 test0016 - 11(org.eclipse.jdt.core.tests.compiler.parser.GenericDietRecoveryTest)  Time elapsed: 0.003 s
23:40:06 test0017 - 11(org.eclipse.jdt.core.tests.compiler.parser.GenericDietRecoveryTest)  Time elapsed: 0.004 s
23:40:06 test0018 - 11(org.eclipse.jdt.core.tests.compiler.parser.GenericDietRecoveryTest)  Time elapsed: 0.004 s
23:40:06 test0019 - 11(org.eclipse.jdt.core.tests.compiler.parser.GenericDietRecoveryTest)  Time elapsed: 0.006 s
23:40:06 test0020 - 11(org.eclipse.jdt.core.tests.compiler.parser.GenericDietRecoveryTest)  Time elapsed: 0.002 s
23:40:06 test0021 - 11(org.eclipse.jdt.core.tests.compiler.parser.GenericDietRecoveryTest)  Time elapsed: 0.006 s
23:40:06 test0022 - 11(org.eclipse.jdt.core.tests.compiler.parser.GenericDietRecoveryTest)  Time elapsed: 0.004 s
23:40:06 test0023 - 11(org.eclipse.jdt.core.tests.compiler.parser.GenericDietRecoveryTest)  Time elapsed: 0.003 s
23:40:06 test0024 - 11(org.eclipse.jdt.core.tests.compiler.parser.GenericDietRecoveryTest)  Time elapsed: 0.003 s
23:40:06 test0025 - 11(org.eclipse.jdt.core.tests.compiler.parser.GenericDietRecoveryTest)  Time elapsed: 0.005 s
23:40:06 test0026 - 11(org.eclipse.jdt.core.tests.compiler.parser.GenericDietRecoveryTest)  Time elapsed: 0.004 s
23:40:06 test0001 - 11(org.eclipse.jdt.core.tests.compiler.parser.EnumDietRecoveryTest)  Time elapsed: 0.001 s
23:40:06 test0002 - 11(org.eclipse.jdt.core.tests.compiler.parser.EnumDietRecoveryTest)  Time elapsed: 0.002 s
23:40:06 test0003 - 11(org.eclipse.jdt.core.tests.compiler.parser.EnumDietRecoveryTest)  Time elapsed: 0.002 s
23:40:06 test0004 - 11(org.eclipse.jdt.core.tests.compiler.parser.EnumDietRecoveryTest)  Time elapsed: 0.002 s
23:40:06 test0005 - 11(org.eclipse.jdt.core.tests.compiler.parser.EnumDietRecoveryTest)  Time elapsed: 0.003 s
23:40:06 test0006 - 11(org.eclipse.jdt.core.tests.compiler.parser.EnumDietRecoveryTest)  Time elapsed: 0.002 s
23:40:06 test0007 - 11(org.eclipse.jdt.core.tests.compiler.parser.EnumDietRecoveryTest)  Time elapsed: 0.003 s
23:40:06 test0008 - 11(org.eclipse.jdt.core.tests.compiler.parser.EnumDietRecoveryTest)  Time elapsed: 0.002 s
23:40:06 test0009 - 11(org.eclipse.jdt.core.tests.compiler.parser.EnumDietRecoveryTest)  Time elapsed: 0.002 s
23:40:06 test0010 - 11(org.eclipse.jdt.core.tests.compiler.parser.EnumDietRecoveryTest)  Time elapsed: 0.003 s
23:40:06 test0011 - 11(org.eclipse.jdt.core.tests.compiler.parser.EnumDietRecoveryTest)  Time elapsed: 0.002 s
23:40:06 test0012 - 11(org.eclipse.jdt.core.tests.compiler.parser.EnumDietRecoveryTest)  Time elapsed: 0.002 s
23:40:06 test0013 - 11(org.eclipse.jdt.core.tests.compiler.parser.EnumDietRecoveryTest)  Time elapsed: 0.003 s
23:40:06 test0014 - 11(org.eclipse.jdt.core.tests.compiler.parser.EnumDietRecoveryTest)  Time elapsed: 0.002 s
23:40:06 test0015 - 11(org.eclipse.jdt.core.tests.compiler.parser.EnumDietRecoveryTest)  Time elapsed: 0.003 s
23:40:06 test0016 - 11(org.eclipse.jdt.core.tests.compiler.parser.EnumDietRecoveryTest)  Time elapsed: 0.003 s
23:40:06 test0017 - 11(org.eclipse.jdt.core.tests.compiler.parser.EnumDietRecoveryTest)  Time elapsed: 0.001 s
23:40:06 test0001 - 11(org.eclipse.jdt.core.tests.compiler.parser.AnnotationDietRecoveryTest)  Time elapsed: 0.001 s
23:40:06 test0002 - 11(org.eclipse.jdt.core.tests.compiler.parser.AnnotationDietRecoveryTest)  Time elapsed: 0.001 s
23:40:06 test0003 - 11(org.eclipse.jdt.core.tests.compiler.parser.AnnotationDietRecoveryTest)  Time elapsed: 0.003 s
23:40:06 test0004 - 11(org.eclipse.jdt.core.tests.compiler.parser.AnnotationDietRecoveryTest)  Time elapsed: 0.002 s
23:40:06 test0005 - 11(org.eclipse.jdt.core.tests.compiler.parser.AnnotationDietRecoveryTest)  Time elapsed: 0.002 s
23:40:06 test0006 - 11(org.eclipse.jdt.core.tests.compiler.parser.AnnotationDietRecoveryTest)  Time elapsed: 0.002 s
23:40:06 test0007 - 11(org.eclipse.jdt.core.tests.compiler.parser.AnnotationDietRecoveryTest)  Time elapsed: 0.003 s
23:40:06 test0008 - 11(org.eclipse.jdt.core.tests.compiler.parser.AnnotationDietRecoveryTest)  Time elapsed: 0.003 s
23:40:06 test0009 - 11(org.eclipse.jdt.core.tests.compiler.parser.AnnotationDietRecoveryTest)  Time elapsed: 0.004 s
23:40:06 test0010 - 11(org.eclipse.jdt.core.tests.compiler.parser.AnnotationDietRecoveryTest)  Time elapsed: 0.002 s
23:40:06 test0011 - 11(org.eclipse.jdt.core.tests.compiler.parser.AnnotationDietRecoveryTest)  Time elapsed: 0.002 s
23:40:06 test0012 - 11(org.eclipse.jdt.core.tests.compiler.parser.AnnotationDietRecoveryTest)  Time elapsed: 0.004 s
23:40:06 test0013 - 11(org.eclipse.jdt.core.tests.compiler.parser.AnnotationDietRecoveryTest)  Time elapsed: 0.001 s
23:40:06 test0014 - 11(org.eclipse.jdt.core.tests.compiler.parser.AnnotationDietRecoveryTest)  Time elapsed: 0.001 s
23:40:06 test0015 - 11(org.eclipse.jdt.core.tests.compiler.parser.AnnotationDietRecoveryTest)  Time elapsed: 0.002 s
23:40:06 test0016 - 11(org.eclipse.jdt.core.tests.compiler.parser.AnnotationDietRecoveryTest)  Time elapsed: 0.004 s
23:40:06 test0017 - 11(org.eclipse.jdt.core.tests.compiler.parser.AnnotationDietRecoveryTest)  Time elapsed: 0.005 s
23:40:06 test0018 - 11(org.eclipse.jdt.core.tests.compiler.parser.AnnotationDietRecoveryTest)  Time elapsed: 0.003 s
23:40:06 test0019 - 11(org.eclipse.jdt.core.tests.compiler.parser.AnnotationDietRecoveryTest)  Time elapsed: 0.004 s
23:40:06 test0020 - 11(org.eclipse.jdt.core.tests.compiler.parser.AnnotationDietRecoveryTest)  Time elapsed: 0.006 s
23:40:06 test0021 - 11(org.eclipse.jdt.core.tests.compiler.parser.AnnotationDietRecoveryTest)  Time elapsed: 0.004 s
23:40:06 test0022 - 11(org.eclipse.jdt.core.tests.compiler.parser.AnnotationDietRecoveryTest)  Time elapsed: 0.006 s
23:40:06 test0023 - 11(org.eclipse.jdt.core.tests.compiler.parser.AnnotationDietRecoveryTest)  Time elapsed: 0.004 s
23:40:06 test0024 - 11(org.eclipse.jdt.core.tests.compiler.parser.AnnotationDietRecoveryTest)  Time elapsed: 0.004 s
23:40:06 test0025 - 11(org.eclipse.jdt.core.tests.compiler.parser.AnnotationDietRecoveryTest)  Time elapsed: 0.004 s
23:40:06 test0026 - 11(org.eclipse.jdt.core.tests.compiler.parser.AnnotationDietRecoveryTest)  Time elapsed: 0.003 s
23:40:06 test0027 - 11(org.eclipse.jdt.core.tests.compiler.parser.AnnotationDietRecoveryTest)  Time elapsed: 0.002 s
23:40:06 test0028 - 11(org.eclipse.jdt.core.tests.compiler.parser.AnnotationDietRecoveryTest)  Time elapsed: 0.002 s
23:40:06 test0030 - 11(org.eclipse.jdt.core.tests.compiler.parser.AnnotationDietRecoveryTest)  Time elapsed: 0.003 s
23:40:06 test0031 - 11(org.eclipse.jdt.core.tests.compiler.parser.AnnotationDietRecoveryTest)  Time elapsed: 0.004 s
23:40:06 test0032 - 11(org.eclipse.jdt.core.tests.compiler.parser.AnnotationDietRecoveryTest)  Time elapsed: 0.004 s
23:40:06 test0033 - 11(org.eclipse.jdt.core.tests.compiler.parser.AnnotationDietRecoveryTest)  Time elapsed: 0.003 s
23:40:06 test0034 - 11(org.eclipse.jdt.core.tests.compiler.parser.AnnotationDietRecoveryTest)  Time elapsed: 0.002 s
23:40:06 test0035 - 11(org.eclipse.jdt.core.tests.compiler.parser.AnnotationDietRecoveryTest)  Time elapsed: 0.004 s
23:40:06 test0036 - 11(org.eclipse.jdt.core.tests.compiler.parser.AnnotationDietRecoveryTest)  Time elapsed: 0.002 s
23:40:06 test0037 - 11(org.eclipse.jdt.core.tests.compiler.parser.AnnotationDietRecoveryTest)  Time elapsed: 0.002 s
23:40:06 test0038 - 11(org.eclipse.jdt.core.tests.compiler.parser.AnnotationDietRecoveryTest)  Time elapsed: 0.003 s
23:40:06 test0039 - 11(org.eclipse.jdt.core.tests.compiler.parser.AnnotationDietRecoveryTest)  Time elapsed: 0.002 s
23:40:06 test0040 - 11(org.eclipse.jdt.core.tests.compiler.parser.AnnotationDietRecoveryTest)  Time elapsed: 0.001 s
23:40:06 test0041 - 11(org.eclipse.jdt.core.tests.compiler.parser.AnnotationDietRecoveryTest)  Time elapsed: 0.002 s
23:40:06 test0001 - 11(org.eclipse.jdt.core.tests.compiler.parser.StatementRecoveryTest_1_5)  Time elapsed: 0.003 s
23:40:06 test0002 - 11(org.eclipse.jdt.core.tests.compiler.parser.StatementRecoveryTest_1_5)  Time elapsed: 0.004 s
23:40:06 test0003 - 11(org.eclipse.jdt.core.tests.compiler.parser.StatementRecoveryTest_1_5)  Time elapsed: 0.004 s
23:40:06 test0004 - 11(org.eclipse.jdt.core.tests.compiler.parser.StatementRecoveryTest_1_5)  Time elapsed: 0.003 s
23:40:06 test0005 - 11(org.eclipse.jdt.core.tests.compiler.parser.StatementRecoveryTest_1_5)  Time elapsed: 0.004 s
23:40:06 test0006 - 11(org.eclipse.jdt.core.tests.compiler.parser.StatementRecoveryTest_1_5)  Time elapsed: 0.003 s
23:40:06 test0007 - 11(org.eclipse.jdt.core.tests.compiler.parser.StatementRecoveryTest_1_5)  Time elapsed: 0.003 s
23:40:06 test0008 - 11(org.eclipse.jdt.core.tests.compiler.parser.StatementRecoveryTest_1_5)  Time elapsed: 0.002 s
23:40:06 test0001 - 11(org.eclipse.jdt.core.tests.compiler.parser.ParserTest1_7)  Time elapsed: 0.001 s
23:40:06 test0002 - 11(org.eclipse.jdt.core.tests.compiler.parser.ParserTest1_7)  Time elapsed: 0.001 s
23:40:06 test0003 - 11(org.eclipse.jdt.core.tests.compiler.parser.ParserTest1_7)  Time elapsed: 0.001 s
23:40:06 test0004 - 11(org.eclipse.jdt.core.tests.compiler.parser.ParserTest1_7)  Time elapsed: 0.001 s
23:40:06 test0005 - 11(org.eclipse.jdt.core.tests.compiler.parser.ParserTest1_7)  Time elapsed: 0.001 s
23:40:06 test0006 - 11(org.eclipse.jdt.core.tests.compiler.parser.ParserTest1_7)  Time elapsed: 0.001 s
23:40:06 test0007 - 11(org.eclipse.jdt.core.tests.compiler.parser.ParserTest1_7)  Time elapsed: 0.001 s
23:40:06 test0008 - 11(org.eclipse.jdt.core.tests.compiler.parser.ParserTest1_7)  Time elapsed: 0.001 s
23:40:06 test0009 - 11(org.eclipse.jdt.core.tests.compiler.parser.ParserTest1_7)  Time elapsed: 0.001 s
23:40:06 test0010 - 11(org.eclipse.jdt.core.tests.compiler.parser.ParserTest1_7)  Time elapsed: 0.001 s
23:40:06 test0011 - 11(org.eclipse.jdt.core.tests.compiler.parser.ParserTest1_7)  Time elapsed: 0.001 s
23:40:06 test0012 - 11(org.eclipse.jdt.core.tests.compiler.parser.ParserTest1_7)  Time elapsed: 0.001 s
23:40:06 test0001 - 11(org.eclipse.jdt.core.tests.compiler.parser.LambdaExpressionSyntaxTest)  Time elapsed: 0 s
23:40:06 test00010 - 11(org.eclipse.jdt.core.tests.compiler.parser.LambdaExpressionSyntaxTest)  Time elapsed: 0 s
23:40:06 test0002 - 11(org.eclipse.jdt.core.tests.compiler.parser.LambdaExpressionSyntaxTest)  Time elapsed: 0.001 s
23:40:06 test0003 - 11(org.eclipse.jdt.core.tests.compiler.parser.LambdaExpressionSyntaxTest)  Time elapsed: 0 s
23:40:06 test0004 - 11(org.eclipse.jdt.core.tests.compiler.parser.LambdaExpressionSyntaxTest)  Time elapsed: 0 s
23:40:06 test0005 - 11(org.eclipse.jdt.core.tests.compiler.parser.LambdaExpressionSyntaxTest)  Time elapsed: 0 s
23:40:06 test0006 - 11(org.eclipse.jdt.core.tests.compiler.parser.LambdaExpressionSyntaxTest)  Time elapsed: 0.001 s
23:40:06 test0007 - 11(org.eclipse.jdt.core.tests.compiler.parser.LambdaExpressionSyntaxTest)  Time elapsed: 0 s
23:40:06 test0008 - 11(org.eclipse.jdt.core.tests.compiler.parser.LambdaExpressionSyntaxTest)  Time elapsed: 0 s
23:40:06 test0009 - 11(org.eclipse.jdt.core.tests.compiler.parser.LambdaExpressionSyntaxTest)  Time elapsed: 0 s
23:40:06 test0011 - 11(org.eclipse.jdt.core.tests.compiler.parser.LambdaExpressionSyntaxTest)  Time elapsed: 0.001 s
23:40:06 test0012 - 11(org.eclipse.jdt.core.tests.compiler.parser.LambdaExpressionSyntaxTest)  Time elapsed: 0 s
23:40:06 test0013 - 11(org.eclipse.jdt.core.tests.compiler.parser.LambdaExpressionSyntaxTest)  Time elapsed: 0 s
23:40:06 test0014 - 11(org.eclipse.jdt.core.tests.compiler.parser.LambdaExpressionSyntaxTest)  Time elapsed: 0 s
23:40:06 test0015 - 11(org.eclipse.jdt.core.tests.compiler.parser.LambdaExpressionSyntaxTest)  Time elapsed: 0.001 s
23:40:06 test0016 - 11(org.eclipse.jdt.core.tests.compiler.parser.LambdaExpressionSyntaxTest)  Time elapsed: 0 s
23:40:06 test0017 - 11(org.eclipse.jdt.core.tests.compiler.parser.LambdaExpressionSyntaxTest)  Time elapsed: 0 s
23:40:06 test0018 - 11(org.eclipse.jdt.core.tests.compiler.parser.LambdaExpressionSyntaxTest)  Time elapsed: 0.001 s
23:40:06 test0019 - 11(org.eclipse.jdt.core.tests.compiler.parser.LambdaExpressionSyntaxTest)  Time elapsed: 0 s
23:40:06 test385132 - 11(org.eclipse.jdt.core.tests.compiler.parser.LambdaExpressionSyntaxTest)  Time elapsed: 0 s
23:40:06 testNestedLambda01 - 11(org.eclipse.jdt.core.tests.compiler.parser.LambdaExpressionSyntaxTest)  Time elapsed: 0 s
23:40:06 test0001 - 11(org.eclipse.jdt.core.tests.compiler.parser.ReferenceExpressionSyntaxTest)  Time elapsed: 0.001 s
23:40:06 test0002 - 11(org.eclipse.jdt.core.tests.compiler.parser.ReferenceExpressionSyntaxTest)  Time elapsed: 0 s
23:40:06 test0003 - 11(org.eclipse.jdt.core.tests.compiler.parser.ReferenceExpressionSyntaxTest)  Time elapsed: 0 s
23:40:06 test0004 - 11(org.eclipse.jdt.core.tests.compiler.parser.ReferenceExpressionSyntaxTest)  Time elapsed: 0.001 s
23:40:06 test0005 - 11(org.eclipse.jdt.core.tests.compiler.parser.ReferenceExpressionSyntaxTest)  Time elapsed: 0 s
23:40:06 test0006 - 11(org.eclipse.jdt.core.tests.compiler.parser.ReferenceExpressionSyntaxTest)  Time elapsed: 0 s
23:40:06 test0007 - 11(org.eclipse.jdt.core.tests.compiler.parser.ReferenceExpressionSyntaxTest)  Time elapsed: 0 s
23:40:06 test0008 - 11(org.eclipse.jdt.core.tests.compiler.parser.ReferenceExpressionSyntaxTest)  Time elapsed: 0.001 s
23:40:06 test0009 - 11(org.eclipse.jdt.core.tests.compiler.parser.ReferenceExpressionSyntaxTest)  Time elapsed: 0 s
23:40:06 test0010 - 11(org.eclipse.jdt.core.tests.compiler.parser.ReferenceExpressionSyntaxTest)  Time elapsed: 0 s
23:40:06 test0011 - 11(org.eclipse.jdt.core.tests.compiler.parser.ReferenceExpressionSyntaxTest)  Time elapsed: 0 s
23:40:06 test0012 - 11(org.eclipse.jdt.core.tests.compiler.parser.ReferenceExpressionSyntaxTest)  Time elapsed: 0.001 s
23:40:06 test0013 - 11(org.eclipse.jdt.core.tests.compiler.parser.ReferenceExpressionSyntaxTest)  Time elapsed: 0 s
23:40:06 test0014 - 11(org.eclipse.jdt.core.tests.compiler.parser.ReferenceExpressionSyntaxTest)  Time elapsed: 0 s
23:40:06 test0015 - 11(org.eclipse.jdt.core.tests.compiler.parser.ReferenceExpressionSyntaxTest)  Time elapsed: 0.001 s
23:40:06 test0016 - 11(org.eclipse.jdt.core.tests.compiler.parser.ReferenceExpressionSyntaxTest)  Time elapsed: 0 s
23:40:06 test0017 - 11(org.eclipse.jdt.core.tests.compiler.parser.ReferenceExpressionSyntaxTest)  Time elapsed: 0 s
23:40:06 test0018 - 11(org.eclipse.jdt.core.tests.compiler.parser.ReferenceExpressionSyntaxTest)  Time elapsed: 0 s
23:40:06 test0019 - 11(org.eclipse.jdt.core.tests.compiler.parser.ReferenceExpressionSyntaxTest)  Time elapsed: 0.001 s
23:40:06 test0020 - 11(org.eclipse.jdt.core.tests.compiler.parser.ReferenceExpressionSyntaxTest)  Time elapsed: 0 s
23:40:06 test385132 - 11(org.eclipse.jdt.core.tests.compiler.parser.ReferenceExpressionSyntaxTest)  Time elapsed: 0 s
23:40:06 test385374 - 11(org.eclipse.jdt.core.tests.compiler.parser.ReferenceExpressionSyntaxTest)  Time elapsed: 0.001 s
23:40:06 test385374a - 11(org.eclipse.jdt.core.tests.compiler.parser.ReferenceExpressionSyntaxTest)  Time elapsed: 0 s
23:40:06 test0001 - 11(org.eclipse.jdt.core.tests.compiler.parser.TypeAnnotationSyntaxTest)  Time elapsed: 0.002 s
23:40:06 test0002 - 11(org.eclipse.jdt.core.tests.compiler.parser.TypeAnnotationSyntaxTest)  Time elapsed: 0.001 s
23:40:06 test0003 - 11(org.eclipse.jdt.core.tests.compiler.parser.TypeAnnotationSyntaxTest)  Time elapsed: 0.001 s
23:40:06 test0004 - 11(org.eclipse.jdt.core.tests.compiler.parser.TypeAnnotationSyntaxTest)  Time elapsed: 0.001 s
23:40:06 test0005 - 11(org.eclipse.jdt.core.tests.compiler.parser.TypeAnnotationSyntaxTest)  Time elapsed: 0.001 s
23:40:06 test0006 - 11(org.eclipse.jdt.core.tests.compiler.parser.TypeAnnotationSyntaxTest)  Time elapsed: 0.001 s
23:40:06 test0008 - 11(org.eclipse.jdt.core.tests.compiler.parser.TypeAnnotationSyntaxTest)  Time elapsed: 0.001 s
23:40:06 test0009 - 11(org.eclipse.jdt.core.tests.compiler.parser.TypeAnnotationSyntaxTest)  Time elapsed: 0.002 s
23:40:06 test0010 - 11(org.eclipse.jdt.core.tests.compiler.parser.TypeAnnotationSyntaxTest)  Time elapsed: 0.001 s
23:40:06 test0011 - 11(org.eclipse.jdt.core.tests.compiler.parser.TypeAnnotationSyntaxTest)  Time elapsed: 0.001 s
23:40:06 test0012 - 11(org.eclipse.jdt.core.tests.compiler.parser.TypeAnnotationSyntaxTest)  Time elapsed: 0.002 s
23:40:06 test0013 - 11(org.eclipse.jdt.core.tests.compiler.parser.TypeAnnotationSyntaxTest)  Time elapsed: 0.048 s
23:40:06 test0014 - 11(org.eclipse.jdt.core.tests.compiler.parser.TypeAnnotationSyntaxTest)  Time elapsed: 0.002 s
23:40:06 test0015 - 11(org.eclipse.jdt.core.tests.compiler.parser.TypeAnnotationSyntaxTest)  Time elapsed: 0.002 s
23:40:06 test0016 - 11(org.eclipse.jdt.core.tests.compiler.parser.TypeAnnotationSyntaxTest)  Time elapsed: 0.001 s
23:40:06 test0017 - 11(org.eclipse.jdt.core.tests.compiler.parser.TypeAnnotationSyntaxTest)  Time elapsed: 0.001 s
23:40:06 test0018 - 11(org.eclipse.jdt.core.tests.compiler.parser.TypeAnnotationSyntaxTest)  Time elapsed: 0.002 s
23:40:06 test0019 - 11(org.eclipse.jdt.core.tests.compiler.parser.TypeAnnotationSyntaxTest)  Time elapsed: 0.001 s
23:40:06 test0020 - 11(org.eclipse.jdt.core.tests.compiler.parser.TypeAnnotationSyntaxTest)  Time elapsed: 0.002 s
23:40:06 test0021 - 11(org.eclipse.jdt.core.tests.compiler.parser.TypeAnnotationSyntaxTest)  Time elapsed: 0.001 s
23:40:06 test0022 - 11(org.eclipse.jdt.core.tests.compiler.parser.TypeAnnotationSyntaxTest)  Time elapsed: 0.001 s
23:40:06 test0023 - 11(org.eclipse.jdt.core.tests.compiler.parser.TypeAnnotationSyntaxTest)  Time elapsed: 0.002 s
23:40:06 test0024 - 11(org.eclipse.jdt.core.tests.compiler.parser.TypeAnnotationSyntaxTest)  Time elapsed: 0.001 s
23:40:06 test0025 - 11(org.eclipse.jdt.core.tests.compiler.parser.TypeAnnotationSyntaxTest)  Time elapsed: 0.001 s
23:40:06 test0026 - 11(org.eclipse.jdt.core.tests.compiler.parser.TypeAnnotationSyntaxTest)  Time elapsed: 0 s
23:40:06 test0027 - 11(org.eclipse.jdt.core.tests.compiler.parser.TypeAnnotationSyntaxTest)  Time elapsed: 0.001 s
23:40:06 test0028 - 11(org.eclipse.jdt.core.tests.compiler.parser.TypeAnnotationSyntaxTest)  Time elapsed: 0 s
23:40:06 test0029 - 11(org.eclipse.jdt.core.tests.compiler.parser.TypeAnnotationSyntaxTest)  Time elapsed: 0 s
23:40:06 test0030 - 11(org.eclipse.jdt.core.tests.compiler.parser.TypeAnnotationSyntaxTest)  Time elapsed: 0 s
23:40:06 test0031 - 11(org.eclipse.jdt.core.tests.compiler.parser.TypeAnnotationSyntaxTest)  Time elapsed: 0 s
23:40:06 test0032 - 11(org.eclipse.jdt.core.tests.compiler.parser.TypeAnnotationSyntaxTest)  Time elapsed: 0.001 s
23:40:06 test0033 - 11(org.eclipse.jdt.core.tests.compiler.parser.TypeAnnotationSyntaxTest)  Time elapsed: 0 s
23:40:06 test0034 - 11(org.eclipse.jdt.core.tests.compiler.parser.TypeAnnotationSyntaxTest)  Time elapsed: 0.001 s
23:40:06 test0035 - 11(org.eclipse.jdt.core.tests.compiler.parser.TypeAnnotationSyntaxTest)  Time elapsed: 0.001 s
23:40:06 test0036 - 11(org.eclipse.jdt.core.tests.compiler.parser.TypeAnnotationSyntaxTest)  Time elapsed: 0.001 s
23:40:06 test0037 - 11(org.eclipse.jdt.core.tests.compiler.parser.TypeAnnotationSyntaxTest)  Time elapsed: 0.002 s
23:40:06 test0038 - 11(org.eclipse.jdt.core.tests.compiler.parser.TypeAnnotationSyntaxTest)  Time elapsed: 0.001 s
23:40:06 test0039 - 11(org.eclipse.jdt.core.tests.compiler.parser.TypeAnnotationSyntaxTest)  Time elapsed: 0.001 s
23:40:06 test0040 - 11(org.eclipse.jdt.core.tests.compiler.parser.TypeAnnotationSyntaxTest)  Time elapsed: 0.001 s
23:40:06 test0041 - 11(org.eclipse.jdt.core.tests.compiler.parser.TypeAnnotationSyntaxTest)  Time elapsed: 0.001 s
23:40:06 test0042 - 11(org.eclipse.jdt.core.tests.compiler.parser.TypeAnnotationSyntaxTest)  Time elapsed: 0.001 s
23:40:06 test0043 - 11(org.eclipse.jdt.core.tests.compiler.parser.TypeAnnotationSyntaxTest)  Time elapsed: 0.002 s
23:40:06 test0044 - 11(org.eclipse.jdt.core.tests.compiler.parser.TypeAnnotationSyntaxTest)  Time elapsed: 0.001 s
23:40:06 test0045 - 11(org.eclipse.jdt.core.tests.compiler.parser.TypeAnnotationSyntaxTest)  Time elapsed: 0.001 s
23:40:06 test0046 - 11(org.eclipse.jdt.core.tests.compiler.parser.TypeAnnotationSyntaxTest)  Time elapsed: 0.002 s
23:40:06 test0047 - 11(org.eclipse.jdt.core.tests.compiler.parser.TypeAnnotationSyntaxTest)  Time elapsed: 0.001 s
23:40:06 test0048 - 11(org.eclipse.jdt.core.tests.compiler.parser.TypeAnnotationSyntaxTest)  Time elapsed: 0.001 s
23:40:06 test0049 - 11(org.eclipse.jdt.core.tests.compiler.parser.TypeAnnotationSyntaxTest)  Time elapsed: 0.002 s
23:40:06 test0050 - 11(org.eclipse.jdt.core.tests.compiler.parser.TypeAnnotationSyntaxTest)  Time elapsed: 0.001 s
23:40:06 test0051 - 11(org.eclipse.jdt.core.tests.compiler.parser.TypeAnnotationSyntaxTest)  Time elapsed: 0.001 s
23:40:06 test0052 - 11(org.eclipse.jdt.core.tests.compiler.parser.TypeAnnotationSyntaxTest)  Time elapsed: 0.001 s
23:40:06 test0053 - 11(org.eclipse.jdt.core.tests.compiler.parser.TypeAnnotationSyntaxTest)  Time elapsed: 0.001 s
23:40:06 test0054 - 11(org.eclipse.jdt.core.tests.compiler.parser.TypeAnnotationSyntaxTest)  Time elapsed: 0.001 s
23:40:06 test0055 - 11(org.eclipse.jdt.core.tests.compiler.parser.TypeAnnotationSyntaxTest)  Time elapsed: 0.002 s
23:40:06 test0056 - 11(org.eclipse.jdt.core.tests.compiler.parser.TypeAnnotationSyntaxTest)  Time elapsed: 0.001 s
23:40:06 test0057 - 11(org.eclipse.jdt.core.tests.compiler.parser.TypeAnnotationSyntaxTest)  Time elapsed: 0.002 s
23:40:06 test0058 - 11(org.eclipse.jdt.core.tests.compiler.parser.TypeAnnotationSyntaxTest)  Time elapsed: 0.001 s
23:40:06 test0059 - 11(org.eclipse.jdt.core.tests.compiler.parser.TypeAnnotationSyntaxTest)  Time elapsed: 0.001 s
23:40:06 test0060 - 11(org.eclipse.jdt.core.tests.compiler.parser.TypeAnnotationSyntaxTest)  Time elapsed: 0.007 s
23:40:06 test0061 - 11(org.eclipse.jdt.core.tests.compiler.parser.TypeAnnotationSyntaxTest)  Time elapsed: 0.004 s
23:40:06 test0062 - 11(org.eclipse.jdt.core.tests.compiler.parser.TypeAnnotationSyntaxTest)  Time elapsed: 0.003 s
23:40:06 test0063 - 11(org.eclipse.jdt.core.tests.compiler.parser.TypeAnnotationSyntaxTest)  Time elapsed: 0.004 s
23:40:06 test0064 - 11(org.eclipse.jdt.core.tests.compiler.parser.TypeAnnotationSyntaxTest)  Time elapsed: 0.001 s
23:40:06 test0066 - 11(org.eclipse.jdt.core.tests.compiler.parser.TypeAnnotationSyntaxTest)  Time elapsed: 0.001 s
23:40:06 test0067 - 11(org.eclipse.jdt.core.tests.compiler.parser.TypeAnnotationSyntaxTest)  Time elapsed: 0.002 s
23:40:06 test0068 - 11(org.eclipse.jdt.core.tests.compiler.parser.TypeAnnotationSyntaxTest)  Time elapsed: 0.001 s
23:40:06 test0069 - 11(org.eclipse.jdt.core.tests.compiler.parser.TypeAnnotationSyntaxTest)  Time elapsed: 0.001 s
23:40:06 test007 - 11(org.eclipse.jdt.core.tests.compiler.parser.TypeAnnotationSyntaxTest)  Time elapsed: 0.002 s
23:40:06 test0070 - 11(org.eclipse.jdt.core.tests.compiler.parser.TypeAnnotationSyntaxTest)  Time elapsed: 0.001 s
23:40:06 test0071 - 11(org.eclipse.jdt.core.tests.compiler.parser.TypeAnnotationSyntaxTest)  Time elapsed: 0.001 s
23:40:06 test0072 - 11(org.eclipse.jdt.core.tests.compiler.parser.TypeAnnotationSyntaxTest)  Time elapsed: 0.001 s
23:40:06 test0073 - 11(org.eclipse.jdt.core.tests.compiler.parser.TypeAnnotationSyntaxTest)  Time elapsed: 0.002 s
23:40:06 test0074 - 11(org.eclipse.jdt.core.tests.compiler.parser.TypeAnnotationSyntaxTest)  Time elapsed: 0.001 s
23:40:06 test0075 - 11(org.eclipse.jdt.core.tests.compiler.parser.TypeAnnotationSyntaxTest)  Time elapsed: 0.001 s
23:40:06 test0076 - 11(org.eclipse.jdt.core.tests.compiler.parser.TypeAnnotationSyntaxTest)  Time elapsed: 0.002 s
23:40:06 test0077 - 11(org.eclipse.jdt.core.tests.compiler.parser.TypeAnnotationSyntaxTest)  Time elapsed: 0.001 s
23:40:06 test0078 - 11(org.eclipse.jdt.core.tests.compiler.parser.TypeAnnotationSyntaxTest)  Time elapsed: 0.001 s
23:40:06 test0079 - 11(org.eclipse.jdt.core.tests.compiler.parser.TypeAnnotationSyntaxTest)  Time elapsed: 0.001 s
23:40:06 test0080 - 11(org.eclipse.jdt.core.tests.compiler.parser.TypeAnnotationSyntaxTest)  Time elapsed: 0.002 s
23:40:06 test0081 - 11(org.eclipse.jdt.core.tests.compiler.parser.TypeAnnotationSyntaxTest)  Time elapsed: 0.001 s
23:40:06 test0082 - 11(org.eclipse.jdt.core.tests.compiler.parser.TypeAnnotationSyntaxTest)  Time elapsed: 0.001 s
23:40:06 test0083 - 11(org.eclipse.jdt.core.tests.compiler.parser.TypeAnnotationSyntaxTest)  Time elapsed: 0.001 s
23:40:06 test0084 - 11(org.eclipse.jdt.core.tests.compiler.parser.TypeAnnotationSyntaxTest)  Time elapsed: 0.002 s
23:40:06 test0085 - 11(org.eclipse.jdt.core.tests.compiler.parser.TypeAnnotationSyntaxTest)  Time elapsed: 0.003 s
23:40:06 test0086 - 11(org.eclipse.jdt.core.tests.compiler.parser.TypeAnnotationSyntaxTest)  Time elapsed: 0.002 s
23:40:06 test0087 - 11(org.eclipse.jdt.core.tests.compiler.parser.TypeAnnotationSyntaxTest)  Time elapsed: 0.002 s
23:40:06 test0088 - 11(org.eclipse.jdt.core.tests.compiler.parser.TypeAnnotationSyntaxTest)  Time elapsed: 0.001 s
23:40:06 test0089 - 11(org.eclipse.jdt.core.tests.compiler.parser.TypeAnnotationSyntaxTest)  Time elapsed: 0.001 s
23:40:06 test0090 - 11(org.eclipse.jdt.core.tests.compiler.parser.TypeAnnotationSyntaxTest)  Time elapsed: 0.002 s
23:40:06 test0091 - 11(org.eclipse.jdt.core.tests.compiler.parser.TypeAnnotationSyntaxTest)  Time elapsed: 0.002 s
23:40:06 test0092 - 11(org.eclipse.jdt.core.tests.compiler.parser.TypeAnnotationSyntaxTest)  Time elapsed: 0.001 s
23:40:06 test0093 - 11(org.eclipse.jdt.core.tests.compiler.parser.TypeAnnotationSyntaxTest)  Time elapsed: 0.002 s
23:40:06 test0094 - 11(org.eclipse.jdt.core.tests.compiler.parser.TypeAnnotationSyntaxTest)  Time elapsed: 0.001 s
23:40:06 test0095 - 11(org.eclipse.jdt.core.tests.compiler.parser.TypeAnnotationSyntaxTest)  Time elapsed: 0.002 s
23:40:06 test0096 - 11(org.eclipse.jdt.core.tests.compiler.parser.TypeAnnotationSyntaxTest)  Time elapsed: 0.001 s
23:40:06 test0097 - 11(org.eclipse.jdt.core.tests.compiler.parser.TypeAnnotationSyntaxTest)  Time elapsed: 0.001 s
23:40:06 test0098 - 11(org.eclipse.jdt.core.tests.compiler.parser.TypeAnnotationSyntaxTest)  Time elapsed: 0.001 s
23:40:06 test0099 - 11(org.eclipse.jdt.core.tests.compiler.parser.TypeAnnotationSyntaxTest)  Time elapsed: 0.002 s
23:40:06 test0100 - 11(org.eclipse.jdt.core.tests.compiler.parser.TypeAnnotationSyntaxTest)  Time elapsed: 0.002 s
23:40:06 test0101 - 11(org.eclipse.jdt.core.tests.compiler.parser.TypeAnnotationSyntaxTest)  Time elapsed: 0.001 s
23:40:06 test0102 - 11(org.eclipse.jdt.core.tests.compiler.parser.TypeAnnotationSyntaxTest)  Time elapsed: 0.002 s
23:40:06 test0103 - 11(org.eclipse.jdt.core.tests.compiler.parser.TypeAnnotationSyntaxTest)  Time elapsed: 0.002 s
23:40:06 test0104 - 11(org.eclipse.jdt.core.tests.compiler.parser.TypeAnnotationSyntaxTest)  Time elapsed: 0.002 s
23:40:06 test0105 - 11(org.eclipse.jdt.core.tests.compiler.parser.TypeAnnotationSyntaxTest)  Time elapsed: 0.002 s
23:40:06 test0106 - 11(org.eclipse.jdt.core.tests.compiler.parser.TypeAnnotationSyntaxTest)  Time elapsed: 0.001 s
23:40:06 test0107 - 11(org.eclipse.jdt.core.tests.compiler.parser.TypeAnnotationSyntaxTest)  Time elapsed: 0.003 s
23:40:06 test0108 - 11(org.eclipse.jdt.core.tests.compiler.parser.TypeAnnotationSyntaxTest)  Time elapsed: 0.001 s
23:40:06 test0109 - 11(org.eclipse.jdt.core.tests.compiler.parser.TypeAnnotationSyntaxTest)  Time elapsed: 0.001 s
23:40:06 test0110 - 11(org.eclipse.jdt.core.tests.compiler.parser.TypeAnnotationSyntaxTest)  Time elapsed: 0.001 s
23:40:06 test0111 - 11(org.eclipse.jdt.core.tests.compiler.parser.TypeAnnotationSyntaxTest)  Time elapsed: 0 s
23:40:06 test0112 - 11(org.eclipse.jdt.core.tests.compiler.parser.TypeAnnotationSyntaxTest)  Time elapsed: 0.001 s
23:40:06 test0113 - 11(org.eclipse.jdt.core.tests.compiler.parser.TypeAnnotationSyntaxTest)  Time elapsed: 0.002 s
23:40:06 test0114 - 11(org.eclipse.jdt.core.tests.compiler.parser.TypeAnnotationSyntaxTest)  Time elapsed: 0.001 s
23:40:06 test0115 - 11(org.eclipse.jdt.core.tests.compiler.parser.TypeAnnotationSyntaxTest)  Time elapsed: 0.002 s
23:40:06 test0116 - 11(org.eclipse.jdt.core.tests.compiler.parser.TypeAnnotationSyntaxTest)  Time elapsed: 0.002 s
23:40:06 test0117 - 11(org.eclipse.jdt.core.tests.compiler.parser.TypeAnnotationSyntaxTest)  Time elapsed: 0.002 s
23:40:06 test0118 - 11(org.eclipse.jdt.core.tests.compiler.parser.TypeAnnotationSyntaxTest)  Time elapsed: 0.002 s
23:40:06 test0119 - 11(org.eclipse.jdt.core.tests.compiler.parser.TypeAnnotationSyntaxTest)  Time elapsed: 0.003 s
23:40:06 test0120 - 11(org.eclipse.jdt.core.tests.compiler.parser.TypeAnnotationSyntaxTest)  Time elapsed: 0.002 s
23:40:06 test0121 - 11(org.eclipse.jdt.core.tests.compiler.parser.TypeAnnotationSyntaxTest)  Time elapsed: 0.002 s
23:40:06 test0122 - 11(org.eclipse.jdt.core.tests.compiler.parser.TypeAnnotationSyntaxTest)  Time elapsed: 0.002 s
23:40:06 test0123 - 11(org.eclipse.jdt.core.tests.compiler.parser.TypeAnnotationSyntaxTest)  Time elapsed: 0.002 s
23:40:06 test0125 - 11(org.eclipse.jdt.core.tests.compiler.parser.TypeAnnotationSyntaxTest)  Time elapsed: 0 s
23:40:06 test0126 - 11(org.eclipse.jdt.core.tests.compiler.parser.TypeAnnotationSyntaxTest)  Time elapsed: 0 s
23:40:06 test0127 - 11(org.eclipse.jdt.core.tests.compiler.parser.TypeAnnotationSyntaxTest)  Time elapsed: 0.001 s
23:40:06 test0128 - 11(org.eclipse.jdt.core.tests.compiler.parser.TypeAnnotationSyntaxTest)  Time elapsed: 0.001 s
23:40:06 test0129 - 11(org.eclipse.jdt.core.tests.compiler.parser.TypeAnnotationSyntaxTest)  Time elapsed: 0.002 s
23:40:06 test0130 - 11(org.eclipse.jdt.core.tests.compiler.parser.TypeAnnotationSyntaxTest)  Time elapsed: 0.001 s
23:40:06 test0131 - 11(org.eclipse.jdt.core.tests.compiler.parser.TypeAnnotationSyntaxTest)  Time elapsed: 0 s
23:40:06 test0132 - 11(org.eclipse.jdt.core.tests.compiler.parser.TypeAnnotationSyntaxTest)  Time elapsed: 0 s
23:40:06 test0133 - 11(org.eclipse.jdt.core.tests.compiler.parser.TypeAnnotationSyntaxTest)  Time elapsed: 0.001 s
23:40:06 test0134 - 11(org.eclipse.jdt.core.tests.compiler.parser.TypeAnnotationSyntaxTest)  Time elapsed: 0 s
23:40:06 test0135 - 11(org.eclipse.jdt.core.tests.compiler.parser.TypeAnnotationSyntaxTest)  Time elapsed: 0 s
23:40:06 test0136 - 11(org.eclipse.jdt.core.tests.compiler.parser.TypeAnnotationSyntaxTest)  Time elapsed: 0.001 s
23:40:06 test0137 - 11(org.eclipse.jdt.core.tests.compiler.parser.TypeAnnotationSyntaxTest)  Time elapsed: 0 s
23:40:06 test0138 - 11(org.eclipse.jdt.core.tests.compiler.parser.TypeAnnotationSyntaxTest)  Time elapsed: 0 s
23:40:06 test0139 - 11(org.eclipse.jdt.core.tests.compiler.parser.TypeAnnotationSyntaxTest)  Time elapsed: 0.001 s
23:40:06 test0001 - 11(org.eclipse.jdt.core.tests.compiler.parser.CompletionParserTest18)  Time elapsed: 0.001 s
23:40:06 test0002 - 11(org.eclipse.jdt.core.tests.compiler.parser.CompletionParserTest18)  Time elapsed: 0 s
23:40:06 test0003 - 11(org.eclipse.jdt.core.tests.compiler.parser.CompletionParserTest18)  Time elapsed: 0 s
23:40:06 test0004 - 11(org.eclipse.jdt.core.tests.compiler.parser.CompletionParserTest18)  Time elapsed: 0.001 s
23:40:06 test0005 - 11(org.eclipse.jdt.core.tests.compiler.parser.CompletionParserTest18)  Time elapsed: 0.001 s
23:40:06 test0006 - 11(org.eclipse.jdt.core.tests.compiler.parser.CompletionParserTest18)  Time elapsed: 0.001 s
23:40:06 test0007 - 11(org.eclipse.jdt.core.tests.compiler.parser.CompletionParserTest18)  Time elapsed: 0 s
23:40:06 test0010 - 11(org.eclipse.jdt.core.tests.compiler.parser.CompletionParserTest18)  Time elapsed: 0.001 s
23:40:06 test402081 - 11(org.eclipse.jdt.core.tests.compiler.parser.CompletionParserTest18)  Time elapsed: 0 s
23:40:06 test405126 - 11(org.eclipse.jdt.core.tests.compiler.parser.CompletionParserTest18)  Time elapsed: 0 s
23:40:06 test417935 - 11(org.eclipse.jdt.core.tests.compiler.parser.CompletionParserTest18)  Time elapsed: 0.001 s
23:40:06 test422468 - 11(org.eclipse.jdt.core.tests.compiler.parser.CompletionParserTest18)  Time elapsed: 0.001 s
23:40:06 test424080 - 11(org.eclipse.jdt.core.tests.compiler.parser.CompletionParserTest18)  Time elapsed: 0.001 s
23:40:06 test425084 - 11(org.eclipse.jdt.core.tests.compiler.parser.CompletionParserTest18)  Time elapsed: 0.001 s
23:40:06 test425084b - 11(org.eclipse.jdt.core.tests.compiler.parser.CompletionParserTest18)  Time elapsed: 0 s
23:40:06 test427117 - 11(org.eclipse.jdt.core.tests.compiler.parser.CompletionParserTest18)  Time elapsed: 0.001 s
23:40:06 test427255 - 11(org.eclipse.jdt.core.tests.compiler.parser.CompletionParserTest18)  Time elapsed: 0 s
23:40:06 test427322 - 11(org.eclipse.jdt.core.tests.compiler.parser.CompletionParserTest18)  Time elapsed: 0 s
23:40:06 test427322a - 11(org.eclipse.jdt.core.tests.compiler.parser.CompletionParserTest18)  Time elapsed: 0 s
23:40:06 test427463 - 11(org.eclipse.jdt.core.tests.compiler.parser.CompletionParserTest18)  Time elapsed: 0.001 s
23:40:06 test427532 - 11(org.eclipse.jdt.core.tests.compiler.parser.CompletionParserTest18)  Time elapsed: 0.001 s
23:40:06 test428735 - 11(org.eclipse.jdt.core.tests.compiler.parser.CompletionParserTest18)  Time elapsed: 0 s
23:40:06 test428735a - 11(org.eclipse.jdt.core.tests.compiler.parser.CompletionParserTest18)  Time elapsed: 0.001 s
23:40:06 test428735b - 11(org.eclipse.jdt.core.tests.compiler.parser.CompletionParserTest18)  Time elapsed: 0 s
23:40:06 test428735c - 11(org.eclipse.jdt.core.tests.compiler.parser.CompletionParserTest18)  Time elapsed: 0.001 s
23:40:06 test428735d - 11(org.eclipse.jdt.core.tests.compiler.parser.CompletionParserTest18)  Time elapsed: 0 s
23:40:06 test428735e - 11(org.eclipse.jdt.core.tests.compiler.parser.CompletionParserTest18)  Time elapsed: 0.001 s
23:40:06 test428735f - 11(org.eclipse.jdt.core.tests.compiler.parser.CompletionParserTest18)  Time elapsed: 0 s
23:40:06 test428735g - 11(org.eclipse.jdt.core.tests.compiler.parser.CompletionParserTest18)  Time elapsed: 0.001 s
23:40:06 test428735h - 11(org.eclipse.jdt.core.tests.compiler.parser.CompletionParserTest18)  Time elapsed: 0.001 s
23:40:06 test430656 - 11(org.eclipse.jdt.core.tests.compiler.parser.CompletionParserTest18)  Time elapsed: 0 s
23:40:06 test430667 - 11(org.eclipse.jdt.core.tests.compiler.parser.CompletionParserTest18)  Time elapsed: 0.001 s
23:40:06 test430667a - 11(org.eclipse.jdt.core.tests.compiler.parser.CompletionParserTest18)  Time elapsed: 0.001 s
23:40:06 test430667b - 11(org.eclipse.jdt.core.tests.compiler.parser.CompletionParserTest18)  Time elapsed: 0 s
23:40:06 test430667c - 11(org.eclipse.jdt.core.tests.compiler.parser.CompletionParserTest18)  Time elapsed: 0.001 s
23:40:06 test430667d - 11(org.eclipse.jdt.core.tests.compiler.parser.CompletionParserTest18)  Time elapsed: 0 s
23:40:06 test435219 - 11(org.eclipse.jdt.core.tests.compiler.parser.CompletionParserTest18)  Time elapsed: 0.001 s
23:40:06 test435682 - 11(org.eclipse.jdt.core.tests.compiler.parser.CompletionParserTest18)  Time elapsed: 0 s
23:40:06 test438952 - 11(org.eclipse.jdt.core.tests.compiler.parser.CompletionParserTest18)  Time elapsed: 0.001 s
23:40:06 test446765 - 11(org.eclipse.jdt.core.tests.compiler.parser.CompletionParserTest18)  Time elapsed: 0.001 s
23:40:06 test473008 - 11(org.eclipse.jdt.core.tests.compiler.parser.CompletionParserTest18)  Time elapsed: 0.001 s
23:40:06 testBrokenMethodCall - 11(org.eclipse.jdt.core.tests.compiler.parser.CompletionParserTest18)  Time elapsed: 0 s
23:40:06 testCompletionLocation - 11(org.eclipse.jdt.core.tests.compiler.parser.CompletionParserTest18)  Time elapsed: 0.001 s
23:40:06 testElidedCompletion - 11(org.eclipse.jdt.core.tests.compiler.parser.CompletionParserTest18)  Time elapsed: 0 s
23:40:06 testElidedCompletion2 - 11(org.eclipse.jdt.core.tests.compiler.parser.CompletionParserTest18)  Time elapsed: 0.001 s
23:40:06 testLocalsPromotion - 11(org.eclipse.jdt.core.tests.compiler.parser.CompletionParserTest18)  Time elapsed: 0 s
23:40:06 testUnspecifiedReference - 11(org.eclipse.jdt.core.tests.compiler.parser.CompletionParserTest18)  Time elapsed: 0.001 s
23:40:06 test424110 - 11(org.eclipse.jdt.core.tests.compiler.parser.SelectionParserTest18)  Time elapsed: 0 s
23:40:06 test424110a - 11(org.eclipse.jdt.core.tests.compiler.parser.SelectionParserTest18)  Time elapsed: 0 s
23:40:06 test430572 - 11(org.eclipse.jdt.core.tests.compiler.parser.SelectionParserTest18)  Time elapsed: 0.001 s
23:40:06 test476693 - 11(org.eclipse.jdt.core.tests.compiler.parser.SelectionParserTest18)  Time elapsed: 0.001 s
23:40:06 test495912 - 11(org.eclipse.jdt.core.tests.compiler.parser.SelectionParserTest18)  Time elapsed: 0.001 s
23:40:06 test495912a - 11(org.eclipse.jdt.core.tests.compiler.parser.SelectionParserTest18)  Time elapsed: 0 s
23:40:06 test495912b - 11(org.eclipse.jdt.core.tests.compiler.parser.SelectionParserTest18)  Time elapsed: 0.001 s
23:40:06 test510339_001_since_9 - 11(org.eclipse.jdt.core.tests.compiler.parser.SelectionParserTest9)  Time elapsed: 0.001 s
23:40:06 test510339_002_since_9 - 11(org.eclipse.jdt.core.tests.compiler.parser.SelectionParserTest9)  Time elapsed: 0 s
23:40:06 test510339_003_since_9 - 11(org.eclipse.jdt.core.tests.compiler.parser.SelectionParserTest9)  Time elapsed: 0.001 s
23:40:06 test510339_004_since_9 - 11(org.eclipse.jdt.core.tests.compiler.parser.SelectionParserTest9)  Time elapsed: 0 s
23:40:06 test510339_005_since_9 - 11(org.eclipse.jdt.core.tests.compiler.parser.SelectionParserTest9)  Time elapsed: 0 s
23:40:06 test510339_006_since_9 - 11(org.eclipse.jdt.core.tests.compiler.parser.SelectionParserTest9)  Time elapsed: 0 s
23:40:06 test510339_007_since_9 - 11(org.eclipse.jdt.core.tests.compiler.parser.SelectionParserTest9)  Time elapsed: 0 s
23:40:06 test510339_008_since_9 - 11(org.eclipse.jdt.core.tests.compiler.parser.SelectionParserTest9)  Time elapsed: 0.001 s
23:40:06 test510339_009_since_9 - 11(org.eclipse.jdt.core.tests.compiler.parser.SelectionParserTest9)  Time elapsed: 0 s
23:40:06 test510339_010_since_9 - 11(org.eclipse.jdt.core.tests.compiler.parser.SelectionParserTest9)  Time elapsed: 0 s
23:40:06 test510339_011_since_9 - 11(org.eclipse.jdt.core.tests.compiler.parser.SelectionParserTest9)  Time elapsed: 0 s
23:40:06 test001 - 11(org.eclipse.jdt.core.tests.compiler.parser.SelectionParserTest10)  Time elapsed: 0.001 s
23:40:06 test002 - 11(org.eclipse.jdt.core.tests.compiler.parser.SelectionParserTest10)  Time elapsed: 0 s
23:40:06 test0001 - 11(org.eclipse.jdt.core.tests.compiler.parser.ModuleDeclarationSyntaxTest)  Time elapsed: 0 s
23:40:06 test0002 - 11(org.eclipse.jdt.core.tests.compiler.parser.ModuleDeclarationSyntaxTest)  Time elapsed: 0 s
23:40:06 test0003 - 11(org.eclipse.jdt.core.tests.compiler.parser.ModuleDeclarationSyntaxTest)  Time elapsed: 0.001 s
23:40:06 test0004 - 11(org.eclipse.jdt.core.tests.compiler.parser.ModuleDeclarationSyntaxTest)  Time elapsed: 0 s
23:40:06 test0005 - 11(org.eclipse.jdt.core.tests.compiler.parser.ModuleDeclarationSyntaxTest)  Time elapsed: 0 s
23:40:06 test0006 - 11(org.eclipse.jdt.core.tests.compiler.parser.ModuleDeclarationSyntaxTest)  Time elapsed: 0 s
23:40:06 test0007 - 11(org.eclipse.jdt.core.tests.compiler.parser.ModuleDeclarationSyntaxTest)  Time elapsed: 0.003 s
23:40:06 test0008 - 11(org.eclipse.jdt.core.tests.compiler.parser.ModuleDeclarationSyntaxTest)  Time elapsed: 0.001 s
23:40:06 test0009 - 11(org.eclipse.jdt.core.tests.compiler.parser.ModuleDeclarationSyntaxTest)  Time elapsed: 0 s
23:40:06 test0010 - 11(org.eclipse.jdt.core.tests.compiler.parser.ModuleDeclarationSyntaxTest)  Time elapsed: 0.001 s
23:40:06 test0011 - 11(org.eclipse.jdt.core.tests.compiler.parser.ModuleDeclarationSyntaxTest)  Time elapsed: 0 s
23:40:06 test0012 - 11(org.eclipse.jdt.core.tests.compiler.parser.ModuleDeclarationSyntaxTest)  Time elapsed: 0.001 s
23:40:06 test0013 - 11(org.eclipse.jdt.core.tests.compiler.parser.ModuleDeclarationSyntaxTest)  Time elapsed: 0 s
23:40:06 test0014 - 11(org.eclipse.jdt.core.tests.compiler.parser.ModuleDeclarationSyntaxTest)  Time elapsed: 0 s
23:40:06 test0015 - 11(org.eclipse.jdt.core.tests.compiler.parser.ModuleDeclarationSyntaxTest)  Time elapsed: 0 s
23:40:06 test0016 - 11(org.eclipse.jdt.core.tests.compiler.parser.ModuleDeclarationSyntaxTest)  Time elapsed: 0 s
23:40:06 test0017 - 11(org.eclipse.jdt.core.tests.compiler.parser.ModuleDeclarationSyntaxTest)  Time elapsed: 0 s
23:40:06 test0018 - 11(org.eclipse.jdt.core.tests.compiler.parser.ModuleDeclarationSyntaxTest)  Time elapsed: 0 s
23:40:06 test0019 - 11(org.eclipse.jdt.core.tests.compiler.parser.ModuleDeclarationSyntaxTest)  Time elapsed: 0.001 s
23:40:06 test0020 - 11(org.eclipse.jdt.core.tests.compiler.parser.ModuleDeclarationSyntaxTest)  Time elapsed: 0 s
23:40:06 test0021 - 11(org.eclipse.jdt.core.tests.compiler.parser.ModuleDeclarationSyntaxTest)  Time elapsed: 0 s
23:40:06 test0022 - 11(org.eclipse.jdt.core.tests.compiler.parser.ModuleDeclarationSyntaxTest)  Time elapsed: 0 s
23:40:06 test0023 - 11(org.eclipse.jdt.core.tests.compiler.parser.ModuleDeclarationSyntaxTest)  Time elapsed: 0 s
23:40:06 test0024 - 11(org.eclipse.jdt.core.tests.compiler.parser.ModuleDeclarationSyntaxTest)  Time elapsed: 0.001 s
23:40:06 test0025 - 11(org.eclipse.jdt.core.tests.compiler.parser.ModuleDeclarationSyntaxTest)  Time elapsed: 0 s
23:40:06 test0026 - 11(org.eclipse.jdt.core.tests.compiler.parser.ModuleDeclarationSyntaxTest)  Time elapsed: 0 s
23:40:06 test0027 - 11(org.eclipse.jdt.core.tests.compiler.parser.ModuleDeclarationSyntaxTest)  Time elapsed: 0 s
23:40:06 testBug518626 - 11(org.eclipse.jdt.core.tests.compiler.parser.ModuleDeclarationSyntaxTest)  Time elapsed: 0.001 s
23:40:06 testbug488541 - 11(org.eclipse.jdt.core.tests.compiler.parser.ModuleDeclarationSyntaxTest)  Time elapsed: 0 s
23:40:06 testbug488541a - 11(org.eclipse.jdt.core.tests.compiler.parser.ModuleDeclarationSyntaxTest)  Time elapsed: 0 s
23:40:06 testbug488541b - 11(org.eclipse.jdt.core.tests.compiler.parser.ModuleDeclarationSyntaxTest)  Time elapsed: 0 s
23:40:06 test0001_class_var_warning - 11(org.eclipse.jdt.core.tests.compiler.regression.JEP286ReservedWordTest)  Time elapsed: 0.002 s
23:40:06 test0002_interface_var_warning - 11(org.eclipse.jdt.core.tests.compiler.regression.JEP286ReservedWordTest)  Time elapsed: 0.001 s
23:40:06 testBug530920 - 11(org.eclipse.jdt.core.tests.compiler.regression.JEP286ReservedWordTest)  Time elapsed: 0.001 s
23:40:06 testBug530920a - 11(org.eclipse.jdt.core.tests.compiler.regression.JEP286ReservedWordTest)  Time elapsed: 0.001 s
23:40:06 Running org.eclipse.jdt.core.tests.eval.TestAll
23:40:06 Listening for transport dt_socket at address: 51942
23:40:06 1.4: connected to VM using port 51942
23:40:06 1.4: connected to target using port 51942
23:40:06 This is an expected exception printed by the target VM:
23:40:06 java.io.IOException
23:40:06 	at CodeSnippet_73.run(Unknown Source)
23:40:06 	at java.base/jdk.internal.reflect.GeneratedMethodAccessor1.invoke(Unknown Source)
23:40:06 	at java.base/jdk.internal.reflect.DelegatingMethodAccessorImpl.invoke(DelegatingMethodAccessorImpl.java:43)
23:40:06 	at java.base/java.lang.reflect.Method.invoke(Method.java:566)
23:40:06 	at org.eclipse.jdt.core.tests.eval.target.CodeSnippetRunner$2.run(CodeSnippetRunner.java:351)
23:40:06 This is an expected error printed by the target VM:
23:40:06 java.lang.Error
23:40:06 	at CodeSnippet_75.run(Unknown Source)
23:40:06 	at java.base/jdk.internal.reflect.GeneratedMethodAccessor1.invoke(Unknown Source)
23:40:06 	at java.base/jdk.internal.reflect.DelegatingMethodAccessorImpl.invoke(DelegatingMethodAccessorImpl.java:43)
23:40:06 	at java.base/java.lang.reflect.Method.invoke(Method.java:566)
23:40:06 	at org.eclipse.jdt.core.tests.eval.target.CodeSnippetRunner$2.run(CodeSnippetRunner.java:351)
23:40:17 java.net.ConnectException: Connection refused (Connection refused)
23:40:17 	at java.base/java.net.PlainSocketImpl.socketConnect(Native Method)
23:40:17 	at java.base/java.net.AbstractPlainSocketImpl.doConnect(AbstractPlainSocketImpl.java:399)
23:40:17 	at java.base/java.net.AbstractPlainSocketImpl.connectToAddress(AbstractPlainSocketImpl.java:242)
23:40:17 	at java.base/java.net.AbstractPlainSocketImpl.connect(AbstractPlainSocketImpl.java:224)
23:40:17 	at java.base/java.net.SocksSocketImpl.connect(SocksSocketImpl.java:403)
23:40:17 	at java.base/java.net.Socket.connect(Socket.java:591)
23:40:17 	at java.base/java.net.Socket.connect(Socket.java:540)
23:40:17 	at java.base/java.net.Socket.<init>(Socket.java:436)
23:40:17 	at java.base/java.net.Socket.<init>(Socket.java:213)
23:40:17 	at org.eclipse.jdi.internal.connect.SocketTransportService$2.run(SocketTransportService.java:147)
23:40:17 	at java.base/java.lang.Thread.run(Thread.java:834)
23:40:17 1.7: could not contact the VM at localhost:58780. Retrying...
23:40:17 Listening for transport dt_socket at address: 58780
23:40:18 1.7: connected to VM using port 58780
23:40:18 1.7: connected to target using port 58780
23:40:19 This is an expected exception printed by the target VM:
23:40:19 java.io.IOException
23:40:19 	at CodeSnippet_395.run(Unknown Source)
23:40:19 	at java.base/jdk.internal.reflect.GeneratedMethodAccessor1.invoke(Unknown Source)
23:40:19 	at java.base/jdk.internal.reflect.DelegatingMethodAccessorImpl.invoke(DelegatingMethodAccessorImpl.java:43)
23:40:19 	at java.base/java.lang.reflect.Method.invoke(Method.java:566)
23:40:19 	at org.eclipse.jdt.core.tests.eval.target.CodeSnippetRunner$2.run(CodeSnippetRunner.java:351)
23:40:19 This is an expected error printed by the target VM:
23:40:19 java.lang.Error
23:40:19 	at CodeSnippet_398.run(Unknown Source)
23:40:19 	at java.base/jdk.internal.reflect.GeneratedMethodAccessor1.invoke(Unknown Source)
23:40:19 	at java.base/jdk.internal.reflect.DelegatingMethodAccessorImpl.invoke(DelegatingMethodAccessorImpl.java:43)
23:40:19 	at java.base/java.lang.reflect.Method.invoke(Method.java:566)
23:40:19 	at org.eclipse.jdt.core.tests.eval.target.CodeSnippetRunner$2.run(CodeSnippetRunner.java:351)
23:40:30 java.net.ConnectException: Connection refused (Connection refused)
23:40:30 	at java.base/java.net.PlainSocketImpl.socketConnect(Native Method)
23:40:30 	at java.base/java.net.AbstractPlainSocketImpl.doConnect(AbstractPlainSocketImpl.java:399)
23:40:30 	at java.base/java.net.AbstractPlainSocketImpl.connectToAddress(AbstractPlainSocketImpl.java:242)
23:40:30 	at java.base/java.net.AbstractPlainSocketImpl.connect(AbstractPlainSocketImpl.java:224)
23:40:30 	at java.base/java.net.SocksSocketImpl.connect(SocksSocketImpl.java:403)
23:40:30 	at java.base/java.net.Socket.connect(Socket.java:591)
23:40:30 	at java.base/java.net.Socket.connect(Socket.java:540)
23:40:30 	at java.base/java.net.Socket.<init>(Socket.java:436)
23:40:30 	at java.base/java.net.Socket.<init>(Socket.java:213)
23:40:30 	at org.eclipse.jdi.internal.connect.SocketTransportService$2.run(SocketTransportService.java:147)
23:40:30 	at java.base/java.lang.Thread.run(Thread.java:834)
23:40:30 1.8: could not contact the VM at localhost:59159. Retrying...
23:40:30 Listening for transport dt_socket at address: 59159
23:40:31 1.8: connected to VM using port 59159
23:40:31 1.8: connected to target using port 59159
23:40:31 This is an expected exception printed by the target VM:
23:40:31 java.io.IOException
23:40:31 	at CodeSnippet_736.run(Unknown Source)
23:40:31 	at java.base/jdk.internal.reflect.GeneratedMethodAccessor1.invoke(Unknown Source)
23:40:31 	at java.base/jdk.internal.reflect.DelegatingMethodAccessorImpl.invoke(DelegatingMethodAccessorImpl.java:43)
23:40:31 	at java.base/java.lang.reflect.Method.invoke(Method.java:566)
23:40:31 	at org.eclipse.jdt.core.tests.eval.target.CodeSnippetRunner$2.run(CodeSnippetRunner.java:351)
23:40:31 This is an expected error printed by the target VM:
23:40:31 java.lang.Error
23:40:31 	at CodeSnippet_739.run(Unknown Source)
23:40:31 	at java.base/jdk.internal.reflect.GeneratedMethodAccessor1.invoke(Unknown Source)
23:40:31 	at java.base/jdk.internal.reflect.DelegatingMethodAccessorImpl.invoke(DelegatingMethodAccessorImpl.java:43)
23:40:31 	at java.base/java.lang.reflect.Method.invoke(Method.java:566)
23:40:31 	at org.eclipse.jdt.core.tests.eval.target.CodeSnippetRunner$2.run(CodeSnippetRunner.java:351)
23:40:44 java.net.ConnectException: Connection refused (Connection refused)
23:40:44 	at java.base/java.net.PlainSocketImpl.socketConnect(Native Method)
23:40:44 	at java.base/java.net.AbstractPlainSocketImpl.doConnect(AbstractPlainSocketImpl.java:399)
23:40:44 	at java.base/java.net.AbstractPlainSocketImpl.connectToAddress(AbstractPlainSocketImpl.java:242)
23:40:44 	at java.base/java.net.AbstractPlainSocketImpl.connect(AbstractPlainSocketImpl.java:224)
23:40:44 	at java.base/java.net.SocksSocketImpl.connect(SocksSocketImpl.java:403)
23:40:44 	at java.base/java.net.Socket.connect(Socket.java:591)
23:40:44 	at java.base/java.net.Socket.connect(Socket.java:540)
23:40:44 	at java.base/java.net.Socket.<init>(Socket.java:436)
23:40:44 	at java.base/java.net.Socket.<init>(Socket.java:213)
23:40:44 	at org.eclipse.jdi.internal.connect.SocketTransportService$2.run(SocketTransportService.java:147)
23:40:44 	at java.base/java.lang.Thread.run(Thread.java:834)
23:40:44 11: could not contact the VM at localhost:39031. Retrying...
23:40:44 Listening for transport dt_socket at address: 39031
23:40:45 11: connected to VM using port 39031
23:40:45 11: connected to target using port 39031
23:40:45 This is an expected exception printed by the target VM:
23:40:45 java.io.IOException
23:40:45 	at CodeSnippet_1077.run(Unknown Source)
23:40:45 	at java.base/jdk.internal.reflect.GeneratedMethodAccessor1.invoke(Unknown Source)
23:40:45 	at java.base/jdk.internal.reflect.DelegatingMethodAccessorImpl.invoke(DelegatingMethodAccessorImpl.java:43)
23:40:45 	at java.base/java.lang.reflect.Method.invoke(Method.java:566)
23:40:45 	at org.eclipse.jdt.core.tests.eval.target.CodeSnippetRunner$2.run(CodeSnippetRunner.java:351)
23:40:45 This is an expected error printed by the target VM:
23:40:45 java.lang.Error
23:40:45 	at CodeSnippet_1080.run(Unknown Source)
23:40:45 	at java.base/jdk.internal.reflect.GeneratedMethodAccessor1.invoke(Unknown Source)
23:40:45 	at java.base/jdk.internal.reflect.DelegatingMethodAccessorImpl.invoke(DelegatingMethodAccessorImpl.java:43)
23:40:45 	at java.base/java.lang.reflect.Method.invoke(Method.java:566)
23:40:45 	at org.eclipse.jdt.core.tests.eval.target.CodeSnippetRunner$2.run(CodeSnippetRunner.java:351)
23:40:57 Tests run: 760, Failures: 0, Errors: 0, Skipped: 0, Time elapsed: 50.774 s - in org.eclipse.jdt.core.tests.eval.TestAll
23:40:57 testAllVariables - 1.4(org.eclipse.jdt.core.tests.eval.SanityTestEvaluationContext)  Time elapsed: 0 s
23:40:57 testEvaluate - 1.4(org.eclipse.jdt.core.tests.eval.SanityTestEvaluationContext)  Time elapsed: 0.042 s
23:40:57 testEvaluateImports - 1.4(org.eclipse.jdt.core.tests.eval.SanityTestEvaluationContext)  Time elapsed: 0.001 s
23:40:57 testEvaluateVariable - 1.4(org.eclipse.jdt.core.tests.eval.SanityTestEvaluationContext)  Time elapsed: 0.01 s
23:40:57 testEvaluateVariables - 1.4(org.eclipse.jdt.core.tests.eval.SanityTestEvaluationContext)  Time elapsed: 0.002 s
23:40:57 testGetSetImports - 1.4(org.eclipse.jdt.core.tests.eval.SanityTestEvaluationContext)  Time elapsed: 0 s
23:40:57 testGetSetPackageName - 1.4(org.eclipse.jdt.core.tests.eval.SanityTestEvaluationContext)  Time elapsed: 0 s
23:40:57 testNewDeleteVariable - 1.4(org.eclipse.jdt.core.tests.eval.SanityTestEvaluationContext)  Time elapsed: 0 s
23:40:57 testGetEvaluationType - 1.4(org.eclipse.jdt.core.tests.eval.SanityTestEvaluationResult)  Time elapsed: 0.005 s
23:40:57 testGetProblems - 1.4(org.eclipse.jdt.core.tests.eval.SanityTestEvaluationResult)  Time elapsed: 0.004 s
23:40:57 testGetValue - 1.4(org.eclipse.jdt.core.tests.eval.SanityTestEvaluationResult)  Time elapsed: 0.004 s
23:40:57 testGetValueDisplayString - 1.4(org.eclipse.jdt.core.tests.eval.SanityTestEvaluationResult)  Time elapsed: 0.003 s
23:40:57 testGetValueTypeName - 1.4(org.eclipse.jdt.core.tests.eval.SanityTestEvaluationResult)  Time elapsed: 0.003 s
23:40:57 testHasErrors - 1.4(org.eclipse.jdt.core.tests.eval.SanityTestEvaluationResult)  Time elapsed: 0.003 s
23:40:57 testHasProblems - 1.4(org.eclipse.jdt.core.tests.eval.SanityTestEvaluationResult)  Time elapsed: 0.002 s
23:40:57 testHasValue - 1.4(org.eclipse.jdt.core.tests.eval.SanityTestEvaluationResult)  Time elapsed: 0.003 s
23:40:57 testHasWarnings - 1.4(org.eclipse.jdt.core.tests.eval.SanityTestEvaluationResult)  Time elapsed: 0.003 s
23:40:57 testAllKindOfValues - 1.4(org.eclipse.jdt.core.tests.eval.VariableTest)  Time elapsed: 0.057 s
23:40:57 testCodeSnippetVarAssign - 1.4(org.eclipse.jdt.core.tests.eval.VariableTest)  Time elapsed: 0.075 s
23:40:57 testCodeSnippetVarRetrieval - 1.4(org.eclipse.jdt.core.tests.eval.VariableTest)  Time elapsed: 0.033 s
23:40:57 testImports - 1.4(org.eclipse.jdt.core.tests.eval.VariableTest)  Time elapsed: 0.026 s
23:40:57 testSeveralVariableInstallations - 1.4(org.eclipse.jdt.core.tests.eval.VariableTest)  Time elapsed: 0.099 s
23:40:57 testBug345334 - 1.4(org.eclipse.jdt.core.tests.eval.CodeSnippetTest)  Time elapsed: 0.005 s
23:40:57 testBug464656 - 1.4(org.eclipse.jdt.core.tests.eval.CodeSnippetTest)  Time elapsed: 0 s
23:40:57 testCheckedException - 1.4(org.eclipse.jdt.core.tests.eval.CodeSnippetTest)  Time elapsed: 0.007 s
23:40:57 testDiamond - 1.4(org.eclipse.jdt.core.tests.eval.CodeSnippetTest)  Time elapsed: 0 s
23:40:57 testEmptyStatement - 1.4(org.eclipse.jdt.core.tests.eval.CodeSnippetTest)  Time elapsed: 0.005 s
23:40:57 testEvaluateEmptyImport - 1.4(org.eclipse.jdt.core.tests.eval.CodeSnippetTest)  Time elapsed: 0 s
23:40:57 testEvaluateExistingPackageAndNonExistingTypeImports - 1.4(org.eclipse.jdt.core.tests.eval.CodeSnippetTest)  Time elapsed: 0.001 s
23:40:57 testEvaluateNonExistingPackageAndExistingTypeImports - 1.4(org.eclipse.jdt.core.tests.eval.CodeSnippetTest)  Time elapsed: 0 s
23:40:57 testEvaluateNonExistingPackageImport - 1.4(org.eclipse.jdt.core.tests.eval.CodeSnippetTest)  Time elapsed: 0 s
23:40:57 testEvaluateNonExistingTypeImport - 1.4(org.eclipse.jdt.core.tests.eval.CodeSnippetTest)  Time elapsed: 0 s
23:40:57 testEvaluateValidPackageAndTypeImports - 1.4(org.eclipse.jdt.core.tests.eval.CodeSnippetTest)  Time elapsed: 0 s
23:40:57 testEvaluateValidPackageImport - 1.4(org.eclipse.jdt.core.tests.eval.CodeSnippetTest)  Time elapsed: 0 s
23:40:57 testEvaluateValidTypeImport - 1.4(org.eclipse.jdt.core.tests.eval.CodeSnippetTest)  Time elapsed: 0.001 s
23:40:57 testFinallyError - 1.4(org.eclipse.jdt.core.tests.eval.CodeSnippetTest)  Time elapsed: 0.005 s
23:40:57 testFinallyOneBlock - 1.4(org.eclipse.jdt.core.tests.eval.CodeSnippetTest)  Time elapsed: 0.005 s
23:40:57 testFinallyTwoBlock - 1.4(org.eclipse.jdt.core.tests.eval.CodeSnippetTest)  Time elapsed: 0.005 s
23:40:57 testFor89632 - 1.4(org.eclipse.jdt.core.tests.eval.CodeSnippetTest)  Time elapsed: 0 s
23:40:57 testFreeReturnAnonymous - 1.4(org.eclipse.jdt.core.tests.eval.CodeSnippetTest)  Time elapsed: 0.004 s
23:40:57 testFreeReturnClassDeclaration - 1.4(org.eclipse.jdt.core.tests.eval.CodeSnippetTest)  Time elapsed: 0.008 s
23:40:57 testFreeReturnExpression - 1.4(org.eclipse.jdt.core.tests.eval.CodeSnippetTest)  Time elapsed: 0.007 s
23:40:57 testFreeReturnInteger - 1.4(org.eclipse.jdt.core.tests.eval.CodeSnippetTest)  Time elapsed: 0.005 s
23:40:57 testFreeReturnLocalVar - 1.4(org.eclipse.jdt.core.tests.eval.CodeSnippetTest)  Time elapsed: 0.005 s
23:40:57 testFreeReturnStatement - 1.4(org.eclipse.jdt.core.tests.eval.CodeSnippetTest)  Time elapsed: 0.004 s
23:40:57 testImportPackage - 1.4(org.eclipse.jdt.core.tests.eval.CodeSnippetTest)  Time elapsed: 0.008 s
23:40:57 testImportType - 1.4(org.eclipse.jdt.core.tests.eval.CodeSnippetTest)  Time elapsed: 0.011 s
23:40:57 testImportTypeAndPackage - 1.4(org.eclipse.jdt.core.tests.eval.CodeSnippetTest)  Time elapsed: 0.008 s
23:40:57 testInnerClassAnonymous - 1.4(org.eclipse.jdt.core.tests.eval.CodeSnippetTest)  Time elapsed: 0.007 s
23:40:57 testInnerClassNamed - 1.4(org.eclipse.jdt.core.tests.eval.CodeSnippetTest)  Time elapsed: 0.006 s
23:40:57 testReturnDisplayStringBoolean - 1.4(org.eclipse.jdt.core.tests.eval.CodeSnippetTest)  Time elapsed: 0.005 s
23:40:57 testReturnDisplayStringCharacter - 1.4(org.eclipse.jdt.core.tests.eval.CodeSnippetTest)  Time elapsed: 0.005 s
23:40:57 testReturnDisplayStringDouble - 1.4(org.eclipse.jdt.core.tests.eval.CodeSnippetTest)  Time elapsed: 0.003 s
23:40:57 testReturnDisplayStringEmptyCodeSnippet - 1.4(org.eclipse.jdt.core.tests.eval.CodeSnippetTest)  Time elapsed: 0.003 s
23:40:57 testReturnDisplayStringFloat - 1.4(org.eclipse.jdt.core.tests.eval.CodeSnippetTest)  Time elapsed: 0.01 s
23:40:57 testReturnDisplayStringInteger - 1.4(org.eclipse.jdt.core.tests.eval.CodeSnippetTest)  Time elapsed: 0.005 s
23:40:57 testReturnDisplayStringLong - 1.4(org.eclipse.jdt.core.tests.eval.CodeSnippetTest)  Time elapsed: 0.006 s
23:40:57 testReturnDisplayStringNoExplicitReturnedValue - 1.4(org.eclipse.jdt.core.tests.eval.CodeSnippetTest)  Time elapsed: 0.008 s
23:40:57 testReturnDisplayStringObject - 1.4(org.eclipse.jdt.core.tests.eval.CodeSnippetTest)  Time elapsed: 0.008 s
23:40:57 testReturnDisplayStringShort - 1.4(org.eclipse.jdt.core.tests.eval.CodeSnippetTest)  Time elapsed: 0.005 s
23:40:57 testReturnDisplayStringString - 1.4(org.eclipse.jdt.core.tests.eval.CodeSnippetTest)  Time elapsed: 0.006 s
23:40:57 testReturnDisplayStringVoid - 1.4(org.eclipse.jdt.core.tests.eval.CodeSnippetTest)  Time elapsed: 0.007 s
23:40:57 testReturnTypeBoolean - 1.4(org.eclipse.jdt.core.tests.eval.CodeSnippetTest)  Time elapsed: 0.006 s
23:40:57 testReturnTypeBooleanArray - 1.4(org.eclipse.jdt.core.tests.eval.CodeSnippetTest)  Time elapsed: 0.007 s
23:40:57 testReturnTypeBooleanObject - 1.4(org.eclipse.jdt.core.tests.eval.CodeSnippetTest)  Time elapsed: 0.004 s
23:40:57 testReturnTypeChar - 1.4(org.eclipse.jdt.core.tests.eval.CodeSnippetTest)  Time elapsed: 0.005 s
23:40:57 testReturnTypeCharArray - 1.4(org.eclipse.jdt.core.tests.eval.CodeSnippetTest)  Time elapsed: 0.004 s
23:40:57 testReturnTypeCharacterObject - 1.4(org.eclipse.jdt.core.tests.eval.CodeSnippetTest)  Time elapsed: 0.005 s
23:40:57 testReturnTypeDouble - 1.4(org.eclipse.jdt.core.tests.eval.CodeSnippetTest)  Time elapsed: 0.005 s
23:40:57 testReturnTypeDoubleArray - 1.4(org.eclipse.jdt.core.tests.eval.CodeSnippetTest)  Time elapsed: 0.006 s
23:40:57 testReturnTypeDoubleObject - 1.4(org.eclipse.jdt.core.tests.eval.CodeSnippetTest)  Time elapsed: 0.006 s
23:40:57 testReturnTypeEmptyCodeSnippet - 1.4(org.eclipse.jdt.core.tests.eval.CodeSnippetTest)  Time elapsed: 0.003 s
23:40:57 testReturnTypeFloat - 1.4(org.eclipse.jdt.core.tests.eval.CodeSnippetTest)  Time elapsed: 0.005 s
23:40:57 testReturnTypeFloatArray - 1.4(org.eclipse.jdt.core.tests.eval.CodeSnippetTest)  Time elapsed: 0.005 s
23:40:57 testReturnTypeFloatObject - 1.4(org.eclipse.jdt.core.tests.eval.CodeSnippetTest)  Time elapsed: 0.005 s
23:40:57 testReturnTypeInt - 1.4(org.eclipse.jdt.core.tests.eval.CodeSnippetTest)  Time elapsed: 0.005 s
23:40:57 testReturnTypeIntegerObject - 1.4(org.eclipse.jdt.core.tests.eval.CodeSnippetTest)  Time elapsed: 0.006 s
23:40:57 testReturnTypeLong - 1.4(org.eclipse.jdt.core.tests.eval.CodeSnippetTest)  Time elapsed: 0.005 s
23:40:57 testReturnTypeLongArray - 1.4(org.eclipse.jdt.core.tests.eval.CodeSnippetTest)  Time elapsed: 0.004 s
23:40:57 testReturnTypeLongObject - 1.4(org.eclipse.jdt.core.tests.eval.CodeSnippetTest)  Time elapsed: 0.006 s
23:40:57 testReturnTypeNoExplicitReturnedValue - 1.4(org.eclipse.jdt.core.tests.eval.CodeSnippetTest)  Time elapsed: 0.004 s
23:40:57 testReturnTypeObject - 1.4(org.eclipse.jdt.core.tests.eval.CodeSnippetTest)  Time elapsed: 0.005 s
23:40:57 testReturnTypeObjectArray - 1.4(org.eclipse.jdt.core.tests.eval.CodeSnippetTest)  Time elapsed: 0.004 s
23:40:57 testReturnTypeShort - 1.4(org.eclipse.jdt.core.tests.eval.CodeSnippetTest)  Time elapsed: 0.004 s
23:40:57 testReturnTypeShortArray - 1.4(org.eclipse.jdt.core.tests.eval.CodeSnippetTest)  Time elapsed: 0.005 s
23:40:57 testReturnTypeShortObject - 1.4(org.eclipse.jdt.core.tests.eval.CodeSnippetTest)  Time elapsed: 0.007 s
23:40:57 testReturnTypeString - 1.4(org.eclipse.jdt.core.tests.eval.CodeSnippetTest)  Time elapsed: 0.006 s
23:40:57 testReturnTypeStringArray - 1.4(org.eclipse.jdt.core.tests.eval.CodeSnippetTest)  Time elapsed: 0.006 s
23:40:57 testReturnTypeVoid - 1.4(org.eclipse.jdt.core.tests.eval.CodeSnippetTest)  Time elapsed: 0.006 s
23:40:57 testReturnTypesIntArray - 1.4(org.eclipse.jdt.core.tests.eval.CodeSnippetTest)  Time elapsed: 0.005 s
23:40:57 testRunMethodInAnonymous - 1.4(org.eclipse.jdt.core.tests.eval.CodeSnippetTest)  Time elapsed: 0.211 s
23:40:57 testRunMethodInAnonymous2 - 1.4(org.eclipse.jdt.core.tests.eval.CodeSnippetTest)  Time elapsed: 0.209 s
23:40:57 testRunMethodInAnonymous3 - 1.4(org.eclipse.jdt.core.tests.eval.CodeSnippetTest)  Time elapsed: 0.209 s
23:40:57 testRunMethodInAnonymous4 - 1.4(org.eclipse.jdt.core.tests.eval.CodeSnippetTest)  Time elapsed: 0.207 s
23:40:57 testRunMethodInAnonymous5 - 1.4(org.eclipse.jdt.core.tests.eval.CodeSnippetTest)  Time elapsed: 0.209 s
23:40:57 testRunMethodInAnonymous6 - 1.4(org.eclipse.jdt.core.tests.eval.CodeSnippetTest)  Time elapsed: 0.208 s
23:40:57 testRunMethodInAnonymous7 - 1.4(org.eclipse.jdt.core.tests.eval.CodeSnippetTest)  Time elapsed: 0.208 s
23:40:57 testRunMethodInAnonymous8 - 1.4(org.eclipse.jdt.core.tests.eval.CodeSnippetTest)  Time elapsed: 0.209 s
23:40:57 testExpressionInInnerClass - 1.4(org.eclipse.jdt.core.tests.eval.NegativeCodeSnippetTest)  Time elapsed: 0.002 s
23:40:57 testExtraClosingCurlyBracket - 1.4(org.eclipse.jdt.core.tests.eval.NegativeCodeSnippetTest)  Time elapsed: 0.001 s
23:40:57 testExtraOpenRoundBracket - 1.4(org.eclipse.jdt.core.tests.eval.NegativeCodeSnippetTest)  Time elapsed: 0.002 s
23:40:57 testExtraSemiColonInExpression - 1.4(org.eclipse.jdt.core.tests.eval.NegativeCodeSnippetTest)  Time elapsed: 0.001 s
23:40:57 testInvalidField - 1.4(org.eclipse.jdt.core.tests.eval.NegativeCodeSnippetTest)  Time elapsed: 0.015 s
23:40:57 testInvalidImport - 1.4(org.eclipse.jdt.core.tests.eval.NegativeCodeSnippetTest)  Time elapsed: 0.003 s
23:40:57 testInvalidUseOfThisInSnippet - 1.4(org.eclipse.jdt.core.tests.eval.NegativeCodeSnippetTest)  Time elapsed: 0.003 s
23:40:57 testInvalidUseOfThisInSnippet2 - 1.4(org.eclipse.jdt.core.tests.eval.NegativeCodeSnippetTest)  Time elapsed: 0.002 s
23:40:57 testMissingClosingRoundBracket - 1.4(org.eclipse.jdt.core.tests.eval.NegativeCodeSnippetTest)  Time elapsed: 0.001 s
23:40:57 testMissingDoubleQuote - 1.4(org.eclipse.jdt.core.tests.eval.NegativeCodeSnippetTest)  Time elapsed: 0.002 s
23:40:57 testNonLastExpressionStatement - 1.4(org.eclipse.jdt.core.tests.eval.NegativeCodeSnippetTest)  Time elapsed: 0.001 s
23:40:57 testProblemInExpression - 1.4(org.eclipse.jdt.core.tests.eval.NegativeCodeSnippetTest)  Time elapsed: 0.001 s
23:40:57 testProblemInExpression2 - 1.4(org.eclipse.jdt.core.tests.eval.NegativeCodeSnippetTest)  Time elapsed: 0.002 s
23:40:57 testProblemInInnerClass - 1.4(org.eclipse.jdt.core.tests.eval.NegativeCodeSnippetTest)  Time elapsed: 0.01 s
23:40:57 testProblemInPreviousStatement - 1.4(org.eclipse.jdt.core.tests.eval.NegativeCodeSnippetTest)  Time elapsed: 0.002 s
23:40:57 testProblemInReturnStatement - 1.4(org.eclipse.jdt.core.tests.eval.NegativeCodeSnippetTest)  Time elapsed: 0 s
23:40:57 testRemoveImport - 1.4(org.eclipse.jdt.core.tests.eval.NegativeCodeSnippetTest)  Time elapsed: 0.007 s
23:40:57 testRemoveVariable - 1.4(org.eclipse.jdt.core.tests.eval.NegativeCodeSnippetTest)  Time elapsed: 0.005 s
23:40:57 testUnreachableExpression - 1.4(org.eclipse.jdt.core.tests.eval.NegativeCodeSnippetTest)  Time elapsed: 0.002 s
23:40:57 testUnusedImport - 1.4(org.eclipse.jdt.core.tests.eval.NegativeCodeSnippetTest)  Time elapsed: 0.006 s
23:40:57 testWarning - 1.4(org.eclipse.jdt.core.tests.eval.NegativeCodeSnippetTest)  Time elapsed: 0.003 s
23:40:57 testInitializerProblem - 1.4(org.eclipse.jdt.core.tests.eval.NegativeVariableTest)  Time elapsed: 0.003 s
23:40:57 testUnknownType - 1.4(org.eclipse.jdt.core.tests.eval.NegativeVariableTest)  Time elapsed: 0.002 s
23:40:57 test001 - 1.4(org.eclipse.jdt.core.tests.eval.DebugEvaluationTest)  Time elapsed: 0.161 s
23:40:57 test002 - 1.4(org.eclipse.jdt.core.tests.eval.DebugEvaluationTest)  Time elapsed: 0.131 s
23:40:57 test003 - 1.4(org.eclipse.jdt.core.tests.eval.DebugEvaluationTest)  Time elapsed: 0.023 s
23:40:57 test004 - 1.4(org.eclipse.jdt.core.tests.eval.DebugEvaluationTest)  Time elapsed: 0.124 s
23:40:57 test005 - 1.4(org.eclipse.jdt.core.tests.eval.DebugEvaluationTest)  Time elapsed: 0.134 s
23:40:57 test006 - 1.4(org.eclipse.jdt.core.tests.eval.DebugEvaluationTest)  Time elapsed: 0.135 s
23:40:57 test007 - 1.4(org.eclipse.jdt.core.tests.eval.DebugEvaluationTest)  Time elapsed: 0.145 s
23:40:57 test008 - 1.4(org.eclipse.jdt.core.tests.eval.DebugEvaluationTest)  Time elapsed: 0.046 s
23:40:57 test009 - 1.4(org.eclipse.jdt.core.tests.eval.DebugEvaluationTest)  Time elapsed: 0.129 s
23:40:57 test010 - 1.4(org.eclipse.jdt.core.tests.eval.DebugEvaluationTest)  Time elapsed: 0.134 s
23:40:57 test011 - 1.4(org.eclipse.jdt.core.tests.eval.DebugEvaluationTest)  Time elapsed: 0.132 s
23:40:57 test016 - 1.4(org.eclipse.jdt.core.tests.eval.DebugEvaluationTest)  Time elapsed: 0.231 s
23:40:57 test017 - 1.4(org.eclipse.jdt.core.tests.eval.DebugEvaluationTest)  Time elapsed: 0.022 s
23:40:57 test018 - 1.4(org.eclipse.jdt.core.tests.eval.DebugEvaluationTest)  Time elapsed: 0.245 s
23:40:57 test019 - 1.4(org.eclipse.jdt.core.tests.eval.DebugEvaluationTest)  Time elapsed: 0.031 s
23:40:57 test020 - 1.4(org.eclipse.jdt.core.tests.eval.DebugEvaluationTest)  Time elapsed: 0.05 s
23:40:57 test021 - 1.4(org.eclipse.jdt.core.tests.eval.DebugEvaluationTest)  Time elapsed: 0.277 s
23:40:57 test022 - 1.4(org.eclipse.jdt.core.tests.eval.DebugEvaluationTest)  Time elapsed: 0.262 s
23:40:57 test023 - 1.4(org.eclipse.jdt.core.tests.eval.DebugEvaluationTest)  Time elapsed: 0.261 s
23:40:57 test024 - 1.4(org.eclipse.jdt.core.tests.eval.DebugEvaluationTest)  Time elapsed: 0.077 s
23:40:57 test025 - 1.4(org.eclipse.jdt.core.tests.eval.DebugEvaluationTest)  Time elapsed: 0.265 s
23:40:57 test026 - 1.4(org.eclipse.jdt.core.tests.eval.DebugEvaluationTest)  Time elapsed: 0.144 s
23:40:57 test027 - 1.4(org.eclipse.jdt.core.tests.eval.DebugEvaluationTest)  Time elapsed: 0.155 s
23:40:57 test028 - 1.4(org.eclipse.jdt.core.tests.eval.DebugEvaluationTest)  Time elapsed: 0.153 s
23:40:57 test029 - 1.4(org.eclipse.jdt.core.tests.eval.DebugEvaluationTest)  Time elapsed: 0.457 s
23:40:57 test030 - 1.4(org.eclipse.jdt.core.tests.eval.DebugEvaluationTest)  Time elapsed: 0.127 s
23:40:57 test031 - 1.4(org.eclipse.jdt.core.tests.eval.DebugEvaluationTest)  Time elapsed: 0.13 s
23:40:57 test032 - 1.4(org.eclipse.jdt.core.tests.eval.DebugEvaluationTest)  Time elapsed: 0.023 s
23:40:57 test033 - 1.4(org.eclipse.jdt.core.tests.eval.DebugEvaluationTest)  Time elapsed: 0.134 s
23:40:57 test034 - 1.4(org.eclipse.jdt.core.tests.eval.DebugEvaluationTest)  Time elapsed: 0.129 s
23:40:57 test035 - 1.4(org.eclipse.jdt.core.tests.eval.DebugEvaluationTest)  Time elapsed: 0.129 s
23:40:57 test036 - 1.4(org.eclipse.jdt.core.tests.eval.DebugEvaluationTest)  Time elapsed: 0.131 s
23:40:57 test037 - 1.4(org.eclipse.jdt.core.tests.eval.DebugEvaluationTest)  Time elapsed: 0.127 s
23:40:57 test038 - 1.4(org.eclipse.jdt.core.tests.eval.DebugEvaluationTest)  Time elapsed: 0.126 s
23:40:57 test039 - 1.4(org.eclipse.jdt.core.tests.eval.DebugEvaluationTest)  Time elapsed: 0.128 s
23:40:57 test040 - 1.4(org.eclipse.jdt.core.tests.eval.DebugEvaluationTest)  Time elapsed: 0.127 s
23:40:57 test041 - 1.4(org.eclipse.jdt.core.tests.eval.DebugEvaluationTest)  Time elapsed: 0.127 s
23:40:57 test042 - 1.4(org.eclipse.jdt.core.tests.eval.DebugEvaluationTest)  Time elapsed: 0.127 s
23:40:57 test043 - 1.4(org.eclipse.jdt.core.tests.eval.DebugEvaluationTest)  Time elapsed: 0.126 s
23:40:57 test044 - 1.4(org.eclipse.jdt.core.tests.eval.DebugEvaluationTest)  Time elapsed: 0.126 s
23:40:57 test045 - 1.4(org.eclipse.jdt.core.tests.eval.DebugEvaluationTest)  Time elapsed: 0.127 s
23:40:57 test046 - 1.4(org.eclipse.jdt.core.tests.eval.DebugEvaluationTest)  Time elapsed: 0.128 s
23:40:57 test047 - 1.4(org.eclipse.jdt.core.tests.eval.DebugEvaluationTest)  Time elapsed: 0.126 s
23:40:57 test048 - 1.4(org.eclipse.jdt.core.tests.eval.DebugEvaluationTest)  Time elapsed: 0.125 s
23:40:57 test049 - 1.4(org.eclipse.jdt.core.tests.eval.DebugEvaluationTest)  Time elapsed: 0.126 s
23:40:57 test050 - 1.4(org.eclipse.jdt.core.tests.eval.DebugEvaluationTest)  Time elapsed: 0.126 s
23:40:57 test051 - 1.4(org.eclipse.jdt.core.tests.eval.DebugEvaluationTest)  Time elapsed: 0.127 s
23:40:57 test052 - 1.4(org.eclipse.jdt.core.tests.eval.DebugEvaluationTest)  Time elapsed: 0.125 s
23:40:57 test053 - 1.4(org.eclipse.jdt.core.tests.eval.DebugEvaluationTest)  Time elapsed: 0.126 s
23:40:57 test054 - 1.4(org.eclipse.jdt.core.tests.eval.DebugEvaluationTest)  Time elapsed: 0.126 s
23:40:57 test055 - 1.4(org.eclipse.jdt.core.tests.eval.DebugEvaluationTest)  Time elapsed: 0.126 s
23:40:57 test056 - 1.4(org.eclipse.jdt.core.tests.eval.DebugEvaluationTest)  Time elapsed: 0.127 s
23:40:57 test057 - 1.4(org.eclipse.jdt.core.tests.eval.DebugEvaluationTest)  Time elapsed: 0.127 s
23:40:57 test058 - 1.4(org.eclipse.jdt.core.tests.eval.DebugEvaluationTest)  Time elapsed: 0.127 s
23:40:57 test059 - 1.4(org.eclipse.jdt.core.tests.eval.DebugEvaluationTest)  Time elapsed: 0.128 s
23:40:57 test060 - 1.4(org.eclipse.jdt.core.tests.eval.DebugEvaluationTest)  Time elapsed: 0.127 s
23:40:57 test061 - 1.4(org.eclipse.jdt.core.tests.eval.DebugEvaluationTest)  Time elapsed: 0.131 s
23:40:57 test062 - 1.4(org.eclipse.jdt.core.tests.eval.DebugEvaluationTest)  Time elapsed: 0.125 s
23:40:57 test063 - 1.4(org.eclipse.jdt.core.tests.eval.DebugEvaluationTest)  Time elapsed: 0 s
23:40:57 test065 - 1.4(org.eclipse.jdt.core.tests.eval.DebugEvaluationTest)  Time elapsed: 0 s
23:40:57 test066 - 1.4(org.eclipse.jdt.core.tests.eval.DebugEvaluationTest)  Time elapsed: 0 s
23:40:57 test067 - 1.4(org.eclipse.jdt.core.tests.eval.DebugEvaluationTest)  Time elapsed: 0 s
23:40:57 test068 - 1.4(org.eclipse.jdt.core.tests.eval.DebugEvaluationTest)  Time elapsed: 0 s
23:40:57 test069 - 1.4(org.eclipse.jdt.core.tests.eval.DebugEvaluationTest)  Time elapsed: 0 s
23:40:57 testNegative001 - 1.4(org.eclipse.jdt.core.tests.eval.DebugEvaluationTest)  Time elapsed: 0.018 s
23:40:57 testNegative002 - 1.4(org.eclipse.jdt.core.tests.eval.DebugEvaluationTest)  Time elapsed: 0.018 s
23:40:57 testNegative003 - 1.4(org.eclipse.jdt.core.tests.eval.DebugEvaluationTest)  Time elapsed: 0.018 s
23:40:57 testNegative004 - 1.4(org.eclipse.jdt.core.tests.eval.DebugEvaluationTest)  Time elapsed: 0.008 s
23:40:57 testNegative005 - 1.4(org.eclipse.jdt.core.tests.eval.DebugEvaluationTest)  Time elapsed: 0.008 s
23:40:57 testAllVariables - 1.7(org.eclipse.jdt.core.tests.eval.SanityTestEvaluationContext)  Time elapsed: 0 s
23:40:57 testEvaluate - 1.7(org.eclipse.jdt.core.tests.eval.SanityTestEvaluationContext)  Time elapsed: 0.008 s
23:40:57 testEvaluateImports - 1.7(org.eclipse.jdt.core.tests.eval.SanityTestEvaluationContext)  Time elapsed: 0 s
23:40:57 testEvaluateVariable - 1.7(org.eclipse.jdt.core.tests.eval.SanityTestEvaluationContext)  Time elapsed: 0.006 s
23:40:57 testEvaluateVariables - 1.7(org.eclipse.jdt.core.tests.eval.SanityTestEvaluationContext)  Time elapsed: 0.001 s
23:40:57 testGetSetImports - 1.7(org.eclipse.jdt.core.tests.eval.SanityTestEvaluationContext)  Time elapsed: 0 s
23:40:57 testGetSetPackageName - 1.7(org.eclipse.jdt.core.tests.eval.SanityTestEvaluationContext)  Time elapsed: 0 s
23:40:57 testNewDeleteVariable - 1.7(org.eclipse.jdt.core.tests.eval.SanityTestEvaluationContext)  Time elapsed: 0 s
23:40:57 testGetEvaluationType - 1.7(org.eclipse.jdt.core.tests.eval.SanityTestEvaluationResult)  Time elapsed: 0.004 s
23:40:57 testGetProblems - 1.7(org.eclipse.jdt.core.tests.eval.SanityTestEvaluationResult)  Time elapsed: 0.002 s
23:40:57 testGetValue - 1.7(org.eclipse.jdt.core.tests.eval.SanityTestEvaluationResult)  Time elapsed: 0.002 s
23:40:57 testGetValueDisplayString - 1.7(org.eclipse.jdt.core.tests.eval.SanityTestEvaluationResult)  Time elapsed: 0.003 s
23:40:57 testGetValueTypeName - 1.7(org.eclipse.jdt.core.tests.eval.SanityTestEvaluationResult)  Time elapsed: 0.002 s
23:40:57 testHasErrors - 1.7(org.eclipse.jdt.core.tests.eval.SanityTestEvaluationResult)  Time elapsed: 0.003 s
23:40:57 testHasProblems - 1.7(org.eclipse.jdt.core.tests.eval.SanityTestEvaluationResult)  Time elapsed: 0.003 s
23:40:57 testHasValue - 1.7(org.eclipse.jdt.core.tests.eval.SanityTestEvaluationResult)  Time elapsed: 0.003 s
23:40:57 testHasWarnings - 1.7(org.eclipse.jdt.core.tests.eval.SanityTestEvaluationResult)  Time elapsed: 0.002 s
23:40:57 testAllKindOfValues - 1.7(org.eclipse.jdt.core.tests.eval.VariableTest)  Time elapsed: 0.043 s
23:40:57 testCodeSnippetVarAssign - 1.7(org.eclipse.jdt.core.tests.eval.VariableTest)  Time elapsed: 0.052 s
23:40:57 testCodeSnippetVarRetrieval - 1.7(org.eclipse.jdt.core.tests.eval.VariableTest)  Time elapsed: 0.027 s
23:40:57 testImports - 1.7(org.eclipse.jdt.core.tests.eval.VariableTest)  Time elapsed: 0.026 s
23:40:57 testSeveralVariableInstallations - 1.7(org.eclipse.jdt.core.tests.eval.VariableTest)  Time elapsed: 0.082 s
23:40:57 testBug345334 - 1.7(org.eclipse.jdt.core.tests.eval.CodeSnippetTest)  Time elapsed: 0.004 s
23:40:57 testBug464656 - 1.7(org.eclipse.jdt.core.tests.eval.CodeSnippetTest)  Time elapsed: 0 s
23:40:57 testCheckedException - 1.7(org.eclipse.jdt.core.tests.eval.CodeSnippetTest)  Time elapsed: 0.003 s
23:40:57 testDiamond - 1.7(org.eclipse.jdt.core.tests.eval.CodeSnippetTest)  Time elapsed: 0.006 s
23:40:57 testEmptyStatement - 1.7(org.eclipse.jdt.core.tests.eval.CodeSnippetTest)  Time elapsed: 0.004 s
23:40:57 testEvaluateEmptyImport - 1.7(org.eclipse.jdt.core.tests.eval.CodeSnippetTest)  Time elapsed: 0 s
23:40:57 testEvaluateExistingPackageAndNonExistingTypeImports - 1.7(org.eclipse.jdt.core.tests.eval.CodeSnippetTest)  Time elapsed: 0 s
23:40:57 testEvaluateNonExistingPackageAndExistingTypeImports - 1.7(org.eclipse.jdt.core.tests.eval.CodeSnippetTest)  Time elapsed: 0.001 s
23:40:57 testEvaluateNonExistingPackageImport - 1.7(org.eclipse.jdt.core.tests.eval.CodeSnippetTest)  Time elapsed: 0 s
23:40:57 testEvaluateNonExistingTypeImport - 1.7(org.eclipse.jdt.core.tests.eval.CodeSnippetTest)  Time elapsed: 0 s
23:40:57 testEvaluateValidPackageAndTypeImports - 1.7(org.eclipse.jdt.core.tests.eval.CodeSnippetTest)  Time elapsed: 0 s
23:40:57 testEvaluateValidPackageImport - 1.7(org.eclipse.jdt.core.tests.eval.CodeSnippetTest)  Time elapsed: 0 s
23:40:57 testEvaluateValidTypeImport - 1.7(org.eclipse.jdt.core.tests.eval.CodeSnippetTest)  Time elapsed: 0 s
23:40:57 testFinallyError - 1.7(org.eclipse.jdt.core.tests.eval.CodeSnippetTest)  Time elapsed: 0.003 s
23:40:57 testFinallyOneBlock - 1.7(org.eclipse.jdt.core.tests.eval.CodeSnippetTest)  Time elapsed: 0.003 s
23:40:57 testFinallyTwoBlock - 1.7(org.eclipse.jdt.core.tests.eval.CodeSnippetTest)  Time elapsed: 0.003 s
23:40:57 testFor89632 - 1.7(org.eclipse.jdt.core.tests.eval.CodeSnippetTest)  Time elapsed: 0.008 s
23:40:57 testFreeReturnAnonymous - 1.7(org.eclipse.jdt.core.tests.eval.CodeSnippetTest)  Time elapsed: 0.004 s
23:40:57 testFreeReturnClassDeclaration - 1.7(org.eclipse.jdt.core.tests.eval.CodeSnippetTest)  Time elapsed: 0.004 s
23:40:57 testFreeReturnExpression - 1.7(org.eclipse.jdt.core.tests.eval.CodeSnippetTest)  Time elapsed: 0.002 s
23:40:57 testFreeReturnInteger - 1.7(org.eclipse.jdt.core.tests.eval.CodeSnippetTest)  Time elapsed: 0.002 s
23:40:57 testFreeReturnLocalVar - 1.7(org.eclipse.jdt.core.tests.eval.CodeSnippetTest)  Time elapsed: 0.003 s
23:40:57 testFreeReturnStatement - 1.7(org.eclipse.jdt.core.tests.eval.CodeSnippetTest)  Time elapsed: 0.002 s
23:40:57 testImportPackage - 1.7(org.eclipse.jdt.core.tests.eval.CodeSnippetTest)  Time elapsed: 0.005 s
23:40:57 testImportType - 1.7(org.eclipse.jdt.core.tests.eval.CodeSnippetTest)  Time elapsed: 0.005 s
23:40:57 testImportTypeAndPackage - 1.7(org.eclipse.jdt.core.tests.eval.CodeSnippetTest)  Time elapsed: 0.004 s
23:40:57 testInnerClassAnonymous - 1.7(org.eclipse.jdt.core.tests.eval.CodeSnippetTest)  Time elapsed: 0.004 s
23:40:57 testInnerClassNamed - 1.7(org.eclipse.jdt.core.tests.eval.CodeSnippetTest)  Time elapsed: 0.003 s
23:40:57 testReturnDisplayStringBoolean - 1.7(org.eclipse.jdt.core.tests.eval.CodeSnippetTest)  Time elapsed: 0.003 s
23:40:57 testReturnDisplayStringCharacter - 1.7(org.eclipse.jdt.core.tests.eval.CodeSnippetTest)  Time elapsed: 0.002 s
23:40:57 testReturnDisplayStringDouble - 1.7(org.eclipse.jdt.core.tests.eval.CodeSnippetTest)  Time elapsed: 0.002 s
23:40:57 testReturnDisplayStringEmptyCodeSnippet - 1.7(org.eclipse.jdt.core.tests.eval.CodeSnippetTest)  Time elapsed: 0.002 s
23:40:57 testReturnDisplayStringFloat - 1.7(org.eclipse.jdt.core.tests.eval.CodeSnippetTest)  Time elapsed: 0.002 s
23:40:57 testReturnDisplayStringInteger - 1.7(org.eclipse.jdt.core.tests.eval.CodeSnippetTest)  Time elapsed: 0.003 s
23:40:57 testReturnDisplayStringLong - 1.7(org.eclipse.jdt.core.tests.eval.CodeSnippetTest)  Time elapsed: 0.002 s
23:40:57 testReturnDisplayStringNoExplicitReturnedValue - 1.7(org.eclipse.jdt.core.tests.eval.CodeSnippetTest)  Time elapsed: 0.003 s
23:40:57 testReturnDisplayStringObject - 1.7(org.eclipse.jdt.core.tests.eval.CodeSnippetTest)  Time elapsed: 0.003 s
23:40:57 testReturnDisplayStringShort - 1.7(org.eclipse.jdt.core.tests.eval.CodeSnippetTest)  Time elapsed: 0.002 s
23:40:57 testReturnDisplayStringString - 1.7(org.eclipse.jdt.core.tests.eval.CodeSnippetTest)  Time elapsed: 0.003 s
23:40:57 testReturnDisplayStringVoid - 1.7(org.eclipse.jdt.core.tests.eval.CodeSnippetTest)  Time elapsed: 0.003 s
23:40:57 testReturnTypeBoolean - 1.7(org.eclipse.jdt.core.tests.eval.CodeSnippetTest)  Time elapsed: 0.002 s
23:40:57 testReturnTypeBooleanArray - 1.7(org.eclipse.jdt.core.tests.eval.CodeSnippetTest)  Time elapsed: 0.003 s
23:40:57 testReturnTypeBooleanObject - 1.7(org.eclipse.jdt.core.tests.eval.CodeSnippetTest)  Time elapsed: 0.002 s
23:40:57 testReturnTypeChar - 1.7(org.eclipse.jdt.core.tests.eval.CodeSnippetTest)  Time elapsed: 0.005 s
23:40:57 testReturnTypeCharArray - 1.7(org.eclipse.jdt.core.tests.eval.CodeSnippetTest)  Time elapsed: 0.002 s
23:40:57 testReturnTypeCharacterObject - 1.7(org.eclipse.jdt.core.tests.eval.CodeSnippetTest)  Time elapsed: 0.003 s
23:40:57 testReturnTypeDouble - 1.7(org.eclipse.jdt.core.tests.eval.CodeSnippetTest)  Time elapsed: 0.002 s
23:40:57 testReturnTypeDoubleArray - 1.7(org.eclipse.jdt.core.tests.eval.CodeSnippetTest)  Time elapsed: 0.002 s
23:40:57 testReturnTypeDoubleObject - 1.7(org.eclipse.jdt.core.tests.eval.CodeSnippetTest)  Time elapsed: 0.003 s
23:40:57 testReturnTypeEmptyCodeSnippet - 1.7(org.eclipse.jdt.core.tests.eval.CodeSnippetTest)  Time elapsed: 0.002 s
23:40:57 testReturnTypeFloat - 1.7(org.eclipse.jdt.core.tests.eval.CodeSnippetTest)  Time elapsed: 0.002 s
23:40:57 testReturnTypeFloatArray - 1.7(org.eclipse.jdt.core.tests.eval.CodeSnippetTest)  Time elapsed: 0.002 s
23:40:57 testReturnTypeFloatObject - 1.7(org.eclipse.jdt.core.tests.eval.CodeSnippetTest)  Time elapsed: 0.003 s
23:40:57 testReturnTypeInt - 1.7(org.eclipse.jdt.core.tests.eval.CodeSnippetTest)  Time elapsed: 0.003 s
23:40:57 testReturnTypeIntegerObject - 1.7(org.eclipse.jdt.core.tests.eval.CodeSnippetTest)  Time elapsed: 0.002 s
23:40:57 testReturnTypeLong - 1.7(org.eclipse.jdt.core.tests.eval.CodeSnippetTest)  Time elapsed: 0.003 s
23:40:57 testReturnTypeLongArray - 1.7(org.eclipse.jdt.core.tests.eval.CodeSnippetTest)  Time elapsed: 0.002 s
23:40:57 testReturnTypeLongObject - 1.7(org.eclipse.jdt.core.tests.eval.CodeSnippetTest)  Time elapsed: 0.003 s
23:40:57 testReturnTypeNoExplicitReturnedValue - 1.7(org.eclipse.jdt.core.tests.eval.CodeSnippetTest)  Time elapsed: 0.003 s
23:40:57 testReturnTypeObject - 1.7(org.eclipse.jdt.core.tests.eval.CodeSnippetTest)  Time elapsed: 0.002 s
23:40:57 testReturnTypeObjectArray - 1.7(org.eclipse.jdt.core.tests.eval.CodeSnippetTest)  Time elapsed: 0.004 s
23:40:57 testReturnTypeShort - 1.7(org.eclipse.jdt.core.tests.eval.CodeSnippetTest)  Time elapsed: 0.002 s
23:40:57 testReturnTypeShortArray - 1.7(org.eclipse.jdt.core.tests.eval.CodeSnippetTest)  Time elapsed: 0.003 s
23:40:57 testReturnTypeShortObject - 1.7(org.eclipse.jdt.core.tests.eval.CodeSnippetTest)  Time elapsed: 0.003 s
23:40:57 testReturnTypeString - 1.7(org.eclipse.jdt.core.tests.eval.CodeSnippetTest)  Time elapsed: 0.003 s
23:40:57 testReturnTypeStringArray - 1.7(org.eclipse.jdt.core.tests.eval.CodeSnippetTest)  Time elapsed: 0.002 s
23:40:57 testReturnTypeVoid - 1.7(org.eclipse.jdt.core.tests.eval.CodeSnippetTest)  Time elapsed: 0.003 s
23:40:57 testReturnTypesIntArray - 1.7(org.eclipse.jdt.core.tests.eval.CodeSnippetTest)  Time elapsed: 0.003 s
23:40:57 testRunMethodInAnonymous - 1.7(org.eclipse.jdt.core.tests.eval.CodeSnippetTest)  Time elapsed: 0.207 s
23:40:57 testRunMethodInAnonymous2 - 1.7(org.eclipse.jdt.core.tests.eval.CodeSnippetTest)  Time elapsed: 0.207 s
23:40:57 testRunMethodInAnonymous3 - 1.7(org.eclipse.jdt.core.tests.eval.CodeSnippetTest)  Time elapsed: 0.206 s
23:40:57 testRunMethodInAnonymous4 - 1.7(org.eclipse.jdt.core.tests.eval.CodeSnippetTest)  Time elapsed: 0.287 s
23:40:57 testRunMethodInAnonymous5 - 1.7(org.eclipse.jdt.core.tests.eval.CodeSnippetTest)  Time elapsed: 0.206 s
23:40:57 testRunMethodInAnonymous6 - 1.7(org.eclipse.jdt.core.tests.eval.CodeSnippetTest)  Time elapsed: 0.206 s
23:40:57 testRunMethodInAnonymous7 - 1.7(org.eclipse.jdt.core.tests.eval.CodeSnippetTest)  Time elapsed: 0.208 s
23:40:57 testRunMethodInAnonymous8 - 1.7(org.eclipse.jdt.core.tests.eval.CodeSnippetTest)  Time elapsed: 0.207 s
23:40:57 testExpressionInInnerClass - 1.7(org.eclipse.jdt.core.tests.eval.NegativeCodeSnippetTest)  Time elapsed: 0.002 s
23:40:57 testExtraClosingCurlyBracket - 1.7(org.eclipse.jdt.core.tests.eval.NegativeCodeSnippetTest)  Time elapsed: 0.001 s
23:40:57 testExtraOpenRoundBracket - 1.7(org.eclipse.jdt.core.tests.eval.NegativeCodeSnippetTest)  Time elapsed: 0.001 s
23:40:57 testExtraSemiColonInExpression - 1.7(org.eclipse.jdt.core.tests.eval.NegativeCodeSnippetTest)  Time elapsed: 0.001 s
23:40:57 testInvalidField - 1.7(org.eclipse.jdt.core.tests.eval.NegativeCodeSnippetTest)  Time elapsed: 0.002 s
23:40:57 testInvalidImport - 1.7(org.eclipse.jdt.core.tests.eval.NegativeCodeSnippetTest)  Time elapsed: 0.003 s
23:40:57 testInvalidUseOfThisInSnippet - 1.7(org.eclipse.jdt.core.tests.eval.NegativeCodeSnippetTest)  Time elapsed: 0.002 s
23:40:57 testInvalidUseOfThisInSnippet2 - 1.7(org.eclipse.jdt.core.tests.eval.NegativeCodeSnippetTest)  Time elapsed: 0 s
23:40:57 testMissingClosingRoundBracket - 1.7(org.eclipse.jdt.core.tests.eval.NegativeCodeSnippetTest)  Time elapsed: 0.001 s
23:40:57 testMissingDoubleQuote - 1.7(org.eclipse.jdt.core.tests.eval.NegativeCodeSnippetTest)  Time elapsed: 0.001 s
23:40:57 testNonLastExpressionStatement - 1.7(org.eclipse.jdt.core.tests.eval.NegativeCodeSnippetTest)  Time elapsed: 0.001 s
23:40:57 testProblemInExpression - 1.7(org.eclipse.jdt.core.tests.eval.NegativeCodeSnippetTest)  Time elapsed: 0 s
23:40:57 testProblemInExpression2 - 1.7(org.eclipse.jdt.core.tests.eval.NegativeCodeSnippetTest)  Time elapsed: 0.001 s
23:40:57 testProblemInInnerClass - 1.7(org.eclipse.jdt.core.tests.eval.NegativeCodeSnippetTest)  Time elapsed: 0.083 s
23:40:57 testProblemInPreviousStatement - 1.7(org.eclipse.jdt.core.tests.eval.NegativeCodeSnippetTest)  Time elapsed: 0.001 s
23:40:57 testProblemInReturnStatement - 1.7(org.eclipse.jdt.core.tests.eval.NegativeCodeSnippetTest)  Time elapsed: 0.001 s
23:40:57 testRemoveImport - 1.7(org.eclipse.jdt.core.tests.eval.NegativeCodeSnippetTest)  Time elapsed: 0.012 s
23:40:57 testRemoveVariable - 1.7(org.eclipse.jdt.core.tests.eval.NegativeCodeSnippetTest)  Time elapsed: 0.007 s
23:40:57 testUnreachableExpression - 1.7(org.eclipse.jdt.core.tests.eval.NegativeCodeSnippetTest)  Time elapsed: 0.002 s
23:40:57 testUnusedImport - 1.7(org.eclipse.jdt.core.tests.eval.NegativeCodeSnippetTest)  Time elapsed: 0.009 s
23:40:57 testWarning - 1.7(org.eclipse.jdt.core.tests.eval.NegativeCodeSnippetTest)  Time elapsed: 0.004 s
23:40:57 testInitializerProblem - 1.7(org.eclipse.jdt.core.tests.eval.NegativeVariableTest)  Time elapsed: 0.004 s
23:40:57 testUnknownType - 1.7(org.eclipse.jdt.core.tests.eval.NegativeVariableTest)  Time elapsed: 0.002 s
23:40:57 test001 - 1.7(org.eclipse.jdt.core.tests.eval.DebugEvaluationTest)  Time elapsed: 0.135 s
23:40:57 test002 - 1.7(org.eclipse.jdt.core.tests.eval.DebugEvaluationTest)  Time elapsed: 0.135 s
23:40:57 test003 - 1.7(org.eclipse.jdt.core.tests.eval.DebugEvaluationTest)  Time elapsed: 0.031 s
23:40:57 test004 - 1.7(org.eclipse.jdt.core.tests.eval.DebugEvaluationTest)  Time elapsed: 0.12 s
23:40:57 test005 - 1.7(org.eclipse.jdt.core.tests.eval.DebugEvaluationTest)  Time elapsed: 0.132 s
23:40:57 test006 - 1.7(org.eclipse.jdt.core.tests.eval.DebugEvaluationTest)  Time elapsed: 0.136 s
23:40:57 test007 - 1.7(org.eclipse.jdt.core.tests.eval.DebugEvaluationTest)  Time elapsed: 0.132 s
23:40:57 test008 - 1.7(org.eclipse.jdt.core.tests.eval.DebugEvaluationTest)  Time elapsed: 0.129 s
23:40:57 test009 - 1.7(org.eclipse.jdt.core.tests.eval.DebugEvaluationTest)  Time elapsed: 0.118 s
23:40:57 test010 - 1.7(org.eclipse.jdt.core.tests.eval.DebugEvaluationTest)  Time elapsed: 0.128 s
23:40:57 test011 - 1.7(org.eclipse.jdt.core.tests.eval.DebugEvaluationTest)  Time elapsed: 0.123 s
23:40:57 test016 - 1.7(org.eclipse.jdt.core.tests.eval.DebugEvaluationTest)  Time elapsed: 0.223 s
23:40:57 test017 - 1.7(org.eclipse.jdt.core.tests.eval.DebugEvaluationTest)  Time elapsed: 0.118 s
23:40:57 test018 - 1.7(org.eclipse.jdt.core.tests.eval.DebugEvaluationTest)  Time elapsed: 0.239 s
23:40:57 test019 - 1.7(org.eclipse.jdt.core.tests.eval.DebugEvaluationTest)  Time elapsed: 0.025 s
23:40:57 test020 - 1.7(org.eclipse.jdt.core.tests.eval.DebugEvaluationTest)  Time elapsed: 0.131 s
23:40:57 test021 - 1.7(org.eclipse.jdt.core.tests.eval.DebugEvaluationTest)  Time elapsed: 0.241 s
23:40:57 test022 - 1.7(org.eclipse.jdt.core.tests.eval.DebugEvaluationTest)  Time elapsed: 0.241 s
23:40:57 test023 - 1.7(org.eclipse.jdt.core.tests.eval.DebugEvaluationTest)  Time elapsed: 0.247 s
23:40:57 test024 - 1.7(org.eclipse.jdt.core.tests.eval.DebugEvaluationTest)  Time elapsed: 0.248 s
23:40:57 test025 - 1.7(org.eclipse.jdt.core.tests.eval.DebugEvaluationTest)  Time elapsed: 0.238 s
23:40:57 test026 - 1.7(org.eclipse.jdt.core.tests.eval.DebugEvaluationTest)  Time elapsed: 0.129 s
23:40:57 test027 - 1.7(org.eclipse.jdt.core.tests.eval.DebugEvaluationTest)  Time elapsed: 0.131 s
23:40:57 test028 - 1.7(org.eclipse.jdt.core.tests.eval.DebugEvaluationTest)  Time elapsed: 0.137 s
23:40:57 test029 - 1.7(org.eclipse.jdt.core.tests.eval.DebugEvaluationTest)  Time elapsed: 0.145 s
23:40:57 test030 - 1.7(org.eclipse.jdt.core.tests.eval.DebugEvaluationTest)  Time elapsed: 0.134 s
23:40:57 test031 - 1.7(org.eclipse.jdt.core.tests.eval.DebugEvaluationTest)  Time elapsed: 0.131 s
23:40:57 test032 - 1.7(org.eclipse.jdt.core.tests.eval.DebugEvaluationTest)  Time elapsed: 0.026 s
23:40:57 test033 - 1.7(org.eclipse.jdt.core.tests.eval.DebugEvaluationTest)  Time elapsed: 0.133 s
23:40:57 test034 - 1.7(org.eclipse.jdt.core.tests.eval.DebugEvaluationTest)  Time elapsed: 0.13 s
23:40:57 test035 - 1.7(org.eclipse.jdt.core.tests.eval.DebugEvaluationTest)  Time elapsed: 0.129 s
23:40:57 test036 - 1.7(org.eclipse.jdt.core.tests.eval.DebugEvaluationTest)  Time elapsed: 0.128 s
23:40:57 test037 - 1.7(org.eclipse.jdt.core.tests.eval.DebugEvaluationTest)  Time elapsed: 0.132 s
23:40:57 test038 - 1.7(org.eclipse.jdt.core.tests.eval.DebugEvaluationTest)  Time elapsed: 0.129 s
23:40:57 test039 - 1.7(org.eclipse.jdt.core.tests.eval.DebugEvaluationTest)  Time elapsed: 0.129 s
23:40:57 test040 - 1.7(org.eclipse.jdt.core.tests.eval.DebugEvaluationTest)  Time elapsed: 0.129 s
23:40:57 test041 - 1.7(org.eclipse.jdt.core.tests.eval.DebugEvaluationTest)  Time elapsed: 0.129 s
23:40:57 test042 - 1.7(org.eclipse.jdt.core.tests.eval.DebugEvaluationTest)  Time elapsed: 0.129 s
23:40:57 test043 - 1.7(org.eclipse.jdt.core.tests.eval.DebugEvaluationTest)  Time elapsed: 0.136 s
23:40:57 test044 - 1.7(org.eclipse.jdt.core.tests.eval.DebugEvaluationTest)  Time elapsed: 0.129 s
23:40:57 test045 - 1.7(org.eclipse.jdt.core.tests.eval.DebugEvaluationTest)  Time elapsed: 0.13 s
23:40:57 test046 - 1.7(org.eclipse.jdt.core.tests.eval.DebugEvaluationTest)  Time elapsed: 0.129 s
23:40:57 test047 - 1.7(org.eclipse.jdt.core.tests.eval.DebugEvaluationTest)  Time elapsed: 0.129 s
23:40:57 test048 - 1.7(org.eclipse.jdt.core.tests.eval.DebugEvaluationTest)  Time elapsed: 0.129 s
23:40:57 test049 - 1.7(org.eclipse.jdt.core.tests.eval.DebugEvaluationTest)  Time elapsed: 0.131 s
23:40:57 test050 - 1.7(org.eclipse.jdt.core.tests.eval.DebugEvaluationTest)  Time elapsed: 0.13 s
23:40:57 test051 - 1.7(org.eclipse.jdt.core.tests.eval.DebugEvaluationTest)  Time elapsed: 0.129 s
23:40:57 test052 - 1.7(org.eclipse.jdt.core.tests.eval.DebugEvaluationTest)  Time elapsed: 0.129 s
23:40:57 test053 - 1.7(org.eclipse.jdt.core.tests.eval.DebugEvaluationTest)  Time elapsed: 0.128 s
23:40:57 test054 - 1.7(org.eclipse.jdt.core.tests.eval.DebugEvaluationTest)  Time elapsed: 0.128 s
23:40:57 test055 - 1.7(org.eclipse.jdt.core.tests.eval.DebugEvaluationTest)  Time elapsed: 0.128 s
23:40:57 test056 - 1.7(org.eclipse.jdt.core.tests.eval.DebugEvaluationTest)  Time elapsed: 0.132 s
23:40:57 test057 - 1.7(org.eclipse.jdt.core.tests.eval.DebugEvaluationTest)  Time elapsed: 0.129 s
23:40:57 test058 - 1.7(org.eclipse.jdt.core.tests.eval.DebugEvaluationTest)  Time elapsed: 0.129 s
23:40:57 test059 - 1.7(org.eclipse.jdt.core.tests.eval.DebugEvaluationTest)  Time elapsed: 0.129 s
23:40:57 test060 - 1.7(org.eclipse.jdt.core.tests.eval.DebugEvaluationTest)  Time elapsed: 0.13 s
23:40:57 test061 - 1.7(org.eclipse.jdt.core.tests.eval.DebugEvaluationTest)  Time elapsed: 0.129 s
23:40:57 test062 - 1.7(org.eclipse.jdt.core.tests.eval.DebugEvaluationTest)  Time elapsed: 0.13 s
23:40:57 test063 - 1.7(org.eclipse.jdt.core.tests.eval.DebugEvaluationTest)  Time elapsed: 0.131 s
23:40:57 test065 - 1.7(org.eclipse.jdt.core.tests.eval.DebugEvaluationTest)  Time elapsed: 0.132 s
23:40:57 test066 - 1.7(org.eclipse.jdt.core.tests.eval.DebugEvaluationTest)  Time elapsed: 0.128 s
23:40:57 test067 - 1.7(org.eclipse.jdt.core.tests.eval.DebugEvaluationTest)  Time elapsed: 0.132 s
23:40:57 test068 - 1.7(org.eclipse.jdt.core.tests.eval.DebugEvaluationTest)  Time elapsed: 0.025 s
23:40:57 test069 - 1.7(org.eclipse.jdt.core.tests.eval.DebugEvaluationTest)  Time elapsed: 0.025 s
23:40:57 testNegative001 - 1.7(org.eclipse.jdt.core.tests.eval.DebugEvaluationTest)  Time elapsed: 0.018 s
23:40:57 testNegative002 - 1.7(org.eclipse.jdt.core.tests.eval.DebugEvaluationTest)  Time elapsed: 0.022 s
23:40:57 testNegative003 - 1.7(org.eclipse.jdt.core.tests.eval.DebugEvaluationTest)  Time elapsed: 0.024 s
23:40:57 testNegative004 - 1.7(org.eclipse.jdt.core.tests.eval.DebugEvaluationTest)  Time elapsed: 0.012 s
23:40:57 testNegative005 - 1.7(org.eclipse.jdt.core.tests.eval.DebugEvaluationTest)  Time elapsed: 0.01 s
23:40:57 testAllVariables - 1.8(org.eclipse.jdt.core.tests.eval.SanityTestEvaluationContext)  Time elapsed: 0 s
23:40:57 testEvaluate - 1.8(org.eclipse.jdt.core.tests.eval.SanityTestEvaluationContext)  Time elapsed: 0.01 s
23:40:57 testEvaluateImports - 1.8(org.eclipse.jdt.core.tests.eval.SanityTestEvaluationContext)  Time elapsed: 0 s
23:40:57 testEvaluateVariable - 1.8(org.eclipse.jdt.core.tests.eval.SanityTestEvaluationContext)  Time elapsed: 0.008 s
23:40:57 testEvaluateVariables - 1.8(org.eclipse.jdt.core.tests.eval.SanityTestEvaluationContext)  Time elapsed: 0.001 s
23:40:57 testGetSetImports - 1.8(org.eclipse.jdt.core.tests.eval.SanityTestEvaluationContext)  Time elapsed: 0 s
23:40:57 testGetSetPackageName - 1.8(org.eclipse.jdt.core.tests.eval.SanityTestEvaluationContext)  Time elapsed: 0 s
23:40:57 testNewDeleteVariable - 1.8(org.eclipse.jdt.core.tests.eval.SanityTestEvaluationContext)  Time elapsed: 0 s
23:40:57 testGetEvaluationType - 1.8(org.eclipse.jdt.core.tests.eval.SanityTestEvaluationResult)  Time elapsed: 0.004 s
23:40:57 testGetProblems - 1.8(org.eclipse.jdt.core.tests.eval.SanityTestEvaluationResult)  Time elapsed: 0.003 s
23:40:57 testGetValue - 1.8(org.eclipse.jdt.core.tests.eval.SanityTestEvaluationResult)  Time elapsed: 0.003 s
23:40:57 testGetValueDisplayString - 1.8(org.eclipse.jdt.core.tests.eval.SanityTestEvaluationResult)  Time elapsed: 0.003 s
23:40:57 testGetValueTypeName - 1.8(org.eclipse.jdt.core.tests.eval.SanityTestEvaluationResult)  Time elapsed: 0.003 s
23:40:57 testHasErrors - 1.8(org.eclipse.jdt.core.tests.eval.SanityTestEvaluationResult)  Time elapsed: 0.003 s
23:40:57 testHasProblems - 1.8(org.eclipse.jdt.core.tests.eval.SanityTestEvaluationResult)  Time elapsed: 0.003 s
23:40:57 testHasValue - 1.8(org.eclipse.jdt.core.tests.eval.SanityTestEvaluationResult)  Time elapsed: 0.002 s
23:40:57 testHasWarnings - 1.8(org.eclipse.jdt.core.tests.eval.SanityTestEvaluationResult)  Time elapsed: 0.003 s
23:40:57 testAllKindOfValues - 1.8(org.eclipse.jdt.core.tests.eval.VariableTest)  Time elapsed: 0.05 s
23:40:57 testCodeSnippetVarAssign - 1.8(org.eclipse.jdt.core.tests.eval.VariableTest)  Time elapsed: 0.07 s
23:40:57 testCodeSnippetVarRetrieval - 1.8(org.eclipse.jdt.core.tests.eval.VariableTest)  Time elapsed: 0.033 s
23:40:57 testImports - 1.8(org.eclipse.jdt.core.tests.eval.VariableTest)  Time elapsed: 0.026 s
23:40:57 testSeveralVariableInstallations - 1.8(org.eclipse.jdt.core.tests.eval.VariableTest)  Time elapsed: 0.084 s
23:40:57 testBug345334 - 1.8(org.eclipse.jdt.core.tests.eval.CodeSnippetTest)  Time elapsed: 0.004 s
23:40:57 testBug464656 - 1.8(org.eclipse.jdt.core.tests.eval.CodeSnippetTest)  Time elapsed: 0.029 s
23:40:57 testCheckedException - 1.8(org.eclipse.jdt.core.tests.eval.CodeSnippetTest)  Time elapsed: 0.041 s
23:40:57 testDiamond - 1.8(org.eclipse.jdt.core.tests.eval.CodeSnippetTest)  Time elapsed: 0.007 s
23:40:57 testEmptyStatement - 1.8(org.eclipse.jdt.core.tests.eval.CodeSnippetTest)  Time elapsed: 0.004 s
23:40:57 testEvaluateEmptyImport - 1.8(org.eclipse.jdt.core.tests.eval.CodeSnippetTest)  Time elapsed: 0 s
23:40:57 testEvaluateExistingPackageAndNonExistingTypeImports - 1.8(org.eclipse.jdt.core.tests.eval.CodeSnippetTest)  Time elapsed: 0 s
23:40:57 testEvaluateNonExistingPackageAndExistingTypeImports - 1.8(org.eclipse.jdt.core.tests.eval.CodeSnippetTest)  Time elapsed: 0 s
23:40:57 testEvaluateNonExistingPackageImport - 1.8(org.eclipse.jdt.core.tests.eval.CodeSnippetTest)  Time elapsed: 0 s
23:40:57 testEvaluateNonExistingTypeImport - 1.8(org.eclipse.jdt.core.tests.eval.CodeSnippetTest)  Time elapsed: 0 s
23:40:57 testEvaluateValidPackageAndTypeImports - 1.8(org.eclipse.jdt.core.tests.eval.CodeSnippetTest)  Time elapsed: 0 s
23:40:57 testEvaluateValidPackageImport - 1.8(org.eclipse.jdt.core.tests.eval.CodeSnippetTest)  Time elapsed: 0 s
23:40:57 testEvaluateValidTypeImport - 1.8(org.eclipse.jdt.core.tests.eval.CodeSnippetTest)  Time elapsed: 0 s
23:40:57 testFinallyError - 1.8(org.eclipse.jdt.core.tests.eval.CodeSnippetTest)  Time elapsed: 0.004 s
23:40:57 testFinallyOneBlock - 1.8(org.eclipse.jdt.core.tests.eval.CodeSnippetTest)  Time elapsed: 0.003 s
23:40:57 testFinallyTwoBlock - 1.8(org.eclipse.jdt.core.tests.eval.CodeSnippetTest)  Time elapsed: 0.003 s
23:40:57 testFor89632 - 1.8(org.eclipse.jdt.core.tests.eval.CodeSnippetTest)  Time elapsed: 0.008 s
23:40:57 testFreeReturnAnonymous - 1.8(org.eclipse.jdt.core.tests.eval.CodeSnippetTest)  Time elapsed: 0.004 s
23:40:57 testFreeReturnClassDeclaration - 1.8(org.eclipse.jdt.core.tests.eval.CodeSnippetTest)  Time elapsed: 0.003 s
23:40:57 testFreeReturnExpression - 1.8(org.eclipse.jdt.core.tests.eval.CodeSnippetTest)  Time elapsed: 0.003 s
23:40:57 testFreeReturnInteger - 1.8(org.eclipse.jdt.core.tests.eval.CodeSnippetTest)  Time elapsed: 0.003 s
23:40:57 testFreeReturnLocalVar - 1.8(org.eclipse.jdt.core.tests.eval.CodeSnippetTest)  Time elapsed: 0.003 s
23:40:57 testFreeReturnStatement - 1.8(org.eclipse.jdt.core.tests.eval.CodeSnippetTest)  Time elapsed: 0.002 s
23:40:57 testImportPackage - 1.8(org.eclipse.jdt.core.tests.eval.CodeSnippetTest)  Time elapsed: 0.005 s
23:40:57 testImportType - 1.8(org.eclipse.jdt.core.tests.eval.CodeSnippetTest)  Time elapsed: 0.006 s
23:40:57 testImportTypeAndPackage - 1.8(org.eclipse.jdt.core.tests.eval.CodeSnippetTest)  Time elapsed: 0.005 s
23:40:57 testInnerClassAnonymous - 1.8(org.eclipse.jdt.core.tests.eval.CodeSnippetTest)  Time elapsed: 0.004 s
23:40:57 testInnerClassNamed - 1.8(org.eclipse.jdt.core.tests.eval.CodeSnippetTest)  Time elapsed: 0.004 s
23:40:57 testReturnDisplayStringBoolean - 1.8(org.eclipse.jdt.core.tests.eval.CodeSnippetTest)  Time elapsed: 0.007 s
23:40:57 testReturnDisplayStringCharacter - 1.8(org.eclipse.jdt.core.tests.eval.CodeSnippetTest)  Time elapsed: 0.002 s
23:40:57 testReturnDisplayStringDouble - 1.8(org.eclipse.jdt.core.tests.eval.CodeSnippetTest)  Time elapsed: 0.003 s
23:40:57 testReturnDisplayStringEmptyCodeSnippet - 1.8(org.eclipse.jdt.core.tests.eval.CodeSnippetTest)  Time elapsed: 0.002 s
23:40:57 testReturnDisplayStringFloat - 1.8(org.eclipse.jdt.core.tests.eval.CodeSnippetTest)  Time elapsed: 0.002 s
23:40:57 testReturnDisplayStringInteger - 1.8(org.eclipse.jdt.core.tests.eval.CodeSnippetTest)  Time elapsed: 0.003 s
23:40:57 testReturnDisplayStringLong - 1.8(org.eclipse.jdt.core.tests.eval.CodeSnippetTest)  Time elapsed: 0.003 s
23:40:57 testReturnDisplayStringNoExplicitReturnedValue - 1.8(org.eclipse.jdt.core.tests.eval.CodeSnippetTest)  Time elapsed: 0.003 s
23:40:57 testReturnDisplayStringObject - 1.8(org.eclipse.jdt.core.tests.eval.CodeSnippetTest)  Time elapsed: 0.004 s
23:40:57 testReturnDisplayStringShort - 1.8(org.eclipse.jdt.core.tests.eval.CodeSnippetTest)  Time elapsed: 0.002 s
23:40:57 testReturnDisplayStringString - 1.8(org.eclipse.jdt.core.tests.eval.CodeSnippetTest)  Time elapsed: 0.003 s
23:40:57 testReturnDisplayStringVoid - 1.8(org.eclipse.jdt.core.tests.eval.CodeSnippetTest)  Time elapsed: 0.004 s
23:40:57 testReturnTypeBoolean - 1.8(org.eclipse.jdt.core.tests.eval.CodeSnippetTest)  Time elapsed: 0.002 s
23:40:57 testReturnTypeBooleanArray - 1.8(org.eclipse.jdt.core.tests.eval.CodeSnippetTest)  Time elapsed: 0.003 s
23:40:57 testReturnTypeBooleanObject - 1.8(org.eclipse.jdt.core.tests.eval.CodeSnippetTest)  Time elapsed: 0.003 s
23:40:57 testReturnTypeChar - 1.8(org.eclipse.jdt.core.tests.eval.CodeSnippetTest)  Time elapsed: 0.002 s
23:40:57 testReturnTypeCharArray - 1.8(org.eclipse.jdt.core.tests.eval.CodeSnippetTest)  Time elapsed: 0.002 s
23:40:57 testReturnTypeCharacterObject - 1.8(org.eclipse.jdt.core.tests.eval.CodeSnippetTest)  Time elapsed: 0.003 s
23:40:57 testReturnTypeDouble - 1.8(org.eclipse.jdt.core.tests.eval.CodeSnippetTest)  Time elapsed: 0.002 s
23:40:57 testReturnTypeDoubleArray - 1.8(org.eclipse.jdt.core.tests.eval.CodeSnippetTest)  Time elapsed: 0.003 s
23:40:57 testReturnTypeDoubleObject - 1.8(org.eclipse.jdt.core.tests.eval.CodeSnippetTest)  Time elapsed: 0.003 s
23:40:57 testReturnTypeEmptyCodeSnippet - 1.8(org.eclipse.jdt.core.tests.eval.CodeSnippetTest)  Time elapsed: 0.002 s
23:40:57 testReturnTypeFloat - 1.8(org.eclipse.jdt.core.tests.eval.CodeSnippetTest)  Time elapsed: 0.004 s
23:40:57 testReturnTypeFloatArray - 1.8(org.eclipse.jdt.core.tests.eval.CodeSnippetTest)  Time elapsed: 0.002 s
23:40:57 testReturnTypeFloatObject - 1.8(org.eclipse.jdt.core.tests.eval.CodeSnippetTest)  Time elapsed: 0.003 s
23:40:57 testReturnTypeInt - 1.8(org.eclipse.jdt.core.tests.eval.CodeSnippetTest)  Time elapsed: 0.003 s
23:40:57 testReturnTypeIntegerObject - 1.8(org.eclipse.jdt.core.tests.eval.CodeSnippetTest)  Time elapsed: 0.003 s
23:40:57 testReturnTypeLong - 1.8(org.eclipse.jdt.core.tests.eval.CodeSnippetTest)  Time elapsed: 0.003 s
23:40:57 testReturnTypeLongArray - 1.8(org.eclipse.jdt.core.tests.eval.CodeSnippetTest)  Time elapsed: 0.002 s
23:40:57 testReturnTypeLongObject - 1.8(org.eclipse.jdt.core.tests.eval.CodeSnippetTest)  Time elapsed: 0.004 s
23:40:57 testReturnTypeNoExplicitReturnedValue - 1.8(org.eclipse.jdt.core.tests.eval.CodeSnippetTest)  Time elapsed: 0.003 s
23:40:57 testReturnTypeObject - 1.8(org.eclipse.jdt.core.tests.eval.CodeSnippetTest)  Time elapsed: 0.002 s
23:40:57 testReturnTypeObjectArray - 1.8(org.eclipse.jdt.core.tests.eval.CodeSnippetTest)  Time elapsed: 0.003 s
23:40:57 testReturnTypeShort - 1.8(org.eclipse.jdt.core.tests.eval.CodeSnippetTest)  Time elapsed: 0.002 s
23:40:57 testReturnTypeShortArray - 1.8(org.eclipse.jdt.core.tests.eval.CodeSnippetTest)  Time elapsed: 0.003 s
23:40:57 testReturnTypeShortObject - 1.8(org.eclipse.jdt.core.tests.eval.CodeSnippetTest)  Time elapsed: 0.003 s
23:40:57 testReturnTypeString - 1.8(org.eclipse.jdt.core.tests.eval.CodeSnippetTest)  Time elapsed: 0.003 s
23:40:57 testReturnTypeStringArray - 1.8(org.eclipse.jdt.core.tests.eval.CodeSnippetTest)  Time elapsed: 0.003 s
23:40:57 testReturnTypeVoid - 1.8(org.eclipse.jdt.core.tests.eval.CodeSnippetTest)  Time elapsed: 0.003 s
23:40:57 testReturnTypesIntArray - 1.8(org.eclipse.jdt.core.tests.eval.CodeSnippetTest)  Time elapsed: 0.003 s
23:40:57 testRunMethodInAnonymous - 1.8(org.eclipse.jdt.core.tests.eval.CodeSnippetTest)  Time elapsed: 0.207 s
23:40:57 testRunMethodInAnonymous2 - 1.8(org.eclipse.jdt.core.tests.eval.CodeSnippetTest)  Time elapsed: 0.206 s
23:40:57 testRunMethodInAnonymous3 - 1.8(org.eclipse.jdt.core.tests.eval.CodeSnippetTest)  Time elapsed: 0.207 s
23:40:57 testRunMethodInAnonymous4 - 1.8(org.eclipse.jdt.core.tests.eval.CodeSnippetTest)  Time elapsed: 0.207 s
23:40:57 testRunMethodInAnonymous5 - 1.8(org.eclipse.jdt.core.tests.eval.CodeSnippetTest)  Time elapsed: 0.206 s
23:40:57 testRunMethodInAnonymous6 - 1.8(org.eclipse.jdt.core.tests.eval.CodeSnippetTest)  Time elapsed: 0.206 s
23:40:57 testRunMethodInAnonymous7 - 1.8(org.eclipse.jdt.core.tests.eval.CodeSnippetTest)  Time elapsed: 0.207 s
23:40:57 testRunMethodInAnonymous8 - 1.8(org.eclipse.jdt.core.tests.eval.CodeSnippetTest)  Time elapsed: 0.206 s
23:40:57 testExpressionInInnerClass - 1.8(org.eclipse.jdt.core.tests.eval.NegativeCodeSnippetTest)  Time elapsed: 0.001 s
23:40:57 testExtraClosingCurlyBracket - 1.8(org.eclipse.jdt.core.tests.eval.NegativeCodeSnippetTest)  Time elapsed: 0.001 s
23:40:57 testExtraOpenRoundBracket - 1.8(org.eclipse.jdt.core.tests.eval.NegativeCodeSnippetTest)  Time elapsed: 0.001 s
23:40:57 testExtraSemiColonInExpression - 1.8(org.eclipse.jdt.core.tests.eval.NegativeCodeSnippetTest)  Time elapsed: 0.001 s
23:40:57 testInvalidField - 1.8(org.eclipse.jdt.core.tests.eval.NegativeCodeSnippetTest)  Time elapsed: 0.001 s
23:40:57 testInvalidImport - 1.8(org.eclipse.jdt.core.tests.eval.NegativeCodeSnippetTest)  Time elapsed: 0.003 s
23:40:57 testInvalidUseOfThisInSnippet - 1.8(org.eclipse.jdt.core.tests.eval.NegativeCodeSnippetTest)  Time elapsed: 0.001 s
23:40:57 testInvalidUseOfThisInSnippet2 - 1.8(org.eclipse.jdt.core.tests.eval.NegativeCodeSnippetTest)  Time elapsed: 0.001 s
23:40:57 testMissingClosingRoundBracket - 1.8(org.eclipse.jdt.core.tests.eval.NegativeCodeSnippetTest)  Time elapsed: 0.001 s
23:40:57 testMissingDoubleQuote - 1.8(org.eclipse.jdt.core.tests.eval.NegativeCodeSnippetTest)  Time elapsed: 0.001 s
23:40:57 testNonLastExpressionStatement - 1.8(org.eclipse.jdt.core.tests.eval.NegativeCodeSnippetTest)  Time elapsed: 0 s
23:40:57 testProblemInExpression - 1.8(org.eclipse.jdt.core.tests.eval.NegativeCodeSnippetTest)  Time elapsed: 0.001 s
23:40:57 testProblemInExpression2 - 1.8(org.eclipse.jdt.core.tests.eval.NegativeCodeSnippetTest)  Time elapsed: 0.001 s
23:40:57 testProblemInInnerClass - 1.8(org.eclipse.jdt.core.tests.eval.NegativeCodeSnippetTest)  Time elapsed: 0.005 s
23:40:57 testProblemInPreviousStatement - 1.8(org.eclipse.jdt.core.tests.eval.NegativeCodeSnippetTest)  Time elapsed: 0.001 s
23:40:57 testProblemInReturnStatement - 1.8(org.eclipse.jdt.core.tests.eval.NegativeCodeSnippetTest)  Time elapsed: 0.001 s
23:40:57 testRemoveImport - 1.8(org.eclipse.jdt.core.tests.eval.NegativeCodeSnippetTest)  Time elapsed: 0.006 s
23:40:57 testRemoveVariable - 1.8(org.eclipse.jdt.core.tests.eval.NegativeCodeSnippetTest)  Time elapsed: 0.005 s
23:40:57 testUnreachableExpression - 1.8(org.eclipse.jdt.core.tests.eval.NegativeCodeSnippetTest)  Time elapsed: 0.001 s
23:40:57 testUnusedImport - 1.8(org.eclipse.jdt.core.tests.eval.NegativeCodeSnippetTest)  Time elapsed: 0.006 s
23:40:57 testWarning - 1.8(org.eclipse.jdt.core.tests.eval.NegativeCodeSnippetTest)  Time elapsed: 0.003 s
23:40:57 testInitializerProblem - 1.8(org.eclipse.jdt.core.tests.eval.NegativeVariableTest)  Time elapsed: 0.002 s
23:40:57 testUnknownType - 1.8(org.eclipse.jdt.core.tests.eval.NegativeVariableTest)  Time elapsed: 0.002 s
23:40:57 test001 - 1.8(org.eclipse.jdt.core.tests.eval.DebugEvaluationTest)  Time elapsed: 0.131 s
23:40:57 test002 - 1.8(org.eclipse.jdt.core.tests.eval.DebugEvaluationTest)  Time elapsed: 0.13 s
23:40:57 test003 - 1.8(org.eclipse.jdt.core.tests.eval.DebugEvaluationTest)  Time elapsed: 0.025 s
23:40:57 test004 - 1.8(org.eclipse.jdt.core.tests.eval.DebugEvaluationTest)  Time elapsed: 0.119 s
23:40:57 test005 - 1.8(org.eclipse.jdt.core.tests.eval.DebugEvaluationTest)  Time elapsed: 0.131 s
23:40:57 test006 - 1.8(org.eclipse.jdt.core.tests.eval.DebugEvaluationTest)  Time elapsed: 0.131 s
23:40:57 test007 - 1.8(org.eclipse.jdt.core.tests.eval.DebugEvaluationTest)  Time elapsed: 0.129 s
23:40:57 test008 - 1.8(org.eclipse.jdt.core.tests.eval.DebugEvaluationTest)  Time elapsed: 0.127 s
23:40:57 test009 - 1.8(org.eclipse.jdt.core.tests.eval.DebugEvaluationTest)  Time elapsed: 0.118 s
23:40:57 test010 - 1.8(org.eclipse.jdt.core.tests.eval.DebugEvaluationTest)  Time elapsed: 0.127 s
23:40:57 test011 - 1.8(org.eclipse.jdt.core.tests.eval.DebugEvaluationTest)  Time elapsed: 0.123 s
23:40:57 test016 - 1.8(org.eclipse.jdt.core.tests.eval.DebugEvaluationTest)  Time elapsed: 0.223 s
23:40:57 test017 - 1.8(org.eclipse.jdt.core.tests.eval.DebugEvaluationTest)  Time elapsed: 0.114 s
23:40:57 test018 - 1.8(org.eclipse.jdt.core.tests.eval.DebugEvaluationTest)  Time elapsed: 0.234 s
23:40:57 test019 - 1.8(org.eclipse.jdt.core.tests.eval.DebugEvaluationTest)  Time elapsed: 0.02 s
23:40:57 test020 - 1.8(org.eclipse.jdt.core.tests.eval.DebugEvaluationTest)  Time elapsed: 0.128 s
23:40:57 test021 - 1.8(org.eclipse.jdt.core.tests.eval.DebugEvaluationTest)  Time elapsed: 0.238 s
23:40:57 test022 - 1.8(org.eclipse.jdt.core.tests.eval.DebugEvaluationTest)  Time elapsed: 0.241 s
23:40:57 test023 - 1.8(org.eclipse.jdt.core.tests.eval.DebugEvaluationTest)  Time elapsed: 0.248 s
23:40:57 test024 - 1.8(org.eclipse.jdt.core.tests.eval.DebugEvaluationTest)  Time elapsed: 0.244 s
23:40:57 test025 - 1.8(org.eclipse.jdt.core.tests.eval.DebugEvaluationTest)  Time elapsed: 0.237 s
23:40:57 test026 - 1.8(org.eclipse.jdt.core.tests.eval.DebugEvaluationTest)  Time elapsed: 0.127 s
23:40:57 test027 - 1.8(org.eclipse.jdt.core.tests.eval.DebugEvaluationTest)  Time elapsed: 0.129 s
23:40:57 test028 - 1.8(org.eclipse.jdt.core.tests.eval.DebugEvaluationTest)  Time elapsed: 0.127 s
23:40:57 test029 - 1.8(org.eclipse.jdt.core.tests.eval.DebugEvaluationTest)  Time elapsed: 0.125 s
23:40:57 test030 - 1.8(org.eclipse.jdt.core.tests.eval.DebugEvaluationTest)  Time elapsed: 0.126 s
23:40:57 test031 - 1.8(org.eclipse.jdt.core.tests.eval.DebugEvaluationTest)  Time elapsed: 0.129 s
23:40:57 test032 - 1.8(org.eclipse.jdt.core.tests.eval.DebugEvaluationTest)  Time elapsed: 0.024 s
23:40:57 test033 - 1.8(org.eclipse.jdt.core.tests.eval.DebugEvaluationTest)  Time elapsed: 0.136 s
23:40:57 test034 - 1.8(org.eclipse.jdt.core.tests.eval.DebugEvaluationTest)  Time elapsed: 0.129 s
23:40:57 test035 - 1.8(org.eclipse.jdt.core.tests.eval.DebugEvaluationTest)  Time elapsed: 0.131 s
23:40:57 test036 - 1.8(org.eclipse.jdt.core.tests.eval.DebugEvaluationTest)  Time elapsed: 0.129 s
23:40:57 test037 - 1.8(org.eclipse.jdt.core.tests.eval.DebugEvaluationTest)  Time elapsed: 0.128 s
23:40:57 test038 - 1.8(org.eclipse.jdt.core.tests.eval.DebugEvaluationTest)  Time elapsed: 1.87 s
23:40:57 test039 - 1.8(org.eclipse.jdt.core.tests.eval.DebugEvaluationTest)  Time elapsed: 0.137 s
23:40:57 test040 - 1.8(org.eclipse.jdt.core.tests.eval.DebugEvaluationTest)  Time elapsed: 0.131 s
23:40:57 test041 - 1.8(org.eclipse.jdt.core.tests.eval.DebugEvaluationTest)  Time elapsed: 0.129 s
23:40:57 test042 - 1.8(org.eclipse.jdt.core.tests.eval.DebugEvaluationTest)  Time elapsed: 0.04 s
23:40:57 test043 - 1.8(org.eclipse.jdt.core.tests.eval.DebugEvaluationTest)  Time elapsed: 0.134 s
23:40:57 test044 - 1.8(org.eclipse.jdt.core.tests.eval.DebugEvaluationTest)  Time elapsed: 0.13 s
23:40:57 test045 - 1.8(org.eclipse.jdt.core.tests.eval.DebugEvaluationTest)  Time elapsed: 0.133 s
23:40:57 test046 - 1.8(org.eclipse.jdt.core.tests.eval.DebugEvaluationTest)  Time elapsed: 0.135 s
23:40:57 test047 - 1.8(org.eclipse.jdt.core.tests.eval.DebugEvaluationTest)  Time elapsed: 0.148 s
23:40:57 test048 - 1.8(org.eclipse.jdt.core.tests.eval.DebugEvaluationTest)  Time elapsed: 0.132 s
23:40:57 test049 - 1.8(org.eclipse.jdt.core.tests.eval.DebugEvaluationTest)  Time elapsed: 0.127 s
23:40:57 test050 - 1.8(org.eclipse.jdt.core.tests.eval.DebugEvaluationTest)  Time elapsed: 0.127 s
23:40:57 test051 - 1.8(org.eclipse.jdt.core.tests.eval.DebugEvaluationTest)  Time elapsed: 0.126 s
23:40:57 test052 - 1.8(org.eclipse.jdt.core.tests.eval.DebugEvaluationTest)  Time elapsed: 0.129 s
23:40:57 test053 - 1.8(org.eclipse.jdt.core.tests.eval.DebugEvaluationTest)  Time elapsed: 0.127 s
23:40:57 test054 - 1.8(org.eclipse.jdt.core.tests.eval.DebugEvaluationTest)  Time elapsed: 0.127 s
23:40:57 test055 - 1.8(org.eclipse.jdt.core.tests.eval.DebugEvaluationTest)  Time elapsed: 0.128 s
23:40:57 test056 - 1.8(org.eclipse.jdt.core.tests.eval.DebugEvaluationTest)  Time elapsed: 0.132 s
23:40:57 test057 - 1.8(org.eclipse.jdt.core.tests.eval.DebugEvaluationTest)  Time elapsed: 0.132 s
23:40:57 test058 - 1.8(org.eclipse.jdt.core.tests.eval.DebugEvaluationTest)  Time elapsed: 0.135 s
23:40:57 test059 - 1.8(org.eclipse.jdt.core.tests.eval.DebugEvaluationTest)  Time elapsed: 0.13 s
23:40:57 test060 - 1.8(org.eclipse.jdt.core.tests.eval.DebugEvaluationTest)  Time elapsed: 0.127 s
23:40:57 test061 - 1.8(org.eclipse.jdt.core.tests.eval.DebugEvaluationTest)  Time elapsed: 0.127 s
23:40:57 test062 - 1.8(org.eclipse.jdt.core.tests.eval.DebugEvaluationTest)  Time elapsed: 0.126 s
23:40:57 test063 - 1.8(org.eclipse.jdt.core.tests.eval.DebugEvaluationTest)  Time elapsed: 0.13 s
23:40:57 test065 - 1.8(org.eclipse.jdt.core.tests.eval.DebugEvaluationTest)  Time elapsed: 0.13 s
23:40:57 test066 - 1.8(org.eclipse.jdt.core.tests.eval.DebugEvaluationTest)  Time elapsed: 0.133 s
23:40:57 test067 - 1.8(org.eclipse.jdt.core.tests.eval.DebugEvaluationTest)  Time elapsed: 0.134 s
23:40:57 test068 - 1.8(org.eclipse.jdt.core.tests.eval.DebugEvaluationTest)  Time elapsed: 0.027 s
23:40:57 test069 - 1.8(org.eclipse.jdt.core.tests.eval.DebugEvaluationTest)  Time elapsed: 0.025 s
23:40:57 testNegative001 - 1.8(org.eclipse.jdt.core.tests.eval.DebugEvaluationTest)  Time elapsed: 0.022 s
23:40:57 testNegative002 - 1.8(org.eclipse.jdt.core.tests.eval.DebugEvaluationTest)  Time elapsed: 0.02 s
23:40:57 testNegative003 - 1.8(org.eclipse.jdt.core.tests.eval.DebugEvaluationTest)  Time elapsed: 0.024 s
23:40:57 testNegative004 - 1.8(org.eclipse.jdt.core.tests.eval.DebugEvaluationTest)  Time elapsed: 0.01 s
23:40:57 testNegative005 - 1.8(org.eclipse.jdt.core.tests.eval.DebugEvaluationTest)  Time elapsed: 0.009 s
23:40:57 testAllVariables - 11(org.eclipse.jdt.core.tests.eval.SanityTestEvaluationContext)  Time elapsed: 0 s
23:40:57 testEvaluate - 11(org.eclipse.jdt.core.tests.eval.SanityTestEvaluationContext)  Time elapsed: 0.01 s
23:40:57 testEvaluateImports - 11(org.eclipse.jdt.core.tests.eval.SanityTestEvaluationContext)  Time elapsed: 0 s
23:40:57 testEvaluateVariable - 11(org.eclipse.jdt.core.tests.eval.SanityTestEvaluationContext)  Time elapsed: 0.007 s
23:40:57 testEvaluateVariables - 11(org.eclipse.jdt.core.tests.eval.SanityTestEvaluationContext)  Time elapsed: 0.002 s
23:40:57 testGetSetImports - 11(org.eclipse.jdt.core.tests.eval.SanityTestEvaluationContext)  Time elapsed: 0 s
23:40:57 testGetSetPackageName - 11(org.eclipse.jdt.core.tests.eval.SanityTestEvaluationContext)  Time elapsed: 0 s
23:40:57 testNewDeleteVariable - 11(org.eclipse.jdt.core.tests.eval.SanityTestEvaluationContext)  Time elapsed: 0 s
23:40:57 testGetEvaluationType - 11(org.eclipse.jdt.core.tests.eval.SanityTestEvaluationResult)  Time elapsed: 0.005 s
23:40:57 testGetProblems - 11(org.eclipse.jdt.core.tests.eval.SanityTestEvaluationResult)  Time elapsed: 0.003 s
23:40:57 testGetValue - 11(org.eclipse.jdt.core.tests.eval.SanityTestEvaluationResult)  Time elapsed: 0.004 s
23:40:57 testGetValueDisplayString - 11(org.eclipse.jdt.core.tests.eval.SanityTestEvaluationResult)  Time elapsed: 0.003 s
23:40:57 testGetValueTypeName - 11(org.eclipse.jdt.core.tests.eval.SanityTestEvaluationResult)  Time elapsed: 0.003 s
23:40:57 testHasErrors - 11(org.eclipse.jdt.core.tests.eval.SanityTestEvaluationResult)  Time elapsed: 0.004 s
23:40:57 testHasProblems - 11(org.eclipse.jdt.core.tests.eval.SanityTestEvaluationResult)  Time elapsed: 0.003 s
23:40:57 testHasValue - 11(org.eclipse.jdt.core.tests.eval.SanityTestEvaluationResult)  Time elapsed: 0.005 s
23:40:57 testHasWarnings - 11(org.eclipse.jdt.core.tests.eval.SanityTestEvaluationResult)  Time elapsed: 0.006 s
23:40:57 testAllKindOfValues - 11(org.eclipse.jdt.core.tests.eval.VariableTest)  Time elapsed: 0.053 s
23:40:57 testCodeSnippetVarAssign - 11(org.eclipse.jdt.core.tests.eval.VariableTest)  Time elapsed: 0.074 s
23:40:57 testCodeSnippetVarRetrieval - 11(org.eclipse.jdt.core.tests.eval.VariableTest)  Time elapsed: 0.036 s
23:40:57 testImports - 11(org.eclipse.jdt.core.tests.eval.VariableTest)  Time elapsed: 0.029 s
23:40:57 testSeveralVariableInstallations - 11(org.eclipse.jdt.core.tests.eval.VariableTest)  Time elapsed: 0.105 s
23:40:57 testBug345334 - 11(org.eclipse.jdt.core.tests.eval.CodeSnippetTest)  Time elapsed: 0.005 s
23:40:57 testBug464656 - 11(org.eclipse.jdt.core.tests.eval.CodeSnippetTest)  Time elapsed: 0.03 s
23:40:57 testCheckedException - 11(org.eclipse.jdt.core.tests.eval.CodeSnippetTest)  Time elapsed: 0.005 s
23:40:57 testDiamond - 11(org.eclipse.jdt.core.tests.eval.CodeSnippetTest)  Time elapsed: 0.006 s
23:40:57 testEmptyStatement - 11(org.eclipse.jdt.core.tests.eval.CodeSnippetTest)  Time elapsed: 0.004 s
23:40:57 testEvaluateEmptyImport - 11(org.eclipse.jdt.core.tests.eval.CodeSnippetTest)  Time elapsed: 0 s
23:40:57 testEvaluateExistingPackageAndNonExistingTypeImports - 11(org.eclipse.jdt.core.tests.eval.CodeSnippetTest)  Time elapsed: 0 s
23:40:57 testEvaluateNonExistingPackageAndExistingTypeImports - 11(org.eclipse.jdt.core.tests.eval.CodeSnippetTest)  Time elapsed: 0 s
23:40:57 testEvaluateNonExistingPackageImport - 11(org.eclipse.jdt.core.tests.eval.CodeSnippetTest)  Time elapsed: 0 s
23:40:57 testEvaluateNonExistingTypeImport - 11(org.eclipse.jdt.core.tests.eval.CodeSnippetTest)  Time elapsed: 0 s
23:40:57 testEvaluateValidPackageAndTypeImports - 11(org.eclipse.jdt.core.tests.eval.CodeSnippetTest)  Time elapsed: 0 s
23:40:57 testEvaluateValidPackageImport - 11(org.eclipse.jdt.core.tests.eval.CodeSnippetTest)  Time elapsed: 0 s
23:40:57 testEvaluateValidTypeImport - 11(org.eclipse.jdt.core.tests.eval.CodeSnippetTest)  Time elapsed: 0 s
23:40:57 testFinallyError - 11(org.eclipse.jdt.core.tests.eval.CodeSnippetTest)  Time elapsed: 0.005 s
23:40:57 testFinallyOneBlock - 11(org.eclipse.jdt.core.tests.eval.CodeSnippetTest)  Time elapsed: 0.004 s
23:40:57 testFinallyTwoBlock - 11(org.eclipse.jdt.core.tests.eval.CodeSnippetTest)  Time elapsed: 0.003 s
23:40:57 testFor89632 - 11(org.eclipse.jdt.core.tests.eval.CodeSnippetTest)  Time elapsed: 0.008 s
23:40:57 testFreeReturnAnonymous - 11(org.eclipse.jdt.core.tests.eval.CodeSnippetTest)  Time elapsed: 0.005 s
23:40:57 testFreeReturnClassDeclaration - 11(org.eclipse.jdt.core.tests.eval.CodeSnippetTest)  Time elapsed: 0.004 s
23:40:57 testFreeReturnExpression - 11(org.eclipse.jdt.core.tests.eval.CodeSnippetTest)  Time elapsed: 0.003 s
23:40:57 testFreeReturnInteger - 11(org.eclipse.jdt.core.tests.eval.CodeSnippetTest)  Time elapsed: 0.003 s
23:40:57 testFreeReturnLocalVar - 11(org.eclipse.jdt.core.tests.eval.CodeSnippetTest)  Time elapsed: 0.003 s
23:40:57 testFreeReturnStatement - 11(org.eclipse.jdt.core.tests.eval.CodeSnippetTest)  Time elapsed: 0.004 s
23:40:57 testImportPackage - 11(org.eclipse.jdt.core.tests.eval.CodeSnippetTest)  Time elapsed: 0.005 s
23:40:57 testImportType - 11(org.eclipse.jdt.core.tests.eval.CodeSnippetTest)  Time elapsed: 0.006 s
23:40:57 testImportTypeAndPackage - 11(org.eclipse.jdt.core.tests.eval.CodeSnippetTest)  Time elapsed: 0.006 s
23:40:57 testInnerClassAnonymous - 11(org.eclipse.jdt.core.tests.eval.CodeSnippetTest)  Time elapsed: 0.005 s
23:40:57 testInnerClassNamed - 11(org.eclipse.jdt.core.tests.eval.CodeSnippetTest)  Time elapsed: 0.004 s
23:40:57 testReturnDisplayStringBoolean - 11(org.eclipse.jdt.core.tests.eval.CodeSnippetTest)  Time elapsed: 0.003 s
23:40:57 testReturnDisplayStringCharacter - 11(org.eclipse.jdt.core.tests.eval.CodeSnippetTest)  Time elapsed: 0.003 s
23:40:57 testReturnDisplayStringDouble - 11(org.eclipse.jdt.core.tests.eval.CodeSnippetTest)  Time elapsed: 0.003 s
23:40:57 testReturnDisplayStringEmptyCodeSnippet - 11(org.eclipse.jdt.core.tests.eval.CodeSnippetTest)  Time elapsed: 0.002 s
23:40:57 testReturnDisplayStringFloat - 11(org.eclipse.jdt.core.tests.eval.CodeSnippetTest)  Time elapsed: 0.003 s
23:40:57 testReturnDisplayStringInteger - 11(org.eclipse.jdt.core.tests.eval.CodeSnippetTest)  Time elapsed: 0.003 s
23:40:57 testReturnDisplayStringLong - 11(org.eclipse.jdt.core.tests.eval.CodeSnippetTest)  Time elapsed: 0.003 s
23:40:57 testReturnDisplayStringNoExplicitReturnedValue - 11(org.eclipse.jdt.core.tests.eval.CodeSnippetTest)  Time elapsed: 0.004 s
23:40:57 testReturnDisplayStringObject - 11(org.eclipse.jdt.core.tests.eval.CodeSnippetTest)  Time elapsed: 0.004 s
23:40:57 testReturnDisplayStringShort - 11(org.eclipse.jdt.core.tests.eval.CodeSnippetTest)  Time elapsed: 0.004 s
23:40:57 testReturnDisplayStringString - 11(org.eclipse.jdt.core.tests.eval.CodeSnippetTest)  Time elapsed: 0.003 s
23:40:57 testReturnDisplayStringVoid - 11(org.eclipse.jdt.core.tests.eval.CodeSnippetTest)  Time elapsed: 0.004 s
23:40:57 testReturnTypeBoolean - 11(org.eclipse.jdt.core.tests.eval.CodeSnippetTest)  Time elapsed: 0.003 s
23:40:57 testReturnTypeBooleanArray - 11(org.eclipse.jdt.core.tests.eval.CodeSnippetTest)  Time elapsed: 0.003 s
23:40:57 testReturnTypeBooleanObject - 11(org.eclipse.jdt.core.tests.eval.CodeSnippetTest)  Time elapsed: 0.003 s
23:40:57 testReturnTypeChar - 11(org.eclipse.jdt.core.tests.eval.CodeSnippetTest)  Time elapsed: 0.003 s
23:40:57 testReturnTypeCharArray - 11(org.eclipse.jdt.core.tests.eval.CodeSnippetTest)  Time elapsed: 0.003 s
23:40:57 testReturnTypeCharacterObject - 11(org.eclipse.jdt.core.tests.eval.CodeSnippetTest)  Time elapsed: 0.003 s
23:40:57 testReturnTypeDouble - 11(org.eclipse.jdt.core.tests.eval.CodeSnippetTest)  Time elapsed: 0.003 s
23:40:57 testReturnTypeDoubleArray - 11(org.eclipse.jdt.core.tests.eval.CodeSnippetTest)  Time elapsed: 0.003 s
23:40:57 testReturnTypeDoubleObject - 11(org.eclipse.jdt.core.tests.eval.CodeSnippetTest)  Time elapsed: 0.003 s
23:40:57 testReturnTypeEmptyCodeSnippet - 11(org.eclipse.jdt.core.tests.eval.CodeSnippetTest)  Time elapsed: 0.003 s
23:40:57 testReturnTypeFloat - 11(org.eclipse.jdt.core.tests.eval.CodeSnippetTest)  Time elapsed: 0.002 s
23:40:57 testReturnTypeFloatArray - 11(org.eclipse.jdt.core.tests.eval.CodeSnippetTest)  Time elapsed: 0.003 s
23:40:57 testReturnTypeFloatObject - 11(org.eclipse.jdt.core.tests.eval.CodeSnippetTest)  Time elapsed: 0.004 s
23:40:57 testReturnTypeInt - 11(org.eclipse.jdt.core.tests.eval.CodeSnippetTest)  Time elapsed: 0.003 s
23:40:57 testReturnTypeIntegerObject - 11(org.eclipse.jdt.core.tests.eval.CodeSnippetTest)  Time elapsed: 0.003 s
23:40:57 testReturnTypeLong - 11(org.eclipse.jdt.core.tests.eval.CodeSnippetTest)  Time elapsed: 0.003 s
23:40:57 testReturnTypeLongArray - 11(org.eclipse.jdt.core.tests.eval.CodeSnippetTest)  Time elapsed: 0.006 s
23:40:57 testReturnTypeLongObject - 11(org.eclipse.jdt.core.tests.eval.CodeSnippetTest)  Time elapsed: 0.005 s
23:40:57 testReturnTypeNoExplicitReturnedValue - 11(org.eclipse.jdt.core.tests.eval.CodeSnippetTest)  Time elapsed: 0.003 s
23:40:57 testReturnTypeObject - 11(org.eclipse.jdt.core.tests.eval.CodeSnippetTest)  Time elapsed: 0.003 s
23:40:57 testReturnTypeObjectArray - 11(org.eclipse.jdt.core.tests.eval.CodeSnippetTest)  Time elapsed: 0.003 s
23:40:57 testReturnTypeShort - 11(org.eclipse.jdt.core.tests.eval.CodeSnippetTest)  Time elapsed: 0.003 s
23:40:57 testReturnTypeShortArray - 11(org.eclipse.jdt.core.tests.eval.CodeSnippetTest)  Time elapsed: 0.003 s
23:40:57 testReturnTypeShortObject - 11(org.eclipse.jdt.core.tests.eval.CodeSnippetTest)  Time elapsed: 0.003 s
23:40:57 testReturnTypeString - 11(org.eclipse.jdt.core.tests.eval.CodeSnippetTest)  Time elapsed: 0.004 s
23:40:57 testReturnTypeStringArray - 11(org.eclipse.jdt.core.tests.eval.CodeSnippetTest)  Time elapsed: 0.003 s
23:40:57 testReturnTypeVoid - 11(org.eclipse.jdt.core.tests.eval.CodeSnippetTest)  Time elapsed: 0.004 s
23:40:57 testReturnTypesIntArray - 11(org.eclipse.jdt.core.tests.eval.CodeSnippetTest)  Time elapsed: 0.003 s
23:40:57 testRunMethodInAnonymous - 11(org.eclipse.jdt.core.tests.eval.CodeSnippetTest)  Time elapsed: 0.206 s
23:40:57 testRunMethodInAnonymous2 - 11(org.eclipse.jdt.core.tests.eval.CodeSnippetTest)  Time elapsed: 0.207 s
23:40:57 testRunMethodInAnonymous3 - 11(org.eclipse.jdt.core.tests.eval.CodeSnippetTest)  Time elapsed: 0.208 s
23:40:57 testRunMethodInAnonymous4 - 11(org.eclipse.jdt.core.tests.eval.CodeSnippetTest)  Time elapsed: 0.207 s
23:40:57 testRunMethodInAnonymous5 - 11(org.eclipse.jdt.core.tests.eval.CodeSnippetTest)  Time elapsed: 0.208 s
23:40:57 testRunMethodInAnonymous6 - 11(org.eclipse.jdt.core.tests.eval.CodeSnippetTest)  Time elapsed: 0.208 s
23:40:57 testRunMethodInAnonymous7 - 11(org.eclipse.jdt.core.tests.eval.CodeSnippetTest)  Time elapsed: 0.208 s
23:40:57 testRunMethodInAnonymous8 - 11(org.eclipse.jdt.core.tests.eval.CodeSnippetTest)  Time elapsed: 0.209 s
23:40:57 testExpressionInInnerClass - 11(org.eclipse.jdt.core.tests.eval.NegativeCodeSnippetTest)  Time elapsed: 0.002 s
23:40:57 testExtraClosingCurlyBracket - 11(org.eclipse.jdt.core.tests.eval.NegativeCodeSnippetTest)  Time elapsed: 0.003 s
23:40:57 testExtraOpenRoundBracket - 11(org.eclipse.jdt.core.tests.eval.NegativeCodeSnippetTest)  Time elapsed: 0.001 s
23:40:57 testExtraSemiColonInExpression - 11(org.eclipse.jdt.core.tests.eval.NegativeCodeSnippetTest)  Time elapsed: 0.001 s
23:40:57 testInvalidField - 11(org.eclipse.jdt.core.tests.eval.NegativeCodeSnippetTest)  Time elapsed: 0.003 s
23:40:57 testInvalidImport - 11(org.eclipse.jdt.core.tests.eval.NegativeCodeSnippetTest)  Time elapsed: 0.003 s
23:40:57 testInvalidUseOfThisInSnippet - 11(org.eclipse.jdt.core.tests.eval.NegativeCodeSnippetTest)  Time elapsed: 0.002 s
23:40:57 testInvalidUseOfThisInSnippet2 - 11(org.eclipse.jdt.core.tests.eval.NegativeCodeSnippetTest)  Time elapsed: 0.002 s
23:40:57 testMissingClosingRoundBracket - 11(org.eclipse.jdt.core.tests.eval.NegativeCodeSnippetTest)  Time elapsed: 0.001 s
23:40:57 testMissingDoubleQuote - 11(org.eclipse.jdt.core.tests.eval.NegativeCodeSnippetTest)  Time elapsed: 0.002 s
23:40:57 testNonLastExpressionStatement - 11(org.eclipse.jdt.core.tests.eval.NegativeCodeSnippetTest)  Time elapsed: 0.001 s
23:40:57 testProblemInExpression - 11(org.eclipse.jdt.core.tests.eval.NegativeCodeSnippetTest)  Time elapsed: 0.001 s
23:40:57 testProblemInExpression2 - 11(org.eclipse.jdt.core.tests.eval.NegativeCodeSnippetTest)  Time elapsed: 0.001 s
23:40:57 testProblemInInnerClass - 11(org.eclipse.jdt.core.tests.eval.NegativeCodeSnippetTest)  Time elapsed: 0.008 s
23:40:57 testProblemInPreviousStatement - 11(org.eclipse.jdt.core.tests.eval.NegativeCodeSnippetTest)  Time elapsed: 0.002 s
23:40:57 testProblemInReturnStatement - 11(org.eclipse.jdt.core.tests.eval.NegativeCodeSnippetTest)  Time elapsed: 0.001 s
23:40:57 testRemoveImport - 11(org.eclipse.jdt.core.tests.eval.NegativeCodeSnippetTest)  Time elapsed: 0.009 s
23:40:57 testRemoveVariable - 11(org.eclipse.jdt.core.tests.eval.NegativeCodeSnippetTest)  Time elapsed: 0.009 s
23:40:57 testUnreachableExpression - 11(org.eclipse.jdt.core.tests.eval.NegativeCodeSnippetTest)  Time elapsed: 0.006 s
23:40:57 testUnusedImport - 11(org.eclipse.jdt.core.tests.eval.NegativeCodeSnippetTest)  Time elapsed: 0.01 s
23:40:57 testWarning - 11(org.eclipse.jdt.core.tests.eval.NegativeCodeSnippetTest)  Time elapsed: 0.005 s
23:40:57 testInitializerProblem - 11(org.eclipse.jdt.core.tests.eval.NegativeVariableTest)  Time elapsed: 0.005 s
23:40:57 testUnknownType - 11(org.eclipse.jdt.core.tests.eval.NegativeVariableTest)  Time elapsed: 0.002 s
23:40:57 test001 - 11(org.eclipse.jdt.core.tests.eval.DebugEvaluationTest)  Time elapsed: 0.136 s
23:40:57 test002 - 11(org.eclipse.jdt.core.tests.eval.DebugEvaluationTest)  Time elapsed: 0.128 s
23:40:57 test003 - 11(org.eclipse.jdt.core.tests.eval.DebugEvaluationTest)  Time elapsed: 0.023 s
23:40:57 test004 - 11(org.eclipse.jdt.core.tests.eval.DebugEvaluationTest)  Time elapsed: 0.118 s
23:40:57 test005 - 11(org.eclipse.jdt.core.tests.eval.DebugEvaluationTest)  Time elapsed: 0.13 s
23:40:57 test006 - 11(org.eclipse.jdt.core.tests.eval.DebugEvaluationTest)  Time elapsed: 0.132 s
23:40:57 test007 - 11(org.eclipse.jdt.core.tests.eval.DebugEvaluationTest)  Time elapsed: 0.129 s
23:40:57 test008 - 11(org.eclipse.jdt.core.tests.eval.DebugEvaluationTest)  Time elapsed: 0.13 s
23:40:57 test009 - 11(org.eclipse.jdt.core.tests.eval.DebugEvaluationTest)  Time elapsed: 0.12 s
23:40:57 test010 - 11(org.eclipse.jdt.core.tests.eval.DebugEvaluationTest)  Time elapsed: 0.131 s
23:40:57 test011 - 11(org.eclipse.jdt.core.tests.eval.DebugEvaluationTest)  Time elapsed: 0.127 s
23:40:57 test016 - 11(org.eclipse.jdt.core.tests.eval.DebugEvaluationTest)  Time elapsed: 0.23 s
23:40:57 test017 - 11(org.eclipse.jdt.core.tests.eval.DebugEvaluationTest)  Time elapsed: 0.119 s
23:40:57 test018 - 11(org.eclipse.jdt.core.tests.eval.DebugEvaluationTest)  Time elapsed: 0.238 s
23:40:57 test019 - 11(org.eclipse.jdt.core.tests.eval.DebugEvaluationTest)  Time elapsed: 0.023 s
23:40:57 test020 - 11(org.eclipse.jdt.core.tests.eval.DebugEvaluationTest)  Time elapsed: 0.128 s
23:40:57 test021 - 11(org.eclipse.jdt.core.tests.eval.DebugEvaluationTest)  Time elapsed: 0.238 s
23:40:57 test022 - 11(org.eclipse.jdt.core.tests.eval.DebugEvaluationTest)  Time elapsed: 0.246 s
23:40:57 test023 - 11(org.eclipse.jdt.core.tests.eval.DebugEvaluationTest)  Time elapsed: 0.249 s
23:40:57 test024 - 11(org.eclipse.jdt.core.tests.eval.DebugEvaluationTest)  Time elapsed: 0.25 s
23:40:57 test025 - 11(org.eclipse.jdt.core.tests.eval.DebugEvaluationTest)  Time elapsed: 0.242 s
23:40:57 test026 - 11(org.eclipse.jdt.core.tests.eval.DebugEvaluationTest)  Time elapsed: 0.132 s
23:40:57 test027 - 11(org.eclipse.jdt.core.tests.eval.DebugEvaluationTest)  Time elapsed: 0.133 s
23:40:57 test028 - 11(org.eclipse.jdt.core.tests.eval.DebugEvaluationTest)  Time elapsed: 0.135 s
23:40:57 test029 - 11(org.eclipse.jdt.core.tests.eval.DebugEvaluationTest)  Time elapsed: 0.133 s
23:40:57 test030 - 11(org.eclipse.jdt.core.tests.eval.DebugEvaluationTest)  Time elapsed: 0.139 s
23:40:57 test031 - 11(org.eclipse.jdt.core.tests.eval.DebugEvaluationTest)  Time elapsed: 0.135 s
23:40:57 test032 - 11(org.eclipse.jdt.core.tests.eval.DebugEvaluationTest)  Time elapsed: 0.031 s
23:40:57 test033 - 11(org.eclipse.jdt.core.tests.eval.DebugEvaluationTest)  Time elapsed: 0.139 s
23:40:57 test034 - 11(org.eclipse.jdt.core.tests.eval.DebugEvaluationTest)  Time elapsed: 0.134 s
23:40:57 test035 - 11(org.eclipse.jdt.core.tests.eval.DebugEvaluationTest)  Time elapsed: 0.131 s
23:40:57 test036 - 11(org.eclipse.jdt.core.tests.eval.DebugEvaluationTest)  Time elapsed: 0.131 s
23:40:57 test037 - 11(org.eclipse.jdt.core.tests.eval.DebugEvaluationTest)  Time elapsed: 0.132 s
23:40:57 test038 - 11(org.eclipse.jdt.core.tests.eval.DebugEvaluationTest)  Time elapsed: 0.133 s
23:40:57 test039 - 11(org.eclipse.jdt.core.tests.eval.DebugEvaluationTest)  Time elapsed: 0.134 s
23:40:57 test040 - 11(org.eclipse.jdt.core.tests.eval.DebugEvaluationTest)  Time elapsed: 0.133 s
23:40:57 test041 - 11(org.eclipse.jdt.core.tests.eval.DebugEvaluationTest)  Time elapsed: 0.131 s
23:40:57 test042 - 11(org.eclipse.jdt.core.tests.eval.DebugEvaluationTest)  Time elapsed: 0.133 s
23:40:57 test043 - 11(org.eclipse.jdt.core.tests.eval.DebugEvaluationTest)  Time elapsed: 0.131 s
23:40:57 test044 - 11(org.eclipse.jdt.core.tests.eval.DebugEvaluationTest)  Time elapsed: 0.13 s
23:40:57 test045 - 11(org.eclipse.jdt.core.tests.eval.DebugEvaluationTest)  Time elapsed: 0.131 s
23:40:57 test046 - 11(org.eclipse.jdt.core.tests.eval.DebugEvaluationTest)  Time elapsed: 0.131 s
23:40:57 test047 - 11(org.eclipse.jdt.core.tests.eval.DebugEvaluationTest)  Time elapsed: 0.133 s
23:40:57 test048 - 11(org.eclipse.jdt.core.tests.eval.DebugEvaluationTest)  Time elapsed: 0.13 s
23:40:57 test049 - 11(org.eclipse.jdt.core.tests.eval.DebugEvaluationTest)  Time elapsed: 0.132 s
23:40:57 test050 - 11(org.eclipse.jdt.core.tests.eval.DebugEvaluationTest)  Time elapsed: 0.131 s
23:40:57 test051 - 11(org.eclipse.jdt.core.tests.eval.DebugEvaluationTest)  Time elapsed: 0.135 s
23:40:57 test052 - 11(org.eclipse.jdt.core.tests.eval.DebugEvaluationTest)  Time elapsed: 0.062 s
23:40:57 test053 - 11(org.eclipse.jdt.core.tests.eval.DebugEvaluationTest)  Time elapsed: 0.136 s
23:40:57 test054 - 11(org.eclipse.jdt.core.tests.eval.DebugEvaluationTest)  Time elapsed: 0.138 s
23:40:57 test055 - 11(org.eclipse.jdt.core.tests.eval.DebugEvaluationTest)  Time elapsed: 0.149 s
23:40:57 test056 - 11(org.eclipse.jdt.core.tests.eval.DebugEvaluationTest)  Time elapsed: 0.049 s
23:40:57 test057 - 11(org.eclipse.jdt.core.tests.eval.DebugEvaluationTest)  Time elapsed: 0.154 s
23:40:57 test058 - 11(org.eclipse.jdt.core.tests.eval.DebugEvaluationTest)  Time elapsed: 0.066 s
23:40:57 test059 - 11(org.eclipse.jdt.core.tests.eval.DebugEvaluationTest)  Time elapsed: 0.136 s
23:40:57 test060 - 11(org.eclipse.jdt.core.tests.eval.DebugEvaluationTest)  Time elapsed: 0.136 s
23:40:57 test061 - 11(org.eclipse.jdt.core.tests.eval.DebugEvaluationTest)  Time elapsed: 0.133 s
23:40:57 test062 - 11(org.eclipse.jdt.core.tests.eval.DebugEvaluationTest)  Time elapsed: 0.132 s
23:40:57 test063 - 11(org.eclipse.jdt.core.tests.eval.DebugEvaluationTest)  Time elapsed: 0.134 s
23:40:57 test065 - 11(org.eclipse.jdt.core.tests.eval.DebugEvaluationTest)  Time elapsed: 0.135 s
23:40:57 test066 - 11(org.eclipse.jdt.core.tests.eval.DebugEvaluationTest)  Time elapsed: 0.143 s
23:40:57 test067 - 11(org.eclipse.jdt.core.tests.eval.DebugEvaluationTest)  Time elapsed: 0.135 s
23:40:57 test068 - 11(org.eclipse.jdt.core.tests.eval.DebugEvaluationTest)  Time elapsed: 0.029 s
23:40:57 test069 - 11(org.eclipse.jdt.core.tests.eval.DebugEvaluationTest)  Time elapsed: 0.027 s
23:40:57 testNegative001 - 11(org.eclipse.jdt.core.tests.eval.DebugEvaluationTest)  Time elapsed: 0.024 s
23:40:57 testNegative002 - 11(org.eclipse.jdt.core.tests.eval.DebugEvaluationTest)  Time elapsed: 0.025 s
23:40:57 testNegative003 - 11(org.eclipse.jdt.core.tests.eval.DebugEvaluationTest)  Time elapsed: 0.024 s
23:40:57 testNegative004 - 11(org.eclipse.jdt.core.tests.eval.DebugEvaluationTest)  Time elapsed: 0.012 s
23:40:57 testNegative005 - 11(org.eclipse.jdt.core.tests.eval.DebugEvaluationTest)  Time elapsed: 0.011 s
23:40:57 
23:40:57 Results:
23:40:57 
23:40:57 Failures: 
23:40:57   ComplianceDiagnoseTest>TestCase.runTest:964->test0003:206->runComplianceParserTest:48->AbstractRegressionTest.runNegativeTest:2474->AbstractRegressionTest.runNegativeTest:2485->AbstractRegressionTest.runTest:2920->AbstractRegressionTest.runTest:3127->AbstractRegressionTest.checkCompilerLog:1277->TestCase.assertEquals:242->TestCase.assertStringEquals:266 Invalid problem log .
23:40:57 ----------- Expected ------------
23:40:57 ----------\n
23:40:57 1. ERROR in X.java (at line 1)\n
23:40:57 	public enum X {\n
23:40:57 	       ^^^^\n
23:40:57 Syntax error on token "enum", interface expected\n
23:40:57 ----------\n
23:40:57 
23:40:57 ------------ but was ------------
23:40:57 ----------\n
23:40:57 1. ERROR in X.java (at line 1)\n
23:40:57 	public enum X {\n
23:40:57 	       ^^^^\n
23:40:57 Syntax error on token "enum", module expected\n
23:40:57 ----------\n
23:40:57 
23:40:57 --------- Difference is ----------
23:40:57  expected:<...or on token "enum", [interfac]e expected\n
23:40:57 -------...> but was:<...or on token "enum", [modul]e expected\n
23:40:57 -------...>
23:40:57   ModuleCompilationTests>TestCase.runTest:964->testBug500170b:3826->runNegativeModuleTest:207->runNegativeModuleTest:215->runNegativeModuleTest:224->runNegativeModuleTest:239->AbstractBatchCompilerTest.runNegativeTest:500->AbstractBatchCompilerTest.runTest:654->TestCase.assertEquals:242->TestCase.assertStringEquals:266 Unexpected error output for invocation with arguments [-d /tmp/genie.jdt/comptest/run.1561950676732/regression/bin -8 -classpath "/opt/public/common/java/openjdk/jdk11-x64/lib/jrt-fs.jar:"  "/tmp/genie.jdt/comptest/run.1561950676732/regression/src/mod.one/module-info.java"].
23:40:57 ----------- Expected ------------
23:40:57 ----------\n
23:40:57 1. ERROR in ---OUTPUT_DIR_PLACEHOLDER---/src/mod.one/module-info.java (at line 1)\n
23:40:57 	module mod.one { \n
23:40:57 	^^^^^^\n
23:40:57 Syntax error on token "module", package expected\n
23:40:57 ----------\n
23:40:57 2. ERROR in ---OUTPUT_DIR_PLACEHOLDER---/src/mod.one/module-info.java (at line 1)\n
23:40:57 	module mod.one { \n
23:40:57 	^^^^^^^^^^^^^^\n
23:40:57 Syntax error on token(s), misplaced construct(s)\n
23:40:57 ----------\n
23:40:57 3. ERROR in ---OUTPUT_DIR_PLACEHOLDER---/src/mod.one/module-info.java (at line 2)\n
23:40:57 	requires java.sql;\n
23:40:57 	             ^\n
23:40:57 Syntax error on token ".", , expected\n
23:40:57 ----------\n
23:40:57 4. ERROR in ---OUTPUT_DIR_PLACEHOLDER---/src/mod.one/module-info.java (at line 3)\n
23:40:57 	}\n
23:40:57 	^\n
23:40:57 Syntax error on token "}", delete this token\n
23:40:57 ----------\n
23:40:57 4 problems (4 errors)\n
23:40:57 
23:40:57 ------------ but was ------------
23:40:57 ----------\n
23:40:57 1. ERROR in /tmp/genie.jdt/comptest/run.1561950676732/regression/src/mod.one/module-info.java (at line 1)\n
23:40:57 	module mod.one { \n
23:40:57 	^^^^^^\n
23:40:57 Syntax error on token "module", module expected\n
23:40:57 ----------\n
23:40:57 2. ERROR in /tmp/genie.jdt/comptest/run.1561950676732/regression/src/mod.one/module-info.java (at line 2)\n
23:40:57 	requires java.sql;\n
23:40:57 	^^^^^^^^\n
23:40:57 Syntax error on token "requires", requires expected\n
23:40:57 ----------\n
23:40:57 2 problems (2 errors)\n
23:40:57 
23:40:57 --------- Difference is ----------
23:40:57  expected:<...-----\n
23:40:57 1. ERROR in [---OUTPUT_DIR_PLACEHOLDER---/src/mod.one/module-info.java (at line 1)\n
23:40:57 	module mod.one { \n
23:40:57 	^^^^^^\n
23:40:57 Syntax error on token "module", package expected\n
23:40:57 ----------\n
23:40:57 2. ERROR in ---OUTPUT_DIR_PLACEHOLDER---/src/mod.one/module-info.java (at line 1)\n
23:40:57 	module mod.one { \n
23:40:57 	^^^^^^^^^^^^^^\n
23:40:57 Syntax error on token(s), misplaced construct(s)\n
23:40:57 ----------\n
23:40:57 3. ERROR in ---OUTPUT_DIR_PLACEHOLDER---/src/mod.one/module-info.java (at line 2)\n
23:40:57 	requires java.sql;\n
23:40:57 	             ^\n
23:40:57 Syntax error on token ".", , expected\n
23:40:57 ----------\n
23:40:57 4. ERROR in ---OUTPUT_DIR_PLACEHOLDER---/src/mod.one/module-info.java (at line 3)\n
23:40:57 	}\n
23:40:57 	^\n
23:40:57 Syntax error on token "}", delete this token\n
23:40:57 ----------\n
23:40:57 4 problems (4] errors)\n
23:40:57 > but was:<...-----\n
23:40:57 1. ERROR in [/tmp/genie.jdt/comptest/run.1561950676732/regression/src/mod.one/module-info.java (at line 1)\n
23:40:57 	module mod.one { \n
23:40:57 	^^^^^^\n
23:40:57 Syntax error on token "module", module expected\n
23:40:57 ----------\n
23:40:57 2. ERROR in /tmp/genie.jdt/comptest/run.1561950676732/regression/src/mod.one/module-info.java (at line 2)\n
23:40:57 	requires java.sql;\n
23:40:57 	^^^^^^^^\n
23:40:57 Syntax error on token "requires", requires expected\n
23:40:57 ----------\n
23:40:57 2 problems (2] errors)\n
23:40:57 >
23:40:57   ModuleCompilationTests>TestCase.runTest:964->testReleaseOption14:4211->runNegativeModuleTest:231->runNegativeModuleTest:239->AbstractBatchCompilerTest.runNegativeTest:500->AbstractBatchCompilerTest.runTest:654->TestCase.assertEquals:242->TestCase.assertStringEquals:266 Unexpected error output for invocation with arguments [ --release 8 "/tmp/genie.jdt/comptest/run.1561950676732/regression/module-info.java" ].
23:40:57 ----------- Expected ------------
23:40:57 ----------\n
23:40:57 1. ERROR in ---OUTPUT_DIR_PLACEHOLDER---/module-info.java (at line 1)\n
23:40:57 	module mod.one { \n
23:40:57 	^^^^^^\n
23:40:57 Syntax error on token "module", package expected\n
23:40:57 ----------\n
23:40:57 2. ERROR in ---OUTPUT_DIR_PLACEHOLDER---/module-info.java (at line 1)\n
23:40:57 	module mod.one { \n
23:40:57 }\n
23:40:57 	               ^^^^\n
23:40:57 Syntax error on tokens, delete these tokens\n
23:40:57 ----------\n
23:40:57 2 problems (2 errors)\n
23:40:57 
23:40:57 ------------ but was ------------
23:40:57 ----------\n
23:40:57 1. ERROR in /tmp/genie.jdt/comptest/run.1561950676732/regression/module-info.java (at line 1)\n
23:40:57 	module mod.one { \n
23:40:57 	^^^^^^\n
23:40:57 Syntax error on token "module", module expected\n
23:40:57 ----------\n
23:40:57 1 problem (1 error)\n
23:40:57 
23:40:57 --------- Difference is ----------
23:40:57  expected:<...-----\n
23:40:57 1. ERROR in [---OUTPUT_DIR_PLACEHOLDER---/module-info.java (at line 1)\n
23:40:57 	module mod.one { \n
23:40:57 	^^^^^^\n
23:40:57 Syntax error on token "module", package expected\n
23:40:57 ----------\n
23:40:57 2. ERROR in ---OUTPUT_DIR_PLACEHOLDER---/module-info.java (at line 1)\n
23:40:57 	module mod.one { \n
23:40:57 }\n
23:40:57 	               ^^^^\n
23:40:57 Syntax error on tokens, delete these tokens\n
23:40:57 ----------\n
23:40:57 2 problems (2 errors])\n
23:40:57 > but was:<...-----\n
23:40:57 1. ERROR in [/tmp/genie.jdt/comptest/run.1561950676732/regression/module-info.java (at line 1)\n
23:40:57 	module mod.one { \n
23:40:57 	^^^^^^\n
23:40:57 Syntax error on token "module", module expected\n
23:40:57 ----------\n
23:40:57 1 problem (1 error])\n
23:40:57 >
23:40:57 
23:40:57 Tests run: 40697, Failures: 3, Errors: 0, Skipped: 0
23:40:57 
23:40:58 [INFO] ------------------------------------------------------------------------
23:40:58 [INFO] Reactor Summary:
23:40:58 [INFO] 
23:40:58 [INFO] eclipse.jdt.core 4.13.0-SNAPSHOT ................... SUCCESS [ 20.559 s]
23:40:58 [INFO] org.eclipse.jdt.annotation 2.2.300-SNAPSHOT ........ SUCCESS [ 54.682 s]
23:40:58 [INFO] org.eclipse.jdt.annotation 1.1.400-SNAPSHOT ........ SUCCESS [ 27.706 s]
23:40:58 [INFO] org.eclipse.jdt.core 3.18.100-SNAPSHOT ............. SUCCESS [01:23 min]
23:40:58 [INFO] org.eclipse.jdt.compiler.tool 1.2.600-SNAPSHOT ..... SUCCESS [01:25 min]
23:40:58 [INFO] org.eclipse.jdt.compiler.apt 1.3.600-SNAPSHOT ...... SUCCESS [ 49.882 s]
23:40:58 [INFO] org.eclipse.jdt.core.tests.compiler 3.12.950-SNAPSHOT FAILURE [29:56 min]
23:40:58 [INFO] org.eclipse.jdt.compiler.tool.tests 1.2.500-SNAPSHOT SKIPPED
23:40:58 [INFO] org.eclipse.jdt.core.tests.builder 3.10.700-SNAPSHOT SKIPPED
23:40:58 [INFO] org.eclipse.jdt.compiler.apt.tests 1.1.800-SNAPSHOT  SKIPPED
23:40:58 [INFO] org.eclipse.jdt.core.tests.model 3.10.950-SNAPSHOT . SKIPPED
23:40:58 [INFO] org.eclipse.jdt.core.tests.performance 3.10.600-SNAPSHOT SKIPPED
23:40:58 [INFO] org.eclipse.jdt.apt.core 3.6.500-SNAPSHOT .......... SKIPPED
23:40:58 [INFO] org.eclipse.jdt.apt.pluggable.core 1.2.400-SNAPSHOT  SKIPPED
23:40:58 [INFO] org.eclipse.jdt.apt.ui 3.6.200-SNAPSHOT ............ SKIPPED
23:40:58 [INFO] org.eclipse.jdt.apt.pluggable.tests 3.4.600-SNAPSHOT SKIPPED
23:40:58 [INFO] org.eclipse.jdt.apt.tests 3.4.500-SNAPSHOT ......... SKIPPED
23:40:58 [INFO] ------------------------------------------------------------------------
23:40:58 [INFO] BUILD FAILURE
23:40:58 [INFO] ------------------------------------------------------------------------
23:40:58 [INFO] Total time:  41:48 min
23:40:58 [INFO] Finished at: 2019-06-30T23:40:58-04:00
23:40:58 [INFO] ------------------------------------------------------------------------
23:40:58 [ERROR] Failed to execute goal org.eclipse.tycho:tycho-surefire-plugin:1.5.0-SNAPSHOT:test (default-test) on project org.eclipse.jdt.core.tests.compiler: There are test failures.
23:40:58 [ERROR] 
23:40:58 [ERROR] Please refer to /jobs/genie.jdt/eclipse.jdt.core-Gerrit/workspace/org.eclipse.jdt.core.tests.compiler/target/surefire-reports for the individual test results.
23:40:58 [ERROR] -> [Help 1]
23:40:58 [ERROR] 
23:40:58 [ERROR] To see the full stack trace of the errors, re-run Maven with the -e switch.
23:40:58 [ERROR] Re-run Maven using the -X switch to enable full debug logging.
23:40:58 [ERROR] 
23:40:58 [ERROR] For more information about the errors and possible solutions, please read the following articles:
23:40:58 [ERROR] [Help 1] http://cwiki.apache.org/confluence/display/MAVEN/MojoFailureException
23:40:58 [ERROR] 
23:40:58 [ERROR] After correcting the problems, you can resume the build with the command
23:40:58 [ERROR]   mvn <goals> -rf :org.eclipse.jdt.core.tests.compiler
23:41:00 Build step 'Invoke top-level Maven targets' marked build as failure
23:41:00 Recording test results
23:41:01 Archiving artifacts
23:41:02 Started calculate disk usage of build
23:41:02 Finished Calculation of disk usage of build in 0 seconds
23:41:07 Started calculate disk usage of workspace
23:41:08 Finished Calculation of disk usage of workspace in 0 seconds
23:41:10 Finished: FAILURE