FailedConsole Output

Skipping 781 KB.. Full Log
rom tycho-snapshots: https://repo.eclipse.org/content/repositories/tycho-snapshots/org/sonatype/oss/oss-parent/6/oss-parent-6.pom
12:24:47 Downloading from cbi-jdt: https://repo.eclipse.org/content/repositories/eclipse-staging/org/sonatype/oss/oss-parent/6/oss-parent-6.pom
12:24:47 Downloading from eclipse: https://repo.eclipse.org/content/repositories/cbi/org/sonatype/oss/oss-parent/6/oss-parent-6.pom
12:24:47 Downloading from eclipse.maven.central.mirror: https://repo.eclipse.org/content/repositories/maven_central/org/sonatype/oss/oss-parent/6/oss-parent-6.pom
12:24:47 Progress (1): 4.1/4.8 kB
Progress (1): 4.8 kB    
                    
Downloaded from eclipse.maven.central.mirror: https://repo.eclipse.org/content/repositories/maven_central/org/sonatype/oss/oss-parent/6/oss-parent-6.pom (4.8 kB at 151 kB/s)
12:24:47 Downloading from tycho-snapshots: https://repo.eclipse.org/content/repositories/tycho-snapshots/com/jcraft/jzlib/1.1.1/jzlib-1.1.1.pom
12:24:47 Downloading from cbi-jdt: https://repo.eclipse.org/content/repositories/eclipse-staging/com/jcraft/jzlib/1.1.1/jzlib-1.1.1.pom
12:24:47 Downloading from eclipse: https://repo.eclipse.org/content/repositories/cbi/com/jcraft/jzlib/1.1.1/jzlib-1.1.1.pom
12:24:47 Downloading from eclipse.maven.central.mirror: https://repo.eclipse.org/content/repositories/maven_central/com/jcraft/jzlib/1.1.1/jzlib-1.1.1.pom
12:24:47 Progress (1): 3.1 kB
                    
Downloaded from eclipse.maven.central.mirror: https://repo.eclipse.org/content/repositories/maven_central/com/jcraft/jzlib/1.1.1/jzlib-1.1.1.pom (3.1 kB at 102 kB/s)
12:24:47 Downloading from tycho-snapshots: https://repo.eclipse.org/content/repositories/tycho-snapshots/com/googlecode/javaewah/JavaEWAH/1.1.6/JavaEWAH-1.1.6.pom
12:24:47 Downloading from cbi-jdt: https://repo.eclipse.org/content/repositories/eclipse-staging/com/googlecode/javaewah/JavaEWAH/1.1.6/JavaEWAH-1.1.6.pom
12:24:47 Downloading from eclipse: https://repo.eclipse.org/content/repositories/cbi/com/googlecode/javaewah/JavaEWAH/1.1.6/JavaEWAH-1.1.6.pom
12:24:47 Downloading from eclipse.maven.central.mirror: https://repo.eclipse.org/content/repositories/maven_central/com/googlecode/javaewah/JavaEWAH/1.1.6/JavaEWAH-1.1.6.pom
12:24:47 Progress (1): 4.1/6.0 kB
Progress (1): 6.0 kB    
                    
Downloaded from eclipse.maven.central.mirror: https://repo.eclipse.org/content/repositories/maven_central/com/googlecode/javaewah/JavaEWAH/1.1.6/JavaEWAH-1.1.6.pom (6.0 kB at 188 kB/s)
12:24:47 Downloading from tycho-snapshots: https://repo.eclipse.org/content/repositories/tycho-snapshots/org/sonatype/oss/oss-parent/5/oss-parent-5.pom
12:24:47 Downloading from cbi-jdt: https://repo.eclipse.org/content/repositories/eclipse-staging/org/sonatype/oss/oss-parent/5/oss-parent-5.pom
12:24:47 Downloading from eclipse: https://repo.eclipse.org/content/repositories/cbi/org/sonatype/oss/oss-parent/5/oss-parent-5.pom
12:24:47 Downloading from eclipse.maven.central.mirror: https://repo.eclipse.org/content/repositories/maven_central/org/sonatype/oss/oss-parent/5/oss-parent-5.pom
12:24:47 Progress (1): 4.1 kB
                    
Downloaded from eclipse.maven.central.mirror: https://repo.eclipse.org/content/repositories/maven_central/org/sonatype/oss/oss-parent/5/oss-parent-5.pom (4.1 kB at 141 kB/s)
12:24:47 Downloading from tycho-snapshots: https://repo.eclipse.org/content/repositories/tycho-snapshots/org/slf4j/slf4j-api/1.7.2/slf4j-api-1.7.2.pom
12:24:47 Downloading from cbi-jdt: https://repo.eclipse.org/content/repositories/eclipse-staging/org/slf4j/slf4j-api/1.7.2/slf4j-api-1.7.2.pom
12:24:47 Downloading from eclipse: https://repo.eclipse.org/content/repositories/cbi/org/slf4j/slf4j-api/1.7.2/slf4j-api-1.7.2.pom
12:24:47 Downloading from eclipse.maven.central.mirror: https://repo.eclipse.org/content/repositories/maven_central/org/slf4j/slf4j-api/1.7.2/slf4j-api-1.7.2.pom
12:24:47 Progress (1): 2.7 kB
                    
Downloaded from eclipse.maven.central.mirror: https://repo.eclipse.org/content/repositories/maven_central/org/slf4j/slf4j-api/1.7.2/slf4j-api-1.7.2.pom (2.7 kB at 79 kB/s)
12:24:47 Downloading from tycho-snapshots: https://repo.eclipse.org/content/repositories/tycho-snapshots/org/slf4j/slf4j-parent/1.7.2/slf4j-parent-1.7.2.pom
12:24:47 Downloading from cbi-jdt: https://repo.eclipse.org/content/repositories/eclipse-staging/org/slf4j/slf4j-parent/1.7.2/slf4j-parent-1.7.2.pom
12:24:47 Downloading from eclipse: https://repo.eclipse.org/content/repositories/cbi/org/slf4j/slf4j-parent/1.7.2/slf4j-parent-1.7.2.pom
12:24:47 Downloading from eclipse.maven.central.mirror: https://repo.eclipse.org/content/repositories/maven_central/org/slf4j/slf4j-parent/1.7.2/slf4j-parent-1.7.2.pom
12:24:47 Progress (1): 4.1/12 kB
Progress (1): 7.7/12 kB
Progress (1): 12/12 kB 
Progress (1): 12 kB   
                   
Downloaded from eclipse.maven.central.mirror: https://repo.eclipse.org/content/repositories/maven_central/org/slf4j/slf4j-parent/1.7.2/slf4j-parent-1.7.2.pom (12 kB at 328 kB/s)
12:24:47 Downloading from tycho-snapshots: https://repo.eclipse.org/content/repositories/tycho-snapshots/org/eclipse/tycho/extras/tycho-sourceref-jgit/1.3.0/tycho-sourceref-jgit-1.3.0.pom
12:24:47 Downloading from cbi-jdt: https://repo.eclipse.org/content/repositories/eclipse-staging/org/eclipse/tycho/extras/tycho-sourceref-jgit/1.3.0/tycho-sourceref-jgit-1.3.0.pom
12:24:47 Downloading from eclipse: https://repo.eclipse.org/content/repositories/cbi/org/eclipse/tycho/extras/tycho-sourceref-jgit/1.3.0/tycho-sourceref-jgit-1.3.0.pom
12:24:47 Downloading from eclipse.maven.central.mirror: https://repo.eclipse.org/content/repositories/maven_central/org/eclipse/tycho/extras/tycho-sourceref-jgit/1.3.0/tycho-sourceref-jgit-1.3.0.pom
12:24:47 Progress (1): 1.5 kB
                    
Downloaded from eclipse.maven.central.mirror: https://repo.eclipse.org/content/repositories/maven_central/org/eclipse/tycho/extras/tycho-sourceref-jgit/1.3.0/tycho-sourceref-jgit-1.3.0.pom (1.5 kB at 1.4 kB/s)
12:24:47 Downloading from tycho-snapshots: https://repo.eclipse.org/content/repositories/tycho-snapshots/org/eclipse/tycho/extras/tycho-buildtimestamp-jgit/1.3.0/tycho-buildtimestamp-jgit-1.3.0.jar
12:24:47 Downloading from tycho-snapshots: https://repo.eclipse.org/content/repositories/tycho-snapshots/com/googlecode/javaewah/JavaEWAH/1.1.6/JavaEWAH-1.1.6.jar
12:24:47 Downloading from tycho-snapshots: https://repo.eclipse.org/content/repositories/tycho-snapshots/com/jcraft/jzlib/1.1.1/jzlib-1.1.1.jar
12:24:47 Downloading from tycho-snapshots: https://repo.eclipse.org/content/repositories/tycho-snapshots/com/jcraft/jsch/0.1.54/jsch-0.1.54.jar
12:24:47 Downloading from tycho-snapshots: https://repo.eclipse.org/content/repositories/tycho-snapshots/org/eclipse/jgit/org.eclipse.jgit/5.1.3.201810200350-r/org.eclipse.jgit-5.1.3.201810200350-r.jar
12:24:47 Downloading from tycho-snapshots: https://repo.eclipse.org/content/repositories/tycho-snapshots/org/slf4j/slf4j-api/1.7.2/slf4j-api-1.7.2.jar
12:24:48 Downloading from tycho-snapshots: https://repo.eclipse.org/content/repositories/tycho-snapshots/org/eclipse/tycho/extras/tycho-sourceref-jgit/1.3.0/tycho-sourceref-jgit-1.3.0.jar
12:24:48 Downloading from cbi-jdt: https://repo.eclipse.org/content/repositories/eclipse-staging/org/eclipse/tycho/extras/tycho-buildtimestamp-jgit/1.3.0/tycho-buildtimestamp-jgit-1.3.0.jar
12:24:48 Downloading from cbi-jdt: https://repo.eclipse.org/content/repositories/eclipse-staging/org/eclipse/jgit/org.eclipse.jgit/5.1.3.201810200350-r/org.eclipse.jgit-5.1.3.201810200350-r.jar
12:24:48 Downloading from cbi-jdt: https://repo.eclipse.org/content/repositories/eclipse-staging/com/googlecode/javaewah/JavaEWAH/1.1.6/JavaEWAH-1.1.6.jar
12:24:48 Downloading from cbi-jdt: https://repo.eclipse.org/content/repositories/eclipse-staging/com/jcraft/jzlib/1.1.1/jzlib-1.1.1.jar
12:24:48 Downloading from cbi-jdt: https://repo.eclipse.org/content/repositories/eclipse-staging/com/jcraft/jsch/0.1.54/jsch-0.1.54.jar
12:24:48 Downloading from cbi-jdt: https://repo.eclipse.org/content/repositories/eclipse-staging/org/slf4j/slf4j-api/1.7.2/slf4j-api-1.7.2.jar
12:24:48 Downloading from cbi-jdt: https://repo.eclipse.org/content/repositories/eclipse-staging/org/eclipse/tycho/extras/tycho-sourceref-jgit/1.3.0/tycho-sourceref-jgit-1.3.0.jar
12:24:48 Downloading from eclipse: https://repo.eclipse.org/content/repositories/cbi/org/eclipse/tycho/extras/tycho-buildtimestamp-jgit/1.3.0/tycho-buildtimestamp-jgit-1.3.0.jar
12:24:48 Downloading from eclipse: https://repo.eclipse.org/content/repositories/cbi/com/jcraft/jzlib/1.1.1/jzlib-1.1.1.jar
12:24:48 Downloading from eclipse: https://repo.eclipse.org/content/repositories/cbi/com/jcraft/jsch/0.1.54/jsch-0.1.54.jar
12:24:48 Downloading from eclipse: https://repo.eclipse.org/content/repositories/cbi/org/eclipse/jgit/org.eclipse.jgit/5.1.3.201810200350-r/org.eclipse.jgit-5.1.3.201810200350-r.jar
12:24:48 Downloading from eclipse: https://repo.eclipse.org/content/repositories/cbi/com/googlecode/javaewah/JavaEWAH/1.1.6/JavaEWAH-1.1.6.jar
12:24:48 Downloading from eclipse: https://repo.eclipse.org/content/repositories/cbi/org/slf4j/slf4j-api/1.7.2/slf4j-api-1.7.2.jar
12:24:48 Downloading from eclipse: https://repo.eclipse.org/content/repositories/cbi/org/eclipse/tycho/extras/tycho-sourceref-jgit/1.3.0/tycho-sourceref-jgit-1.3.0.jar
12:24:48 Downloading from eclipse.maven.central.mirror: https://repo.eclipse.org/content/repositories/maven_central/org/eclipse/tycho/extras/tycho-buildtimestamp-jgit/1.3.0/tycho-buildtimestamp-jgit-1.3.0.jar
12:24:48 Downloading from eclipse.maven.central.mirror: https://repo.eclipse.org/content/repositories/maven_central/com/jcraft/jzlib/1.1.1/jzlib-1.1.1.jar
12:24:48 Downloading from eclipse.maven.central.mirror: https://repo.eclipse.org/content/repositories/maven_central/com/jcraft/jsch/0.1.54/jsch-0.1.54.jar
12:24:48 Downloading from eclipse.maven.central.mirror: https://repo.eclipse.org/content/repositories/maven_central/org/eclipse/jgit/org.eclipse.jgit/5.1.3.201810200350-r/org.eclipse.jgit-5.1.3.201810200350-r.jar
12:24:48 Downloading from eclipse.maven.central.mirror: https://repo.eclipse.org/content/repositories/maven_central/com/googlecode/javaewah/JavaEWAH/1.1.6/JavaEWAH-1.1.6.jar
12:24:48 Progress (1): 0/2.7 MB
Progress (1): 0/2.7 MB
Progress (1): 0/2.7 MB
Progress (1): 0/2.7 MB
Progress (1): 0/2.7 MB
Progress (1): 0/2.7 MB
Progress (1): 0/2.7 MB
Progress (1): 0/2.7 MB
Progress (1): 0/2.7 MB
Progress (1): 0/2.7 MB
Progress (2): 0/2.7 MB | 4.1/281 kB
Progress (2): 0/2.7 MB | 7.7/281 kB
Progress (2): 0/2.7 MB | 12/281 kB 
Progress (2): 0/2.7 MB | 16/281 kB
Progress (2): 0/2.7 MB | 20/281 kB
Progress (2): 0/2.7 MB | 24/281 kB
Progress (3): 0/2.7 MB | 24/281 kB | 4.1/166 kB
Progress (3): 0/2.7 MB | 24/281 kB | 7.7/166 kB
Progress (3): 0/2.7 MB | 28/281 kB | 7.7/166 kB
Progress (3): 0/2.7 MB | 32/281 kB | 7.7/166 kB
Progress (3): 0/2.7 MB | 36/281 kB | 7.7/166 kB
Progress (3): 0/2.7 MB | 40/281 kB | 7.7/166 kB
Progress (3): 0/2.7 MB | 40/281 kB | 12/166 kB 
Progress (3): 0/2.7 MB | 44/281 kB | 12/166 kB
Progress (3): 0/2.7 MB | 44/281 kB | 16/166 kB
Progress (3): 0/2.7 MB | 48/281 kB | 16/166 kB
Progress (3): 0/2.7 MB | 52/281 kB | 16/166 kB
Progress (3): 0/2.7 MB | 56/281 kB | 16/166 kB
Progress (3): 0/2.7 MB | 56/281 kB | 20/166 kB
Progress (3): 0/2.7 MB | 60/281 kB | 20/166 kB
Progress (3): 0/2.7 MB | 60/281 kB | 24/166 kB
Progress (3): 0/2.7 MB | 64/281 kB | 24/166 kB
Progress (3): 0/2.7 MB | 66/281 kB | 24/166 kB
Progress (3): 0/2.7 MB | 66/281 kB | 28/166 kB
Progress (3): 0/2.7 MB | 66/281 kB | 32/166 kB
Progress (3): 0/2.7 MB | 70/281 kB | 32/166 kB
Progress (3): 0/2.7 MB | 70/281 kB | 36/166 kB
Progress (3): 0/2.7 MB | 74/281 kB | 36/166 kB
Progress (3): 0/2.7 MB | 74/281 kB | 40/166 kB
Progress (3): 0/2.7 MB | 78/281 kB | 40/166 kB
Progress (3): 0/2.7 MB | 78/281 kB | 44/166 kB
Progress (3): 0/2.7 MB | 82/281 kB | 44/166 kB
Progress (3): 0/2.7 MB | 82/281 kB | 48/166 kB
Progress (4): 0/2.7 MB | 82/281 kB | 48/166 kB | 4.1/11 kB
Progress (4): 0/2.7 MB | 86/281 kB | 48/166 kB | 4.1/11 kB
Progress (4): 0/2.7 MB | 86/281 kB | 52/166 kB | 4.1/11 kB
Progress (4): 0/2.7 MB | 90/281 kB | 52/166 kB | 4.1/11 kB
Progress (4): 0/2.7 MB | 90/281 kB | 52/166 kB | 7.7/11 kB
Progress (4): 0/2.7 MB | 94/281 kB | 52/166 kB | 7.7/11 kB
Progress (4): 0/2.7 MB | 94/281 kB | 56/166 kB | 7.7/11 kB
Progress (4): 0/2.7 MB | 98/281 kB | 56/166 kB | 7.7/11 kB
Progress (4): 0/2.7 MB | 98/281 kB | 56/166 kB | 11 kB    
Progress (4): 0/2.7 MB | 98/281 kB | 60/166 kB | 11 kB
Progress (4): 0/2.7 MB | 102/281 kB | 60/166 kB | 11 kB
Progress (5): 0/2.7 MB | 102/281 kB | 60/166 kB | 11 kB | 4.1/70 kB
Progress (5): 0/2.7 MB | 102/281 kB | 64/166 kB | 11 kB | 4.1/70 kB
Progress (5): 0/2.7 MB | 102/281 kB | 64/166 kB | 11 kB | 7.7/70 kB
Progress (5): 0/2.7 MB | 106/281 kB | 64/166 kB | 11 kB | 7.7/70 kB
Progress (5): 0/2.7 MB | 106/281 kB | 68/166 kB | 11 kB | 7.7/70 kB
Progress (5): 0/2.7 MB | 110/281 kB | 68/166 kB | 11 kB | 7.7/70 kB
Progress (5): 0/2.7 MB | 110/281 kB | 72/166 kB | 11 kB | 7.7/70 kB
Progress (5): 0/2.7 MB | 114/281 kB | 72/166 kB | 11 kB | 7.7/70 kB
Progress (5): 0/2.7 MB | 114/281 kB | 76/166 kB | 11 kB | 7.7/70 kB
Progress (5): 0/2.7 MB | 118/281 kB | 76/166 kB | 11 kB | 7.7/70 kB
Progress (5): 0/2.7 MB | 118/281 kB | 80/166 kB | 11 kB | 7.7/70 kB
Progress (5): 0/2.7 MB | 122/281 kB | 80/166 kB | 11 kB | 7.7/70 kB
Progress (5): 0/2.7 MB | 122/281 kB | 84/166 kB | 11 kB | 7.7/70 kB
Progress (5): 0/2.7 MB | 126/281 kB | 84/166 kB | 11 kB | 7.7/70 kB
Progress (5): 0/2.7 MB | 126/281 kB | 84/166 kB | 11 kB | 12/70 kB 
Progress (5): 0/2.7 MB | 126/281 kB | 88/166 kB | 11 kB | 12/70 kB
Progress (5): 0/2.7 MB | 126/281 kB | 88/166 kB | 11 kB | 16/70 kB
Progress (5): 0/2.7 MB | 130/281 kB | 88/166 kB | 11 kB | 16/70 kB
Progress (5): 0/2.7 MB | 130/281 kB | 92/166 kB | 11 kB | 16/70 kB
Progress (5): 0/2.7 MB | 134/281 kB | 92/166 kB | 11 kB | 16/70 kB
Progress (5): 0/2.7 MB | 134/281 kB | 96/166 kB | 11 kB | 16/70 kB
Progress (5): 0/2.7 MB | 138/281 kB | 96/166 kB | 11 kB | 16/70 kB
Progress (5): 0/2.7 MB | 138/281 kB | 100/166 kB | 11 kB | 16/70 kB
Progress (5): 0/2.7 MB | 138/281 kB | 100/166 kB | 11 kB | 20/70 kB
Progress (5): 0/2.7 MB | 138/281 kB | 104/166 kB | 11 kB | 20/70 kB
Progress (5): 0/2.7 MB | 142/281 kB | 104/166 kB | 11 kB | 20/70 kB
Progress (5): 0/2.7 MB | 142/281 kB | 108/166 kB | 11 kB | 20/70 kB
Progress (5): 0/2.7 MB | 142/281 kB | 108/166 kB | 11 kB | 24/70 kB
Progress (5): 0/2.7 MB | 142/281 kB | 112/166 kB | 11 kB | 24/70 kB
Progress (5): 0/2.7 MB | 146/281 kB | 112/166 kB | 11 kB | 24/70 kB
                                                                   
Downloaded from eclipse.maven.central.mirror: https://repo.eclipse.org/content/repositories/maven_central/org/eclipse/tycho/extras/tycho-buildtimestamp-jgit/1.3.0/tycho-buildtimestamp-jgit-1.3.0.jar (11 kB at 279 kB/s)
12:24:48 Progress (4): 0/2.7 MB | 146/281 kB | 116/166 kB | 24/70 kB
                                                           
Downloading from eclipse.maven.central.mirror: https://repo.eclipse.org/content/repositories/maven_central/org/slf4j/slf4j-api/1.7.2/slf4j-api-1.7.2.jar
12:24:48 Progress (4): 0/2.7 MB | 150/281 kB | 116/166 kB | 24/70 kB
Progress (4): 0/2.7 MB | 150/281 kB | 116/166 kB | 28/70 kB
Progress (4): 0/2.7 MB | 154/281 kB | 116/166 kB | 28/70 kB
Progress (4): 0/2.7 MB | 154/281 kB | 120/166 kB | 28/70 kB
Progress (4): 0/2.7 MB | 154/281 kB | 120/166 kB | 32/70 kB
Progress (4): 0/2.7 MB | 158/281 kB | 120/166 kB | 32/70 kB
Progress (4): 0/2.7 MB | 158/281 kB | 124/166 kB | 32/70 kB
Progress (4): 0/2.7 MB | 162/281 kB | 124/166 kB | 32/70 kB
Progress (4): 0/2.7 MB | 162/281 kB | 124/166 kB | 36/70 kB
Progress (4): 0/2.7 MB | 162/281 kB | 128/166 kB | 36/70 kB
Progress (4): 0/2.7 MB | 162/281 kB | 128/166 kB | 40/70 kB
Progress (4): 0/2.7 MB | 166/281 kB | 128/166 kB | 40/70 kB
Progress (4): 0/2.7 MB | 166/281 kB | 132/166 kB | 40/70 kB
Progress (4): 0/2.7 MB | 170/281 kB | 132/166 kB | 40/70 kB
Progress (4): 0/2.7 MB | 170/281 kB | 132/166 kB | 44/70 kB
Progress (4): 0/2.7 MB | 170/281 kB | 136/166 kB | 44/70 kB
Progress (4): 0/2.7 MB | 170/281 kB | 136/166 kB | 48/70 kB
Progress (4): 0/2.7 MB | 174/281 kB | 136/166 kB | 48/70 kB
Progress (4): 0/2.7 MB | 174/281 kB | 140/166 kB | 48/70 kB
Progress (4): 0/2.7 MB | 178/281 kB | 140/166 kB | 48/70 kB
Progress (4): 0/2.7 MB | 178/281 kB | 140/166 kB | 52/70 kB
Progress (4): 0/2.7 MB | 178/281 kB | 144/166 kB | 52/70 kB
Progress (4): 0/2.7 MB | 178/281 kB | 144/166 kB | 56/70 kB
Progress (4): 0/2.7 MB | 182/281 kB | 144/166 kB | 56/70 kB
Progress (4): 0/2.7 MB | 182/281 kB | 144/166 kB | 60/70 kB
Progress (4): 0/2.7 MB | 182/281 kB | 148/166 kB | 60/70 kB
Progress (4): 0/2.7 MB | 182/281 kB | 148/166 kB | 64/70 kB
Progress (4): 0/2.7 MB | 186/281 kB | 148/166 kB | 64/70 kB
Progress (4): 0/2.7 MB | 186/281 kB | 152/166 kB | 64/70 kB
Progress (4): 0/2.7 MB | 186/281 kB | 152/166 kB | 68/70 kB
Progress (4): 0/2.7 MB | 190/281 kB | 152/166 kB | 68/70 kB
Progress (4): 0/2.7 MB | 190/281 kB | 152/166 kB | 70 kB   
Progress (4): 0/2.7 MB | 190/281 kB | 156/166 kB | 70 kB
Progress (4): 0/2.7 MB | 194/281 kB | 156/166 kB | 70 kB
Progress (4): 0/2.7 MB | 194/281 kB | 160/166 kB | 70 kB
Progress (4): 0/2.7 MB | 198/281 kB | 160/166 kB | 70 kB
Progress (4): 0/2.7 MB | 198/281 kB | 164/166 kB | 70 kB
Progress (4): 0/2.7 MB | 202/281 kB | 164/166 kB | 70 kB
Progress (4): 0/2.7 MB | 202/281 kB | 166 kB | 70 kB    
Progress (4): 0/2.7 MB | 206/281 kB | 166 kB | 70 kB
Progress (4): 0/2.7 MB | 210/281 kB | 166 kB | 70 kB
Progress (4): 0/2.7 MB | 214/281 kB | 166 kB | 70 kB
Progress (4): 0/2.7 MB | 218/281 kB | 166 kB | 70 kB
Progress (4): 0/2.7 MB | 222/281 kB | 166 kB | 70 kB
Progress (4): 0/2.7 MB | 226/281 kB | 166 kB | 70 kB
Progress (4): 0/2.7 MB | 230/281 kB | 166 kB | 70 kB
Progress (4): 0/2.7 MB | 234/281 kB | 166 kB | 70 kB
Progress (4): 0/2.7 MB | 238/281 kB | 166 kB | 70 kB
Progress (4): 0/2.7 MB | 242/281 kB | 166 kB | 70 kB
Progress (4): 0/2.7 MB | 246/281 kB | 166 kB | 70 kB
Progress (4): 0/2.7 MB | 250/281 kB | 166 kB | 70 kB
Progress (4): 0/2.7 MB | 254/281 kB | 166 kB | 70 kB
Progress (4): 0/2.7 MB | 258/281 kB | 166 kB | 70 kB
Progress (4): 0/2.7 MB | 262/281 kB | 166 kB | 70 kB
Progress (4): 0/2.7 MB | 266/281 kB | 166 kB | 70 kB
Progress (4): 0/2.7 MB | 270/281 kB | 166 kB | 70 kB
Progress (5): 0/2.7 MB | 270/281 kB | 166 kB | 70 kB | 4.1/26 kB
Progress (5): 0/2.7 MB | 274/281 kB | 166 kB | 70 kB | 4.1/26 kB
Progress (5): 0/2.7 MB | 274/281 kB | 166 kB | 70 kB | 7.7/26 kB
Progress (5): 0/2.7 MB | 278/281 kB | 166 kB | 70 kB | 7.7/26 kB
Progress (5): 0/2.7 MB | 278/281 kB | 166 kB | 70 kB | 12/26 kB 
                                                               
Downloaded from eclipse.maven.central.mirror: https://repo.eclipse.org/content/repositories/maven_central/com/googlecode/javaewah/JavaEWAH/1.1.6/JavaEWAH-1.1.6.jar (166 kB at 3.4 MB/s)
12:24:48 Progress (4): 0/2.7 MB | 281 kB | 70 kB | 12/26 kB
                                                  
Downloading from eclipse.maven.central.mirror: https://repo.eclipse.org/content/repositories/maven_central/org/eclipse/tycho/extras/tycho-sourceref-jgit/1.3.0/tycho-sourceref-jgit-1.3.0.jar
12:24:48 Downloaded from eclipse.maven.central.mirror: https://repo.eclipse.org/content/repositories/maven_central/com/jcraft/jzlib/1.1.1/jzlib-1.1.1.jar (70 kB at 1.4 MB/s)
12:24:48 Progress (3): 0/2.7 MB | 281 kB | 16/26 kB
Progress (3): 0/2.7 MB | 281 kB | 20/26 kB
Progress (3): 0/2.7 MB | 281 kB | 24/26 kB
Progress (3): 0/2.7 MB | 281 kB | 26 kB   
                                       
Downloaded from eclipse.maven.central.mirror: https://repo.eclipse.org/content/repositories/maven_central/com/jcraft/jsch/0.1.54/jsch-0.1.54.jar (281 kB at 5.2 MB/s)
12:24:48 Progress (3): 0/2.7 MB | 26 kB | 4.1/6.0 kB
Progress (3): 0/2.7 MB | 26 kB | 6.0 kB    
                                       
Downloaded from eclipse.maven.central.mirror: https://repo.eclipse.org/content/repositories/maven_central/org/slf4j/slf4j-api/1.7.2/slf4j-api-1.7.2.jar (26 kB at 450 kB/s)
12:24:48 Downloaded from eclipse.maven.central.mirror: https://repo.eclipse.org/content/repositories/maven_central/org/eclipse/tycho/extras/tycho-sourceref-jgit/1.3.0/tycho-sourceref-jgit-1.3.0.jar (6.0 kB at 93 kB/s)
12:24:49 Progress (1): 0/2.7 MB
Progress (1): 0/2.7 MB
Progress (1): 0.1/2.7 MB
Progress (1): 0.1/2.7 MB
Progress (1): 0.1/2.7 MB
Progress (1): 0.1/2.7 MB
Progress (1): 0.1/2.7 MB
Progress (1): 0.1/2.7 MB
Progress (1): 0.1/2.7 MB
Progress (1): 0.1/2.7 MB
Progress (1): 0.1/2.7 MB
Progress (1): 0.1/2.7 MB
Progress (1): 0.1/2.7 MB
Progress (1): 0.1/2.7 MB
Progress (1): 0.1/2.7 MB
Progress (1): 0.1/2.7 MB
Progress (1): 0.1/2.7 MB
Progress (1): 0.1/2.7 MB
Progress (1): 0.1/2.7 MB
Progress (1): 0.1/2.7 MB
Progress (1): 0.1/2.7 MB
Progress (1): 0.1/2.7 MB
Progress (1): 0.1/2.7 MB
Progress (1): 0.1/2.7 MB
Progress (1): 0.1/2.7 MB
Progress (1): 0.1/2.7 MB
Progress (1): 0.1/2.7 MB
Progress (1): 0.2/2.7 MB
Progress (1): 0.2/2.7 MB
Progress (1): 0.2/2.7 MB
Progress (1): 0.2/2.7 MB
Progress (1): 0.2/2.7 MB
Progress (1): 0.2/2.7 MB
Progress (1): 0.2/2.7 MB
Progress (1): 0.2/2.7 MB
Progress (1): 0.2/2.7 MB
Progress (1): 0.2/2.7 MB
Progress (1): 0.2/2.7 MB
Progress (1): 0.2/2.7 MB
Progress (1): 0.2/2.7 MB
Progress (1): 0.2/2.7 MB
Progress (1): 0.2/2.7 MB
Progress (1): 0.2/2.7 MB
Progress (1): 0.2/2.7 MB
Progress (1): 0.2/2.7 MB
Progress (1): 0.2/2.7 MB
Progress (1): 0.2/2.7 MB
Progress (1): 0.2/2.7 MB
Progress (1): 0.2/2.7 MB
Progress (1): 0.2/2.7 MB
Progress (1): 0.2/2.7 MB
Progress (1): 0.2/2.7 MB
Progress (1): 0.3/2.7 MB
Progress (1): 0.3/2.7 MB
Progress (1): 0.3/2.7 MB
Progress (1): 0.3/2.7 MB
Progress (1): 0.3/2.7 MB
Progress (1): 0.3/2.7 MB
Progress (1): 0.3/2.7 MB
Progress (1): 0.3/2.7 MB
Progress (1): 0.3/2.7 MB
Progress (1): 0.3/2.7 MB
Progress (1): 0.3/2.7 MB
Progress (1): 0.3/2.7 MB
Progress (1): 0.3/2.7 MB
Progress (1): 0.3/2.7 MB
Progress (1): 0.3/2.7 MB
Progress (1): 0.3/2.7 MB
Progress (1): 0.3/2.7 MB
Progress (1): 0.3/2.7 MB
Progress (1): 0.3/2.7 MB
Progress (1): 0.3/2.7 MB
Progress (1): 0.3/2.7 MB
Progress (1): 0.3/2.7 MB
Progress (1): 0.3/2.7 MB
Progress (1): 0.3/2.7 MB
Progress (1): 0.3/2.7 MB
Progress (1): 0.4/2.7 MB
Progress (1): 0.4/2.7 MB
Progress (1): 0.4/2.7 MB
Progress (1): 0.4/2.7 MB
Progress (1): 0.4/2.7 MB
Progress (1): 0.4/2.7 MB
Progress (1): 0.4/2.7 MB
Progress (1): 0.4/2.7 MB
Progress (1): 0.4/2.7 MB
Progress (1): 0.4/2.7 MB
Progress (1): 0.4/2.7 MB
Progress (1): 0.4/2.7 MB
Progress (1): 0.4/2.7 MB
Progress (1): 0.4/2.7 MB
Progress (1): 0.4/2.7 MB
Progress (1): 0.4/2.7 MB
Progress (1): 0.4/2.7 MB
Progress (1): 0.4/2.7 MB
Progress (1): 0.4/2.7 MB
Progress (1): 0.4/2.7 MB
Progress (1): 0.4/2.7 MB
Progress (1): 0.4/2.7 MB
Progress (1): 0.4/2.7 MB
Progress (1): 0.4/2.7 MB
Progress (1): 0.4/2.7 MB
Progress (1): 0.5/2.7 MB
Progress (1): 0.5/2.7 MB
Progress (1): 0.5/2.7 MB
Progress (1): 0.5/2.7 MB
Progress (1): 0.5/2.7 MB
Progress (1): 0.5/2.7 MB
Progress (1): 0.5/2.7 MB
Progress (1): 0.5/2.7 MB
Progress (1): 0.5/2.7 MB
Progress (1): 0.5/2.7 MB
Progress (1): 0.5/2.7 MB
Progress (1): 0.5/2.7 MB
Progress (1): 0.5/2.7 MB
Progress (1): 0.5/2.7 MB
Progress (1): 0.5/2.7 MB
Progress (1): 0.5/2.7 MB
Progress (1): 0.5/2.7 MB
Progress (1): 0.5/2.7 MB
Progress (1): 0.5/2.7 MB
Progress (1): 0.5/2.7 MB
Progress (1): 0.5/2.7 MB
Progress (1): 0.5/2.7 MB
Progress (1): 0.5/2.7 MB
Progress (1): 0.5/2.7 MB
Progress (1): 0.5/2.7 MB
Progress (1): 0.6/2.7 MB
Progress (1): 0.6/2.7 MB
Progress (1): 0.6/2.7 MB
Progress (1): 0.6/2.7 MB
Progress (1): 0.6/2.7 MB
Progress (1): 0.6/2.7 MB
Progress (1): 0.6/2.7 MB
Progress (1): 0.6/2.7 MB
Progress (1): 0.6/2.7 MB
Progress (1): 0.6/2.7 MB
Progress (1): 0.6/2.7 MB
Progress (1): 0.6/2.7 MB
Progress (1): 0.6/2.7 MB
Progress (1): 0.6/2.7 MB
Progress (1): 0.6/2.7 MB
Progress (1): 0.6/2.7 MB
Progress (1): 0.6/2.7 MB
Progress (1): 0.6/2.7 MB
Progress (1): 0.6/2.7 MB
Progress (1): 0.6/2.7 MB
Progress (1): 0.6/2.7 MB
Progress (1): 0.6/2.7 MB
Progress (1): 0.6/2.7 MB
Progress (1): 0.6/2.7 MB
Progress (1): 0.6/2.7 MB
Progress (1): 0.7/2.7 MB
Progress (1): 0.7/2.7 MB
Progress (1): 0.7/2.7 MB
Progress (1): 0.7/2.7 MB
Progress (1): 0.7/2.7 MB
Progress (1): 0.7/2.7 MB
Progress (1): 0.7/2.7 MB
Progress (1): 0.7/2.7 MB
Progress (1): 0.7/2.7 MB
Progress (1): 0.7/2.7 MB
Progress (1): 0.7/2.7 MB
Progress (1): 0.7/2.7 MB
Progress (1): 0.7/2.7 MB
Progress (1): 0.7/2.7 MB
Progress (1): 0.7/2.7 MB
Progress (1): 0.7/2.7 MB
Progress (1): 0.7/2.7 MB
Progress (1): 0.7/2.7 MB
Progress (1): 0.7/2.7 MB
Progress (1): 0.7/2.7 MB
Progress (1): 0.7/2.7 MB
Progress (1): 0.7/2.7 MB
Progress (1): 0.7/2.7 MB
Progress (1): 0.7/2.7 MB
Progress (1): 0.7/2.7 MB
Progress (1): 0.8/2.7 MB
Progress (1): 0.8/2.7 MB
Progress (1): 0.8/2.7 MB
Progress (1): 0.8/2.7 MB
Progress (1): 0.8/2.7 MB
Progress (1): 0.8/2.7 MB
Progress (1): 0.8/2.7 MB
Progress (1): 0.8/2.7 MB
Progress (1): 0.8/2.7 MB
Progress (1): 0.8/2.7 MB
Progress (1): 0.8/2.7 MB
Progress (1): 0.8/2.7 MB
Progress (1): 0.8/2.7 MB
Progress (1): 0.8/2.7 MB
Progress (1): 0.8/2.7 MB
Progress (1): 0.8/2.7 MB
Progress (1): 0.8/2.7 MB
Progress (1): 0.8/2.7 MB
Progress (1): 0.8/2.7 MB
Progress (1): 0.8/2.7 MB
Progress (1): 0.8/2.7 MB
Progress (1): 0.8/2.7 MB
Progress (1): 0.8/2.7 MB
Progress (1): 0.8/2.7 MB
Progress (1): 0.8/2.7 MB
Progress (1): 0.9/2.7 MB
Progress (1): 0.9/2.7 MB
Progress (1): 0.9/2.7 MB
Progress (1): 0.9/2.7 MB
Progress (1): 0.9/2.7 MB
Progress (1): 0.9/2.7 MB
Progress (1): 0.9/2.7 MB
Progress (1): 0.9/2.7 MB
Progress (1): 0.9/2.7 MB
Progress (1): 0.9/2.7 MB
Progress (1): 0.9/2.7 MB
Progress (1): 0.9/2.7 MB
Progress (1): 0.9/2.7 MB
Progress (1): 0.9/2.7 MB
Progress (1): 0.9/2.7 MB
Progress (1): 0.9/2.7 MB
Progress (1): 0.9/2.7 MB
Progress (1): 0.9/2.7 MB
Progress (1): 0.9/2.7 MB
Progress (1): 0.9/2.7 MB
Progress (1): 0.9/2.7 MB
Progress (1): 0.9/2.7 MB
Progress (1): 0.9/2.7 MB
Progress (1): 0.9/2.7 MB
Progress (1): 0.9/2.7 MB
Progress (1): 1.0/2.7 MB
Progress (1): 1.0/2.7 MB
Progress (1): 1.0/2.7 MB
Progress (1): 1.0/2.7 MB
Progress (1): 1.0/2.7 MB
Progress (1): 1.0/2.7 MB
Progress (1): 1.0/2.7 MB
Progress (1): 1.0/2.7 MB
Progress (1): 1.0/2.7 MB
Progress (1): 1.0/2.7 MB
Progress (1): 1.0/2.7 MB
Progress (1): 1.0/2.7 MB
Progress (1): 1.0/2.7 MB
Progress (1): 1.0/2.7 MB
Progress (1): 1.0/2.7 MB
Progress (1): 1.0/2.7 MB
Progress (1): 1.0/2.7 MB
Progress (1): 1.0/2.7 MB
Progress (1): 1.0/2.7 MB
Progress (1): 1.0/2.7 MB
Progress (1): 1.0/2.7 MB
Progress (1): 1.0/2.7 MB
Progress (1): 1.0/2.7 MB
Progress (1): 1.0/2.7 MB
Progress (1): 1.0/2.7 MB
Progress (1): 1.1/2.7 MB
Progress (1): 1.1/2.7 MB
Progress (1): 1.1/2.7 MB
Progress (1): 1.1/2.7 MB
Progress (1): 1.1/2.7 MB
Progress (1): 1.1/2.7 MB
Progress (1): 1.1/2.7 MB
Progress (1): 1.1/2.7 MB
Progress (1): 1.1/2.7 MB
Progress (1): 1.1/2.7 MB
Progress (1): 1.1/2.7 MB
Progress (1): 1.1/2.7 MB
Progress (1): 1.1/2.7 MB
Progress (1): 1.1/2.7 MB
Progress (1): 1.1/2.7 MB
Progress (1): 1.1/2.7 MB
Progress (1): 1.1/2.7 MB
Progress (1): 1.1/2.7 MB
Progress (1): 1.1/2.7 MB
Progress (1): 1.1/2.7 MB
Progress (1): 1.1/2.7 MB
Progress (1): 1.1/2.7 MB
Progress (1): 1.1/2.7 MB
Progress (1): 1.1/2.7 MB
Progress (1): 1.1/2.7 MB
Progress (1): 1.2/2.7 MB
Progress (1): 1.2/2.7 MB
Progress (1): 1.2/2.7 MB
Progress (1): 1.2/2.7 MB
Progress (1): 1.2/2.7 MB
Progress (1): 1.2/2.7 MB
Progress (1): 1.2/2.7 MB
Progress (1): 1.2/2.7 MB
Progress (1): 1.2/2.7 MB
Progress (1): 1.2/2.7 MB
Progress (1): 1.2/2.7 MB
Progress (1): 1.2/2.7 MB
Progress (1): 1.2/2.7 MB
Progress (1): 1.2/2.7 MB
Progress (1): 1.2/2.7 MB
Progress (1): 1.2/2.7 MB
Progress (1): 1.2/2.7 MB
Progress (1): 1.2/2.7 MB
Progress (1): 1.2/2.7 MB
Progress (1): 1.2/2.7 MB
Progress (1): 1.2/2.7 MB
Progress (1): 1.2/2.7 MB
Progress (1): 1.2/2.7 MB
Progress (1): 1.2/2.7 MB
Progress (1): 1.2/2.7 MB
Progress (1): 1.3/2.7 MB
Progress (1): 1.3/2.7 MB
Progress (1): 1.3/2.7 MB
Progress (1): 1.3/2.7 MB
Progress (1): 1.3/2.7 MB
Progress (1): 1.3/2.7 MB
Progress (1): 1.3/2.7 MB
Progress (1): 1.3/2.7 MB
Progress (1): 1.3/2.7 MB
Progress (1): 1.3/2.7 MB
Progress (1): 1.3/2.7 MB
Progress (1): 1.3/2.7 MB
Progress (1): 1.3/2.7 MB
Progress (1): 1.3/2.7 MB
Progress (1): 1.3/2.7 MB
Progress (1): 1.3/2.7 MB
Progress (1): 1.3/2.7 MB
Progress (1): 1.3/2.7 MB
Progress (1): 1.3/2.7 MB
Progress (1): 1.3/2.7 MB
Progress (1): 1.3/2.7 MB
Progress (1): 1.3/2.7 MB
Progress (1): 1.3/2.7 MB
Progress (1): 1.3/2.7 MB
Progress (1): 1.3/2.7 MB
Progress (1): 1.4/2.7 MB
Progress (1): 1.4/2.7 MB
Progress (1): 1.4/2.7 MB
Progress (1): 1.4/2.7 MB
Progress (1): 1.4/2.7 MB
Progress (1): 1.4/2.7 MB
Progress (1): 1.4/2.7 MB
Progress (1): 1.4/2.7 MB
Progress (1): 1.4/2.7 MB
Progress (1): 1.4/2.7 MB
Progress (1): 1.4/2.7 MB
Progress (1): 1.4/2.7 MB
Progress (1): 1.4/2.7 MB
Progress (1): 1.4/2.7 MB
Progress (1): 1.4/2.7 MB
Progress (1): 1.4/2.7 MB
Progress (1): 1.4/2.7 MB
Progress (1): 1.4/2.7 MB
Progress (1): 1.4/2.7 MB
Progress (1): 1.4/2.7 MB
Progress (1): 1.4/2.7 MB
Progress (1): 1.4/2.7 MB
Progress (1): 1.4/2.7 MB
Progress (1): 1.4/2.7 MB
Progress (1): 1.4/2.7 MB
Progress (1): 1.5/2.7 MB
Progress (1): 1.5/2.7 MB
Progress (1): 1.5/2.7 MB
Progress (1): 1.5/2.7 MB
Progress (1): 1.5/2.7 MB
Progress (1): 1.5/2.7 MB
Progress (1): 1.5/2.7 MB
Progress (1): 1.5/2.7 MB
Progress (1): 1.5/2.7 MB
Progress (1): 1.5/2.7 MB
Progress (1): 1.5/2.7 MB
Progress (1): 1.5/2.7 MB
Progress (1): 1.5/2.7 MB
Progress (1): 1.5/2.7 MB
Progress (1): 1.5/2.7 MB
Progress (1): 1.5/2.7 MB
Progress (1): 1.5/2.7 MB
Progress (1): 1.5/2.7 MB
Progress (1): 1.5/2.7 MB
Progress (1): 1.5/2.7 MB
Progress (1): 1.5/2.7 MB
Progress (1): 1.5/2.7 MB
Progress (1): 1.5/2.7 MB
Progress (1): 1.5/2.7 MB
Progress (1): 1.5/2.7 MB
Progress (1): 1.6/2.7 MB
Progress (1): 1.6/2.7 MB
Progress (1): 1.6/2.7 MB
Progress (1): 1.6/2.7 MB
Progress (1): 1.6/2.7 MB
Progress (1): 1.6/2.7 MB
Progress (1): 1.6/2.7 MB
Progress (1): 1.6/2.7 MB
Progress (1): 1.6/2.7 MB
Progress (1): 1.6/2.7 MB
Progress (1): 1.6/2.7 MB
Progress (1): 1.6/2.7 MB
Progress (1): 1.6/2.7 MB
Progress (1): 1.6/2.7 MB
Progress (1): 1.6/2.7 MB
Progress (1): 1.6/2.7 MB
Progress (1): 1.6/2.7 MB
Progress (1): 1.6/2.7 MB
Progress (1): 1.6/2.7 MB
Progress (1): 1.6/2.7 MB
Progress (1): 1.6/2.7 MB
Progress (1): 1.6/2.7 MB
Progress (1): 1.6/2.7 MB
Progress (1): 1.6/2.7 MB
Progress (1): 1.6/2.7 MB
Progress (1): 1.7/2.7 MB
Progress (1): 1.7/2.7 MB
Progress (1): 1.7/2.7 MB
Progress (1): 1.7/2.7 MB
Progress (1): 1.7/2.7 MB
Progress (1): 1.7/2.7 MB
Progress (1): 1.7/2.7 MB
Progress (1): 1.7/2.7 MB
Progress (1): 1.7/2.7 MB
Progress (1): 1.7/2.7 MB
Progress (1): 1.7/2.7 MB
Progress (1): 1.7/2.7 MB
Progress (1): 1.7/2.7 MB
Progress (1): 1.7/2.7 MB
Progress (1): 1.7/2.7 MB
Progress (1): 1.7/2.7 MB
Progress (1): 1.7/2.7 MB
Progress (1): 1.7/2.7 MB
Progress (1): 1.7/2.7 MB
Progress (1): 1.7/2.7 MB
Progress (1): 1.7/2.7 MB
Progress (1): 1.7/2.7 MB
Progress (1): 1.7/2.7 MB
Progress (1): 1.7/2.7 MB
Progress (1): 1.7/2.7 MB
Progress (1): 1.8/2.7 MB
Progress (1): 1.8/2.7 MB
Progress (1): 1.8/2.7 MB
Progress (1): 1.8/2.7 MB
Progress (1): 1.8/2.7 MB
Progress (1): 1.8/2.7 MB
Progress (1): 1.8/2.7 MB
Progress (1): 1.8/2.7 MB
Progress (1): 1.8/2.7 MB
Progress (1): 1.8/2.7 MB
Progress (1): 1.8/2.7 MB
Progress (1): 1.8/2.7 MB
Progress (1): 1.8/2.7 MB
Progress (1): 1.8/2.7 MB
Progress (1): 1.8/2.7 MB
Progress (1): 1.8/2.7 MB
Progress (1): 1.8/2.7 MB
Progress (1): 1.8/2.7 MB
Progress (1): 1.8/2.7 MB
Progress (1): 1.8/2.7 MB
Progress (1): 1.8/2.7 MB
Progress (1): 1.8/2.7 MB
Progress (1): 1.8/2.7 MB
Progress (1): 1.8/2.7 MB
Progress (1): 1.8/2.7 MB
Progress (1): 1.9/2.7 MB
Progress (1): 1.9/2.7 MB
Progress (1): 1.9/2.7 MB
Progress (1): 1.9/2.7 MB
Progress (1): 1.9/2.7 MB
Progress (1): 1.9/2.7 MB
Progress (1): 1.9/2.7 MB
Progress (1): 1.9/2.7 MB
Progress (1): 1.9/2.7 MB
Progress (1): 1.9/2.7 MB
Progress (1): 1.9/2.7 MB
Progress (1): 1.9/2.7 MB
Progress (1): 1.9/2.7 MB
Progress (1): 1.9/2.7 MB
Progress (1): 1.9/2.7 MB
Progress (1): 1.9/2.7 MB
Progress (1): 1.9/2.7 MB
Progress (1): 1.9/2.7 MB
Progress (1): 1.9/2.7 MB
Progress (1): 1.9/2.7 MB
Progress (1): 1.9/2.7 MB
Progress (1): 1.9/2.7 MB
Progress (1): 1.9/2.7 MB
Progress (1): 1.9/2.7 MB
Progress (1): 1.9/2.7 MB
Progress (1): 2.0/2.7 MB
Progress (1): 2.0/2.7 MB
Progress (1): 2.0/2.7 MB
Progress (1): 2.0/2.7 MB
Progress (1): 2.0/2.7 MB
Progress (1): 2.0/2.7 MB
Progress (1): 2.0/2.7 MB
Progress (1): 2.0/2.7 MB
Progress (1): 2.0/2.7 MB
Progress (1): 2.0/2.7 MB
Progress (1): 2.0/2.7 MB
Progress (1): 2.0/2.7 MB
Progress (1): 2.0/2.7 MB
Progress (1): 2.0/2.7 MB
Progress (1): 2.0/2.7 MB
Progress (1): 2.0/2.7 MB
Progress (1): 2.0/2.7 MB
Progress (1): 2.0/2.7 MB
Progress (1): 2.0/2.7 MB
Progress (1): 2.0/2.7 MB
Progress (1): 2.0/2.7 MB
Progress (1): 2.0/2.7 MB
Progress (1): 2.0/2.7 MB
Progress (1): 2.0/2.7 MB
Progress (1): 2.0/2.7 MB
Progress (1): 2.1/2.7 MB
Progress (1): 2.1/2.7 MB
Progress (1): 2.1/2.7 MB
Progress (1): 2.1/2.7 MB
Progress (1): 2.1/2.7 MB
Progress (1): 2.1/2.7 MB
Progress (1): 2.1/2.7 MB
Progress (1): 2.1/2.7 MB
Progress (1): 2.1/2.7 MB
Progress (1): 2.1/2.7 MB
Progress (1): 2.1/2.7 MB
Progress (1): 2.1/2.7 MB
Progress (1): 2.1/2.7 MB
Progress (1): 2.1/2.7 MB
Progress (1): 2.1/2.7 MB
Progress (1): 2.1/2.7 MB
Progress (1): 2.1/2.7 MB
Progress (1): 2.1/2.7 MB
Progress (1): 2.1/2.7 MB
Progress (1): 2.1/2.7 MB
Progress (1): 2.1/2.7 MB
Progress (1): 2.1/2.7 MB
Progress (1): 2.1/2.7 MB
Progress (1): 2.1/2.7 MB
Progress (1): 2.1/2.7 MB
Progress (1): 2.2/2.7 MB
Progress (1): 2.2/2.7 MB
Progress (1): 2.2/2.7 MB
Progress (1): 2.2/2.7 MB
Progress (1): 2.2/2.7 MB
Progress (1): 2.2/2.7 MB
Progress (1): 2.2/2.7 MB
Progress (1): 2.2/2.7 MB
Progress (1): 2.2/2.7 MB
Progress (1): 2.2/2.7 MB
Progress (1): 2.2/2.7 MB
Progress (1): 2.2/2.7 MB
Progress (1): 2.2/2.7 MB
Progress (1): 2.2/2.7 MB
Progress (1): 2.2/2.7 MB
Progress (1): 2.2/2.7 MB
Progress (1): 2.2/2.7 MB
Progress (1): 2.2/2.7 MB
Progress (1): 2.2/2.7 MB
Progress (1): 2.2/2.7 MB
Progress (1): 2.2/2.7 MB
Progress (1): 2.2/2.7 MB
Progress (1): 2.2/2.7 MB
Progress (1): 2.2/2.7 MB
Progress (1): 2.2/2.7 MB
Progress (1): 2.3/2.7 MB
Progress (1): 2.3/2.7 MB
Progress (1): 2.3/2.7 MB
Progress (1): 2.3/2.7 MB
Progress (1): 2.3/2.7 MB
Progress (1): 2.3/2.7 MB
Progress (1): 2.3/2.7 MB
Progress (1): 2.3/2.7 MB
Progress (1): 2.3/2.7 MB
Progress (1): 2.3/2.7 MB
Progress (1): 2.3/2.7 MB
Progress (1): 2.3/2.7 MB
Progress (1): 2.3/2.7 MB
Progress (1): 2.3/2.7 MB
Progress (1): 2.3/2.7 MB
Progress (1): 2.3/2.7 MB
Progress (1): 2.3/2.7 MB
Progress (1): 2.3/2.7 MB
Progress (1): 2.3/2.7 MB
Progress (1): 2.3/2.7 MB
Progress (1): 2.3/2.7 MB
Progress (1): 2.3/2.7 MB
Progress (1): 2.3/2.7 MB
Progress (1): 2.3/2.7 MB
Progress (1): 2.3/2.7 MB
Progress (1): 2.4/2.7 MB
Progress (1): 2.4/2.7 MB
Progress (1): 2.4/2.7 MB
Progress (1): 2.4/2.7 MB
Progress (1): 2.4/2.7 MB
Progress (1): 2.4/2.7 MB
Progress (1): 2.4/2.7 MB
Progress (1): 2.4/2.7 MB
Progress (1): 2.4/2.7 MB
Progress (1): 2.4/2.7 MB
Progress (1): 2.4/2.7 MB
Progress (1): 2.4/2.7 MB
Progress (1): 2.4/2.7 MB
Progress (1): 2.4/2.7 MB
Progress (1): 2.4/2.7 MB
Progress (1): 2.4/2.7 MB
Progress (1): 2.4/2.7 MB
Progress (1): 2.4/2.7 MB
Progress (1): 2.4/2.7 MB
Progress (1): 2.4/2.7 MB
Progress (1): 2.4/2.7 MB
Progress (1): 2.4/2.7 MB
Progress (1): 2.4/2.7 MB
Progress (1): 2.4/2.7 MB
Progress (1): 2.4/2.7 MB
Progress (1): 2.5/2.7 MB
Progress (1): 2.5/2.7 MB
Progress (1): 2.5/2.7 MB
Progress (1): 2.5/2.7 MB
Progress (1): 2.5/2.7 MB
Progress (1): 2.5/2.7 MB
Progress (1): 2.5/2.7 MB
Progress (1): 2.5/2.7 MB
Progress (1): 2.5/2.7 MB
Progress (1): 2.5/2.7 MB
Progress (1): 2.5/2.7 MB
Progress (1): 2.5/2.7 MB
Progress (1): 2.5/2.7 MB
Progress (1): 2.5/2.7 MB
Progress (1): 2.5/2.7 MB
Progress (1): 2.5/2.7 MB
Progress (1): 2.5/2.7 MB
Progress (1): 2.5/2.7 MB
Progress (1): 2.5/2.7 MB
Progress (1): 2.5/2.7 MB
Progress (1): 2.5/2.7 MB
Progress (1): 2.5/2.7 MB
Progress (1): 2.5/2.7 MB
Progress (1): 2.5/2.7 MB
Progress (1): 2.5/2.7 MB
Progress (1): 2.6/2.7 MB
Progress (1): 2.6/2.7 MB
Progress (1): 2.6/2.7 MB
Progress (1): 2.6/2.7 MB
Progress (1): 2.6/2.7 MB
Progress (1): 2.6/2.7 MB
Progress (1): 2.6/2.7 MB
Progress (1): 2.6/2.7 MB
Progress (1): 2.6/2.7 MB
Progress (1): 2.6/2.7 MB
Progress (1): 2.6/2.7 MB
Progress (1): 2.6/2.7 MB
Progress (1): 2.6/2.7 MB
Progress (1): 2.6/2.7 MB
Progress (1): 2.6/2.7 MB
Progress (1): 2.6/2.7 MB
Progress (1): 2.6/2.7 MB
Progress (1): 2.6/2.7 MB
Progress (1): 2.6/2.7 MB
Progress (1): 2.6/2.7 MB
Progress (1): 2.6/2.7 MB
Progress (1): 2.6/2.7 MB
Progress (1): 2.6/2.7 MB
Progress (1): 2.6/2.7 MB
Progress (1): 2.6/2.7 MB
Progress (1): 2.7/2.7 MB
Progress (1): 2.7/2.7 MB
Progress (1): 2.7/2.7 MB
Progress (1): 2.7/2.7 MB
Progress (1): 2.7/2.7 MB
Progress (1): 2.7/2.7 MB
Progress (1): 2.7/2.7 MB
Progress (1): 2.7/2.7 MB
Progress (1): 2.7 MB    
                    
Downloaded from eclipse.maven.central.mirror: https://repo.eclipse.org/content/repositories/maven_central/org/eclipse/jgit/org.eclipse.jgit/5.1.3.201810200350-r/org.eclipse.jgit-5.1.3.201810200350-r.jar (2.7 MB at 2.0 MB/s)
12:24:50 [INFO] The project's OSGi version is 2.2.200.v20180921-1416
12:24:50 [INFO] 
12:24:50 [INFO] --- tycho-packaging-plugin:1.3.0:validate-id (default-validate-id) @ org.eclipse.jdt.annotation ---
12:24:50 [INFO] 
12:24:50 [INFO] --- tycho-packaging-plugin:1.3.0:validate-version (default-validate-version) @ org.eclipse.jdt.annotation ---
12:24:50 [INFO] 
12:24:50 [INFO] --- maven-resources-plugin:3.1.0:copy-resources (saveproperties) @ org.eclipse.jdt.annotation ---
12:24:50 [INFO] Using 'UTF-8' encoding to copy filtered resources.
12:24:50 [INFO] skip non existing resourceDirectory /jobs/genie.jdt/eclipse.jdt.core-Gerrit/workspace/org.eclipse.jdt.annotation/saveproperties
12:24:50 [INFO] 
12:24:50 [INFO] --- maven-enforcer-plugin:3.0.0-M2:enforce (enforce-maven) @ org.eclipse.jdt.annotation ---
12:24:50 [INFO] 
12:24:50 [INFO] --- eclipse-cbi-plugin:1.1.5:generate-api-build-xml (default) @ org.eclipse.jdt.annotation ---
12:24:50 Generating target/.apibuild.xml
12:24:50 [INFO] 
12:24:50 [INFO] --- maven-resources-plugin:3.1.0:resources (default-resources) @ org.eclipse.jdt.annotation ---
12:24:50 [INFO] Using 'UTF-8' encoding to copy filtered resources.
12:24:50 [INFO] skip non existing resourceDirectory /jobs/genie.jdt/eclipse.jdt.core-Gerrit/workspace/org.eclipse.jdt.annotation/src/main/resources
12:24:50 [INFO] 
12:24:50 [INFO] --- maven-resources-plugin:3.1.0:resources (filter-resources) @ org.eclipse.jdt.annotation ---
12:24:50 [INFO] Using 'UTF-8' encoding to copy filtered resources.
12:24:50 [INFO] skip non existing resourceDirectory /jobs/genie.jdt/eclipse.jdt.core-Gerrit/workspace/org.eclipse.jdt.annotation/src/main/resources
12:24:50 [INFO] 
12:24:50 [INFO] --- tycho-compiler-plugin:1.3.0:compile (default-compile) @ org.eclipse.jdt.annotation ---
12:24:50 Downloading from tycho-snapshots: https://repo.eclipse.org/content/repositories/tycho-snapshots/org/eclipse/jdt/ecj/3.17.0.v20190106-1040/ecj-3.17.0.v20190106-1040.pom
12:24:50 Downloading from cbi-jdt: https://repo.eclipse.org/content/repositories/eclipse-staging/org/eclipse/jdt/ecj/3.17.0.v20190106-1040/ecj-3.17.0.v20190106-1040.pom
12:24:50 Progress (1): 407 B
                   
Downloaded from cbi-jdt: https://repo.eclipse.org/content/repositories/eclipse-staging/org/eclipse/jdt/ecj/3.17.0.v20190106-1040/ecj-3.17.0.v20190106-1040.pom (407 B at 20 kB/s)
12:24:50 Downloading from tycho-snapshots: https://repo.eclipse.org/content/repositories/tycho-snapshots/org/codehaus/plexus/plexus-compiler-manager/2.2/plexus-compiler-manager-2.2.pom
12:24:50 Downloading from cbi-jdt: https://repo.eclipse.org/content/repositories/eclipse-staging/org/codehaus/plexus/plexus-compiler-manager/2.2/plexus-compiler-manager-2.2.pom
12:24:50 Downloading from eclipse: https://repo.eclipse.org/content/repositories/cbi/org/codehaus/plexus/plexus-compiler-manager/2.2/plexus-compiler-manager-2.2.pom
12:24:50 Downloading from eclipse.maven.central.mirror: https://repo.eclipse.org/content/repositories/maven_central/org/codehaus/plexus/plexus-compiler-manager/2.2/plexus-compiler-manager-2.2.pom
12:24:50 Progress (1): 690 B
                   
Downloaded from eclipse.maven.central.mirror: https://repo.eclipse.org/content/repositories/maven_central/org/codehaus/plexus/plexus-compiler-manager/2.2/plexus-compiler-manager-2.2.pom (690 B at 41 kB/s)
12:24:50 Downloading from tycho-snapshots: https://repo.eclipse.org/content/repositories/tycho-snapshots/org/codehaus/plexus/plexus-compiler/2.2/plexus-compiler-2.2.pom
12:24:50 Downloading from cbi-jdt: https://repo.eclipse.org/content/repositories/eclipse-staging/org/codehaus/plexus/plexus-compiler/2.2/plexus-compiler-2.2.pom
12:24:50 Downloading from eclipse: https://repo.eclipse.org/content/repositories/cbi/org/codehaus/plexus/plexus-compiler/2.2/plexus-compiler-2.2.pom
12:24:50 Downloading from eclipse.maven.central.mirror: https://repo.eclipse.org/content/repositories/maven_central/org/codehaus/plexus/plexus-compiler/2.2/plexus-compiler-2.2.pom
12:24:50 Progress (1): 3.6 kB
                    
Downloaded from eclipse.maven.central.mirror: https://repo.eclipse.org/content/repositories/maven_central/org/codehaus/plexus/plexus-compiler/2.2/plexus-compiler-2.2.pom (3.6 kB at 117 kB/s)
12:24:50 Downloading from tycho-snapshots: https://repo.eclipse.org/content/repositories/tycho-snapshots/org/codehaus/plexus/plexus-compiler-api/2.2/plexus-compiler-api-2.2.pom
12:24:50 Downloading from cbi-jdt: https://repo.eclipse.org/content/repositories/eclipse-staging/org/codehaus/plexus/plexus-compiler-api/2.2/plexus-compiler-api-2.2.pom
12:24:50 Downloading from eclipse: https://repo.eclipse.org/content/repositories/cbi/org/codehaus/plexus/plexus-compiler-api/2.2/plexus-compiler-api-2.2.pom
12:24:51 Downloading from eclipse.maven.central.mirror: https://repo.eclipse.org/content/repositories/maven_central/org/codehaus/plexus/plexus-compiler-api/2.2/plexus-compiler-api-2.2.pom
12:24:51 Progress (1): 865 B
                   
Downloaded from eclipse.maven.central.mirror: https://repo.eclipse.org/content/repositories/maven_central/org/codehaus/plexus/plexus-compiler-api/2.2/plexus-compiler-api-2.2.pom (865 B at 33 kB/s)
12:24:51 Downloading from tycho-snapshots: https://repo.eclipse.org/content/repositories/tycho-snapshots/org/eclipse/tycho/tycho-compiler-jdt/1.3.0/tycho-compiler-jdt-1.3.0.pom
12:24:51 Downloading from cbi-jdt: https://repo.eclipse.org/content/repositories/eclipse-staging/org/eclipse/tycho/tycho-compiler-jdt/1.3.0/tycho-compiler-jdt-1.3.0.pom
12:24:51 Downloading from eclipse: https://repo.eclipse.org/content/repositories/cbi/org/eclipse/tycho/tycho-compiler-jdt/1.3.0/tycho-compiler-jdt-1.3.0.pom
12:24:51 Downloading from eclipse.maven.central.mirror: https://repo.eclipse.org/content/repositories/maven_central/org/eclipse/tycho/tycho-compiler-jdt/1.3.0/tycho-compiler-jdt-1.3.0.pom
12:24:51 Progress (1): 2.4 kB
                    
Downloaded from eclipse.maven.central.mirror: https://repo.eclipse.org/content/repositories/maven_central/org/eclipse/tycho/tycho-compiler-jdt/1.3.0/tycho-compiler-jdt-1.3.0.pom (2.4 kB at 82 kB/s)
12:24:51 Downloading from tycho-snapshots: https://repo.eclipse.org/content/repositories/tycho-snapshots/org/eclipse/tycho/tycho-lib-detector/1.3.0/tycho-lib-detector-1.3.0.pom
12:24:51 Downloading from cbi-jdt: https://repo.eclipse.org/content/repositories/eclipse-staging/org/eclipse/tycho/tycho-lib-detector/1.3.0/tycho-lib-detector-1.3.0.pom
12:24:51 Downloading from eclipse: https://repo.eclipse.org/content/repositories/cbi/org/eclipse/tycho/tycho-lib-detector/1.3.0/tycho-lib-detector-1.3.0.pom
12:24:51 Downloading from eclipse.maven.central.mirror: https://repo.eclipse.org/content/repositories/maven_central/org/eclipse/tycho/tycho-lib-detector/1.3.0/tycho-lib-detector-1.3.0.pom
12:24:51 Progress (1): 1.6 kB
                    
Downloaded from eclipse.maven.central.mirror: https://repo.eclipse.org/content/repositories/maven_central/org/eclipse/tycho/tycho-lib-detector/1.3.0/tycho-lib-detector-1.3.0.pom (1.6 kB at 52 kB/s)
12:24:51 Downloading from tycho-snapshots: https://repo.eclipse.org/content/repositories/tycho-snapshots/org/eclipse/jdt/ecj/3.15.1/ecj-3.15.1.pom
12:24:51 Downloading from cbi-jdt: https://repo.eclipse.org/content/repositories/eclipse-staging/org/eclipse/jdt/ecj/3.15.1/ecj-3.15.1.pom
12:24:51 Downloading from eclipse: https://repo.eclipse.org/content/repositories/cbi/org/eclipse/jdt/ecj/3.15.1/ecj-3.15.1.pom
12:24:51 Downloading from eclipse.maven.central.mirror: https://repo.eclipse.org/content/repositories/maven_central/org/eclipse/jdt/ecj/3.15.1/ecj-3.15.1.pom
12:24:51 Progress (1): 1.7 kB
                    
Downloaded from eclipse.maven.central.mirror: https://repo.eclipse.org/content/repositories/maven_central/org/eclipse/jdt/ecj/3.15.1/ecj-3.15.1.pom (1.7 kB at 57 kB/s)
12:24:51 Downloading from tycho-snapshots: https://repo.eclipse.org/content/repositories/tycho-snapshots/org/eclipse/jdt/ecj/3.17.0.v20190106-1040/ecj-3.17.0.v20190106-1040.jar
12:24:51 Downloading from tycho-snapshots: https://repo.eclipse.org/content/repositories/tycho-snapshots/org/codehaus/plexus/plexus-compiler-api/2.2/plexus-compiler-api-2.2.jar
12:24:51 Downloading from tycho-snapshots: https://repo.eclipse.org/content/repositories/tycho-snapshots/org/codehaus/plexus/plexus-compiler-manager/2.2/plexus-compiler-manager-2.2.jar
12:24:51 Downloading from tycho-snapshots: https://repo.eclipse.org/content/repositories/tycho-snapshots/org/eclipse/tycho/tycho-lib-detector/1.3.0/tycho-lib-detector-1.3.0.jar
12:24:51 Downloading from tycho-snapshots: https://repo.eclipse.org/content/repositories/tycho-snapshots/org/eclipse/tycho/tycho-compiler-jdt/1.3.0/tycho-compiler-jdt-1.3.0.jar
12:24:51 Downloading from cbi-jdt: https://repo.eclipse.org/content/repositories/eclipse-staging/org/eclipse/jdt/ecj/3.17.0.v20190106-1040/ecj-3.17.0.v20190106-1040.jar
12:24:51 Downloading from cbi-jdt: https://repo.eclipse.org/content/repositories/eclipse-staging/org/codehaus/plexus/plexus-compiler-manager/2.2/plexus-compiler-manager-2.2.jar
12:24:51 Downloading from cbi-jdt: https://repo.eclipse.org/content/repositories/eclipse-staging/org/eclipse/tycho/tycho-compiler-jdt/1.3.0/tycho-compiler-jdt-1.3.0.jar
12:24:51 Downloading from cbi-jdt: https://repo.eclipse.org/content/repositories/eclipse-staging/org/codehaus/plexus/plexus-compiler-api/2.2/plexus-compiler-api-2.2.jar
12:24:51 Downloading from cbi-jdt: https://repo.eclipse.org/content/repositories/eclipse-staging/org/eclipse/tycho/tycho-lib-detector/1.3.0/tycho-lib-detector-1.3.0.jar
12:24:52 Progress (1): 0/2.8 MB
Progress (1): 0/2.8 MB
Progress (1): 0/2.8 MB
Progress (1): 0/2.8 MB
Progress (1): 0/2.8 MB
Progress (1): 0/2.8 MB
Progress (1): 0/2.8 MB
Progress (1): 0/2.8 MB
Progress (1): 0/2.8 MB
Progress (1): 0/2.8 MB
Progress (1): 0/2.8 MB
Progress (1): 0/2.8 MB
Progress (1): 0.1/2.8 MB
Progress (1): 0.1/2.8 MB
Progress (1): 0.1/2.8 MB
Progress (1): 0.1/2.8 MB
Progress (1): 0.1/2.8 MB
Progress (1): 0.1/2.8 MB
Progress (1): 0.1/2.8 MB
Progress (1): 0.1/2.8 MB
Progress (1): 0.1/2.8 MB
Progress (1): 0.1/2.8 MB
Progress (1): 0.1/2.8 MB
Progress (1): 0.1/2.8 MB
Progress (1): 0.1/2.8 MB
Progress (1): 0.1/2.8 MB
Progress (1): 0.1/2.8 MB
Progress (1): 0.1/2.8 MB
Progress (1): 0.1/2.8 MB
Progress (1): 0.1/2.8 MB
Progress (1): 0.1/2.8 MB
Progress (1): 0.1/2.8 MB
Progress (1): 0.1/2.8 MB
Progress (1): 0.1/2.8 MB
Progress (1): 0.1/2.8 MB
Progress (1): 0.1/2.8 MB
Progress (1): 0.1/2.8 MB
Progress (1): 0.2/2.8 MB
Progress (1): 0.2/2.8 MB
Progress (1): 0.2/2.8 MB
Progress (1): 0.2/2.8 MB
Progress (1): 0.2/2.8 MB
Progress (1): 0.2/2.8 MB
Progress (1): 0.2/2.8 MB
Progress (1): 0.2/2.8 MB
Progress (1): 0.2/2.8 MB
Progress (1): 0.2/2.8 MB
Progress (1): 0.2/2.8 MB
Progress (1): 0.2/2.8 MB
Progress (1): 0.2/2.8 MB
Progress (1): 0.2/2.8 MB
Progress (1): 0.2/2.8 MB
Progress (1): 0.2/2.8 MB
Progress (1): 0.2/2.8 MB
Progress (1): 0.2/2.8 MB
Progress (1): 0.2/2.8 MB
Progress (1): 0.2/2.8 MB
Progress (1): 0.2/2.8 MB
Progress (1): 0.2/2.8 MB
Progress (1): 0.2/2.8 MB
Progress (1): 0.2/2.8 MB
Progress (1): 0.2/2.8 MB
Progress (1): 0.3/2.8 MB
Progress (1): 0.3/2.8 MB
Progress (1): 0.3/2.8 MB
Progress (1): 0.3/2.8 MB
Progress (1): 0.3/2.8 MB
Progress (1): 0.3/2.8 MB
Progress (1): 0.3/2.8 MB
Progress (1): 0.3/2.8 MB
Progress (1): 0.3/2.8 MB
Progress (1): 0.3/2.8 MB
Progress (1): 0.3/2.8 MB
Progress (1): 0.3/2.8 MB
Progress (1): 0.3/2.8 MB
Progress (1): 0.3/2.8 MB
Progress (1): 0.3/2.8 MB
Progress (1): 0.3/2.8 MB
Progress (1): 0.3/2.8 MB
Progress (1): 0.3/2.8 MB
Progress (1): 0.3/2.8 MB
Progress (1): 0.3/2.8 MB
Progress (1): 0.3/2.8 MB
Progress (1): 0.3/2.8 MB
Progress (1): 0.3/2.8 MB
Progress (1): 0.3/2.8 MB
Progress (1): 0.3/2.8 MB
Progress (1): 0.4/2.8 MB
Progress (1): 0.4/2.8 MB
Progress (1): 0.4/2.8 MB
Progress (1): 0.4/2.8 MB
Progress (1): 0.4/2.8 MB
Progress (1): 0.4/2.8 MB
Progress (1): 0.4/2.8 MB
Progress (1): 0.4/2.8 MB
Progress (1): 0.4/2.8 MB
Progress (1): 0.4/2.8 MB
Progress (1): 0.4/2.8 MB
Progress (1): 0.4/2.8 MB
Progress (1): 0.4/2.8 MB
Progress (1): 0.4/2.8 MB
Progress (1): 0.4/2.8 MB
Progress (1): 0.4/2.8 MB
Progress (1): 0.4/2.8 MB
Progress (1): 0.4/2.8 MB
Progress (1): 0.4/2.8 MB
Progress (1): 0.4/2.8 MB
Progress (1): 0.4/2.8 MB
Progress (1): 0.4/2.8 MB
Progress (1): 0.4/2.8 MB
Progress (1): 0.4/2.8 MB
Progress (1): 0.4/2.8 MB
Progress (1): 0.5/2.8 MB
Progress (1): 0.5/2.8 MB
Progress (1): 0.5/2.8 MB
Progress (1): 0.5/2.8 MB
Progress (1): 0.5/2.8 MB
Progress (1): 0.5/2.8 MB
Progress (1): 0.5/2.8 MB
Progress (1): 0.5/2.8 MB
Progress (1): 0.5/2.8 MB
Progress (1): 0.5/2.8 MB
Progress (1): 0.5/2.8 MB
Progress (1): 0.5/2.8 MB
Progress (1): 0.5/2.8 MB
Progress (1): 0.5/2.8 MB
Progress (1): 0.5/2.8 MB
Progress (1): 0.5/2.8 MB
Progress (1): 0.5/2.8 MB
Progress (1): 0.5/2.8 MB
Progress (1): 0.5/2.8 MB
Progress (1): 0.5/2.8 MB
Progress (1): 0.5/2.8 MB
Progress (1): 0.5/2.8 MB
Progress (1): 0.5/2.8 MB
Progress (1): 0.5/2.8 MB
Progress (1): 0.5/2.8 MB
Progress (1): 0.6/2.8 MB
Progress (1): 0.6/2.8 MB
Progress (1): 0.6/2.8 MB
Progress (1): 0.6/2.8 MB
Progress (1): 0.6/2.8 MB
Progress (1): 0.6/2.8 MB
Progress (1): 0.6/2.8 MB
Progress (1): 0.6/2.8 MB
Progress (1): 0.6/2.8 MB
Progress (1): 0.6/2.8 MB
Progress (1): 0.6/2.8 MB
Progress (1): 0.6/2.8 MB
Progress (1): 0.6/2.8 MB
Progress (1): 0.6/2.8 MB
Progress (1): 0.6/2.8 MB
Progress (1): 0.6/2.8 MB
Progress (1): 0.6/2.8 MB
Progress (1): 0.6/2.8 MB
Progress (1): 0.6/2.8 MB
Progress (1): 0.6/2.8 MB
Progress (1): 0.6/2.8 MB
Progress (1): 0.6/2.8 MB
Progress (1): 0.6/2.8 MB
Progress (1): 0.6/2.8 MB
Progress (1): 0.6/2.8 MB
Progress (1): 0.7/2.8 MB
Progress (1): 0.7/2.8 MB
Progress (1): 0.7/2.8 MB
Progress (1): 0.7/2.8 MB
Progress (1): 0.7/2.8 MB
Progress (1): 0.7/2.8 MB
Progress (1): 0.7/2.8 MB
Progress (1): 0.7/2.8 MB
Progress (1): 0.7/2.8 MB
Progress (1): 0.7/2.8 MB
Progress (1): 0.7/2.8 MB
Progress (1): 0.7/2.8 MB
Progress (1): 0.7/2.8 MB
Progress (1): 0.7/2.8 MB
Progress (1): 0.7/2.8 MB
Progress (1): 0.7/2.8 MB
Progress (1): 0.7/2.8 MB
Progress (1): 0.7/2.8 MB
Progress (1): 0.7/2.8 MB
Progress (1): 0.7/2.8 MB
Progress (1): 0.7/2.8 MB
Progress (1): 0.7/2.8 MB
Progress (1): 0.7/2.8 MB
Progress (1): 0.7/2.8 MB
Progress (1): 0.7/2.8 MB
Progress (1): 0.8/2.8 MB
Progress (1): 0.8/2.8 MB
Progress (1): 0.8/2.8 MB
Progress (1): 0.8/2.8 MB
Progress (1): 0.8/2.8 MB
Progress (1): 0.8/2.8 MB
Progress (1): 0.8/2.8 MB
Progress (1): 0.8/2.8 MB
Progress (1): 0.8/2.8 MB
Progress (1): 0.8/2.8 MB
Progress (1): 0.8/2.8 MB
Progress (1): 0.8/2.8 MB
Progress (1): 0.8/2.8 MB
Progress (1): 0.8/2.8 MB
Progress (1): 0.8/2.8 MB
Progress (1): 0.8/2.8 MB
Progress (1): 0.8/2.8 MB
Progress (1): 0.8/2.8 MB
Progress (1): 0.8/2.8 MB
Progress (1): 0.8/2.8 MB
Progress (1): 0.8/2.8 MB
Progress (1): 0.8/2.8 MB
Progress (1): 0.8/2.8 MB
Progress (1): 0.8/2.8 MB
Progress (1): 0.8/2.8 MB
Progress (1): 0.9/2.8 MB
Progress (1): 0.9/2.8 MB
Progress (1): 0.9/2.8 MB
Progress (1): 0.9/2.8 MB
Progress (1): 0.9/2.8 MB
Progress (1): 0.9/2.8 MB
Progress (1): 0.9/2.8 MB
Progress (1): 0.9/2.8 MB
Progress (1): 0.9/2.8 MB
Progress (1): 0.9/2.8 MB
Progress (1): 0.9/2.8 MB
Progress (1): 0.9/2.8 MB
Progress (1): 0.9/2.8 MB
Progress (1): 0.9/2.8 MB
Progress (1): 0.9/2.8 MB
Progress (1): 0.9/2.8 MB
Progress (1): 0.9/2.8 MB
Progress (1): 0.9/2.8 MB
Progress (1): 0.9/2.8 MB
Progress (1): 0.9/2.8 MB
Progress (1): 0.9/2.8 MB
Progress (1): 0.9/2.8 MB
Progress (1): 0.9/2.8 MB
Progress (1): 0.9/2.8 MB
Progress (1): 0.9/2.8 MB
Progress (1): 1.0/2.8 MB
Progress (1): 1.0/2.8 MB
Progress (1): 1.0/2.8 MB
Progress (1): 1.0/2.8 MB
Progress (1): 1.0/2.8 MB
Progress (1): 1.0/2.8 MB
Progress (1): 1.0/2.8 MB
Progress (1): 1.0/2.8 MB
Progress (1): 1.0/2.8 MB
Progress (1): 1.0/2.8 MB
Progress (1): 1.0/2.8 MB
Progress (1): 1.0/2.8 MB
Progress (1): 1.0/2.8 MB
Progress (1): 1.0/2.8 MB
Progress (1): 1.0/2.8 MB
Progress (1): 1.0/2.8 MB
Progress (1): 1.0/2.8 MB
Progress (1): 1.0/2.8 MB
Progress (1): 1.0/2.8 MB
Progress (1): 1.0/2.8 MB
Progress (1): 1.0/2.8 MB
Progress (1): 1.0/2.8 MB
Progress (1): 1.0/2.8 MB
Progress (1): 1.0/2.8 MB
Progress (1): 1.0/2.8 MB
Progress (1): 1.1/2.8 MB
Progress (1): 1.1/2.8 MB
Progress (1): 1.1/2.8 MB
Progress (1): 1.1/2.8 MB
Progress (1): 1.1/2.8 MB
Progress (1): 1.1/2.8 MB
Progress (1): 1.1/2.8 MB
Progress (1): 1.1/2.8 MB
Progress (1): 1.1/2.8 MB
Progress (1): 1.1/2.8 MB
Progress (1): 1.1/2.8 MB
Progress (1): 1.1/2.8 MB
Progress (1): 1.1/2.8 MB
Progress (1): 1.1/2.8 MB
Progress (1): 1.1/2.8 MB
Progress (1): 1.1/2.8 MB
Progress (1): 1.1/2.8 MB
Progress (1): 1.1/2.8 MB
Progress (1): 1.1/2.8 MB
Progress (1): 1.1/2.8 MB
Progress (1): 1.1/2.8 MB
Progress (1): 1.1/2.8 MB
Progress (1): 1.1/2.8 MB
Progress (1): 1.1/2.8 MB
Progress (1): 1.1/2.8 MB
Progress (1): 1.2/2.8 MB
Progress (1): 1.2/2.8 MB
Progress (1): 1.2/2.8 MB
Progress (1): 1.2/2.8 MB
Progress (1): 1.2/2.8 MB
Progress (1): 1.2/2.8 MB
Progress (1): 1.2/2.8 MB
Progress (1): 1.2/2.8 MB
Progress (1): 1.2/2.8 MB
Progress (1): 1.2/2.8 MB
Progress (1): 1.2/2.8 MB
Progress (1): 1.2/2.8 MB
Progress (1): 1.2/2.8 MB
Progress (1): 1.2/2.8 MB
Progress (1): 1.2/2.8 MB
Progress (1): 1.2/2.8 MB
Progress (1): 1.2/2.8 MB
Progress (1): 1.2/2.8 MB
Progress (1): 1.2/2.8 MB
Progress (1): 1.2/2.8 MB
Progress (1): 1.2/2.8 MB
Progress (1): 1.2/2.8 MB
Progress (1): 1.2/2.8 MB
Progress (1): 1.2/2.8 MB
Progress (1): 1.2/2.8 MB
Progress (1): 1.3/2.8 MB
Progress (1): 1.3/2.8 MB
Progress (1): 1.3/2.8 MB
Progress (1): 1.3/2.8 MB
Progress (1): 1.3/2.8 MB
Progress (1): 1.3/2.8 MB
Progress (1): 1.3/2.8 MB
Progress (1): 1.3/2.8 MB
Progress (1): 1.3/2.8 MB
Progress (1): 1.3/2.8 MB
Progress (1): 1.3/2.8 MB
Progress (1): 1.3/2.8 MB
Progress (1): 1.3/2.8 MB
Progress (1): 1.3/2.8 MB
Progress (1): 1.3/2.8 MB
Progress (1): 1.3/2.8 MB
Progress (1): 1.3/2.8 MB
Progress (1): 1.3/2.8 MB
Progress (1): 1.3/2.8 MB
Progress (1): 1.3/2.8 MB
Progress (1): 1.3/2.8 MB
Progress (1): 1.3/2.8 MB
Progress (1): 1.3/2.8 MB
Progress (1): 1.3/2.8 MB
Progress (1): 1.3/2.8 MB
Progress (1): 1.4/2.8 MB
Progress (1): 1.4/2.8 MB
Progress (1): 1.4/2.8 MB
Progress (1): 1.4/2.8 MB
Progress (1): 1.4/2.8 MB
Progress (1): 1.4/2.8 MB
Progress (1): 1.4/2.8 MB
Progress (1): 1.4/2.8 MB
Progress (1): 1.4/2.8 MB
Progress (1): 1.4/2.8 MB
Progress (1): 1.4/2.8 MB
Progress (1): 1.4/2.8 MB
Progress (1): 1.4/2.8 MB
Progress (1): 1.4/2.8 MB
Progress (1): 1.4/2.8 MB
Progress (1): 1.4/2.8 MB
Progress (1): 1.4/2.8 MB
Progress (1): 1.4/2.8 MB
Progress (1): 1.4/2.8 MB
Progress (1): 1.4/2.8 MB
Progress (1): 1.4/2.8 MB
Progress (1): 1.4/2.8 MB
Progress (1): 1.4/2.8 MB
Progress (1): 1.4/2.8 MB
Progress (1): 1.4/2.8 MB
Progress (1): 1.5/2.8 MB
Progress (1): 1.5/2.8 MB
Progress (1): 1.5/2.8 MB
Progress (1): 1.5/2.8 MB
Progress (1): 1.5/2.8 MB
Progress (1): 1.5/2.8 MB
Progress (1): 1.5/2.8 MB
Progress (1): 1.5/2.8 MB
Progress (1): 1.5/2.8 MB
Progress (1): 1.5/2.8 MB
Progress (1): 1.5/2.8 MB
Progress (1): 1.5/2.8 MB
Progress (1): 1.5/2.8 MB
Progress (1): 1.5/2.8 MB
Progress (1): 1.5/2.8 MB
Progress (1): 1.5/2.8 MB
Progress (1): 1.5/2.8 MB
Progress (1): 1.5/2.8 MB
Progress (1): 1.5/2.8 MB
Progress (1): 1.5/2.8 MB
Progress (1): 1.5/2.8 MB
Progress (1): 1.5/2.8 MB
Progress (1): 1.5/2.8 MB
Progress (1): 1.5/2.8 MB
Progress (1): 1.5/2.8 MB
Progress (1): 1.6/2.8 MB
Progress (1): 1.6/2.8 MB
Progress (1): 1.6/2.8 MB
Progress (1): 1.6/2.8 MB
Progress (1): 1.6/2.8 MB
Progress (1): 1.6/2.8 MB
Progress (1): 1.6/2.8 MB
Progress (1): 1.6/2.8 MB
Progress (1): 1.6/2.8 MB
Progress (1): 1.6/2.8 MB
Progress (1): 1.6/2.8 MB
Progress (1): 1.6/2.8 MB
Progress (1): 1.6/2.8 MB
Progress (1): 1.6/2.8 MB
Progress (1): 1.6/2.8 MB
Progress (1): 1.6/2.8 MB
Progress (1): 1.6/2.8 MB
Progress (1): 1.6/2.8 MB
Progress (1): 1.6/2.8 MB
Progress (1): 1.6/2.8 MB
Progress (1): 1.6/2.8 MB
Progress (1): 1.6/2.8 MB
Progress (1): 1.6/2.8 MB
Progress (1): 1.6/2.8 MB
Progress (1): 1.6/2.8 MB
Progress (1): 1.7/2.8 MB
Progress (1): 1.7/2.8 MB
Progress (1): 1.7/2.8 MB
Progress (1): 1.7/2.8 MB
Progress (1): 1.7/2.8 MB
Progress (1): 1.7/2.8 MB
Progress (1): 1.7/2.8 MB
Progress (1): 1.7/2.8 MB
Progress (1): 1.7/2.8 MB
Progress (1): 1.7/2.8 MB
Progress (1): 1.7/2.8 MB
Progress (1): 1.7/2.8 MB
Progress (1): 1.7/2.8 MB
Progress (1): 1.7/2.8 MB
Progress (1): 1.7/2.8 MB
Progress (1): 1.7/2.8 MB
Progress (1): 1.7/2.8 MB
Progress (1): 1.7/2.8 MB
Progress (1): 1.7/2.8 MB
Progress (1): 1.7/2.8 MB
Progress (1): 1.7/2.8 MB
Progress (1): 1.7/2.8 MB
Progress (1): 1.7/2.8 MB
Progress (1): 1.7/2.8 MB
Progress (1): 1.7/2.8 MB
Progress (1): 1.8/2.8 MB
Progress (1): 1.8/2.8 MB
Progress (1): 1.8/2.8 MB
Progress (1): 1.8/2.8 MB
Progress (1): 1.8/2.8 MB
Progress (1): 1.8/2.8 MB
Progress (1): 1.8/2.8 MB
Progress (1): 1.8/2.8 MB
Progress (1): 1.8/2.8 MB
Progress (1): 1.8/2.8 MB
Progress (1): 1.8/2.8 MB
Progress (1): 1.8/2.8 MB
Progress (1): 1.8/2.8 MB
Progress (1): 1.8/2.8 MB
Progress (1): 1.8/2.8 MB
Progress (1): 1.8/2.8 MB
Progress (1): 1.8/2.8 MB
Progress (1): 1.8/2.8 MB
Progress (1): 1.8/2.8 MB
Progress (1): 1.8/2.8 MB
Progress (1): 1.8/2.8 MB
Progress (1): 1.8/2.8 MB
Progress (1): 1.8/2.8 MB
Progress (1): 1.8/2.8 MB
Progress (1): 1.8/2.8 MB
Progress (1): 1.9/2.8 MB
Progress (1): 1.9/2.8 MB
Progress (1): 1.9/2.8 MB
Progress (1): 1.9/2.8 MB
Progress (1): 1.9/2.8 MB
Progress (1): 1.9/2.8 MB
Progress (1): 1.9/2.8 MB
Progress (1): 1.9/2.8 MB
Progress (1): 1.9/2.8 MB
Progress (1): 1.9/2.8 MB
Progress (1): 1.9/2.8 MB
Progress (1): 1.9/2.8 MB
Progress (1): 1.9/2.8 MB
Progress (1): 1.9/2.8 MB
Progress (1): 1.9/2.8 MB
Progress (1): 1.9/2.8 MB
Progress (1): 1.9/2.8 MB
Progress (1): 1.9/2.8 MB
Progress (1): 1.9/2.8 MB
Progress (1): 1.9/2.8 MB
Progress (1): 1.9/2.8 MB
Progress (1): 1.9/2.8 MB
Progress (1): 1.9/2.8 MB
Progress (1): 1.9/2.8 MB
Progress (1): 1.9/2.8 MB
Progress (1): 2.0/2.8 MB
Progress (1): 2.0/2.8 MB
Progress (1): 2.0/2.8 MB
Progress (1): 2.0/2.8 MB
Progress (1): 2.0/2.8 MB
Progress (1): 2.0/2.8 MB
Progress (1): 2.0/2.8 MB
Progress (1): 2.0/2.8 MB
Progress (1): 2.0/2.8 MB
Progress (1): 2.0/2.8 MB
Progress (1): 2.0/2.8 MB
Progress (1): 2.0/2.8 MB
Progress (1): 2.0/2.8 MB
Progress (1): 2.0/2.8 MB
Progress (1): 2.0/2.8 MB
Progress (1): 2.0/2.8 MB
Progress (1): 2.0/2.8 MB
Progress (1): 2.0/2.8 MB
Progress (1): 2.0/2.8 MB
Progress (1): 2.0/2.8 MB
Progress (1): 2.0/2.8 MB
Progress (1): 2.0/2.8 MB
Progress (1): 2.0/2.8 MB
Progress (1): 2.0/2.8 MB
Progress (1): 2.0/2.8 MB
Progress (1): 2.1/2.8 MB
Progress (1): 2.1/2.8 MB
Progress (1): 2.1/2.8 MB
Progress (1): 2.1/2.8 MB
Progress (1): 2.1/2.8 MB
Progress (1): 2.1/2.8 MB
Progress (1): 2.1/2.8 MB
Progress (1): 2.1/2.8 MB
Progress (1): 2.1/2.8 MB
Progress (1): 2.1/2.8 MB
Progress (1): 2.1/2.8 MB
Progress (1): 2.1/2.8 MB
Progress (1): 2.1/2.8 MB
Progress (1): 2.1/2.8 MB
Progress (1): 2.1/2.8 MB
Progress (1): 2.1/2.8 MB
Progress (1): 2.1/2.8 MB
Progress (1): 2.1/2.8 MB
Progress (1): 2.1/2.8 MB
Progress (1): 2.1/2.8 MB
Progress (1): 2.1/2.8 MB
Progress (1): 2.1/2.8 MB
Progress (1): 2.1/2.8 MB
Progress (1): 2.1/2.8 MB
Progress (1): 2.1/2.8 MB
Progress (1): 2.2/2.8 MB
Progress (1): 2.2/2.8 MB
Progress (1): 2.2/2.8 MB
Progress (1): 2.2/2.8 MB
Progress (1): 2.2/2.8 MB
Progress (1): 2.2/2.8 MB
Progress (1): 2.2/2.8 MB
Progress (1): 2.2/2.8 MB
Progress (1): 2.2/2.8 MB
Progress (1): 2.2/2.8 MB
Progress (1): 2.2/2.8 MB
Progress (1): 2.2/2.8 MB
Progress (1): 2.2/2.8 MB
Progress (1): 2.2/2.8 MB
Progress (1): 2.2/2.8 MB
Progress (1): 2.2/2.8 MB
Progress (1): 2.2/2.8 MB
Progress (1): 2.2/2.8 MB
Progress (1): 2.2/2.8 MB
Progress (1): 2.2/2.8 MB
Progress (1): 2.2/2.8 MB
Progress (1): 2.2/2.8 MB
Progress (1): 2.2/2.8 MB
Progress (1): 2.2/2.8 MB
Progress (1): 2.2/2.8 MB
Progress (1): 2.3/2.8 MB
Progress (1): 2.3/2.8 MB
Progress (1): 2.3/2.8 MB
Progress (1): 2.3/2.8 MB
Progress (1): 2.3/2.8 MB
Progress (1): 2.3/2.8 MB
Progress (1): 2.3/2.8 MB
Progress (1): 2.3/2.8 MB
Progress (1): 2.3/2.8 MB
Progress (1): 2.3/2.8 MB
Progress (1): 2.3/2.8 MB
Progress (1): 2.3/2.8 MB
Progress (1): 2.3/2.8 MB
Progress (1): 2.3/2.8 MB
Progress (1): 2.3/2.8 MB
Progress (1): 2.3/2.8 MB
Progress (1): 2.3/2.8 MB
Progress (1): 2.3/2.8 MB
Progress (1): 2.3/2.8 MB
Progress (1): 2.3/2.8 MB
Progress (1): 2.3/2.8 MB
Progress (1): 2.3/2.8 MB
Progress (1): 2.3/2.8 MB
Progress (1): 2.3/2.8 MB
Progress (1): 2.3/2.8 MB
Progress (1): 2.4/2.8 MB
Progress (1): 2.4/2.8 MB
Progress (1): 2.4/2.8 MB
Progress (1): 2.4/2.8 MB
Progress (1): 2.4/2.8 MB
Progress (1): 2.4/2.8 MB
Progress (1): 2.4/2.8 MB
Progress (1): 2.4/2.8 MB
Progress (1): 2.4/2.8 MB
Progress (1): 2.4/2.8 MB
Progress (1): 2.4/2.8 MB
Progress (1): 2.4/2.8 MB
Progress (1): 2.4/2.8 MB
Progress (1): 2.4/2.8 MB
Progress (1): 2.4/2.8 MB
Progress (1): 2.4/2.8 MB
Progress (1): 2.4/2.8 MB
Progress (1): 2.4/2.8 MB
Progress (1): 2.4/2.8 MB
Progress (1): 2.4/2.8 MB
Progress (1): 2.4/2.8 MB
Progress (1): 2.4/2.8 MB
Progress (1): 2.4/2.8 MB
Progress (1): 2.4/2.8 MB
Progress (1): 2.4/2.8 MB
Progress (1): 2.5/2.8 MB
Progress (1): 2.5/2.8 MB
Progress (1): 2.5/2.8 MB
Progress (1): 2.5/2.8 MB
Progress (1): 2.5/2.8 MB
Progress (1): 2.5/2.8 MB
Progress (1): 2.5/2.8 MB
Progress (1): 2.5/2.8 MB
Progress (1): 2.5/2.8 MB
Progress (1): 2.5/2.8 MB
Progress (1): 2.5/2.8 MB
Progress (1): 2.5/2.8 MB
Progress (1): 2.5/2.8 MB
Progress (1): 2.5/2.8 MB
Progress (1): 2.5/2.8 MB
Progress (1): 2.5/2.8 MB
Progress (1): 2.5/2.8 MB
Progress (1): 2.5/2.8 MB
Progress (1): 2.5/2.8 MB
Progress (1): 2.5/2.8 MB
Progress (1): 2.5/2.8 MB
Progress (1): 2.5/2.8 MB
Progress (1): 2.5/2.8 MB
Progress (1): 2.5/2.8 MB
Progress (1): 2.5/2.8 MB
Progress (1): 2.6/2.8 MB
Progress (1): 2.6/2.8 MB
Progress (1): 2.6/2.8 MB
Progress (1): 2.6/2.8 MB
Progress (1): 2.6/2.8 MB
Progress (1): 2.6/2.8 MB
Progress (1): 2.6/2.8 MB
Progress (1): 2.6/2.8 MB
Progress (1): 2.6/2.8 MB
Progress (1): 2.6/2.8 MB
Progress (1): 2.6/2.8 MB
Progress (1): 2.6/2.8 MB
Progress (1): 2.6/2.8 MB
Progress (1): 2.6/2.8 MB
Progress (1): 2.6/2.8 MB
Progress (1): 2.6/2.8 MB
Progress (1): 2.6/2.8 MB
Progress (1): 2.6/2.8 MB
Progress (1): 2.6/2.8 MB
Progress (1): 2.6/2.8 MB
Progress (1): 2.6/2.8 MB
Progress (1): 2.6/2.8 MB
Progress (1): 2.6/2.8 MB
Progress (1): 2.6/2.8 MB
Progress (1): 2.6/2.8 MB
Progress (1): 2.7/2.8 MB
Progress (1): 2.7/2.8 MB
Progress (1): 2.7/2.8 MB
Progress (1): 2.7/2.8 MB
Progress (1): 2.7/2.8 MB
Progress (1): 2.7/2.8 MB
Progress (1): 2.7/2.8 MB
Progress (1): 2.7/2.8 MB
Progress (1): 2.7/2.8 MB
Progress (1): 2.7/2.8 MB
Progress (1): 2.7/2.8 MB
Progress (1): 2.7/2.8 MB
Progress (1): 2.7/2.8 MB
Progress (1): 2.7/2.8 MB
Progress (1): 2.7/2.8 MB
Progress (1): 2.7/2.8 MB
Progress (1): 2.7/2.8 MB
Progress (1): 2.7/2.8 MB
Progress (1): 2.7/2.8 MB
Progress (1): 2.7/2.8 MB
Progress (1): 2.7/2.8 MB
Progress (1): 2.7/2.8 MB
Progress (1): 2.7/2.8 MB
Progress (1): 2.7/2.8 MB
Progress (1): 2.7/2.8 MB
Progress (1): 2.8/2.8 MB
Progress (1): 2.8/2.8 MB
Progress (1): 2.8/2.8 MB
Progress (1): 2.8/2.8 MB
Progress (1): 2.8/2.8 MB
Progress (1): 2.8/2.8 MB
Progress (1): 2.8/2.8 MB
Progress (1): 2.8/2.8 MB
Progress (1): 2.8/2.8 MB
Progress (1): 2.8/2.8 MB
Progress (1): 2.8/2.8 MB
Progress (1): 2.8/2.8 MB
Progress (1): 2.8/2.8 MB
Progress (1): 2.8/2.8 MB
Progress (1): 2.8/2.8 MB
Progress (1): 2.8/2.8 MB
Progress (1): 2.8/2.8 MB
Progress (1): 2.8/2.8 MB
Progress (1): 2.8 MB    
                    
Downloaded from cbi-jdt: https://repo.eclipse.org/content/repositories/eclipse-staging/org/eclipse/jdt/ecj/3.17.0.v20190106-1040/ecj-3.17.0.v20190106-1040.jar (2.8 MB at 4.6 MB/s)
12:24:52 Downloading from eclipse: https://repo.eclipse.org/content/repositories/cbi/org/codehaus/plexus/plexus-compiler-manager/2.2/plexus-compiler-manager-2.2.jar
12:24:52 Downloading from eclipse: https://repo.eclipse.org/content/repositories/cbi/org/eclipse/tycho/tycho-compiler-jdt/1.3.0/tycho-compiler-jdt-1.3.0.jar
12:24:52 Downloading from eclipse: https://repo.eclipse.org/content/repositories/cbi/org/codehaus/plexus/plexus-compiler-api/2.2/plexus-compiler-api-2.2.jar
12:24:52 Downloading from eclipse: https://repo.eclipse.org/content/repositories/cbi/org/eclipse/tycho/tycho-lib-detector/1.3.0/tycho-lib-detector-1.3.0.jar
12:24:52 Downloading from eclipse.maven.central.mirror: https://repo.eclipse.org/content/repositories/maven_central/org/codehaus/plexus/plexus-compiler-manager/2.2/plexus-compiler-manager-2.2.jar
12:24:52 Downloading from eclipse.maven.central.mirror: https://repo.eclipse.org/content/repositories/maven_central/org/eclipse/tycho/tycho-compiler-jdt/1.3.0/tycho-compiler-jdt-1.3.0.jar
12:24:52 Downloading from eclipse.maven.central.mirror: https://repo.eclipse.org/content/repositories/maven_central/org/codehaus/plexus/plexus-compiler-api/2.2/plexus-compiler-api-2.2.jar
12:24:52 Downloading from eclipse.maven.central.mirror: https://repo.eclipse.org/content/repositories/maven_central/org/eclipse/tycho/tycho-lib-detector/1.3.0/tycho-lib-detector-1.3.0.jar
12:24:52 Progress (1): 4.1/4.6 kB
Progress (1): 4.6 kB    
                    
Downloaded from eclipse.maven.central.mirror: https://repo.eclipse.org/content/repositories/maven_central/org/codehaus/plexus/plexus-compiler-manager/2.2/plexus-compiler-manager-2.2.jar (4.6 kB at 152 kB/s)
12:24:52 Progress (1): 4.1/25 kB
Progress (1): 7.7/25 kB
Progress (1): 12/25 kB 
Progress (1): 16/25 kB
Progress (1): 20/25 kB
Progress (1): 24/25 kB
Progress (1): 25 kB   
Progress (2): 25 kB | 4.1/18 kB
Progress (2): 25 kB | 7.7/18 kB
Progress (2): 25 kB | 12/18 kB 
Progress (2): 25 kB | 16/18 kB
Progress (2): 25 kB | 18 kB   
Progress (3): 25 kB | 18 kB | 3.6 kB
                                    
Downloaded from eclipse.maven.central.mirror: https://repo.eclipse.org/content/repositories/maven_central/org/codehaus/plexus/plexus-compiler-api/2.2/plexus-compiler-api-2.2.jar (25 kB at 694 kB/s)
12:24:52 Downloaded from eclipse.maven.central.mirror: https://repo.eclipse.org/content/repositories/maven_central/org/eclipse/tycho/tycho-lib-detector/1.3.0/tycho-lib-detector-1.3.0.jar (3.6 kB at 95 kB/s)
12:24:52 Downloaded from eclipse.maven.central.mirror: https://repo.eclipse.org/content/repositories/maven_central/org/eclipse/tycho/tycho-compiler-jdt/1.3.0/tycho-compiler-jdt-1.3.0.jar (18 kB at 438 kB/s)
12:24:52 [INFO] Compiling 6 source files to /jobs/genie.jdt/eclipse.jdt.core-Gerrit/workspace/org.eclipse.jdt.annotation/target/classes
12:24:53 [INFO] 
12:24:53 [INFO] --- tycho-eclipserun-plugin:1.3.0:eclipse-run (default) @ org.eclipse.jdt.annotation ---
12:24:53 [INFO] Fetching org.eclipse.jdt.core_3.17.0.v20190120-1943.jar from http://download.eclipse.org/eclipse/updates/4.11-I-builds/I20190120-1800/plugins/ (6.58MB)
12:24:53 [INFO] Fetching org.eclipse.jdt.core_3.17.0.v20190120-1943.jar from http://download.eclipse.org/eclipse/updates/4.11-I-builds/I20190120-1800/plugins/ (6.58MB)
12:24:54 [INFO] Fetching org.eclipse.osgi.compatibility.state_1.1.300.v20181116-1550.jar.pack.gz from http://download.eclipse.org/eclipse/updates/4.11-I-builds/I20190117-2335/plugins/ (102.07kB)
12:24:54 [INFO] Fetching org.eclipse.osgi.compatibility.state_1.1.300.v20181116-1550.jar.pack.gz from http://download.eclipse.org/eclipse/updates/4.11-I-builds/I20190117-2335/plugins/ (102.07kB)
12:24:55 [INFO] Fetching org.eclipse.pde.api.tools_1.1.500.v20181126-0814.jar from http://download.eclipse.org/eclipse/updates/4.11-I-builds/I20190117-2335/plugins/ (905.42kB)
12:24:55 [INFO] Fetching org.eclipse.pde.api.tools_1.1.500.v20181126-0814.jar from http://download.eclipse.org/eclipse/updates/4.11-I-builds/I20190117-2335/plugins/ (905.42kB)
12:24:55 [INFO] Fetching org.objectweb.asm_7.0.0.v20181030-2244.jar.pack.gz from http://download.eclipse.org/eclipse/updates/4.11-I-builds/I20190117-2335/plugins/ (58.69kB)
12:24:55 [INFO] Fetching org.objectweb.asm_7.0.0.v20181030-2244.jar.pack.gz from http://download.eclipse.org/eclipse/updates/4.11-I-builds/I20190117-2335/plugins/ (58.69kB)
12:24:55 [INFO] Fetching org.objectweb.asm.tree_7.0.0.v20181030-2244.jar.pack.gz from http://download.eclipse.org/eclipse/updates/4.11-I-builds/I20190117-2335/plugins/ (25.81kB)
12:24:55 [INFO] Fetching org.objectweb.asm.tree_7.0.0.v20181030-2244.jar.pack.gz from http://download.eclipse.org/eclipse/updates/4.11-I-builds/I20190117-2335/plugins/ (25.81kB)
12:24:55 [INFO] Toolchain in tycho-eclipserun-plugin: JDK[/opt/public/common/jdk1.8.0_x64-latest/jre]
12:24:55 [INFO] Expected eclipse log file: /jobs/genie.jdt/eclipse.jdt.core-Gerrit/workspace/org.eclipse.jdt.annotation/target/eclipserun-work/data/.metadata/.log
12:24:55 [INFO] Command line:
12:24:55 	[/opt/public/common/jdk1.8.0_x64-latest/jre/bin/java, -jar, /jobs/genie.jdt/eclipse.jdt.core-Gerrit/workspace/.repository/p2/osgi/bundle/org.eclipse.equinox.launcher/1.5.200.v20180922-1751/org.eclipse.equinox.launcher-1.5.200.v20180922-1751.jar, -install, /jobs/genie.jdt/eclipse.jdt.core-Gerrit/workspace/org.eclipse.jdt.annotation/target/eclipserun-work, -configuration, /jobs/genie.jdt/eclipse.jdt.core-Gerrit/workspace/org.eclipse.jdt.annotation/target/eclipserun-work/configuration, -data, target/apibuild-workspace, -application, org.eclipse.ant.core.antRunner, -buildfile, target/.apibuild.xml]
12:24:55 Picked up JAVA_TOOL_OPTIONS: -Xmx2G -Djava.io.tmpdir=/tmp/genie.jdt
12:24:57 Buildfile: target/.apibuild.xml
12:24:57 
12:24:57 apigen:
12:24:58 BUILD SUCCESSFUL
12:24:58 
12:24:58 BUILD SUCCESSFUL
12:24:58 Total time: 1 second
12:24:59 [INFO] 
12:24:59 [INFO] --- maven-resources-plugin:3.1.0:testResources (default-testResources) @ org.eclipse.jdt.annotation ---
12:24:59 [INFO] Using 'UTF-8' encoding to copy filtered resources.
12:24:59 [INFO] skip non existing resourceDirectory /jobs/genie.jdt/eclipse.jdt.core-Gerrit/workspace/org.eclipse.jdt.annotation/src/test/resources
12:24:59 [INFO] 
12:24:59 [INFO] --- tycho-source-plugin:1.3.0:plugin-source (plugin-source) @ org.eclipse.jdt.annotation ---
12:24:59 [INFO] Building jar: /jobs/genie.jdt/eclipse.jdt.core-Gerrit/workspace/org.eclipse.jdt.annotation/target/org.eclipse.jdt.annotation-2.2.200-SNAPSHOT-sources.jar
12:24:59 [INFO] 
12:24:59 [INFO] --- target-platform-configuration:1.3.0:target-platform (default-target-platform) @ org.eclipse.jdt.annotation ---
12:24:59 [INFO] 
12:24:59 [INFO] --- tycho-packaging-plugin:1.3.0:package-plugin (default-package-plugin) @ org.eclipse.jdt.annotation ---
12:25:00 [INFO] Building jar: /jobs/genie.jdt/eclipse.jdt.core-Gerrit/workspace/org.eclipse.jdt.annotation/target/org.eclipse.jdt.annotation-2.2.200-SNAPSHOT.jar
12:25:00 [INFO] 
12:25:00 [INFO] --- tycho-p2-plugin:1.3.0:p2-metadata-default (default-p2-metadata-default) @ org.eclipse.jdt.annotation ---
12:25:00 [INFO] MavenProject: org.eclipse.jdt:org.eclipse.jdt.annotation:2.2.200-SNAPSHOT @ /jobs/genie.jdt/eclipse.jdt.core-Gerrit/workspace/org.eclipse.jdt.annotation/pom.xml
12:25:00     The main artifact has been replaced with the baseline version.
12:25:00     The following attached artifacts have been replaced with the baseline version: [sources]
12:25:00 
12:25:00 [INFO] 
12:25:00 [INFO] --- tycho-p2-extras-plugin:1.3.0:compare-version-with-baselines (compare-attached-artifacts-with-release) @ org.eclipse.jdt.annotation ---
12:25:00 [INFO] Skipped
12:25:00 [INFO] 
12:25:00 [INFO] -------------< org.eclipse.jdt:org.eclipse.jdt.annotation >-------------
12:25:00 [INFO] Building org.eclipse.jdt.annotation 1.1.400-SNAPSHOT              [3/17]
12:25:00 [INFO] ---------------------------[ eclipse-plugin ]---------------------------
12:25:00 [INFO] 
12:25:00 [INFO] --- maven-clean-plugin:3.1.0:clean (default-clean) @ org.eclipse.jdt.annotation ---
12:25:00 [INFO] 
12:25:00 [INFO] --- tycho-packaging-plugin:1.3.0:build-qualifier (default-build-qualifier) @ org.eclipse.jdt.annotation ---
12:25:00 [INFO] The project's OSGi version is 1.1.400.v20180921-1416
12:25:00 [INFO] 
12:25:00 [INFO] --- tycho-packaging-plugin:1.3.0:validate-id (default-validate-id) @ org.eclipse.jdt.annotation ---
12:25:00 [INFO] 
12:25:00 [INFO] --- tycho-packaging-plugin:1.3.0:validate-version (default-validate-version) @ org.eclipse.jdt.annotation ---
12:25:00 [INFO] 
12:25:00 [INFO] --- maven-resources-plugin:3.1.0:copy-resources (saveproperties) @ org.eclipse.jdt.annotation ---
12:25:00 [INFO] Using 'UTF-8' encoding to copy filtered resources.
12:25:00 [INFO] skip non existing resourceDirectory /jobs/genie.jdt/eclipse.jdt.core-Gerrit/workspace/org.eclipse.jdt.annotation_v1/saveproperties
12:25:00 [INFO] 
12:25:00 [INFO] --- maven-enforcer-plugin:3.0.0-M2:enforce (enforce-maven) @ org.eclipse.jdt.annotation ---
12:25:00 [INFO] 
12:25:00 [INFO] --- eclipse-cbi-plugin:1.1.5:generate-api-build-xml (default) @ org.eclipse.jdt.annotation ---
12:25:00 Generating target/.apibuild.xml
12:25:00 [INFO] 
12:25:00 [INFO] --- maven-resources-plugin:3.1.0:resources (default-resources) @ org.eclipse.jdt.annotation ---
12:25:00 [INFO] Using 'UTF-8' encoding to copy filtered resources.
12:25:00 [INFO] skip non existing resourceDirectory /jobs/genie.jdt/eclipse.jdt.core-Gerrit/workspace/org.eclipse.jdt.annotation_v1/src/main/resources
12:25:00 [INFO] 
12:25:00 [INFO] --- maven-resources-plugin:3.1.0:resources (filter-resources) @ org.eclipse.jdt.annotation ---
12:25:00 [INFO] Using 'UTF-8' encoding to copy filtered resources.
12:25:00 [INFO] skip non existing resourceDirectory /jobs/genie.jdt/eclipse.jdt.core-Gerrit/workspace/org.eclipse.jdt.annotation_v1/src/main/resources
12:25:00 [INFO] 
12:25:00 [INFO] --- tycho-compiler-plugin:1.3.0:compile (default-compile) @ org.eclipse.jdt.annotation ---
12:25:00 [INFO] Compiling 4 source files to /jobs/genie.jdt/eclipse.jdt.core-Gerrit/workspace/org.eclipse.jdt.annotation_v1/target/classes
12:25:01 [INFO] 
12:25:01 [INFO] --- tycho-eclipserun-plugin:1.3.0:eclipse-run (default) @ org.eclipse.jdt.annotation ---
12:25:01 [INFO] Toolchain in tycho-eclipserun-plugin: JDK[/opt/public/common/jdk1.8.0_x64-latest/jre]
12:25:01 [INFO] Expected eclipse log file: /jobs/genie.jdt/eclipse.jdt.core-Gerrit/workspace/org.eclipse.jdt.annotation_v1/target/eclipserun-work/data/.metadata/.log
12:25:01 [INFO] Command line:
12:25:01 	[/opt/public/common/jdk1.8.0_x64-latest/jre/bin/java, -jar, /jobs/genie.jdt/eclipse.jdt.core-Gerrit/workspace/.repository/p2/osgi/bundle/org.eclipse.equinox.launcher/1.5.200.v20180922-1751/org.eclipse.equinox.launcher-1.5.200.v20180922-1751.jar, -install, /jobs/genie.jdt/eclipse.jdt.core-Gerrit/workspace/org.eclipse.jdt.annotation_v1/target/eclipserun-work, -configuration, /jobs/genie.jdt/eclipse.jdt.core-Gerrit/workspace/org.eclipse.jdt.annotation_v1/target/eclipserun-work/configuration, -data, target/apibuild-workspace, -application, org.eclipse.ant.core.antRunner, -buildfile, target/.apibuild.xml]
12:25:01 Picked up JAVA_TOOL_OPTIONS: -Xmx2G -Djava.io.tmpdir=/tmp/genie.jdt
12:25:02 Buildfile: target/.apibuild.xml
12:25:02 
12:25:02 apigen:
12:25:03 BUILD SUCCESSFUL
12:25:03 
12:25:03 BUILD SUCCESSFUL
12:25:03 Total time: 0 seconds
12:25:05 [INFO] 
12:25:05 [INFO] --- maven-resources-plugin:3.1.0:testResources (default-testResources) @ org.eclipse.jdt.annotation ---
12:25:05 [INFO] Using 'UTF-8' encoding to copy filtered resources.
12:25:05 [INFO] skip non existing resourceDirectory /jobs/genie.jdt/eclipse.jdt.core-Gerrit/workspace/org.eclipse.jdt.annotation_v1/src/test/resources
12:25:05 [INFO] 
12:25:05 [INFO] --- tycho-source-plugin:1.3.0:plugin-source (plugin-source) @ org.eclipse.jdt.annotation ---
12:25:05 [INFO] Building jar: /jobs/genie.jdt/eclipse.jdt.core-Gerrit/workspace/org.eclipse.jdt.annotation_v1/target/org.eclipse.jdt.annotation-1.1.400-SNAPSHOT-sources.jar
12:25:05 [INFO] 
12:25:05 [INFO] --- target-platform-configuration:1.3.0:target-platform (default-target-platform) @ org.eclipse.jdt.annotation ---
12:25:05 [INFO] 
12:25:05 [INFO] --- tycho-packaging-plugin:1.3.0:package-plugin (default-package-plugin) @ org.eclipse.jdt.annotation ---
12:25:05 [INFO] Building jar: /jobs/genie.jdt/eclipse.jdt.core-Gerrit/workspace/org.eclipse.jdt.annotation_v1/target/org.eclipse.jdt.annotation-1.1.400-SNAPSHOT.jar
12:25:05 [INFO] 
12:25:05 [INFO] --- tycho-p2-plugin:1.3.0:p2-metadata-default (default-p2-metadata-default) @ org.eclipse.jdt.annotation ---
12:25:05 [INFO] MavenProject: org.eclipse.jdt:org.eclipse.jdt.annotation:1.1.400-SNAPSHOT @ /jobs/genie.jdt/eclipse.jdt.core-Gerrit/workspace/org.eclipse.jdt.annotation_v1/pom.xml
12:25:05     The main artifact has been replaced with the baseline version.
12:25:05     The following attached artifacts have been replaced with the baseline version: [sources]
12:25:05 
12:25:05 [INFO] 
12:25:05 [INFO] --- tycho-p2-extras-plugin:1.3.0:compare-version-with-baselines (compare-attached-artifacts-with-release) @ org.eclipse.jdt.annotation ---
12:25:05 [INFO] Skipped
12:25:05 [INFO] 
12:25:05 [INFO] ----------------< org.eclipse.jdt:org.eclipse.jdt.core >----------------
12:25:05 [INFO] Building org.eclipse.jdt.core 3.17.0-SNAPSHOT                     [4/17]
12:25:05 [INFO] ---------------------------[ eclipse-plugin ]---------------------------
12:25:05 [INFO] 
12:25:05 [INFO] --- maven-clean-plugin:3.1.0:clean (default-clean) @ org.eclipse.jdt.core ---
12:25:05 [INFO] 
12:25:05 [INFO] --- tycho-packaging-plugin:1.3.0:build-qualifier (default-build-qualifier) @ org.eclipse.jdt.core ---
12:25:07 [INFO] The project's OSGi version is 3.17.0.v20190122-1538
12:25:07 [INFO] 
12:25:07 [INFO] --- tycho-packaging-plugin:1.3.0:validate-id (default-validate-id) @ org.eclipse.jdt.core ---
12:25:07 [INFO] 
12:25:07 [INFO] --- tycho-packaging-plugin:1.3.0:validate-version (default-validate-version) @ org.eclipse.jdt.core ---
12:25:07 [INFO] 
12:25:07 [INFO] --- maven-resources-plugin:3.1.0:copy-resources (saveproperties) @ org.eclipse.jdt.core ---
12:25:07 [INFO] Using 'UTF-8' encoding to copy filtered resources.
12:25:07 [INFO] skip non existing resourceDirectory /jobs/genie.jdt/eclipse.jdt.core-Gerrit/workspace/org.eclipse.jdt.core/saveproperties
12:25:07 [INFO] 
12:25:07 [INFO] --- maven-enforcer-plugin:3.0.0-M2:enforce (enforce-maven) @ org.eclipse.jdt.core ---
12:25:07 [INFO] 
12:25:07 [INFO] --- eclipse-cbi-plugin:1.1.5:generate-api-build-xml (default) @ org.eclipse.jdt.core ---
12:25:07 Generating target/.apibuild.xml
12:25:07 [INFO] 
12:25:07 [INFO] --- maven-resources-plugin:3.1.0:resources (default-resources) @ org.eclipse.jdt.core ---
12:25:07 [INFO] Using 'UTF-8' encoding to copy filtered resources.
12:25:07 [INFO] skip non existing resourceDirectory /jobs/genie.jdt/eclipse.jdt.core-Gerrit/workspace/org.eclipse.jdt.core/src/main/resources
12:25:07 [INFO] 
12:25:07 [INFO] --- maven-resources-plugin:3.1.0:resources (filter-resources) @ org.eclipse.jdt.core ---
12:25:07 [INFO] Using 'UTF-8' encoding to copy filtered resources.
12:25:07 [INFO] skip non existing resourceDirectory /jobs/genie.jdt/eclipse.jdt.core-Gerrit/workspace/org.eclipse.jdt.core/src/main/resources
12:25:07 [INFO] 
12:25:07 [INFO] --- tycho-compiler-plugin:1.3.0:compile (default-compile) @ org.eclipse.jdt.core ---
12:25:07 [INFO] Compiling 1569 source files to /jobs/genie.jdt/eclipse.jdt.core-Gerrit/workspace/org.eclipse.jdt.core/target/classes
12:25:21 [INFO] Compiling 4 source files to /jobs/genie.jdt/eclipse.jdt.core-Gerrit/workspace/org.eclipse.jdt.core/target/jdtCompilerAdapter.jar-classes
12:25:21 [INFO] 
12:25:21 [INFO] --- tycho-eclipserun-plugin:1.3.0:eclipse-run (default) @ org.eclipse.jdt.core ---
12:25:21 [INFO] Toolchain in tycho-eclipserun-plugin: JDK[/opt/public/common/jdk1.8.0_x64-latest/jre]
12:25:21 [INFO] Expected eclipse log file: /jobs/genie.jdt/eclipse.jdt.core-Gerrit/workspace/org.eclipse.jdt.core/target/eclipserun-work/data/.metadata/.log
12:25:21 [INFO] Command line:
12:25:21 	[/opt/public/common/jdk1.8.0_x64-latest/jre/bin/java, -jar, /jobs/genie.jdt/eclipse.jdt.core-Gerrit/workspace/.repository/p2/osgi/bundle/org.eclipse.equinox.launcher/1.5.200.v20180922-1751/org.eclipse.equinox.launcher-1.5.200.v20180922-1751.jar, -install, /jobs/genie.jdt/eclipse.jdt.core-Gerrit/workspace/org.eclipse.jdt.core/target/eclipserun-work, -configuration, /jobs/genie.jdt/eclipse.jdt.core-Gerrit/workspace/org.eclipse.jdt.core/target/eclipserun-work/configuration, -data, target/apibuild-workspace, -application, org.eclipse.ant.core.antRunner, -buildfile, target/.apibuild.xml]
12:25:21 Picked up JAVA_TOOL_OPTIONS: -Xmx2G -Djava.io.tmpdir=/tmp/genie.jdt
12:25:24 Buildfile: target/.apibuild.xml
12:25:24 
12:25:24 apigen:
12:25:31 BUILD SUCCESSFUL
12:25:31 
12:25:31 BUILD SUCCESSFUL
12:25:31 Total time: 7 seconds
12:25:36 [INFO] 
12:25:36 [INFO] --- maven-resources-plugin:3.1.0:testResources (default-testResources) @ org.eclipse.jdt.core ---
12:25:36 [INFO] Using 'UTF-8' encoding to copy filtered resources.
12:25:36 [INFO] skip non existing resourceDirectory /jobs/genie.jdt/eclipse.jdt.core-Gerrit/workspace/org.eclipse.jdt.core/src/test/resources
12:25:36 [INFO] 
12:25:36 [INFO] --- tycho-source-plugin:1.3.0:plugin-source (plugin-source) @ org.eclipse.jdt.core ---
12:25:36 [INFO] Building jar: /jobs/genie.jdt/eclipse.jdt.core-Gerrit/workspace/org.eclipse.jdt.core/target/org.eclipse.jdt.core-3.17.0-SNAPSHOT-sources.jar
12:25:37 [INFO] 
12:25:37 [INFO] --- maven-antrun-plugin:1.8:run (default) @ org.eclipse.jdt.core ---
12:25:37 Downloading from tycho-snapshots: https://repo.eclipse.org/content/repositories/tycho-snapshots/org/apache/maven/maven-plugin-api/2.2.1/maven-plugin-api-2.2.1.pom
12:25:37 Downloading from cbi-jdt: https://repo.eclipse.org/content/repositories/eclipse-staging/org/apache/maven/maven-plugin-api/2.2.1/maven-plugin-api-2.2.1.pom
12:25:37 Downloading from eclipse: https://repo.eclipse.org/content/repositories/cbi/org/apache/maven/maven-plugin-api/2.2.1/maven-plugin-api-2.2.1.pom
12:25:37 Downloading from eclipse.maven.central.mirror: https://repo.eclipse.org/content/repositories/maven_central/org/apache/maven/maven-plugin-api/2.2.1/maven-plugin-api-2.2.1.pom
12:25:37 Progress (1): 1.5 kB
                    
Downloaded from eclipse.maven.central.mirror: https://repo.eclipse.org/content/repositories/maven_central/org/apache/maven/maven-plugin-api/2.2.1/maven-plugin-api-2.2.1.pom (1.5 kB at 49 kB/s)
12:25:37 Downloading from tycho-snapshots: https://repo.eclipse.org/content/repositories/tycho-snapshots/org/apache/maven/maven-settings/2.2.1/maven-settings-2.2.1.pom
12:25:37 Downloading from cbi-jdt: https://repo.eclipse.org/content/repositories/eclipse-staging/org/apache/maven/maven-settings/2.2.1/maven-settings-2.2.1.pom
12:25:37 Downloading from eclipse: https://repo.eclipse.org/content/repositories/cbi/org/apache/maven/maven-settings/2.2.1/maven-settings-2.2.1.pom
12:25:37 Downloading from eclipse.maven.central.mirror: https://repo.eclipse.org/content/repositories/maven_central/org/apache/maven/maven-settings/2.2.1/maven-settings-2.2.1.pom
12:25:37 Progress (1): 2.2 kB
                    
Downloaded from eclipse.maven.central.mirror: https://repo.eclipse.org/content/repositories/maven_central/org/apache/maven/maven-settings/2.2.1/maven-settings-2.2.1.pom (2.2 kB at 73 kB/s)
12:25:37 Downloading from tycho-snapshots: https://repo.eclipse.org/content/repositories/tycho-snapshots/org/apache/maven/maven-model/2.2.1/maven-model-2.2.1.pom
12:25:37 Downloading from cbi-jdt: https://repo.eclipse.org/content/repositories/eclipse-staging/org/apache/maven/maven-model/2.2.1/maven-model-2.2.1.pom
12:25:37 Downloading from eclipse: https://repo.eclipse.org/content/repositories/cbi/org/apache/maven/maven-model/2.2.1/maven-model-2.2.1.pom
12:25:37 Downloading from eclipse.maven.central.mirror: https://repo.eclipse.org/content/repositories/maven_central/org/apache/maven/maven-model/2.2.1/maven-model-2.2.1.pom
12:25:37 Progress (1): 3.2 kB
                    
Downloaded from eclipse.maven.central.mirror: https://repo.eclipse.org/content/repositories/maven_central/org/apache/maven/maven-model/2.2.1/maven-model-2.2.1.pom (3.2 kB at 105 kB/s)
12:25:37 Downloading from tycho-snapshots: https://repo.eclipse.org/content/repositories/tycho-snapshots/org/codehaus/plexus/plexus-utils/1.5.15/plexus-utils-1.5.15.pom
12:25:37 Downloading from cbi-jdt: https://repo.eclipse.org/content/repositories/eclipse-staging/org/codehaus/plexus/plexus-utils/1.5.15/plexus-utils-1.5.15.pom
12:25:37 Downloading from eclipse: https://repo.eclipse.org/content/repositories/cbi/org/codehaus/plexus/plexus-utils/1.5.15/plexus-utils-1.5.15.pom
12:25:37 Downloading from eclipse.maven.central.mirror: https://repo.eclipse.org/content/repositories/maven_central/org/codehaus/plexus/plexus-utils/1.5.15/plexus-utils-1.5.15.pom
12:25:37 Progress (1): 4.1/6.8 kB
Progress (1): 6.8 kB    
                    
Downloaded from eclipse.maven.central.mirror: https://repo.eclipse.org/content/repositories/maven_central/org/codehaus/plexus/plexus-utils/1.5.15/plexus-utils-1.5.15.pom (6.8 kB at 201 kB/s)
12:25:37 Downloading from tycho-snapshots: https://repo.eclipse.org/content/repositories/tycho-snapshots/junit/junit/3.8.1/junit-3.8.1.pom
12:25:37 Downloading from cbi-jdt: https://repo.eclipse.org/content/repositories/eclipse-staging/junit/junit/3.8.1/junit-3.8.1.pom
12:25:37 Downloading from eclipse: https://repo.eclipse.org/content/repositories/cbi/junit/junit/3.8.1/junit-3.8.1.pom
12:25:37 Downloading from eclipse.maven.central.mirror: https://repo.eclipse.org/content/repositories/maven_central/junit/junit/3.8.1/junit-3.8.1.pom
12:25:37 Progress (1): 998 B
                   
Downloaded from eclipse.maven.central.mirror: https://repo.eclipse.org/content/repositories/maven_central/junit/junit/3.8.1/junit-3.8.1.pom (998 B at 28 kB/s)
12:25:37 Downloading from tycho-snapshots: https://repo.eclipse.org/content/repositories/tycho-snapshots/org/codehaus/plexus/plexus-utils/1.0.4/plexus-utils-1.0.4.pom
12:25:37 Downloading from cbi-jdt: https://repo.eclipse.org/content/repositories/eclipse-staging/org/codehaus/plexus/plexus-utils/1.0.4/plexus-utils-1.0.4.pom
12:25:37 Downloading from eclipse: https://repo.eclipse.org/content/repositories/cbi/org/codehaus/plexus/plexus-utils/1.0.4/plexus-utils-1.0.4.pom
12:25:37 Downloading from eclipse.maven.central.mirror: https://repo.eclipse.org/content/repositories/maven_central/org/codehaus/plexus/plexus-utils/1.0.4/plexus-utils-1.0.4.pom
12:25:37 Progress (1): 4.1/6.9 kB
Progress (1): 6.9 kB    
                    
Downloaded from eclipse.maven.central.mirror: https://repo.eclipse.org/content/repositories/maven_central/org/codehaus/plexus/plexus-utils/1.0.4/plexus-utils-1.0.4.pom (6.9 kB at 190 kB/s)
12:25:37 Downloading from tycho-snapshots: https://repo.eclipse.org/content/repositories/tycho-snapshots/org/codehaus/plexus/plexus-utils/3.0.20/plexus-utils-3.0.20.pom
12:25:37 Downloading from cbi-jdt: https://repo.eclipse.org/content/repositories/eclipse-staging/org/codehaus/plexus/plexus-utils/3.0.20/plexus-utils-3.0.20.pom
12:25:37 Downloading from eclipse: https://repo.eclipse.org/content/repositories/cbi/org/codehaus/plexus/plexus-utils/3.0.20/plexus-utils-3.0.20.pom
12:25:37 Downloading from eclipse.maven.central.mirror: https://repo.eclipse.org/content/repositories/maven_central/org/codehaus/plexus/plexus-utils/3.0.20/plexus-utils-3.0.20.pom
12:25:37 Progress (1): 3.8 kB
                    
Downloaded from eclipse.maven.central.mirror: https://repo.eclipse.org/content/repositories/maven_central/org/codehaus/plexus/plexus-utils/3.0.20/plexus-utils-3.0.20.pom (3.8 kB at 127 kB/s)
12:25:37 Downloading from tycho-snapshots: https://repo.eclipse.org/content/repositories/tycho-snapshots/org/apache/ant/ant/1.9.4/ant-1.9.4.pom
12:25:37 Downloading from cbi-jdt: https://repo.eclipse.org/content/repositories/eclipse-staging/org/apache/ant/ant/1.9.4/ant-1.9.4.pom
12:25:37 Downloading from eclipse: https://repo.eclipse.org/content/repositories/cbi/org/apache/ant/ant/1.9.4/ant-1.9.4.pom
12:25:37 Downloading from eclipse.maven.central.mirror: https://repo.eclipse.org/content/repositories/maven_central/org/apache/ant/ant/1.9.4/ant-1.9.4.pom
12:25:37 Progress (1): 4.1/9.6 kB
Progress (1): 7.7/9.6 kB
Progress (1): 9.6 kB    
                    
Downloaded from eclipse.maven.central.mirror: https://repo.eclipse.org/content/repositories/maven_central/org/apache/ant/ant/1.9.4/ant-1.9.4.pom (9.6 kB at 292 kB/s)
12:25:37 Downloading from tycho-snapshots: https://repo.eclipse.org/content/repositories/tycho-snapshots/org/apache/ant/ant-parent/1.9.4/ant-parent-1.9.4.pom
12:25:37 Downloading from cbi-jdt: https://repo.eclipse.org/content/repositories/eclipse-staging/org/apache/ant/ant-parent/1.9.4/ant-parent-1.9.4.pom
12:25:38 Downloading from eclipse: https://repo.eclipse.org/content/repositories/cbi/org/apache/ant/ant-parent/1.9.4/ant-parent-1.9.4.pom
12:25:38 Downloading from eclipse.maven.central.mirror: https://repo.eclipse.org/content/repositories/maven_central/org/apache/ant/ant-parent/1.9.4/ant-parent-1.9.4.pom
12:25:38 Progress (1): 4.1/5.6 kB
Progress (1): 5.6 kB    
                    
Downloaded from eclipse.maven.central.mirror: https://repo.eclipse.org/content/repositories/maven_central/org/apache/ant/ant-parent/1.9.4/ant-parent-1.9.4.pom (5.6 kB at 175 kB/s)
12:25:38 Downloading from tycho-snapshots: https://repo.eclipse.org/content/repositories/tycho-snapshots/org/apache/ant/ant-launcher/1.9.4/ant-launcher-1.9.4.pom
12:25:38 Downloading from cbi-jdt: https://repo.eclipse.org/content/repositories/eclipse-staging/org/apache/ant/ant-launcher/1.9.4/ant-launcher-1.9.4.pom
12:25:38 Downloading from eclipse: https://repo.eclipse.org/content/repositories/cbi/org/apache/ant/ant-launcher/1.9.4/ant-launcher-1.9.4.pom
12:25:38 Downloading from eclipse.maven.central.mirror: https://repo.eclipse.org/content/repositories/maven_central/org/apache/ant/ant-launcher/1.9.4/ant-launcher-1.9.4.pom
12:25:38 Progress (1): 2.3 kB
                    
Downloaded from eclipse.maven.central.mirror: https://repo.eclipse.org/content/repositories/maven_central/org/apache/ant/ant-launcher/1.9.4/ant-launcher-1.9.4.pom (2.3 kB at 67 kB/s)
12:25:38 Downloading from tycho-snapshots: https://repo.eclipse.org/content/repositories/tycho-snapshots/org/apache/maven/maven-plugin-api/2.2.1/maven-plugin-api-2.2.1.jar
12:25:38 Downloading from tycho-snapshots: https://repo.eclipse.org/content/repositories/tycho-snapshots/org/apache/maven/maven-repository-metadata/2.2.1/maven-repository-metadata-2.2.1.jar
12:25:38 Downloading from tycho-snapshots: https://repo.eclipse.org/content/repositories/tycho-snapshots/org/apache/maven/maven-model/2.2.1/maven-model-2.2.1.jar
12:25:38 Downloading from tycho-snapshots: https://repo.eclipse.org/content/repositories/tycho-snapshots/org/apache/maven/maven-settings/2.2.1/maven-settings-2.2.1.jar
12:25:38 Downloading from tycho-snapshots: https://repo.eclipse.org/content/repositories/tycho-snapshots/org/codehaus/plexus/plexus-interpolation/1.11/plexus-interpolation-1.11.jar
12:25:38 Downloading from tycho-snapshots: https://repo.eclipse.org/content/repositories/tycho-snapshots/org/codehaus/plexus/plexus-container-default/1.0-alpha-9-stable-1/plexus-container-default-1.0-alpha-9-stable-1.jar
12:25:38 Downloading from tycho-snapshots: https://repo.eclipse.org/content/repositories/tycho-snapshots/junit/junit/3.8.1/junit-3.8.1.jar
12:25:38 Downloading from tycho-snapshots: https://repo.eclipse.org/content/repositories/tycho-snapshots/org/apache/maven/maven-artifact/2.2.1/maven-artifact-2.2.1.jar
12:25:38 Downloading from tycho-snapshots: https://repo.eclipse.org/content/repositories/tycho-snapshots/org/codehaus/plexus/plexus-utils/3.0.20/plexus-utils-3.0.20.jar
12:25:38 Downloading from tycho-snapshots: https://repo.eclipse.org/content/repositories/tycho-snapshots/org/apache/ant/ant/1.9.4/ant-1.9.4.jar
12:25:38 Downloading from tycho-snapshots: https://repo.eclipse.org/content/repositories/tycho-snapshots/org/apache/ant/ant-launcher/1.9.4/ant-launcher-1.9.4.jar
12:25:38 Downloading from cbi-jdt: https://repo.eclipse.org/content/repositories/eclipse-staging/org/apache/maven/maven-plugin-api/2.2.1/maven-plugin-api-2.2.1.jar
12:25:38 Downloading from cbi-jdt: https://repo.eclipse.org/content/repositories/eclipse-staging/org/apache/maven/maven-model/2.2.1/maven-model-2.2.1.jar
12:25:38 Downloading from cbi-jdt: https://repo.eclipse.org/content/repositories/eclipse-staging/org/codehaus/plexus/plexus-interpolation/1.11/plexus-interpolation-1.11.jar
12:25:38 Downloading from cbi-jdt: https://repo.eclipse.org/content/repositories/eclipse-staging/org/apache/maven/maven-settings/2.2.1/maven-settings-2.2.1.jar
12:25:38 Downloading from cbi-jdt: https://repo.eclipse.org/content/repositories/eclipse-staging/org/apache/maven/maven-repository-metadata/2.2.1/maven-repository-metadata-2.2.1.jar
12:25:38 Downloading from cbi-jdt: https://repo.eclipse.org/content/repositories/eclipse-staging/org/codehaus/plexus/plexus-container-default/1.0-alpha-9-stable-1/plexus-container-default-1.0-alpha-9-stable-1.jar
12:25:38 Downloading from cbi-jdt: https://repo.eclipse.org/content/repositories/eclipse-staging/junit/junit/3.8.1/junit-3.8.1.jar
12:25:38 Downloading from cbi-jdt: https://repo.eclipse.org/content/repositories/eclipse-staging/org/apache/maven/maven-artifact/2.2.1/maven-artifact-2.2.1.jar
12:25:38 Downloading from cbi-jdt: https://repo.eclipse.org/content/repositories/eclipse-staging/org/codehaus/plexus/plexus-utils/3.0.20/plexus-utils-3.0.20.jar
12:25:38 Downloading from cbi-jdt: https://repo.eclipse.org/content/repositories/eclipse-staging/org/apache/ant/ant/1.9.4/ant-1.9.4.jar
12:25:38 Downloading from cbi-jdt: https://repo.eclipse.org/content/repositories/eclipse-staging/org/apache/ant/ant-launcher/1.9.4/ant-launcher-1.9.4.jar
12:25:38 Downloading from eclipse: https://repo.eclipse.org/content/repositories/cbi/org/apache/maven/maven-plugin-api/2.2.1/maven-plugin-api-2.2.1.jar
12:25:38 Downloading from eclipse: https://repo.eclipse.org/content/repositories/cbi/org/apache/maven/maven-settings/2.2.1/maven-settings-2.2.1.jar
12:25:38 Downloading from eclipse: https://repo.eclipse.org/content/repositories/cbi/org/apache/maven/maven-repository-metadata/2.2.1/maven-repository-metadata-2.2.1.jar
12:25:38 Downloading from eclipse: https://repo.eclipse.org/content/repositories/cbi/org/apache/maven/maven-model/2.2.1/maven-model-2.2.1.jar
12:25:38 Downloading from eclipse: https://repo.eclipse.org/content/repositories/cbi/org/codehaus/plexus/plexus-interpolation/1.11/plexus-interpolation-1.11.jar
12:25:38 Downloading from eclipse: https://repo.eclipse.org/content/repositories/cbi/org/codehaus/plexus/plexus-container-default/1.0-alpha-9-stable-1/plexus-container-default-1.0-alpha-9-stable-1.jar
12:25:38 Downloading from eclipse: https://repo.eclipse.org/content/repositories/cbi/junit/junit/3.8.1/junit-3.8.1.jar
12:25:38 Downloading from eclipse: https://repo.eclipse.org/content/repositories/cbi/org/apache/maven/maven-artifact/2.2.1/maven-artifact-2.2.1.jar
12:25:38 Downloading from eclipse: https://repo.eclipse.org/content/repositories/cbi/org/codehaus/plexus/plexus-utils/3.0.20/plexus-utils-3.0.20.jar
12:25:38 Downloading from eclipse: https://repo.eclipse.org/content/repositories/cbi/org/apache/ant/ant/1.9.4/ant-1.9.4.jar
12:25:38 Downloading from eclipse: https://repo.eclipse.org/content/repositories/cbi/org/apache/ant/ant-launcher/1.9.4/ant-launcher-1.9.4.jar
12:25:38 Downloading from eclipse.maven.central.mirror: https://repo.eclipse.org/content/repositories/maven_central/org/apache/maven/maven-plugin-api/2.2.1/maven-plugin-api-2.2.1.jar
12:25:38 Downloading from eclipse.maven.central.mirror: https://repo.eclipse.org/content/repositories/maven_central/org/apache/maven/maven-model/2.2.1/maven-model-2.2.1.jar
12:25:38 Downloading from eclipse.maven.central.mirror: https://repo.eclipse.org/content/repositories/maven_central/org/apache/maven/maven-settings/2.2.1/maven-settings-2.2.1.jar
12:25:38 Downloading from eclipse.maven.central.mirror: https://repo.eclipse.org/content/repositories/maven_central/org/codehaus/plexus/plexus-interpolation/1.11/plexus-interpolation-1.11.jar
12:25:38 Downloading from eclipse.maven.central.mirror: https://repo.eclipse.org/content/repositories/maven_central/org/apache/maven/maven-repository-metadata/2.2.1/maven-repository-metadata-2.2.1.jar
12:25:38 Progress (1): 4.1/12 kB
Progress (2): 4.1/12 kB | 4.1/51 kB
Progress (2): 7.7/12 kB | 4.1/51 kB
Progress (2): 7.7/12 kB | 7.7/51 kB
Progress (2): 12/12 kB | 7.7/51 kB 
Progress (2): 12/12 kB | 12/51 kB 
Progress (2): 12 kB | 12/51 kB   
Progress (2): 12 kB | 16/51 kB
Progress (2): 12 kB | 20/51 kB
Progress (2): 12 kB | 24/51 kB
Progress (3): 12 kB | 24/51 kB | 4.1/26 kB
Progress (3): 12 kB | 28/51 kB | 4.1/26 kB
Progress (3): 12 kB | 28/51 kB | 7.7/26 kB
Progress (3): 12 kB | 32/51 kB | 7.7/26 kB
Progress (3): 12 kB | 36/51 kB | 7.7/26 kB
Progress (3): 12 kB | 36/51 kB | 12/26 kB 
Progress (3): 12 kB | 40/51 kB | 12/26 kB
Progress (3): 12 kB | 40/51 kB | 16/26 kB
Progress (3): 12 kB | 44/51 kB | 16/26 kB
Progress (3): 12 kB | 48/51 kB | 16/26 kB
Progress (3): 12 kB | 48/51 kB | 20/26 kB
Progress (3): 12 kB | 51 kB | 20/26 kB   
Progress (3): 12 kB | 51 kB | 24/26 kB
Progress (4): 12 kB | 51 kB | 24/26 kB | 4.1/88 kB
Progress (4): 12 kB | 51 kB | 26 kB | 4.1/88 kB   
Progress (4): 12 kB | 51 kB | 26 kB | 7.7/88 kB
Progress (4): 12 kB | 51 kB | 26 kB | 12/88 kB 
Progress (4): 12 kB | 51 kB | 26 kB | 16/88 kB
Progress (4): 12 kB | 51 kB | 26 kB | 20/88 kB
Progress (4): 12 kB | 51 kB | 26 kB | 24/88 kB
Progress (4): 12 kB | 51 kB | 26 kB | 28/88 kB
Progress (4): 12 kB | 51 kB | 26 kB | 32/88 kB
Progress (4): 12 kB | 51 kB | 26 kB | 36/88 kB
Progress (4): 12 kB | 51 kB | 26 kB | 40/88 kB
Progress (4): 12 kB | 51 kB | 26 kB | 44/88 kB
Progress (4): 12 kB | 51 kB | 26 kB | 48/88 kB
Progress (4): 12 kB | 51 kB | 26 kB | 52/88 kB
Progress (4): 12 kB | 51 kB | 26 kB | 56/88 kB
Progress (4): 12 kB | 51 kB | 26 kB | 60/88 kB
Progress (4): 12 kB | 51 kB | 26 kB | 64/88 kB
                                              
Downloaded from eclipse.maven.central.mirror: https://repo.eclipse.org/content/repositories/maven_central/org/apache/maven/maven-plugin-api/2.2.1/maven-plugin-api-2.2.1.jar (12 kB at 375 kB/s)
12:25:38 Progress (3): 51 kB | 26 kB | 68/88 kB
                                      
Downloading from eclipse.maven.central.mirror: https://repo.eclipse.org/content/repositories/maven_central/org/codehaus/plexus/plexus-container-default/1.0-alpha-9-stable-1/plexus-container-default-1.0-alpha-9-stable-1.jar
12:25:38 Progress (3): 51 kB | 26 kB | 72/88 kB
                                      
Downloaded from eclipse.maven.central.mirror: https://repo.eclipse.org/content/repositories/maven_central/org/apache/maven/maven-repository-metadata/2.2.1/maven-repository-metadata-2.2.1.jar (26 kB at 777 kB/s)
12:25:38 Progress (2): 51 kB | 76/88 kB
                              
Downloading from eclipse.maven.central.mirror: https://repo.eclipse.org/content/repositories/maven_central/junit/junit/3.8.1/junit-3.8.1.jar
12:25:38 Downloaded from eclipse.maven.central.mirror: https://repo.eclipse.org/content/repositories/maven_central/org/codehaus/plexus/plexus-interpolation/1.11/plexus-interpolation-1.11.jar (51 kB at 1.5 MB/s)
12:25:38 Progress (1): 80/88 kB
                      
Downloading from eclipse.maven.central.mirror: https://repo.eclipse.org/content/repositories/maven_central/org/apache/maven/maven-artifact/2.2.1/maven-artifact-2.2.1.jar
12:25:38 Progress (1): 84/88 kB
Progress (1): 88 kB   
Progress (2): 88 kB | 4.1/121 kB
Progress (2): 88 kB | 7.7/121 kB
Progress (2): 88 kB | 12/121 kB 
Progress (2): 88 kB | 16/121 kB
Progress (2): 88 kB | 20/121 kB
Progress (2): 88 kB | 24/121 kB
Progress (3): 88 kB | 24/121 kB | 4.1/194 kB
                                            
Downloaded from eclipse.maven.central.mirror: https://repo.eclipse.org/content/repositories/maven_central/org/apache/maven/maven-model/2.2.1/maven-model-2.2.1.jar (88 kB at 2.0 MB/s)
12:25:38 Downloading from eclipse.maven.central.mirror: https://repo.eclipse.org/content/repositories/maven_central/org/codehaus/plexus/plexus-utils/3.0.20/plexus-utils-3.0.20.jar
12:25:38 Progress (2): 24/121 kB | 7.7/194 kB
Progress (2): 28/121 kB | 7.7/194 kB
Progress (2): 32/121 kB | 7.7/194 kB
Progress (2): 32/121 kB | 12/194 kB 
Progress (2): 32/121 kB | 16/194 kB
Progress (2): 36/121 kB | 16/194 kB
Progress (2): 40/121 kB | 16/194 kB
Progress (2): 40/121 kB | 20/194 kB
Progress (2): 40/121 kB | 24/194 kB
Progress (2): 44/121 kB | 24/194 kB
Progress (2): 48/121 kB | 24/194 kB
Progress (2): 48/121 kB | 28/194 kB
Progress (2): 48/121 kB | 32/194 kB
Progress (2): 52/121 kB | 32/194 kB
Progress (2): 56/121 kB | 32/194 kB
Progress (2): 56/121 kB | 36/194 kB
Progress (2): 56/121 kB | 40/194 kB
Progress (2): 60/121 kB | 40/194 kB
Progress (3): 60/121 kB | 40/194 kB | 4.1/80 kB
Progress (3): 64/121 kB | 40/194 kB | 4.1/80 kB
Progress (3): 64/121 kB | 40/194 kB | 7.7/80 kB
Progress (3): 68/121 kB | 40/194 kB | 7.7/80 kB
Progress (3): 72/121 kB | 40/194 kB | 7.7/80 kB
Progress (3): 76/121 kB | 40/194 kB | 7.7/80 kB
Progress (3): 80/121 kB | 40/194 kB | 7.7/80 kB
Progress (3): 84/121 kB | 40/194 kB | 7.7/80 kB
Progress (3): 88/121 kB | 40/194 kB | 7.7/80 kB
Progress (3): 92/121 kB | 40/194 kB | 7.7/80 kB
Progress (3): 96/121 kB | 40/194 kB | 7.7/80 kB
Progress (3): 96/121 kB | 40/194 kB | 12/80 kB 
Progress (3): 96/121 kB | 40/194 kB | 16/80 kB
Progress (3): 96/121 kB | 44/194 kB | 16/80 kB
Progress (3): 100/121 kB | 44/194 kB | 16/80 kB
Progress (3): 100/121 kB | 48/194 kB | 16/80 kB
Progress (3): 100/121 kB | 48/194 kB | 20/80 kB
Progress (3): 104/121 kB | 48/194 kB | 20/80 kB
Progress (3): 104/121 kB | 48/194 kB | 24/80 kB
Progress (3): 104/121 kB | 52/194 kB | 24/80 kB
Progress (3): 108/121 kB | 52/194 kB | 24/80 kB
Progress (3): 108/121 kB | 52/194 kB | 28/80 kB
Progress (3): 108/121 kB | 56/194 kB | 28/80 kB
Progress (3): 108/121 kB | 56/194 kB | 32/80 kB
Progress (3): 112/121 kB | 56/194 kB | 32/80 kB
Progress (3): 112/121 kB | 56/194 kB | 33/80 kB
Progress (4): 112/121 kB | 56/194 kB | 33/80 kB | 4.1/243 kB
Progress (4): 116/121 kB | 56/194 kB | 33/80 kB | 4.1/243 kB
Progress (4): 116/121 kB | 56/194 kB | 33/80 kB | 7.7/243 kB
Progress (4): 116/121 kB | 60/194 kB | 33/80 kB | 7.7/243 kB
Progress (4): 116/121 kB | 60/194 kB | 37/80 kB | 7.7/243 kB
Progress (4): 116/121 kB | 60/194 kB | 37/80 kB | 12/243 kB 
Progress (4): 116/121 kB | 64/194 kB | 37/80 kB | 12/243 kB
Progress (4): 120/121 kB | 64/194 kB | 37/80 kB | 12/243 kB
Progress (4): 120/121 kB | 64/194 kB | 37/80 kB | 16/243 kB
Progress (4): 120/121 kB | 64/194 kB | 41/80 kB | 16/243 kB
Progress (4): 121 kB | 64/194 kB | 41/80 kB | 16/243 kB    
Progress (4): 121 kB | 68/194 kB | 41/80 kB | 16/243 kB
Progress (4): 121 kB | 68/194 kB | 45/80 kB | 16/243 kB
Progress (4): 121 kB | 68/194 kB | 45/80 kB | 20/243 kB
Progress (4): 121 kB | 68/194 kB | 49/80 kB | 20/243 kB
Progress (4): 121 kB | 72/194 kB | 49/80 kB | 20/243 kB
Progress (4): 121 kB | 72/194 kB | 49/80 kB | 24/243 kB
Progress (4): 121 kB | 76/194 kB | 49/80 kB | 24/243 kB
Progress (4): 121 kB | 76/194 kB | 53/80 kB | 24/243 kB
Progress (4): 121 kB | 80/194 kB | 53/80 kB | 24/243 kB
Progress (4): 121 kB | 80/194 kB | 53/80 kB | 28/243 kB
Progress (4): 121 kB | 80/194 kB | 57/80 kB | 28/243 kB
Progress (4): 121 kB | 80/194 kB | 57/80 kB | 32/243 kB
Progress (4): 121 kB | 84/194 kB | 57/80 kB | 32/243 kB
Progress (4): 121 kB | 84/194 kB | 57/80 kB | 33/243 kB
Progress (4): 121 kB | 84/194 kB | 61/80 kB | 33/243 kB
Progress (4): 121 kB | 88/194 kB | 61/80 kB | 33/243 kB
Progress (4): 121 kB | 88/194 kB | 65/80 kB | 33/243 kB
Progress (4): 121 kB | 88/194 kB | 65/80 kB | 37/243 kB
Progress (4): 121 kB | 92/194 kB | 65/80 kB | 37/243 kB
Progress (4): 121 kB | 92/194 kB | 65/80 kB | 41/243 kB
Progress (4): 121 kB | 92/194 kB | 69/80 kB | 41/243 kB
Progress (4): 121 kB | 96/194 kB | 69/80 kB | 41/243 kB
Progress (4): 121 kB | 96/194 kB | 73/80 kB | 41/243 kB
Progress (4): 121 kB | 96/194 kB | 73/80 kB | 45/243 kB
Progress (4): 121 kB | 100/194 kB | 73/80 kB | 45/243 kB
Progress (4): 121 kB | 100/194 kB | 73/80 kB | 49/243 kB
Progress (4): 121 kB | 100/194 kB | 77/80 kB | 49/243 kB
Progress (4): 121 kB | 104/194 kB | 77/80 kB | 49/243 kB
Progress (4): 121 kB | 104/194 kB | 80 kB | 49/243 kB   
Progress (4): 121 kB | 104/194 kB | 80 kB | 53/243 kB
Progress (4): 121 kB | 108/194 kB | 80 kB | 53/243 kB
Progress (4): 121 kB | 108/194 kB | 80 kB | 57/243 kB
Progress (4): 121 kB | 112/194 kB | 80 kB | 57/243 kB
Progress (4): 121 kB | 112/194 kB | 80 kB | 61/243 kB
Progress (4): 121 kB | 116/194 kB | 80 kB | 61/243 kB
Progress (4): 121 kB | 116/194 kB | 80 kB | 65/243 kB
Progress (4): 121 kB | 120/194 kB | 80 kB | 65/243 kB
                                                     
Downloaded from eclipse.maven.central.mirror: https://repo.eclipse.org/content/repositories/maven_central/junit/junit/3.8.1/junit-3.8.1.jar (121 kB at 2.2 MB/s)
12:25:38 Progress (3): 124/194 kB | 80 kB | 65/243 kB
Progress (3): 124/194 kB | 80 kB | 69/243 kB
Progress (3): 128/194 kB | 80 kB | 69/243 kB
                                            
Downloading from eclipse.maven.central.mirror: https://repo.eclipse.org/content/repositories/maven_central/org/apache/ant/ant/1.9.4/ant-1.9.4.jar
12:25:38 Progress (3): 128/194 kB | 80 kB | 73/243 kB
Progress (3): 128/194 kB | 80 kB | 77/243 kB
Progress (3): 132/194 kB | 80 kB | 77/243 kB
Progress (3): 132/194 kB | 80 kB | 81/243 kB
Progress (3): 136/194 kB | 80 kB | 81/243 kB
Progress (3): 136/194 kB | 80 kB | 85/243 kB
Progress (3): 136/194 kB | 80 kB | 89/243 kB
Progress (3): 136/194 kB | 80 kB | 93/243 kB
Progress (3): 140/194 kB | 80 kB | 93/243 kB
Progress (3): 140/194 kB | 80 kB | 97/243 kB
Progress (3): 144/194 kB | 80 kB | 97/243 kB
Progress (3): 144/194 kB | 80 kB | 101/243 kB
Progress (3): 144/194 kB | 80 kB | 105/243 kB
Progress (3): 144/194 kB | 80 kB | 109/243 kB
Progress (3): 148/194 kB | 80 kB | 109/243 kB
Progress (3): 148/194 kB | 80 kB | 113/243 kB
Progress (3): 152/194 kB | 80 kB | 113/243 kB
Progress (3): 152/194 kB | 80 kB | 117/243 kB
Progress (3): 152/194 kB | 80 kB | 121/243 kB
Progress (3): 156/194 kB | 80 kB | 121/243 kB
Progress (3): 156/194 kB | 80 kB | 125/243 kB
Progress (3): 160/194 kB | 80 kB | 125/243 kB
Progress (3): 160/194 kB | 80 kB | 129/243 kB
Progress (3): 164/194 kB | 80 kB | 129/243 kB
Progress (3): 164/194 kB | 80 kB | 133/243 kB
Progress (3): 168/194 kB | 80 kB | 133/243 kB
Progress (3): 168/194 kB | 80 kB | 137/243 kB
Progress (3): 168/194 kB | 80 kB | 141/243 kB
Progress (3): 168/194 kB | 80 kB | 145/243 kB
                                             
Downloaded from eclipse.maven.central.mirror: https://repo.eclipse.org/content/repositories/maven_central/org/apache/maven/maven-artifact/2.2.1/maven-artifact-2.2.1.jar (80 kB at 1.3 MB/s)
12:25:38 Progress (2): 168/194 kB | 149/243 kB
Progress (2): 172/194 kB | 149/243 kB
Progress (2): 172/194 kB | 153/243 kB
                                     
Downloading from eclipse.maven.central.mirror: https://repo.eclipse.org/content/repositories/maven_central/org/apache/ant/ant-launcher/1.9.4/ant-launcher-1.9.4.jar
12:25:38 Progress (2): 172/194 kB | 157/243 kB
Progress (2): 176/194 kB | 157/243 kB
Progress (2): 176/194 kB | 161/243 kB
Progress (2): 180/194 kB | 161/243 kB
Progress (2): 180/194 kB | 165/243 kB
Progress (2): 184/194 kB | 165/243 kB
Progress (2): 184/194 kB | 169/243 kB
Progress (3): 184/194 kB | 169/243 kB | 0/2.0 MB
Progress (3): 184/194 kB | 173/243 kB | 0/2.0 MB
Progress (3): 184/194 kB | 173/243 kB | 0/2.0 MB
Progress (3): 188/194 kB | 173/243 kB | 0/2.0 MB
Progress (3): 188/194 kB | 177/243 kB | 0/2.0 MB
Progress (3): 192/194 kB | 177/243 kB | 0/2.0 MB
Progress (3): 192/194 kB | 177/243 kB | 0/2.0 MB
Progress (3): 194 kB | 177/243 kB | 0/2.0 MB    
Progress (3): 194 kB | 181/243 kB | 0/2.0 MB
Progress (3): 194 kB | 181/243 kB | 0/2.0 MB
Progress (3): 194 kB | 185/243 kB | 0/2.0 MB
Progress (3): 194 kB | 185/243 kB | 0/2.0 MB
Progress (3): 194 kB | 189/243 kB | 0/2.0 MB
Progress (3): 194 kB | 189/243 kB | 0/2.0 MB
Progress (3): 194 kB | 193/243 kB | 0/2.0 MB
Progress (3): 194 kB | 193/243 kB | 0/2.0 MB
Progress (3): 194 kB | 197/243 kB | 0/2.0 MB
Progress (3): 194 kB | 197/243 kB | 0/2.0 MB
Progress (3): 194 kB | 201/243 kB | 0/2.0 MB
Progress (3): 194 kB | 201/243 kB | 0/2.0 MB
Progress (3): 194 kB | 205/243 kB | 0/2.0 MB
Progress (3): 194 kB | 205/243 kB | 0/2.0 MB
Progress (3): 194 kB | 209/243 kB | 0/2.0 MB
Progress (3): 194 kB | 209/243 kB | 0/2.0 MB
Progress (3): 194 kB | 213/243 kB | 0/2.0 MB
Progress (3): 194 kB | 213/243 kB | 0/2.0 MB
Progress (3): 194 kB | 217/243 kB | 0/2.0 MB
Progress (3): 194 kB | 217/243 kB | 0/2.0 MB
Progress (3): 194 kB | 221/243 kB | 0/2.0 MB
Progress (3): 194 kB | 221/243 kB | 0.1/2.0 MB
Progress (3): 194 kB | 225/243 kB | 0.1/2.0 MB
Progress (3): 194 kB | 225/243 kB | 0.1/2.0 MB
Progress (3): 194 kB | 229/243 kB | 0.1/2.0 MB
Progress (3): 194 kB | 229/243 kB | 0.1/2.0 MB
Progress (3): 194 kB | 233/243 kB | 0.1/2.0 MB
Progress (3): 194 kB | 233/243 kB | 0.1/2.0 MB
Progress (3): 194 kB | 237/243 kB | 0.1/2.0 MB
Progress (3): 194 kB | 237/243 kB | 0.1/2.0 MB
Progress (3): 194 kB | 241/243 kB | 0.1/2.0 MB
Progress (3): 194 kB | 241/243 kB | 0.1/2.0 MB
Progress (3): 194 kB | 243 kB | 0.1/2.0 MB    
Progress (3): 194 kB | 243 kB | 0.1/2.0 MB
Progress (3): 194 kB | 243 kB | 0.1/2.0 MB
Progress (3): 194 kB | 243 kB | 0.1/2.0 MB
Progress (3): 194 kB | 243 kB | 0.1/2.0 MB
Progress (3): 194 kB | 243 kB | 0.1/2.0 MB
Progress (3): 194 kB | 243 kB | 0.1/2.0 MB
Progress (3): 194 kB | 243 kB | 0.1/2.0 MB
Progress (3): 194 kB | 243 kB | 0.1/2.0 MB
Progress (3): 194 kB | 243 kB | 0.1/2.0 MB
Progress (3): 194 kB | 243 kB | 0.1/2.0 MB
Progress (3): 194 kB | 243 kB | 0.1/2.0 MB
Progress (3): 194 kB | 243 kB | 0.1/2.0 MB
Progress (3): 194 kB | 243 kB | 0.1/2.0 MB
Progress (3): 194 kB | 243 kB | 0.1/2.0 MB
Progress (3): 194 kB | 243 kB | 0.1/2.0 MB
                                          
Downloaded from eclipse.maven.central.mirror: https://repo.eclipse.org/content/repositories/maven_central/org/codehaus/plexus/plexus-container-default/1.0-alpha-9-stable-1/plexus-container-default-1.0-alpha-9-stable-1.jar (194 kB at 2.8 MB/s)
12:25:38 Progress (2): 243 kB | 0.1/2.0 MB
Progress (2): 243 kB | 0.1/2.0 MB
Progress (2): 243 kB | 0.1/2.0 MB
Progress (2): 243 kB | 0.1/2.0 MB
Progress (2): 243 kB | 0.1/2.0 MB
Progress (2): 243 kB | 0.2/2.0 MB
Progress (2): 243 kB | 0.2/2.0 MB
Progress (3): 243 kB | 0.2/2.0 MB | 4.1/18 kB
Progress (3): 243 kB | 0.2/2.0 MB | 4.1/18 kB
Progress (3): 243 kB | 0.2/2.0 MB | 7.7/18 kB
Progress (3): 243 kB | 0.2/2.0 MB | 7.7/18 kB
Progress (3): 243 kB | 0.2/2.0 MB | 12/18 kB 
Progress (3): 243 kB | 0.2/2.0 MB | 12/18 kB
Progress (3): 243 kB | 0.2/2.0 MB | 16/18 kB
Progress (3): 243 kB | 0.2/2.0 MB | 16/18 kB
Progress (3): 243 kB | 0.2/2.0 MB | 18 kB   
Progress (3): 243 kB | 0.2/2.0 MB | 18 kB
Progress (3): 243 kB | 0.2/2.0 MB | 18 kB
Progress (3): 243 kB | 0.2/2.0 MB | 18 kB
Progress (3): 243 kB | 0.2/2.0 MB | 18 kB
Progress (3): 243 kB | 0.2/2.0 MB | 18 kB
Progress (3): 243 kB | 0.2/2.0 MB | 18 kB
Progress (3): 243 kB | 0.2/2.0 MB | 18 kB
Progress (3): 243 kB | 0.2/2.0 MB | 18 kB
Progress (3): 243 kB | 0.2/2.0 MB | 18 kB
Progress (3): 243 kB | 0.2/2.0 MB | 18 kB
Progress (3): 243 kB | 0.2/2.0 MB | 18 kB
Progress (3): 243 kB | 0.2/2.0 MB | 18 kB
Progress (3): 243 kB | 0.2/2.0 MB | 18 kB
Progress (3): 243 kB | 0.2/2.0 MB | 18 kB
Progress (3): 243 kB | 0.2/2.0 MB | 18 kB
Progress (3): 243 kB | 0.2/2.0 MB | 18 kB
Progress (3): 243 kB | 0.2/2.0 MB | 18 kB
Progress (3): 243 kB | 0.2/2.0 MB | 18 kB
Progress (3): 243 kB | 0.2/2.0 MB | 18 kB
Progress (3): 243 kB | 0.3/2.0 MB | 18 kB
Progress (3): 243 kB | 0.3/2.0 MB | 18 kB
Progress (3): 243 kB | 0.3/2.0 MB | 18 kB
Progress (3): 243 kB | 0.3/2.0 MB | 18 kB
Progress (3): 243 kB | 0.3/2.0 MB | 18 kB
Progress (3): 243 kB | 0.3/2.0 MB | 18 kB
Progress (3): 243 kB | 0.3/2.0 MB | 18 kB
Progress (3): 243 kB | 0.3/2.0 MB | 18 kB
Progress (3): 243 kB | 0.3/2.0 MB | 18 kB
Progress (3): 243 kB | 0.3/2.0 MB | 18 kB
Progress (3): 243 kB | 0.3/2.0 MB | 18 kB
Progress (3): 243 kB | 0.3/2.0 MB | 18 kB
Progress (3): 243 kB | 0.3/2.0 MB | 18 kB
Progress (3): 243 kB | 0.3/2.0 MB | 18 kB
Progress (3): 243 kB | 0.3/2.0 MB | 18 kB
Progress (3): 243 kB | 0.3/2.0 MB | 18 kB
Progress (3): 243 kB | 0.3/2.0 MB | 18 kB
Progress (3): 243 kB | 0.3/2.0 MB | 18 kB
Progress (3): 243 kB | 0.3/2.0 MB | 18 kB
Progress (3): 243 kB | 0.3/2.0 MB | 18 kB
Progress (3): 243 kB | 0.3/2.0 MB | 18 kB
Progress (3): 243 kB | 0.3/2.0 MB | 18 kB
Progress (3): 243 kB | 0.3/2.0 MB | 18 kB
                                         
Downloaded from eclipse.maven.central.mirror: https://repo.eclipse.org/content/repositories/maven_central/org/codehaus/plexus/plexus-utils/3.0.20/plexus-utils-3.0.20.jar (243 kB at 3.1 MB/s)
12:25:38 Progress (2): 0.3/2.0 MB | 18 kB
Progress (2): 0.3/2.0 MB | 18 kB
Progress (2): 0.4/2.0 MB | 18 kB
Progress (2): 0.4/2.0 MB | 18 kB
Progress (2): 0.4/2.0 MB | 18 kB
                                
Downloaded from eclipse.maven.central.mirror: https://repo.eclipse.org/content/repositories/maven_central/org/apache/ant/ant-launcher/1.9.4/ant-launcher-1.9.4.jar (18 kB at 227 kB/s)
12:25:38 Progress (1): 0.4/2.0 MB
Progress (1): 0.4/2.0 MB
Progress (1): 0.4/2.0 MB
Progress (1): 0.4/2.0 MB
Progress (1): 0.4/2.0 MB
Progress (1): 0.4/2.0 MB
Progress (1): 0.4/2.0 MB
Progress (1): 0.4/2.0 MB
Progress (1): 0.4/2.0 MB
Progress (1): 0.4/2.0 MB
Progress (1): 0.4/2.0 MB
Progress (1): 0.4/2.0 MB
Progress (1): 0.4/2.0 MB
Progress (1): 0.4/2.0 MB
Progress (1): 0.4/2.0 MB
Progress (1): 0.4/2.0 MB
Progress (1): 0.4/2.0 MB
Progress (1): 0.4/2.0 MB
Progress (1): 0.4/2.0 MB
Progress (1): 0.4/2.0 MB
Progress (1): 0.4/2.0 MB
Progress (1): 0.4/2.0 MB
Progress (1): 0.5/2.0 MB
Progress (1): 0.5/2.0 MB
Progress (1): 0.5/2.0 MB
Progress (1): 0.5/2.0 MB
Progress (1): 0.5/2.0 MB
Progress (1): 0.5/2.0 MB
Progress (1): 0.5/2.0 MB
Progress (1): 0.5/2.0 MB
Progress (1): 0.5/2.0 MB
Progress (1): 0.5/2.0 MB
Progress (1): 0.5/2.0 MB
Progress (1): 0.5/2.0 MB
Progress (1): 0.5/2.0 MB
Progress (1): 0.5/2.0 MB
Progress (1): 0.5/2.0 MB
Progress (1): 0.5/2.0 MB
Progress (1): 0.5/2.0 MB
Progress (1): 0.5/2.0 MB
Progress (1): 0.5/2.0 MB
Progress (1): 0.5/2.0 MB
Progress (1): 0.5/2.0 MB
Progress (1): 0.5/2.0 MB
Progress (1): 0.5/2.0 MB
Progress (1): 0.5/2.0 MB
Progress (1): 0.5/2.0 MB
Progress (1): 0.6/2.0 MB
Progress (1): 0.6/2.0 MB
Progress (1): 0.6/2.0 MB
Progress (1): 0.6/2.0 MB
Progress (1): 0.6/2.0 MB
Progress (1): 0.6/2.0 MB
Progress (1): 0.6/2.0 MB
Progress (1): 0.6/2.0 MB
Progress (1): 0.6/2.0 MB
Progress (1): 0.6/2.0 MB
Progress (1): 0.6/2.0 MB
Progress (1): 0.6/2.0 MB
Progress (1): 0.6/2.0 MB
Progress (1): 0.6/2.0 MB
Progress (1): 0.6/2.0 MB
Progress (1): 0.6/2.0 MB
Progress (1): 0.6/2.0 MB
Progress (1): 0.6/2.0 MB
Progress (1): 0.6/2.0 MB
Progress (1): 0.6/2.0 MB
Progress (1): 0.6/2.0 MB
Progress (1): 0.6/2.0 MB
Progress (1): 0.6/2.0 MB
Progress (1): 0.6/2.0 MB
Progress (1): 0.6/2.0 MB
Progress (1): 0.7/2.0 MB
Progress (1): 0.7/2.0 MB
Progress (1): 0.7/2.0 MB
Progress (1): 0.7/2.0 MB
Progress (1): 0.7/2.0 MB
Progress (1): 0.7/2.0 MB
Progress (1): 0.7/2.0 MB
Progress (1): 0.7/2.0 MB
Progress (1): 0.7/2.0 MB
Progress (1): 0.7/2.0 MB
Progress (1): 0.7/2.0 MB
Progress (1): 0.7/2.0 MB
Progress (1): 0.7/2.0 MB
Progress (1): 0.7/2.0 MB
Progress (1): 0.7/2.0 MB
Progress (1): 0.7/2.0 MB
Progress (1): 0.7/2.0 MB
Progress (1): 0.7/2.0 MB
Progress (1): 0.7/2.0 MB
Progress (1): 0.7/2.0 MB
Progress (1): 0.7/2.0 MB
Progress (1): 0.7/2.0 MB
Progress (1): 0.7/2.0 MB
Progress (1): 0.7/2.0 MB
Progress (1): 0.7/2.0 MB
Progress (1): 0.8/2.0 MB
Progress (1): 0.8/2.0 MB
Progress (1): 0.8/2.0 MB
Progress (1): 0.8/2.0 MB
Progress (1): 0.8/2.0 MB
Progress (1): 0.8/2.0 MB
Progress (1): 0.8/2.0 MB
Progress (1): 0.8/2.0 MB
Progress (1): 0.8/2.0 MB
Progress (1): 0.8/2.0 MB
Progress (1): 0.8/2.0 MB
Progress (1): 0.8/2.0 MB
Progress (1): 0.8/2.0 MB
Progress (1): 0.8/2.0 MB
Progress (1): 0.8/2.0 MB
Progress (1): 0.8/2.0 MB
Progress (1): 0.8/2.0 MB
Progress (1): 0.8/2.0 MB
Progress (1): 0.8/2.0 MB
Progress (1): 0.8/2.0 MB
Progress (1): 0.8/2.0 MB
Progress (1): 0.8/2.0 MB
Progress (1): 0.8/2.0 MB
Progress (1): 0.8/2.0 MB
Progress (1): 0.8/2.0 MB
Progress (1): 0.9/2.0 MB
Progress (1): 0.9/2.0 MB
Progress (1): 0.9/2.0 MB
Progress (1): 0.9/2.0 MB
Progress (1): 0.9/2.0 MB
Progress (1): 0.9/2.0 MB
Progress (1): 0.9/2.0 MB
Progress (1): 0.9/2.0 MB
Progress (1): 0.9/2.0 MB
Progress (1): 0.9/2.0 MB
Progress (1): 0.9/2.0 MB
Progress (1): 0.9/2.0 MB
Progress (1): 0.9/2.0 MB
Progress (1): 0.9/2.0 MB
Progress (1): 0.9/2.0 MB
Progress (1): 0.9/2.0 MB
Progress (1): 0.9/2.0 MB
Progress (1): 0.9/2.0 MB
Progress (1): 0.9/2.0 MB
Progress (1): 0.9/2.0 MB
Progress (1): 0.9/2.0 MB
Progress (1): 0.9/2.0 MB
Progress (1): 0.9/2.0 MB
Progress (1): 0.9/2.0 MB
Progress (1): 0.9/2.0 MB
Progress (1): 1.0/2.0 MB
Progress (1): 1.0/2.0 MB
Progress (1): 1.0/2.0 MB
Progress (1): 1.0/2.0 MB
Progress (1): 1.0/2.0 MB
Progress (1): 1.0/2.0 MB
Progress (1): 1.0/2.0 MB
Progress (1): 1.0/2.0 MB
Progress (1): 1.0/2.0 MB
Progress (1): 1.0/2.0 MB
Progress (1): 1.0/2.0 MB
Progress (1): 1.0/2.0 MB
Progress (1): 1.0/2.0 MB
Progress (1): 1.0/2.0 MB
Progress (1): 1.0/2.0 MB
Progress (1): 1.0/2.0 MB
Progress (1): 1.0/2.0 MB
Progress (1): 1.0/2.0 MB
Progress (1): 1.0/2.0 MB
Progress (1): 1.0/2.0 MB
Progress (1): 1.0/2.0 MB
Progress (1): 1.0/2.0 MB
Progress (1): 1.0/2.0 MB
Progress (1): 1.0/2.0 MB
Progress (1): 1.0/2.0 MB
Progress (1): 1.1/2.0 MB
Progress (1): 1.1/2.0 MB
Progress (1): 1.1/2.0 MB
Progress (1): 1.1/2.0 MB
Progress (1): 1.1/2.0 MB
Progress (1): 1.1/2.0 MB
Progress (1): 1.1/2.0 MB
Progress (1): 1.1/2.0 MB
Progress (1): 1.1/2.0 MB
Progress (1): 1.1/2.0 MB
Progress (1): 1.1/2.0 MB
Progress (1): 1.1/2.0 MB
Progress (1): 1.1/2.0 MB
Progress (1): 1.1/2.0 MB
Progress (1): 1.1/2.0 MB
Progress (1): 1.1/2.0 MB
Progress (1): 1.1/2.0 MB
Progress (1): 1.1/2.0 MB
Progress (1): 1.1/2.0 MB
Progress (1): 1.1/2.0 MB
Progress (1): 1.1/2.0 MB
Progress (1): 1.1/2.0 MB
Progress (1): 1.1/2.0 MB
Progress (1): 1.1/2.0 MB
Progress (1): 1.1/2.0 MB
Progress (1): 1.2/2.0 MB
Progress (1): 1.2/2.0 MB
Progress (1): 1.2/2.0 MB
Progress (1): 1.2/2.0 MB
Progress (1): 1.2/2.0 MB
Progress (1): 1.2/2.0 MB
Progress (1): 1.2/2.0 MB
Progress (1): 1.2/2.0 MB
Progress (1): 1.2/2.0 MB
Progress (1): 1.2/2.0 MB
Progress (1): 1.2/2.0 MB
Progress (1): 1.2/2.0 MB
Progress (1): 1.2/2.0 MB
Progress (1): 1.2/2.0 MB
Progress (1): 1.2/2.0 MB
Progress (1): 1.2/2.0 MB
Progress (1): 1.2/2.0 MB
Progress (1): 1.2/2.0 MB
Progress (1): 1.2/2.0 MB
Progress (1): 1.2/2.0 MB
Progress (1): 1.2/2.0 MB
Progress (1): 1.2/2.0 MB
Progress (1): 1.2/2.0 MB
Progress (1): 1.2/2.0 MB
Progress (1): 1.2/2.0 MB
Progress (1): 1.3/2.0 MB
Progress (1): 1.3/2.0 MB
Progress (1): 1.3/2.0 MB
Progress (1): 1.3/2.0 MB
Progress (1): 1.3/2.0 MB
Progress (1): 1.3/2.0 MB
Progress (1): 1.3/2.0 MB
Progress (1): 1.3/2.0 MB
Progress (1): 1.3/2.0 MB
Progress (1): 1.3/2.0 MB
Progress (1): 1.3/2.0 MB
Progress (1): 1.3/2.0 MB
Progress (1): 1.3/2.0 MB
Progress (1): 1.3/2.0 MB
Progress (1): 1.3/2.0 MB
Progress (1): 1.3/2.0 MB
Progress (1): 1.3/2.0 MB
Progress (1): 1.3/2.0 MB
Progress (1): 1.3/2.0 MB
Progress (1): 1.3/2.0 MB
Progress (1): 1.3/2.0 MB
Progress (1): 1.3/2.0 MB
Progress (1): 1.3/2.0 MB
Progress (1): 1.3/2.0 MB
Progress (1): 1.3/2.0 MB
Progress (1): 1.4/2.0 MB
Progress (1): 1.4/2.0 MB
Progress (1): 1.4/2.0 MB
Progress (1): 1.4/2.0 MB
Progress (1): 1.4/2.0 MB
Progress (1): 1.4/2.0 MB
Progress (1): 1.4/2.0 MB
Progress (1): 1.4/2.0 MB
Progress (1): 1.4/2.0 MB
Progress (1): 1.4/2.0 MB
Progress (1): 1.4/2.0 MB
Progress (1): 1.4/2.0 MB
Progress (1): 1.4/2.0 MB
Progress (1): 1.4/2.0 MB
Progress (1): 1.4/2.0 MB
Progress (1): 1.4/2.0 MB
Progress (1): 1.4/2.0 MB
Progress (1): 1.4/2.0 MB
Progress (1): 1.4/2.0 MB
Progress (1): 1.4/2.0 MB
Progress (1): 1.4/2.0 MB
Progress (1): 1.4/2.0 MB
Progress (1): 1.4/2.0 MB
Progress (1): 1.4/2.0 MB
Progress (1): 1.4/2.0 MB
Progress (1): 1.5/2.0 MB
Progress (1): 1.5/2.0 MB
Progress (1): 1.5/2.0 MB
Progress (1): 1.5/2.0 MB
Progress (1): 1.5/2.0 MB
Progress (1): 1.5/2.0 MB
Progress (1): 1.5/2.0 MB
Progress (1): 1.5/2.0 MB
Progress (1): 1.5/2.0 MB
Progress (1): 1.5/2.0 MB
Progress (1): 1.5/2.0 MB
Progress (1): 1.5/2.0 MB
Progress (1): 1.5/2.0 MB
Progress (1): 1.5/2.0 MB
Progress (1): 1.5/2.0 MB
Progress (1): 1.5/2.0 MB
Progress (1): 1.5/2.0 MB
Progress (1): 1.5/2.0 MB
Progress (1): 1.5/2.0 MB
Progress (1): 1.5/2.0 MB
Progress (1): 1.5/2.0 MB
Progress (1): 1.5/2.0 MB
Progress (1): 1.5/2.0 MB
Progress (1): 1.5/2.0 MB
Progress (1): 1.5/2.0 MB
Progress (1): 1.6/2.0 MB
Progress (1): 1.6/2.0 MB
Progress (1): 1.6/2.0 MB
Progress (1): 1.6/2.0 MB
Progress (1): 1.6/2.0 MB
Progress (1): 1.6/2.0 MB
Progress (1): 1.6/2.0 MB
Progress (1): 1.6/2.0 MB
Progress (1): 1.6/2.0 MB
Progress (1): 1.6/2.0 MB
Progress (1): 1.6/2.0 MB
Progress (1): 1.6/2.0 MB
Progress (1): 1.6/2.0 MB
Progress (1): 1.6/2.0 MB
Progress (1): 1.6/2.0 MB
Progress (1): 1.6/2.0 MB
Progress (1): 1.6/2.0 MB
Progress (1): 1.6/2.0 MB
Progress (1): 1.6/2.0 MB
Progress (1): 1.6/2.0 MB
Progress (1): 1.6/2.0 MB
Progress (1): 1.6/2.0 MB
Progress (1): 1.6/2.0 MB
Progress (1): 1.6/2.0 MB
Progress (1): 1.6/2.0 MB
Progress (1): 1.7/2.0 MB
Progress (1): 1.7/2.0 MB
Progress (1): 1.7/2.0 MB
Progress (1): 1.7/2.0 MB
Progress (1): 1.7/2.0 MB
Progress (1): 1.7/2.0 MB
Progress (1): 1.7/2.0 MB
Progress (1): 1.7/2.0 MB
Progress (1): 1.7/2.0 MB
Progress (1): 1.7/2.0 MB
Progress (1): 1.7/2.0 MB
Progress (1): 1.7/2.0 MB
Progress (1): 1.7/2.0 MB
Progress (1): 1.7/2.0 MB
Progress (1): 1.7/2.0 MB
Progress (1): 1.7/2.0 MB
Progress (1): 1.7/2.0 MB
Progress (1): 1.7/2.0 MB
Progress (1): 1.7/2.0 MB
Progress (1): 1.7/2.0 MB
Progress (1): 1.7/2.0 MB
Progress (1): 1.7/2.0 MB
Progress (1): 1.7/2.0 MB
Progress (1): 1.7/2.0 MB
Progress (1): 1.7/2.0 MB
Progress (1): 1.8/2.0 MB
Progress (1): 1.8/2.0 MB
Progress (1): 1.8/2.0 MB
Progress (1): 1.8/2.0 MB
Progress (1): 1.8/2.0 MB
Progress (1): 1.8/2.0 MB
Progress (1): 1.8/2.0 MB
Progress (1): 1.8/2.0 MB
Progress (1): 1.8/2.0 MB
Progress (1): 1.8/2.0 MB
Progress (1): 1.8/2.0 MB
Progress (1): 1.8/2.0 MB
Progress (1): 1.8/2.0 MB
Progress (1): 1.8/2.0 MB
Progress (1): 1.8/2.0 MB
Progress (1): 1.8/2.0 MB
Progress (1): 1.8/2.0 MB
Progress (1): 1.8/2.0 MB
Progress (1): 1.8/2.0 MB
Progress (1): 1.8/2.0 MB
Progress (1): 1.8/2.0 MB
Progress (1): 1.8/2.0 MB
Progress (1): 1.8/2.0 MB
Progress (1): 1.8/2.0 MB
Progress (1): 1.8/2.0 MB
Progress (1): 1.9/2.0 MB
Progress (1): 1.9/2.0 MB
Progress (1): 1.9/2.0 MB
Progress (1): 1.9/2.0 MB
Progress (1): 1.9/2.0 MB
Progress (1): 1.9/2.0 MB
Progress (1): 1.9/2.0 MB
Progress (1): 1.9/2.0 MB
Progress (1): 1.9/2.0 MB
Progress (1): 1.9/2.0 MB
Progress (1): 1.9/2.0 MB
Progress (1): 1.9/2.0 MB
Progress (1): 1.9/2.0 MB
Progress (1): 1.9/2.0 MB
Progress (1): 1.9/2.0 MB
Progress (1): 1.9/2.0 MB
Progress (1): 1.9/2.0 MB
Progress (1): 1.9/2.0 MB
Progress (1): 1.9/2.0 MB
Progress (1): 1.9/2.0 MB
Progress (1): 1.9/2.0 MB
Progress (1): 1.9/2.0 MB
Progress (1): 1.9/2.0 MB
Progress (1): 1.9/2.0 MB
Progress (1): 1.9/2.0 MB
Progress (1): 2.0/2.0 MB
Progress (1): 2.0/2.0 MB
Progress (1): 2.0/2.0 MB
Progress (1): 2.0/2.0 MB
Progress (1): 2.0/2.0 MB
Progress (1): 2.0/2.0 MB
Progress (1): 2.0/2.0 MB
Progress (1): 2.0/2.0 MB
Progress (1): 2.0/2.0 MB
Progress (1): 2.0/2.0 MB
Progress (1): 2.0/2.0 MB
Progress (1): 2.0/2.0 MB
Progress (1): 2.0/2.0 MB
Progress (1): 2.0/2.0 MB
Progress (1): 2.0/2.0 MB
Progress (1): 2.0/2.0 MB
Progress (1): 2.0/2.0 MB
Progress (1): 2.0/2.0 MB
Progress (1): 2.0 MB    
                    
Downloaded from eclipse.maven.central.mirror: https://repo.eclipse.org/content/repositories/maven_central/org/apache/ant/ant/1.9.4/ant-1.9.4.jar (2.0 MB at 13 MB/s)
12:25:38 Progress (1): 4.1/49 kB
Progress (1): 7.7/49 kB
Progress (1): 12/49 kB 
Progress (1): 16/49 kB
Progress (1): 20/49 kB
Progress (1): 24/49 kB
Progress (1): 28/49 kB
Progress (1): 32/49 kB
Progress (1): 36/49 kB
Progress (1): 40/49 kB
Progress (1): 44/49 kB
Progress (1): 48/49 kB
Progress (1): 49 kB   
                   
Downloaded from eclipse.maven.central.mirror: https://repo.eclipse.org/content/repositories/maven_central/org/apache/maven/maven-settings/2.2.1/maven-settings-2.2.1.jar (49 kB at 192 kB/s)
12:25:38 [WARNING] Parameter tasks is deprecated, use target instead
12:25:38 [INFO] Executing tasks
12:25:38 
12:25:38 main:
12:25:38 [INFO] Executed tasks
12:25:38 [INFO] 
12:25:38 [INFO] --- target-platform-configuration:1.3.0:target-platform (default-target-platform) @ org.eclipse.jdt.core ---
12:25:38 [INFO] 
12:25:38 [INFO] --- tycho-packaging-plugin:1.3.0:package-plugin (default-package-plugin) @ org.eclipse.jdt.core ---
12:25:38 [INFO] Building jar: /jobs/genie.jdt/eclipse.jdt.core-Gerrit/workspace/org.eclipse.jdt.core/jdtCompilerAdapter.jar
12:25:39 [INFO] Building jar: /jobs/genie.jdt/eclipse.jdt.core-Gerrit/workspace/org.eclipse.jdt.core/target/org.eclipse.jdt.core-3.17.0-SNAPSHOT.jar
12:25:39 [INFO] 
12:25:39 [INFO] --- tycho-p2-plugin:1.3.0:p2-metadata-default (default-p2-metadata-default) @ org.eclipse.jdt.core ---
12:25:39 [INFO] No baseline version MavenProject: org.eclipse.jdt:org.eclipse.jdt.core:3.17.0-SNAPSHOT @ /jobs/genie.jdt/eclipse.jdt.core-Gerrit/workspace/org.eclipse.jdt.core/pom.xml
12:25:39 [INFO] 
12:25:39 [INFO] --- maven-resources-plugin:3.1.0:copy-resources (copy-batch-compiler-source) @ org.eclipse.jdt.core ---
12:25:39 [INFO] Using 'UTF-8' encoding to copy filtered resources.
12:25:39 [INFO] Copying 1 resource
12:25:39 [INFO] 
12:25:39 [INFO] --- tycho-custom-bundle-plugin:1.3.0:custom-bundle (antadapter) @ org.eclipse.jdt.core ---
12:25:39 [INFO] Building jar: /jobs/genie.jdt/eclipse.jdt.core-Gerrit/workspace/org.eclipse.jdt.core/target/org.eclipse.jdt.core-3.17.0-SNAPSHOT-antadapter.jar
12:25:39 [INFO] 
12:25:39 [INFO] --- tycho-custom-bundle-plugin:1.3.0:custom-bundle (batch-compiler-src) @ org.eclipse.jdt.core ---
12:25:39 [INFO] Building jar: /jobs/genie.jdt/eclipse.jdt.core-Gerrit/workspace/org.eclipse.jdt.core/target/org.eclipse.jdt.core-3.17.0-SNAPSHOT-batch-compiler-src.jar
12:25:39 [INFO] 
12:25:39 [INFO] --- tycho-custom-bundle-plugin:1.3.0:custom-bundle (batch-compiler) @ org.eclipse.jdt.core ---
12:25:39 [INFO] Building jar: /jobs/genie.jdt/eclipse.jdt.core-Gerrit/workspace/org.eclipse.jdt.core/target/org.eclipse.jdt.core-3.17.0-SNAPSHOT-batch-compiler.jar
12:25:39 [INFO] 
12:25:39 [INFO] --- tycho-p2-plugin:1.3.0:p2-metadata (attached-p2-metadata) @ org.eclipse.jdt.core ---
12:25:40 [INFO] No baseline version MavenProject: org.eclipse.jdt:org.eclipse.jdt.core:3.17.0-SNAPSHOT @ /jobs/genie.jdt/eclipse.jdt.core-Gerrit/workspace/org.eclipse.jdt.core/pom.xml
12:25:40 [INFO] 
12:25:40 [INFO] --- tycho-p2-extras-plugin:1.3.0:compare-version-with-baselines (compare-attached-artifacts-with-release) @ org.eclipse.jdt.core ---
12:25:40 [INFO] Skipped
12:25:40 [INFO] 
12:25:40 [INFO] -----------< org.eclipse.jdt:org.eclipse.jdt.compiler.tool >------------
12:25:40 [INFO] Building org.eclipse.jdt.compiler.tool 1.2.400-SNAPSHOT           [5/17]
12:25:40 [INFO] ---------------------------[ eclipse-plugin ]---------------------------
12:25:40 [INFO] 
12:25:40 [INFO] --- maven-clean-plugin:3.1.0:clean (default-clean) @ org.eclipse.jdt.compiler.tool ---
12:25:40 [INFO] 
12:25:40 [INFO] --- tycho-packaging-plugin:1.3.0:build-qualifier (default-build-qualifier) @ org.eclipse.jdt.compiler.tool ---
12:25:40 [INFO] The project's OSGi version is 1.2.400.v20181113-0926
12:25:40 [INFO] 
12:25:40 [INFO] --- tycho-packaging-plugin:1.3.0:validate-id (default-validate-id) @ org.eclipse.jdt.compiler.tool ---
12:25:40 [INFO] 
12:25:40 [INFO] --- tycho-packaging-plugin:1.3.0:validate-version (default-validate-version) @ org.eclipse.jdt.compiler.tool ---
12:25:40 [INFO] 
12:25:40 [INFO] --- maven-resources-plugin:3.1.0:copy-resources (saveproperties) @ org.eclipse.jdt.compiler.tool ---
12:25:40 [INFO] Using 'UTF-8' encoding to copy filtered resources.
12:25:40 [INFO] skip non existing resourceDirectory /jobs/genie.jdt/eclipse.jdt.core-Gerrit/workspace/org.eclipse.jdt.compiler.tool/saveproperties
12:25:40 [INFO] 
12:25:40 [INFO] --- maven-enforcer-plugin:3.0.0-M2:enforce (enforce-maven) @ org.eclipse.jdt.compiler.tool ---
12:25:40 [INFO] 
12:25:40 [INFO] --- eclipse-cbi-plugin:1.1.5:generate-api-build-xml (default) @ org.eclipse.jdt.compiler.tool ---
12:25:40 Generating target/.apibuild.xml
12:25:40 [INFO] 
12:25:40 [INFO] --- maven-resources-plugin:3.1.0:resources (default-resources) @ org.eclipse.jdt.compiler.tool ---
12:25:40 [INFO] Using 'UTF-8' encoding to copy filtered resources.
12:25:40 [INFO] skip non existing resourceDirectory /jobs/genie.jdt/eclipse.jdt.core-Gerrit/workspace/org.eclipse.jdt.compiler.tool/src/main/resources
12:25:40 [INFO] 
12:25:40 [INFO] --- maven-resources-plugin:3.1.0:resources (filter-resources) @ org.eclipse.jdt.compiler.tool ---
12:25:40 [INFO] Using 'UTF-8' encoding to copy filtered resources.
12:25:40 [INFO] skip non existing resourceDirectory /jobs/genie.jdt/eclipse.jdt.core-Gerrit/workspace/org.eclipse.jdt.compiler.tool/src/main/resources
12:25:40 [INFO] 
12:25:40 [INFO] --- tycho-compiler-plugin:1.3.0:compile (default-compile) @ org.eclipse.jdt.compiler.tool ---
12:25:40 [INFO] Compiling 15 source files to /jobs/genie.jdt/eclipse.jdt.core-Gerrit/workspace/org.eclipse.jdt.compiler.tool/target/classes
12:25:40 [INFO] ------------------------------------------------------------------------
12:25:40 [INFO] Reactor Summary:
12:25:40 [INFO] 
12:25:40 [INFO] eclipse.jdt.core 4.11.0-SNAPSHOT ................... SUCCESS [ 30.680 s]
12:25:40 [INFO] org.eclipse.jdt.annotation 2.2.200-SNAPSHOT ........ SUCCESS [ 14.387 s]
12:25:40 [INFO] org.eclipse.jdt.annotation 1.1.400-SNAPSHOT ........ SUCCESS [  5.320 s]
12:25:40 [INFO] org.eclipse.jdt.core 3.17.0-SNAPSHOT ............... SUCCESS [ 34.289 s]
12:25:40 [INFO] org.eclipse.jdt.compiler.tool 1.2.400-SNAPSHOT ..... FAILURE [  0.687 s]
12:25:40 [INFO] org.eclipse.jdt.compiler.apt 1.3.400-SNAPSHOT ...... SKIPPED
12:25:40 [INFO] org.eclipse.jdt.core.tests.compiler 3.12.800-SNAPSHOT SKIPPED
12:25:40 [INFO] org.eclipse.jdt.compiler.tool.tests 1.2.500-SNAPSHOT SKIPPED
12:25:40 [INFO] org.eclipse.jdt.core.tests.builder 3.10.400-SNAPSHOT SKIPPED
12:25:40 [INFO] org.eclipse.jdt.compiler.apt.tests 1.1.700-SNAPSHOT  SKIPPED
12:25:40 [INFO] org.eclipse.jdt.core.tests.model 3.10.800-SNAPSHOT . SKIPPED
12:25:40 [INFO] org.eclipse.jdt.core.tests.performance 3.10.500-SNAPSHOT SKIPPED
12:25:40 [INFO] org.eclipse.jdt.apt.core 3.6.200-SNAPSHOT .......... SKIPPED
12:25:40 [INFO] org.eclipse.jdt.apt.pluggable.core 1.2.300-SNAPSHOT  SKIPPED
12:25:40 [INFO] org.eclipse.jdt.apt.ui 3.6.200-SNAPSHOT ............ SKIPPED
12:25:40 [INFO] org.eclipse.jdt.apt.pluggable.tests 3.4.500-SNAPSHOT SKIPPED
12:25:40 [INFO] org.eclipse.jdt.apt.tests 3.4.500-SNAPSHOT ......... SKIPPED
12:25:40 [INFO] ------------------------------------------------------------------------
12:25:40 [INFO] BUILD FAILURE
12:25:40 [INFO] ------------------------------------------------------------------------
12:25:40 [INFO] Total time: 03:40 min
12:25:40 [INFO] Finished at: 2019-01-22T12:25:40-05:00
12:25:40 [INFO] ------------------------------------------------------------------------
12:25:40 [ERROR] Failed to execute goal org.eclipse.tycho:tycho-compiler-plugin:1.3.0:compile (default-compile) on project org.eclipse.jdt.compiler.tool: Fatal error compiling: incorrect classpath: /opt/public/common/java/oracle/jdk1.8.0_192_x64/jre/classes
12:25:40 [ERROR] java.lang.NullPointerException
12:25:40 [ERROR] 	at org.eclipse.jdt.internal.compiler.apt.util.EclipseFileManager.prependFiles(EclipseFileManager.java:937)
12:25:40 [ERROR] 	at org.eclipse.jdt.internal.compiler.apt.util.EclipseFileManager.handleOption(EclipseFileManager.java:773)
12:25:40 [ERROR] 	at org.eclipse.jdt.internal.compiler.apt.dispatch.BatchProcessingEnvImpl.<init>(BatchProcessingEnvImpl.java:91)
12:25:40 [ERROR] 	at org.eclipse.jdt.internal.compiler.apt.dispatch.BatchAnnotationProcessorManager.configure(BatchAnnotationProcessorManager.java:78)
12:25:40 [ERROR] 	at org.eclipse.jdt.internal.compiler.batch.Main.initializeAnnotationProcessorManager(Main.java:4570)
12:25:40 [ERROR] 	at org.eclipse.jdt.internal.compiler.batch.Main.performCompilation(Main.java:4686)
12:25:40 [ERROR] 	at org.eclipse.jdt.internal.compiler.batch.Main.compile(Main.java:1768)
12:25:40 [ERROR] 	at org.eclipse.tycho.compiler.jdt.JDTCompiler.compileInProcess(JDTCompiler.java:350)
12:25:40 [ERROR] 	at org.eclipse.tycho.compiler.jdt.JDTCompiler.performCompile(JDTCompiler.java:115)
12:25:40 [ERROR] 	at copied.org.apache.maven.plugin.AbstractCompilerMojo.execute(AbstractCompilerMojo.java:403)
12:25:40 [ERROR] 	at org.eclipse.tycho.compiler.AbstractOsgiCompilerMojo.execute(AbstractOsgiCompilerMojo.java:293)
12:25:40 [ERROR] 	at org.apache.maven.plugin.DefaultBuildPluginManager.executeMojo(DefaultBuildPluginManager.java:137)
12:25:40 [ERROR] 	at org.apache.maven.lifecycle.internal.MojoExecutor.execute(MojoExecutor.java:208)
12:25:40 [ERROR] 	at org.apache.maven.lifecycle.internal.MojoExecutor.execute(MojoExecutor.java:154)
12:25:40 [ERROR] 	at org.apache.maven.lifecycle.internal.MojoExecutor.execute(MojoExecutor.java:146)
12:25:40 [ERROR] 	at org.apache.maven.lifecycle.internal.LifecycleModuleBuilder.buildProject(LifecycleModuleBuilder.java:117)
12:25:40 [ERROR] 	at org.apache.maven.lifecycle.internal.LifecycleModuleBuilder.buildProject(LifecycleModuleBuilder.java:81)
12:25:41 [ERROR] 	at org.apache.maven.lifecycle.internal.builder.singlethreaded.SingleThreadedBuilder.build(SingleThreadedBuilder.java:56)
12:25:41 [ERROR] 	at org.apache.maven.lifecycle.internal.LifecycleStarter.execute(LifecycleStarter.java:128)
12:25:41 [ERROR] 	at org.apache.maven.DefaultMaven.doExecute(DefaultMaven.java:305)
12:25:41 [ERROR] 	at org.apache.maven.DefaultMaven.doExecute(DefaultMaven.java:192)
12:25:41 [ERROR] 	at org.apache.maven.DefaultMaven.execute(DefaultMaven.java:105)
12:25:41 [ERROR] 	at org.apache.maven.cli.MavenCli.execute(MavenCli.java:954)
12:25:41 [ERROR] 	at org.apache.maven.cli.MavenCli.doMain(MavenCli.java:288)
12:25:41 [ERROR] 	at org.apache.maven.cli.MavenCli.main(MavenCli.java:192)
12:25:41 [ERROR] 	at java.base/jdk.internal.reflect.NativeMethodAccessorImpl.invoke0(Native Method)
12:25:41 [ERROR] 	at java.base/jdk.internal.reflect.NativeMethodAccessorImpl.invoke(NativeMethodAccessorImpl.java:62)
12:25:41 [ERROR] 	at java.base/jdk.internal.reflect.DelegatingMethodAccessorImpl.invoke(DelegatingMethodAccessorImpl.java:43)
12:25:41 [ERROR] 	at java.base/java.lang.reflect.Method.invoke(Method.java:566)
12:25:41 [ERROR] 	at org.codehaus.plexus.classworlds.launcher.Launcher.launchEnhanced(Launcher.java:289)
12:25:41 [ERROR] 	at org.codehaus.plexus.classworlds.launcher.Launcher.launch(Launcher.java:229)
12:25:41 [ERROR] 	at org.codehaus.plexus.classworlds.launcher.Launcher.mainWithExitCode(Launcher.java:415)
12:25:41 [ERROR] 	at org.codehaus.plexus.classworlds.launcher.Launcher.main(Launcher.java:356)
12:25:41 [ERROR] -> [Help 1]
12:25:41 [ERROR] 
12:25:41 [ERROR] To see the full stack trace of the errors, re-run Maven with the -e switch.
12:25:41 [ERROR] Re-run Maven using the -X switch to enable full debug logging.
12:25:41 [ERROR] 
12:25:41 [ERROR] For more information about the errors and possible solutions, please read the following articles:
12:25:41 [ERROR] [Help 1] http://cwiki.apache.org/confluence/display/MAVEN/MojoExecutionException
12:25:41 [ERROR] 
12:25:41 [ERROR] After correcting the problems, you can resume the build with the command
12:25:41 [ERROR]   mvn <goals> -rf :org.eclipse.jdt.compiler.tool
12:25:43 Build step 'Invoke top-level Maven targets' marked build as failure
12:25:43 Recording test results
12:25:43 ERROR: Step ‘Publish JUnit test result report’ failed: No test report files were found. Configuration error?
12:25:43 Archiving artifacts
12:25:43 Started calculate disk usage of build
12:25:43 Finished Calculation of disk usage of build in 0 seconds
12:25:51 Started calculate disk usage of workspace
12:25:52 Finished Calculation of disk usage of workspace in 0 seconds
12:26:02 Finished: FAILURE