FailedConsole Output

Skipping 5,584 KB.. Full Log
42 s
04:30:14 test016 - 1.4(org.eclipse.jdt.core.tests.eval.DebugEvaluationTest)  Time elapsed: 0.242 s
04:30:14 test017 - 1.4(org.eclipse.jdt.core.tests.eval.DebugEvaluationTest)  Time elapsed: 0.127 s
04:30:14 test018 - 1.4(org.eclipse.jdt.core.tests.eval.DebugEvaluationTest)  Time elapsed: 0.271 s
04:30:14 test019 - 1.4(org.eclipse.jdt.core.tests.eval.DebugEvaluationTest)  Time elapsed: 0.032 s
04:30:14 test020 - 1.4(org.eclipse.jdt.core.tests.eval.DebugEvaluationTest)  Time elapsed: 0.148 s
04:30:14 test021 - 1.4(org.eclipse.jdt.core.tests.eval.DebugEvaluationTest)  Time elapsed: 0.273 s
04:30:14 test022 - 1.4(org.eclipse.jdt.core.tests.eval.DebugEvaluationTest)  Time elapsed: 0.277 s
04:30:14 test023 - 1.4(org.eclipse.jdt.core.tests.eval.DebugEvaluationTest)  Time elapsed: 0.277 s
04:30:14 test024 - 1.4(org.eclipse.jdt.core.tests.eval.DebugEvaluationTest)  Time elapsed: 0.277 s
04:30:14 test025 - 1.4(org.eclipse.jdt.core.tests.eval.DebugEvaluationTest)  Time elapsed: 0.268 s
04:30:14 test026 - 1.4(org.eclipse.jdt.core.tests.eval.DebugEvaluationTest)  Time elapsed: 0.14 s
04:30:14 test027 - 1.4(org.eclipse.jdt.core.tests.eval.DebugEvaluationTest)  Time elapsed: 0.178 s
04:30:14 test028 - 1.4(org.eclipse.jdt.core.tests.eval.DebugEvaluationTest)  Time elapsed: 0.145 s
04:30:14 test029 - 1.4(org.eclipse.jdt.core.tests.eval.DebugEvaluationTest)  Time elapsed: 0.145 s
04:30:14 test030 - 1.4(org.eclipse.jdt.core.tests.eval.DebugEvaluationTest)  Time elapsed: 0.148 s
04:30:14 test031 - 1.4(org.eclipse.jdt.core.tests.eval.DebugEvaluationTest)  Time elapsed: 0.148 s
04:30:14 test032 - 1.4(org.eclipse.jdt.core.tests.eval.DebugEvaluationTest)  Time elapsed: 0.034 s
04:30:14 test033 - 1.4(org.eclipse.jdt.core.tests.eval.DebugEvaluationTest)  Time elapsed: 0.047 s
04:30:14 test034 - 1.4(org.eclipse.jdt.core.tests.eval.DebugEvaluationTest)  Time elapsed: 0.145 s
04:30:14 test035 - 1.4(org.eclipse.jdt.core.tests.eval.DebugEvaluationTest)  Time elapsed: 0.145 s
04:30:14 test036 - 1.4(org.eclipse.jdt.core.tests.eval.DebugEvaluationTest)  Time elapsed: 0.144 s
04:30:14 test037 - 1.4(org.eclipse.jdt.core.tests.eval.DebugEvaluationTest)  Time elapsed: 0.148 s
04:30:14 test038 - 1.4(org.eclipse.jdt.core.tests.eval.DebugEvaluationTest)  Time elapsed: 0.141 s
04:30:14 test039 - 1.4(org.eclipse.jdt.core.tests.eval.DebugEvaluationTest)  Time elapsed: 0.146 s
04:30:14 test040 - 1.4(org.eclipse.jdt.core.tests.eval.DebugEvaluationTest)  Time elapsed: 0.148 s
04:30:14 test041 - 1.4(org.eclipse.jdt.core.tests.eval.DebugEvaluationTest)  Time elapsed: 0.142 s
04:30:14 test042 - 1.4(org.eclipse.jdt.core.tests.eval.DebugEvaluationTest)  Time elapsed: 0.146 s
04:30:14 test043 - 1.4(org.eclipse.jdt.core.tests.eval.DebugEvaluationTest)  Time elapsed: 0.143 s
04:30:14 test044 - 1.4(org.eclipse.jdt.core.tests.eval.DebugEvaluationTest)  Time elapsed: 0.145 s
04:30:14 test045 - 1.4(org.eclipse.jdt.core.tests.eval.DebugEvaluationTest)  Time elapsed: 0.041 s
04:30:14 test046 - 1.4(org.eclipse.jdt.core.tests.eval.DebugEvaluationTest)  Time elapsed: 0.041 s
04:30:14 test047 - 1.4(org.eclipse.jdt.core.tests.eval.DebugEvaluationTest)  Time elapsed: 0.038 s
04:30:14 test048 - 1.4(org.eclipse.jdt.core.tests.eval.DebugEvaluationTest)  Time elapsed: 0.141 s
04:30:14 test049 - 1.4(org.eclipse.jdt.core.tests.eval.DebugEvaluationTest)  Time elapsed: 0.143 s
04:30:14 test050 - 1.4(org.eclipse.jdt.core.tests.eval.DebugEvaluationTest)  Time elapsed: 0.142 s
04:30:14 test051 - 1.4(org.eclipse.jdt.core.tests.eval.DebugEvaluationTest)  Time elapsed: 0.142 s
04:30:14 test052 - 1.4(org.eclipse.jdt.core.tests.eval.DebugEvaluationTest)  Time elapsed: 0.145 s
04:30:14 test053 - 1.4(org.eclipse.jdt.core.tests.eval.DebugEvaluationTest)  Time elapsed: 0.145 s
04:30:14 test054 - 1.4(org.eclipse.jdt.core.tests.eval.DebugEvaluationTest)  Time elapsed: 0.145 s
04:30:14 test055 - 1.4(org.eclipse.jdt.core.tests.eval.DebugEvaluationTest)  Time elapsed: 0.142 s
04:30:14 test056 - 1.4(org.eclipse.jdt.core.tests.eval.DebugEvaluationTest)  Time elapsed: 0.145 s
04:30:14 test057 - 1.4(org.eclipse.jdt.core.tests.eval.DebugEvaluationTest)  Time elapsed: 0.15 s
04:30:14 test058 - 1.4(org.eclipse.jdt.core.tests.eval.DebugEvaluationTest)  Time elapsed: 0.159 s
04:30:14 test059 - 1.4(org.eclipse.jdt.core.tests.eval.DebugEvaluationTest)  Time elapsed: 0.149 s
04:30:14 test060 - 1.4(org.eclipse.jdt.core.tests.eval.DebugEvaluationTest)  Time elapsed: 0.145 s
04:30:14 test061 - 1.4(org.eclipse.jdt.core.tests.eval.DebugEvaluationTest)  Time elapsed: 0.143 s
04:30:14 test062 - 1.4(org.eclipse.jdt.core.tests.eval.DebugEvaluationTest)  Time elapsed: 0.142 s
04:30:14 test063 - 1.4(org.eclipse.jdt.core.tests.eval.DebugEvaluationTest)  Time elapsed: 0 s
04:30:14 test065 - 1.4(org.eclipse.jdt.core.tests.eval.DebugEvaluationTest)  Time elapsed: 0 s
04:30:14 test066 - 1.4(org.eclipse.jdt.core.tests.eval.DebugEvaluationTest)  Time elapsed: 0 s
04:30:14 test067 - 1.4(org.eclipse.jdt.core.tests.eval.DebugEvaluationTest)  Time elapsed: 0 s
04:30:14 test068 - 1.4(org.eclipse.jdt.core.tests.eval.DebugEvaluationTest)  Time elapsed: 0 s
04:30:14 test069 - 1.4(org.eclipse.jdt.core.tests.eval.DebugEvaluationTest)  Time elapsed: 0 s
04:30:14 testNegative001 - 1.4(org.eclipse.jdt.core.tests.eval.DebugEvaluationTest)  Time elapsed: 0.03 s
04:30:14 testNegative002 - 1.4(org.eclipse.jdt.core.tests.eval.DebugEvaluationTest)  Time elapsed: 0.031 s
04:30:14 testNegative003 - 1.4(org.eclipse.jdt.core.tests.eval.DebugEvaluationTest)  Time elapsed: 0.029 s
04:30:14 testNegative004 - 1.4(org.eclipse.jdt.core.tests.eval.DebugEvaluationTest)  Time elapsed: 0.014 s
04:30:14 testNegative005 - 1.4(org.eclipse.jdt.core.tests.eval.DebugEvaluationTest)  Time elapsed: 0.015 s
04:30:14 testAllVariables - 1.7(org.eclipse.jdt.core.tests.eval.SanityTestEvaluationContext)  Time elapsed: 0 s
04:30:14 testEvaluate - 1.7(org.eclipse.jdt.core.tests.eval.SanityTestEvaluationContext)  Time elapsed: 0.016 s
04:30:14 testEvaluateImports - 1.7(org.eclipse.jdt.core.tests.eval.SanityTestEvaluationContext)  Time elapsed: 0.001 s
04:30:14 testEvaluateVariable - 1.7(org.eclipse.jdt.core.tests.eval.SanityTestEvaluationContext)  Time elapsed: 0.011 s
04:30:14 testEvaluateVariables - 1.7(org.eclipse.jdt.core.tests.eval.SanityTestEvaluationContext)  Time elapsed: 0.003 s
04:30:14 testGetSetImports - 1.7(org.eclipse.jdt.core.tests.eval.SanityTestEvaluationContext)  Time elapsed: 0 s
04:30:14 testGetSetPackageName - 1.7(org.eclipse.jdt.core.tests.eval.SanityTestEvaluationContext)  Time elapsed: 0 s
04:30:14 testNewDeleteVariable - 1.7(org.eclipse.jdt.core.tests.eval.SanityTestEvaluationContext)  Time elapsed: 0 s
04:30:14 testGetEvaluationType - 1.7(org.eclipse.jdt.core.tests.eval.SanityTestEvaluationResult)  Time elapsed: 0.006 s
04:30:14 testGetProblems - 1.7(org.eclipse.jdt.core.tests.eval.SanityTestEvaluationResult)  Time elapsed: 0.004 s
04:30:14 testGetValue - 1.7(org.eclipse.jdt.core.tests.eval.SanityTestEvaluationResult)  Time elapsed: 0.006 s
04:30:14 testGetValueDisplayString - 1.7(org.eclipse.jdt.core.tests.eval.SanityTestEvaluationResult)  Time elapsed: 0.004 s
04:30:14 testGetValueTypeName - 1.7(org.eclipse.jdt.core.tests.eval.SanityTestEvaluationResult)  Time elapsed: 0.004 s
04:30:14 testHasErrors - 1.7(org.eclipse.jdt.core.tests.eval.SanityTestEvaluationResult)  Time elapsed: 0.004 s
04:30:14 testHasProblems - 1.7(org.eclipse.jdt.core.tests.eval.SanityTestEvaluationResult)  Time elapsed: 0.005 s
04:30:14 testHasValue - 1.7(org.eclipse.jdt.core.tests.eval.SanityTestEvaluationResult)  Time elapsed: 0.004 s
04:30:14 testHasWarnings - 1.7(org.eclipse.jdt.core.tests.eval.SanityTestEvaluationResult)  Time elapsed: 0.004 s
04:30:14 testAllKindOfValues - 1.7(org.eclipse.jdt.core.tests.eval.VariableTest)  Time elapsed: 0.066 s
04:30:14 testCodeSnippetVarAssign - 1.7(org.eclipse.jdt.core.tests.eval.VariableTest)  Time elapsed: 0.108 s
04:30:14 testCodeSnippetVarRetrieval - 1.7(org.eclipse.jdt.core.tests.eval.VariableTest)  Time elapsed: 0.051 s
04:30:14 testImports - 1.7(org.eclipse.jdt.core.tests.eval.VariableTest)  Time elapsed: 0.05 s
04:30:14 testSeveralVariableInstallations - 1.7(org.eclipse.jdt.core.tests.eval.VariableTest)  Time elapsed: 0.12 s
04:30:14 testBug345334 - 1.7(org.eclipse.jdt.core.tests.eval.CodeSnippetTest)  Time elapsed: 0.005 s
04:30:14 testBug464656 - 1.7(org.eclipse.jdt.core.tests.eval.CodeSnippetTest)  Time elapsed: 0 s
04:30:14 testCheckedException - 1.7(org.eclipse.jdt.core.tests.eval.CodeSnippetTest)  Time elapsed: 0.006 s
04:30:14 testDiamond - 1.7(org.eclipse.jdt.core.tests.eval.CodeSnippetTest)  Time elapsed: 0.01 s
04:30:14 testEmptyStatement - 1.7(org.eclipse.jdt.core.tests.eval.CodeSnippetTest)  Time elapsed: 0.006 s
04:30:14 testEvaluateEmptyImport - 1.7(org.eclipse.jdt.core.tests.eval.CodeSnippetTest)  Time elapsed: 0 s
04:30:14 testEvaluateExistingPackageAndNonExistingTypeImports - 1.7(org.eclipse.jdt.core.tests.eval.CodeSnippetTest)  Time elapsed: 0 s
04:30:14 testEvaluateNonExistingPackageAndExistingTypeImports - 1.7(org.eclipse.jdt.core.tests.eval.CodeSnippetTest)  Time elapsed: 0 s
04:30:14 testEvaluateNonExistingPackageImport - 1.7(org.eclipse.jdt.core.tests.eval.CodeSnippetTest)  Time elapsed: 0 s
04:30:14 testEvaluateNonExistingTypeImport - 1.7(org.eclipse.jdt.core.tests.eval.CodeSnippetTest)  Time elapsed: 0 s
04:30:14 testEvaluateValidPackageAndTypeImports - 1.7(org.eclipse.jdt.core.tests.eval.CodeSnippetTest)  Time elapsed: 0 s
04:30:14 testEvaluateValidPackageImport - 1.7(org.eclipse.jdt.core.tests.eval.CodeSnippetTest)  Time elapsed: 0 s
04:30:14 testEvaluateValidTypeImport - 1.7(org.eclipse.jdt.core.tests.eval.CodeSnippetTest)  Time elapsed: 0 s
04:30:14 testFinallyError - 1.7(org.eclipse.jdt.core.tests.eval.CodeSnippetTest)  Time elapsed: 0.037 s
04:30:14 testFinallyOneBlock - 1.7(org.eclipse.jdt.core.tests.eval.CodeSnippetTest)  Time elapsed: 0.006 s
04:30:14 testFinallyTwoBlock - 1.7(org.eclipse.jdt.core.tests.eval.CodeSnippetTest)  Time elapsed: 0.006 s
04:30:14 testFor89632 - 1.7(org.eclipse.jdt.core.tests.eval.CodeSnippetTest)  Time elapsed: 0.011 s
04:30:14 testFreeReturnAnonymous - 1.7(org.eclipse.jdt.core.tests.eval.CodeSnippetTest)  Time elapsed: 0.006 s
04:30:14 testFreeReturnClassDeclaration - 1.7(org.eclipse.jdt.core.tests.eval.CodeSnippetTest)  Time elapsed: 0.005 s
04:30:14 testFreeReturnExpression - 1.7(org.eclipse.jdt.core.tests.eval.CodeSnippetTest)  Time elapsed: 0.004 s
04:30:14 testFreeReturnInteger - 1.7(org.eclipse.jdt.core.tests.eval.CodeSnippetTest)  Time elapsed: 0.004 s
04:30:14 testFreeReturnLocalVar - 1.7(org.eclipse.jdt.core.tests.eval.CodeSnippetTest)  Time elapsed: 0.004 s
04:30:14 testFreeReturnStatement - 1.7(org.eclipse.jdt.core.tests.eval.CodeSnippetTest)  Time elapsed: 0.004 s
04:30:14 testImportPackage - 1.7(org.eclipse.jdt.core.tests.eval.CodeSnippetTest)  Time elapsed: 0.008 s
04:30:14 testImportType - 1.7(org.eclipse.jdt.core.tests.eval.CodeSnippetTest)  Time elapsed: 0.039 s
04:30:14 testImportTypeAndPackage - 1.7(org.eclipse.jdt.core.tests.eval.CodeSnippetTest)  Time elapsed: 0.007 s
04:30:14 testInnerClassAnonymous - 1.7(org.eclipse.jdt.core.tests.eval.CodeSnippetTest)  Time elapsed: 0.006 s
04:30:14 testInnerClassNamed - 1.7(org.eclipse.jdt.core.tests.eval.CodeSnippetTest)  Time elapsed: 0.005 s
04:30:14 testReturnDisplayStringBoolean - 1.7(org.eclipse.jdt.core.tests.eval.CodeSnippetTest)  Time elapsed: 0.004 s
04:30:14 testReturnDisplayStringCharacter - 1.7(org.eclipse.jdt.core.tests.eval.CodeSnippetTest)  Time elapsed: 0.004 s
04:30:14 testReturnDisplayStringDouble - 1.7(org.eclipse.jdt.core.tests.eval.CodeSnippetTest)  Time elapsed: 0.004 s
04:30:14 testReturnDisplayStringEmptyCodeSnippet - 1.7(org.eclipse.jdt.core.tests.eval.CodeSnippetTest)  Time elapsed: 0.003 s
04:30:14 testReturnDisplayStringFloat - 1.7(org.eclipse.jdt.core.tests.eval.CodeSnippetTest)  Time elapsed: 0.003 s
04:30:14 testReturnDisplayStringInteger - 1.7(org.eclipse.jdt.core.tests.eval.CodeSnippetTest)  Time elapsed: 0.004 s
04:30:14 testReturnDisplayStringLong - 1.7(org.eclipse.jdt.core.tests.eval.CodeSnippetTest)  Time elapsed: 0.003 s
04:30:14 testReturnDisplayStringNoExplicitReturnedValue - 1.7(org.eclipse.jdt.core.tests.eval.CodeSnippetTest)  Time elapsed: 0.005 s
04:30:14 testReturnDisplayStringObject - 1.7(org.eclipse.jdt.core.tests.eval.CodeSnippetTest)  Time elapsed: 0.005 s
04:30:14 testReturnDisplayStringShort - 1.7(org.eclipse.jdt.core.tests.eval.CodeSnippetTest)  Time elapsed: 0.004 s
04:30:14 testReturnDisplayStringString - 1.7(org.eclipse.jdt.core.tests.eval.CodeSnippetTest)  Time elapsed: 0.004 s
04:30:14 testReturnDisplayStringVoid - 1.7(org.eclipse.jdt.core.tests.eval.CodeSnippetTest)  Time elapsed: 0.004 s
04:30:14 testReturnTypeBoolean - 1.7(org.eclipse.jdt.core.tests.eval.CodeSnippetTest)  Time elapsed: 0.038 s
04:30:14 testReturnTypeBooleanArray - 1.7(org.eclipse.jdt.core.tests.eval.CodeSnippetTest)  Time elapsed: 0.004 s
04:30:14 testReturnTypeBooleanObject - 1.7(org.eclipse.jdt.core.tests.eval.CodeSnippetTest)  Time elapsed: 0.004 s
04:30:14 testReturnTypeChar - 1.7(org.eclipse.jdt.core.tests.eval.CodeSnippetTest)  Time elapsed: 0.004 s
04:30:14 testReturnTypeCharArray - 1.7(org.eclipse.jdt.core.tests.eval.CodeSnippetTest)  Time elapsed: 0.004 s
04:30:14 testReturnTypeCharacterObject - 1.7(org.eclipse.jdt.core.tests.eval.CodeSnippetTest)  Time elapsed: 0.005 s
04:30:14 testReturnTypeDouble - 1.7(org.eclipse.jdt.core.tests.eval.CodeSnippetTest)  Time elapsed: 0.004 s
04:30:14 testReturnTypeDoubleArray - 1.7(org.eclipse.jdt.core.tests.eval.CodeSnippetTest)  Time elapsed: 0.004 s
04:30:14 testReturnTypeDoubleObject - 1.7(org.eclipse.jdt.core.tests.eval.CodeSnippetTest)  Time elapsed: 0.006 s
04:30:14 testReturnTypeEmptyCodeSnippet - 1.7(org.eclipse.jdt.core.tests.eval.CodeSnippetTest)  Time elapsed: 0.003 s
04:30:14 testReturnTypeFloat - 1.7(org.eclipse.jdt.core.tests.eval.CodeSnippetTest)  Time elapsed: 0.005 s
04:30:14 testReturnTypeFloatArray - 1.7(org.eclipse.jdt.core.tests.eval.CodeSnippetTest)  Time elapsed: 0.004 s
04:30:14 testReturnTypeFloatObject - 1.7(org.eclipse.jdt.core.tests.eval.CodeSnippetTest)  Time elapsed: 0.005 s
04:30:14 testReturnTypeInt - 1.7(org.eclipse.jdt.core.tests.eval.CodeSnippetTest)  Time elapsed: 0.004 s
04:30:14 testReturnTypeIntegerObject - 1.7(org.eclipse.jdt.core.tests.eval.CodeSnippetTest)  Time elapsed: 0.005 s
04:30:14 testReturnTypeLong - 1.7(org.eclipse.jdt.core.tests.eval.CodeSnippetTest)  Time elapsed: 0.004 s
04:30:14 testReturnTypeLongArray - 1.7(org.eclipse.jdt.core.tests.eval.CodeSnippetTest)  Time elapsed: 0.034 s
04:30:14 testReturnTypeLongObject - 1.7(org.eclipse.jdt.core.tests.eval.CodeSnippetTest)  Time elapsed: 0.005 s
04:30:14 testReturnTypeNoExplicitReturnedValue - 1.7(org.eclipse.jdt.core.tests.eval.CodeSnippetTest)  Time elapsed: 0.004 s
04:30:14 testReturnTypeObject - 1.7(org.eclipse.jdt.core.tests.eval.CodeSnippetTest)  Time elapsed: 0.003 s
04:30:14 testReturnTypeObjectArray - 1.7(org.eclipse.jdt.core.tests.eval.CodeSnippetTest)  Time elapsed: 0.004 s
04:30:14 testReturnTypeShort - 1.7(org.eclipse.jdt.core.tests.eval.CodeSnippetTest)  Time elapsed: 0.004 s
04:30:14 testReturnTypeShortArray - 1.7(org.eclipse.jdt.core.tests.eval.CodeSnippetTest)  Time elapsed: 0.003 s
04:30:14 testReturnTypeShortObject - 1.7(org.eclipse.jdt.core.tests.eval.CodeSnippetTest)  Time elapsed: 0.004 s
04:30:14 testReturnTypeString - 1.7(org.eclipse.jdt.core.tests.eval.CodeSnippetTest)  Time elapsed: 0.004 s
04:30:14 testReturnTypeStringArray - 1.7(org.eclipse.jdt.core.tests.eval.CodeSnippetTest)  Time elapsed: 0.004 s
04:30:14 testReturnTypeVoid - 1.7(org.eclipse.jdt.core.tests.eval.CodeSnippetTest)  Time elapsed: 0.004 s
04:30:14 testReturnTypesIntArray - 1.7(org.eclipse.jdt.core.tests.eval.CodeSnippetTest)  Time elapsed: 0.004 s
04:30:14 testRunMethodInAnonymous - 1.7(org.eclipse.jdt.core.tests.eval.CodeSnippetTest)  Time elapsed: 0.208 s
04:30:14 testRunMethodInAnonymous2 - 1.7(org.eclipse.jdt.core.tests.eval.CodeSnippetTest)  Time elapsed: 0.209 s
04:30:14 testRunMethodInAnonymous3 - 1.7(org.eclipse.jdt.core.tests.eval.CodeSnippetTest)  Time elapsed: 0.21 s
04:30:14 testRunMethodInAnonymous4 - 1.7(org.eclipse.jdt.core.tests.eval.CodeSnippetTest)  Time elapsed: 0.21 s
04:30:14 testRunMethodInAnonymous5 - 1.7(org.eclipse.jdt.core.tests.eval.CodeSnippetTest)  Time elapsed: 0.209 s
04:30:14 testRunMethodInAnonymous6 - 1.7(org.eclipse.jdt.core.tests.eval.CodeSnippetTest)  Time elapsed: 0.209 s
04:30:14 testRunMethodInAnonymous7 - 1.7(org.eclipse.jdt.core.tests.eval.CodeSnippetTest)  Time elapsed: 0.209 s
04:30:14 testRunMethodInAnonymous8 - 1.7(org.eclipse.jdt.core.tests.eval.CodeSnippetTest)  Time elapsed: 0.209 s
04:30:14 testExpressionInInnerClass - 1.7(org.eclipse.jdt.core.tests.eval.NegativeCodeSnippetTest)  Time elapsed: 0.001 s
04:30:14 testExtraClosingCurlyBracket - 1.7(org.eclipse.jdt.core.tests.eval.NegativeCodeSnippetTest)  Time elapsed: 0.001 s
04:30:14 testExtraOpenRoundBracket - 1.7(org.eclipse.jdt.core.tests.eval.NegativeCodeSnippetTest)  Time elapsed: 0.001 s
04:30:14 testExtraSemiColonInExpression - 1.7(org.eclipse.jdt.core.tests.eval.NegativeCodeSnippetTest)  Time elapsed: 0.001 s
04:30:14 testInvalidField - 1.7(org.eclipse.jdt.core.tests.eval.NegativeCodeSnippetTest)  Time elapsed: 0.002 s
04:30:14 testInvalidImport - 1.7(org.eclipse.jdt.core.tests.eval.NegativeCodeSnippetTest)  Time elapsed: 0.003 s
04:30:14 testInvalidUseOfThisInSnippet - 1.7(org.eclipse.jdt.core.tests.eval.NegativeCodeSnippetTest)  Time elapsed: 0.002 s
04:30:14 testInvalidUseOfThisInSnippet2 - 1.7(org.eclipse.jdt.core.tests.eval.NegativeCodeSnippetTest)  Time elapsed: 0.001 s
04:30:14 testMissingClosingRoundBracket - 1.7(org.eclipse.jdt.core.tests.eval.NegativeCodeSnippetTest)  Time elapsed: 0 s
04:30:14 testMissingDoubleQuote - 1.7(org.eclipse.jdt.core.tests.eval.NegativeCodeSnippetTest)  Time elapsed: 0.001 s
04:30:14 testNonLastExpressionStatement - 1.7(org.eclipse.jdt.core.tests.eval.NegativeCodeSnippetTest)  Time elapsed: 0.001 s
04:30:14 testProblemInExpression - 1.7(org.eclipse.jdt.core.tests.eval.NegativeCodeSnippetTest)  Time elapsed: 0.001 s
04:30:14 testProblemInExpression2 - 1.7(org.eclipse.jdt.core.tests.eval.NegativeCodeSnippetTest)  Time elapsed: 0.001 s
04:30:14 testProblemInInnerClass - 1.7(org.eclipse.jdt.core.tests.eval.NegativeCodeSnippetTest)  Time elapsed: 0.008 s
04:30:14 testProblemInPreviousStatement - 1.7(org.eclipse.jdt.core.tests.eval.NegativeCodeSnippetTest)  Time elapsed: 0.002 s
04:30:14 testProblemInReturnStatement - 1.7(org.eclipse.jdt.core.tests.eval.NegativeCodeSnippetTest)  Time elapsed: 0 s
04:30:14 testRemoveImport - 1.7(org.eclipse.jdt.core.tests.eval.NegativeCodeSnippetTest)  Time elapsed: 0.009 s
04:30:14 testRemoveVariable - 1.7(org.eclipse.jdt.core.tests.eval.NegativeCodeSnippetTest)  Time elapsed: 0.011 s
04:30:14 testUnreachableExpression - 1.7(org.eclipse.jdt.core.tests.eval.NegativeCodeSnippetTest)  Time elapsed: 0.001 s
04:30:14 testUnusedImport - 1.7(org.eclipse.jdt.core.tests.eval.NegativeCodeSnippetTest)  Time elapsed: 0.009 s
04:30:14 testWarning - 1.7(org.eclipse.jdt.core.tests.eval.NegativeCodeSnippetTest)  Time elapsed: 0.005 s
04:30:14 testInitializerProblem - 1.7(org.eclipse.jdt.core.tests.eval.NegativeVariableTest)  Time elapsed: 0.003 s
04:30:14 testUnknownType - 1.7(org.eclipse.jdt.core.tests.eval.NegativeVariableTest)  Time elapsed: 0.002 s
04:30:14 test001 - 1.7(org.eclipse.jdt.core.tests.eval.DebugEvaluationTest)  Time elapsed: 0.157 s
04:30:14 test002 - 1.7(org.eclipse.jdt.core.tests.eval.DebugEvaluationTest)  Time elapsed: 0.148 s
04:30:14 test003 - 1.7(org.eclipse.jdt.core.tests.eval.DebugEvaluationTest)  Time elapsed: 0.035 s
04:30:14 test004 - 1.7(org.eclipse.jdt.core.tests.eval.DebugEvaluationTest)  Time elapsed: 0.135 s
04:30:14 test005 - 1.7(org.eclipse.jdt.core.tests.eval.DebugEvaluationTest)  Time elapsed: 0.15 s
04:30:14 test006 - 1.7(org.eclipse.jdt.core.tests.eval.DebugEvaluationTest)  Time elapsed: 0.149 s
04:30:14 test007 - 1.7(org.eclipse.jdt.core.tests.eval.DebugEvaluationTest)  Time elapsed: 0.147 s
04:30:14 test008 - 1.7(org.eclipse.jdt.core.tests.eval.DebugEvaluationTest)  Time elapsed: 0.154 s
04:30:14 test009 - 1.7(org.eclipse.jdt.core.tests.eval.DebugEvaluationTest)  Time elapsed: 0.135 s
04:30:14 test010 - 1.7(org.eclipse.jdt.core.tests.eval.DebugEvaluationTest)  Time elapsed: 0.146 s
04:30:14 test011 - 1.7(org.eclipse.jdt.core.tests.eval.DebugEvaluationTest)  Time elapsed: 0.178 s
04:30:14 test016 - 1.7(org.eclipse.jdt.core.tests.eval.DebugEvaluationTest)  Time elapsed: 0.235 s
04:30:14 test017 - 1.7(org.eclipse.jdt.core.tests.eval.DebugEvaluationTest)  Time elapsed: 0.125 s
04:30:14 test018 - 1.7(org.eclipse.jdt.core.tests.eval.DebugEvaluationTest)  Time elapsed: 0.264 s
04:30:14 test019 - 1.7(org.eclipse.jdt.core.tests.eval.DebugEvaluationTest)  Time elapsed: 0.033 s
04:30:14 test020 - 1.7(org.eclipse.jdt.core.tests.eval.DebugEvaluationTest)  Time elapsed: 0.148 s
04:30:14 test021 - 1.7(org.eclipse.jdt.core.tests.eval.DebugEvaluationTest)  Time elapsed: 0.258 s
04:30:14 test022 - 1.7(org.eclipse.jdt.core.tests.eval.DebugEvaluationTest)  Time elapsed: 0.273 s
04:30:14 test023 - 1.7(org.eclipse.jdt.core.tests.eval.DebugEvaluationTest)  Time elapsed: 0.275 s
04:30:14 test024 - 1.7(org.eclipse.jdt.core.tests.eval.DebugEvaluationTest)  Time elapsed: 0.284 s
04:30:14 test025 - 1.7(org.eclipse.jdt.core.tests.eval.DebugEvaluationTest)  Time elapsed: 0.265 s
04:30:14 test026 - 1.7(org.eclipse.jdt.core.tests.eval.DebugEvaluationTest)  Time elapsed: 0.144 s
04:30:14 test027 - 1.7(org.eclipse.jdt.core.tests.eval.DebugEvaluationTest)  Time elapsed: 0.143 s
04:30:14 test028 - 1.7(org.eclipse.jdt.core.tests.eval.DebugEvaluationTest)  Time elapsed: 0.14 s
04:30:14 test029 - 1.7(org.eclipse.jdt.core.tests.eval.DebugEvaluationTest)  Time elapsed: 0.145 s
04:30:14 test030 - 1.7(org.eclipse.jdt.core.tests.eval.DebugEvaluationTest)  Time elapsed: 0.145 s
04:30:14 test031 - 1.7(org.eclipse.jdt.core.tests.eval.DebugEvaluationTest)  Time elapsed: 0.146 s
04:30:14 test032 - 1.7(org.eclipse.jdt.core.tests.eval.DebugEvaluationTest)  Time elapsed: 0.034 s
04:30:14 test033 - 1.7(org.eclipse.jdt.core.tests.eval.DebugEvaluationTest)  Time elapsed: 0.146 s
04:30:14 test034 - 1.7(org.eclipse.jdt.core.tests.eval.DebugEvaluationTest)  Time elapsed: 0.141 s
04:30:14 test035 - 1.7(org.eclipse.jdt.core.tests.eval.DebugEvaluationTest)  Time elapsed: 0.146 s
04:30:14 test036 - 1.7(org.eclipse.jdt.core.tests.eval.DebugEvaluationTest)  Time elapsed: 0.14 s
04:30:14 test037 - 1.7(org.eclipse.jdt.core.tests.eval.DebugEvaluationTest)  Time elapsed: 0.146 s
04:30:14 test038 - 1.7(org.eclipse.jdt.core.tests.eval.DebugEvaluationTest)  Time elapsed: 0.144 s
04:30:14 test039 - 1.7(org.eclipse.jdt.core.tests.eval.DebugEvaluationTest)  Time elapsed: 0.147 s
04:30:14 test040 - 1.7(org.eclipse.jdt.core.tests.eval.DebugEvaluationTest)  Time elapsed: 0.146 s
04:30:14 test041 - 1.7(org.eclipse.jdt.core.tests.eval.DebugEvaluationTest)  Time elapsed: 0.044 s
04:30:14 test042 - 1.7(org.eclipse.jdt.core.tests.eval.DebugEvaluationTest)  Time elapsed: 0.142 s
04:30:14 test043 - 1.7(org.eclipse.jdt.core.tests.eval.DebugEvaluationTest)  Time elapsed: 0.147 s
04:30:14 test044 - 1.7(org.eclipse.jdt.core.tests.eval.DebugEvaluationTest)  Time elapsed: 0.146 s
04:30:14 test045 - 1.7(org.eclipse.jdt.core.tests.eval.DebugEvaluationTest)  Time elapsed: 0.144 s
04:30:14 test046 - 1.7(org.eclipse.jdt.core.tests.eval.DebugEvaluationTest)  Time elapsed: 0.144 s
04:30:14 test047 - 1.7(org.eclipse.jdt.core.tests.eval.DebugEvaluationTest)  Time elapsed: 0.143 s
04:30:14 test048 - 1.7(org.eclipse.jdt.core.tests.eval.DebugEvaluationTest)  Time elapsed: 0.14 s
04:30:14 test049 - 1.7(org.eclipse.jdt.core.tests.eval.DebugEvaluationTest)  Time elapsed: 0.142 s
04:30:14 test050 - 1.7(org.eclipse.jdt.core.tests.eval.DebugEvaluationTest)  Time elapsed: 0.142 s
04:30:14 test051 - 1.7(org.eclipse.jdt.core.tests.eval.DebugEvaluationTest)  Time elapsed: 0.143 s
04:30:14 test052 - 1.7(org.eclipse.jdt.core.tests.eval.DebugEvaluationTest)  Time elapsed: 0.143 s
04:30:14 test053 - 1.7(org.eclipse.jdt.core.tests.eval.DebugEvaluationTest)  Time elapsed: 0.146 s
04:30:14 test054 - 1.7(org.eclipse.jdt.core.tests.eval.DebugEvaluationTest)  Time elapsed: 0.148 s
04:30:14 test055 - 1.7(org.eclipse.jdt.core.tests.eval.DebugEvaluationTest)  Time elapsed: 0.046 s
04:30:14 test056 - 1.7(org.eclipse.jdt.core.tests.eval.DebugEvaluationTest)  Time elapsed: 0.148 s
04:30:14 test057 - 1.7(org.eclipse.jdt.core.tests.eval.DebugEvaluationTest)  Time elapsed: 0.146 s
04:30:14 test058 - 1.7(org.eclipse.jdt.core.tests.eval.DebugEvaluationTest)  Time elapsed: 0.149 s
04:30:14 test059 - 1.7(org.eclipse.jdt.core.tests.eval.DebugEvaluationTest)  Time elapsed: 0.151 s
04:30:14 test060 - 1.7(org.eclipse.jdt.core.tests.eval.DebugEvaluationTest)  Time elapsed: 0.143 s
04:30:14 test061 - 1.7(org.eclipse.jdt.core.tests.eval.DebugEvaluationTest)  Time elapsed: 0.14 s
04:30:14 test062 - 1.7(org.eclipse.jdt.core.tests.eval.DebugEvaluationTest)  Time elapsed: 0.138 s
04:30:14 test063 - 1.7(org.eclipse.jdt.core.tests.eval.DebugEvaluationTest)  Time elapsed: 0.142 s
04:30:14 test065 - 1.7(org.eclipse.jdt.core.tests.eval.DebugEvaluationTest)  Time elapsed: 0.146 s
04:30:14 test066 - 1.7(org.eclipse.jdt.core.tests.eval.DebugEvaluationTest)  Time elapsed: 0.148 s
04:30:14 test067 - 1.7(org.eclipse.jdt.core.tests.eval.DebugEvaluationTest)  Time elapsed: 0.151 s
04:30:14 test068 - 1.7(org.eclipse.jdt.core.tests.eval.DebugEvaluationTest)  Time elapsed: 0.037 s
04:30:14 test069 - 1.7(org.eclipse.jdt.core.tests.eval.DebugEvaluationTest)  Time elapsed: 0.042 s
04:30:14 testNegative001 - 1.7(org.eclipse.jdt.core.tests.eval.DebugEvaluationTest)  Time elapsed: 0.033 s
04:30:14 testNegative002 - 1.7(org.eclipse.jdt.core.tests.eval.DebugEvaluationTest)  Time elapsed: 0.029 s
04:30:14 testNegative003 - 1.7(org.eclipse.jdt.core.tests.eval.DebugEvaluationTest)  Time elapsed: 0.031 s
04:30:14 testNegative004 - 1.7(org.eclipse.jdt.core.tests.eval.DebugEvaluationTest)  Time elapsed: 0.015 s
04:30:14 testNegative005 - 1.7(org.eclipse.jdt.core.tests.eval.DebugEvaluationTest)  Time elapsed: 0.013 s
04:30:14 testAllVariables - 1.8(org.eclipse.jdt.core.tests.eval.SanityTestEvaluationContext)  Time elapsed: 0 s
04:30:14 testEvaluate - 1.8(org.eclipse.jdt.core.tests.eval.SanityTestEvaluationContext)  Time elapsed: 0.018 s
04:30:14 testEvaluateImports - 1.8(org.eclipse.jdt.core.tests.eval.SanityTestEvaluationContext)  Time elapsed: 0 s
04:30:14 testEvaluateVariable - 1.8(org.eclipse.jdt.core.tests.eval.SanityTestEvaluationContext)  Time elapsed: 0.013 s
04:30:14 testEvaluateVariables - 1.8(org.eclipse.jdt.core.tests.eval.SanityTestEvaluationContext)  Time elapsed: 0.004 s
04:30:14 testGetSetImports - 1.8(org.eclipse.jdt.core.tests.eval.SanityTestEvaluationContext)  Time elapsed: 0 s
04:30:14 testGetSetPackageName - 1.8(org.eclipse.jdt.core.tests.eval.SanityTestEvaluationContext)  Time elapsed: 0 s
04:30:14 testNewDeleteVariable - 1.8(org.eclipse.jdt.core.tests.eval.SanityTestEvaluationContext)  Time elapsed: 0 s
04:30:14 testGetEvaluationType - 1.8(org.eclipse.jdt.core.tests.eval.SanityTestEvaluationResult)  Time elapsed: 0.008 s
04:30:14 testGetProblems - 1.8(org.eclipse.jdt.core.tests.eval.SanityTestEvaluationResult)  Time elapsed: 0.006 s
04:30:14 testGetValue - 1.8(org.eclipse.jdt.core.tests.eval.SanityTestEvaluationResult)  Time elapsed: 0.008 s
04:30:14 testGetValueDisplayString - 1.8(org.eclipse.jdt.core.tests.eval.SanityTestEvaluationResult)  Time elapsed: 0.006 s
04:30:14 testGetValueTypeName - 1.8(org.eclipse.jdt.core.tests.eval.SanityTestEvaluationResult)  Time elapsed: 0.007 s
04:30:14 testHasErrors - 1.8(org.eclipse.jdt.core.tests.eval.SanityTestEvaluationResult)  Time elapsed: 0.023 s
04:30:14 testHasProblems - 1.8(org.eclipse.jdt.core.tests.eval.SanityTestEvaluationResult)  Time elapsed: 0.006 s
04:30:14 testHasValue - 1.8(org.eclipse.jdt.core.tests.eval.SanityTestEvaluationResult)  Time elapsed: 0.007 s
04:30:14 testHasWarnings - 1.8(org.eclipse.jdt.core.tests.eval.SanityTestEvaluationResult)  Time elapsed: 0.006 s
04:30:14 testAllKindOfValues - 1.8(org.eclipse.jdt.core.tests.eval.VariableTest)  Time elapsed: 0.11 s
04:30:14 testCodeSnippetVarAssign - 1.8(org.eclipse.jdt.core.tests.eval.VariableTest)  Time elapsed: 0.133 s
04:30:14 testCodeSnippetVarRetrieval - 1.8(org.eclipse.jdt.core.tests.eval.VariableTest)  Time elapsed: 0.089 s
04:30:14 testImports - 1.8(org.eclipse.jdt.core.tests.eval.VariableTest)  Time elapsed: 0.06 s
04:30:14 testSeveralVariableInstallations - 1.8(org.eclipse.jdt.core.tests.eval.VariableTest)  Time elapsed: 0.151 s
04:30:14 testBug345334 - 1.8(org.eclipse.jdt.core.tests.eval.CodeSnippetTest)  Time elapsed: 0.008 s
04:30:14 testBug464656 - 1.8(org.eclipse.jdt.core.tests.eval.CodeSnippetTest)  Time elapsed: 0.046 s
04:30:14 testCheckedException - 1.8(org.eclipse.jdt.core.tests.eval.CodeSnippetTest)  Time elapsed: 0.008 s
04:30:14 testDiamond - 1.8(org.eclipse.jdt.core.tests.eval.CodeSnippetTest)  Time elapsed: 0.014 s
04:30:14 testEmptyStatement - 1.8(org.eclipse.jdt.core.tests.eval.CodeSnippetTest)  Time elapsed: 0.008 s
04:30:14 testEvaluateEmptyImport - 1.8(org.eclipse.jdt.core.tests.eval.CodeSnippetTest)  Time elapsed: 0 s
04:30:14 testEvaluateExistingPackageAndNonExistingTypeImports - 1.8(org.eclipse.jdt.core.tests.eval.CodeSnippetTest)  Time elapsed: 0 s
04:30:14 testEvaluateNonExistingPackageAndExistingTypeImports - 1.8(org.eclipse.jdt.core.tests.eval.CodeSnippetTest)  Time elapsed: 0 s
04:30:14 testEvaluateNonExistingPackageImport - 1.8(org.eclipse.jdt.core.tests.eval.CodeSnippetTest)  Time elapsed: 0 s
04:30:14 testEvaluateNonExistingTypeImport - 1.8(org.eclipse.jdt.core.tests.eval.CodeSnippetTest)  Time elapsed: 0 s
04:30:14 testEvaluateValidPackageAndTypeImports - 1.8(org.eclipse.jdt.core.tests.eval.CodeSnippetTest)  Time elapsed: 0 s
04:30:14 testEvaluateValidPackageImport - 1.8(org.eclipse.jdt.core.tests.eval.CodeSnippetTest)  Time elapsed: 0 s
04:30:14 testEvaluateValidTypeImport - 1.8(org.eclipse.jdt.core.tests.eval.CodeSnippetTest)  Time elapsed: 0.001 s
04:30:14 testFinallyError - 1.8(org.eclipse.jdt.core.tests.eval.CodeSnippetTest)  Time elapsed: 0.007 s
04:30:14 testFinallyOneBlock - 1.8(org.eclipse.jdt.core.tests.eval.CodeSnippetTest)  Time elapsed: 0.005 s
04:30:14 testFinallyTwoBlock - 1.8(org.eclipse.jdt.core.tests.eval.CodeSnippetTest)  Time elapsed: 0.04 s
04:30:14 testFor89632 - 1.8(org.eclipse.jdt.core.tests.eval.CodeSnippetTest)  Time elapsed: 0.013 s
04:30:14 testFreeReturnAnonymous - 1.8(org.eclipse.jdt.core.tests.eval.CodeSnippetTest)  Time elapsed: 0.009 s
04:30:14 testFreeReturnClassDeclaration - 1.8(org.eclipse.jdt.core.tests.eval.CodeSnippetTest)  Time elapsed: 0.031 s
04:30:14 testFreeReturnExpression - 1.8(org.eclipse.jdt.core.tests.eval.CodeSnippetTest)  Time elapsed: 0.005 s
04:30:14 testFreeReturnInteger - 1.8(org.eclipse.jdt.core.tests.eval.CodeSnippetTest)  Time elapsed: 0.004 s
04:30:14 testFreeReturnLocalVar - 1.8(org.eclipse.jdt.core.tests.eval.CodeSnippetTest)  Time elapsed: 0.004 s
04:30:14 testFreeReturnStatement - 1.8(org.eclipse.jdt.core.tests.eval.CodeSnippetTest)  Time elapsed: 0.005 s
04:30:14 testImportPackage - 1.8(org.eclipse.jdt.core.tests.eval.CodeSnippetTest)  Time elapsed: 0.034 s
04:30:14 testImportType - 1.8(org.eclipse.jdt.core.tests.eval.CodeSnippetTest)  Time elapsed: 0.01 s
04:30:14 testImportTypeAndPackage - 1.8(org.eclipse.jdt.core.tests.eval.CodeSnippetTest)  Time elapsed: 0.008 s
04:30:14 testInnerClassAnonymous - 1.8(org.eclipse.jdt.core.tests.eval.CodeSnippetTest)  Time elapsed: 0.008 s
04:30:14 testInnerClassNamed - 1.8(org.eclipse.jdt.core.tests.eval.CodeSnippetTest)  Time elapsed: 0.007 s
04:30:14 testReturnDisplayStringBoolean - 1.8(org.eclipse.jdt.core.tests.eval.CodeSnippetTest)  Time elapsed: 0.004 s
04:30:14 testReturnDisplayStringCharacter - 1.8(org.eclipse.jdt.core.tests.eval.CodeSnippetTest)  Time elapsed: 0.005 s
04:30:14 testReturnDisplayStringDouble - 1.8(org.eclipse.jdt.core.tests.eval.CodeSnippetTest)  Time elapsed: 0.005 s
04:30:14 testReturnDisplayStringEmptyCodeSnippet - 1.8(org.eclipse.jdt.core.tests.eval.CodeSnippetTest)  Time elapsed: 0.004 s
04:30:14 testReturnDisplayStringFloat - 1.8(org.eclipse.jdt.core.tests.eval.CodeSnippetTest)  Time elapsed: 0.006 s
04:30:14 testReturnDisplayStringInteger - 1.8(org.eclipse.jdt.core.tests.eval.CodeSnippetTest)  Time elapsed: 0.005 s
04:30:14 testReturnDisplayStringLong - 1.8(org.eclipse.jdt.core.tests.eval.CodeSnippetTest)  Time elapsed: 0.005 s
04:30:14 testReturnDisplayStringNoExplicitReturnedValue - 1.8(org.eclipse.jdt.core.tests.eval.CodeSnippetTest)  Time elapsed: 0.031 s
04:30:14 testReturnDisplayStringObject - 1.8(org.eclipse.jdt.core.tests.eval.CodeSnippetTest)  Time elapsed: 0.007 s
04:30:14 testReturnDisplayStringShort - 1.8(org.eclipse.jdt.core.tests.eval.CodeSnippetTest)  Time elapsed: 0.005 s
04:30:14 testReturnDisplayStringString - 1.8(org.eclipse.jdt.core.tests.eval.CodeSnippetTest)  Time elapsed: 0.007 s
04:30:14 testReturnDisplayStringVoid - 1.8(org.eclipse.jdt.core.tests.eval.CodeSnippetTest)  Time elapsed: 0.006 s
04:30:14 testReturnTypeBoolean - 1.8(org.eclipse.jdt.core.tests.eval.CodeSnippetTest)  Time elapsed: 0.004 s
04:30:14 testReturnTypeBooleanArray - 1.8(org.eclipse.jdt.core.tests.eval.CodeSnippetTest)  Time elapsed: 0.006 s
04:30:14 testReturnTypeBooleanObject - 1.8(org.eclipse.jdt.core.tests.eval.CodeSnippetTest)  Time elapsed: 0.004 s
04:30:14 testReturnTypeChar - 1.8(org.eclipse.jdt.core.tests.eval.CodeSnippetTest)  Time elapsed: 0.005 s
04:30:14 testReturnTypeCharArray - 1.8(org.eclipse.jdt.core.tests.eval.CodeSnippetTest)  Time elapsed: 0.004 s
04:30:14 testReturnTypeCharacterObject - 1.8(org.eclipse.jdt.core.tests.eval.CodeSnippetTest)  Time elapsed: 0.005 s
04:30:14 testReturnTypeDouble - 1.8(org.eclipse.jdt.core.tests.eval.CodeSnippetTest)  Time elapsed: 0.005 s
04:30:14 testReturnTypeDoubleArray - 1.8(org.eclipse.jdt.core.tests.eval.CodeSnippetTest)  Time elapsed: 0.005 s
04:30:14 testReturnTypeDoubleObject - 1.8(org.eclipse.jdt.core.tests.eval.CodeSnippetTest)  Time elapsed: 0.032 s
04:30:14 testReturnTypeEmptyCodeSnippet - 1.8(org.eclipse.jdt.core.tests.eval.CodeSnippetTest)  Time elapsed: 0.004 s
04:30:14 testReturnTypeFloat - 1.8(org.eclipse.jdt.core.tests.eval.CodeSnippetTest)  Time elapsed: 0.005 s
04:30:14 testReturnTypeFloatArray - 1.8(org.eclipse.jdt.core.tests.eval.CodeSnippetTest)  Time elapsed: 0.006 s
04:30:14 testReturnTypeFloatObject - 1.8(org.eclipse.jdt.core.tests.eval.CodeSnippetTest)  Time elapsed: 0.007 s
04:30:14 testReturnTypeInt - 1.8(org.eclipse.jdt.core.tests.eval.CodeSnippetTest)  Time elapsed: 0.005 s
04:30:14 testReturnTypeIntegerObject - 1.8(org.eclipse.jdt.core.tests.eval.CodeSnippetTest)  Time elapsed: 0.007 s
04:30:14 testReturnTypeLong - 1.8(org.eclipse.jdt.core.tests.eval.CodeSnippetTest)  Time elapsed: 0.004 s
04:30:14 testReturnTypeLongArray - 1.8(org.eclipse.jdt.core.tests.eval.CodeSnippetTest)  Time elapsed: 0.005 s
04:30:14 testReturnTypeLongObject - 1.8(org.eclipse.jdt.core.tests.eval.CodeSnippetTest)  Time elapsed: 0.007 s
04:30:14 testReturnTypeNoExplicitReturnedValue - 1.8(org.eclipse.jdt.core.tests.eval.CodeSnippetTest)  Time elapsed: 0.005 s
04:30:14 testReturnTypeObject - 1.8(org.eclipse.jdt.core.tests.eval.CodeSnippetTest)  Time elapsed: 0.004 s
04:30:14 testReturnTypeObjectArray - 1.8(org.eclipse.jdt.core.tests.eval.CodeSnippetTest)  Time elapsed: 0.005 s
04:30:14 testReturnTypeShort - 1.8(org.eclipse.jdt.core.tests.eval.CodeSnippetTest)  Time elapsed: 0.006 s
04:30:14 testReturnTypeShortArray - 1.8(org.eclipse.jdt.core.tests.eval.CodeSnippetTest)  Time elapsed: 0.005 s
04:30:14 testReturnTypeShortObject - 1.8(org.eclipse.jdt.core.tests.eval.CodeSnippetTest)  Time elapsed: 0.006 s
04:30:14 testReturnTypeString - 1.8(org.eclipse.jdt.core.tests.eval.CodeSnippetTest)  Time elapsed: 0.006 s
04:30:14 testReturnTypeStringArray - 1.8(org.eclipse.jdt.core.tests.eval.CodeSnippetTest)  Time elapsed: 0.017 s
04:30:14 testReturnTypeVoid - 1.8(org.eclipse.jdt.core.tests.eval.CodeSnippetTest)  Time elapsed: 0.006 s
04:30:14 testReturnTypesIntArray - 1.8(org.eclipse.jdt.core.tests.eval.CodeSnippetTest)  Time elapsed: 0.004 s
04:30:14 testRunMethodInAnonymous - 1.8(org.eclipse.jdt.core.tests.eval.CodeSnippetTest)  Time elapsed: 0.211 s
04:30:14 testRunMethodInAnonymous2 - 1.8(org.eclipse.jdt.core.tests.eval.CodeSnippetTest)  Time elapsed: 0.21 s
04:30:14 testRunMethodInAnonymous3 - 1.8(org.eclipse.jdt.core.tests.eval.CodeSnippetTest)  Time elapsed: 0.21 s
04:30:14 testRunMethodInAnonymous4 - 1.8(org.eclipse.jdt.core.tests.eval.CodeSnippetTest)  Time elapsed: 0.209 s
04:30:14 testRunMethodInAnonymous5 - 1.8(org.eclipse.jdt.core.tests.eval.CodeSnippetTest)  Time elapsed: 0.209 s
04:30:14 testRunMethodInAnonymous6 - 1.8(org.eclipse.jdt.core.tests.eval.CodeSnippetTest)  Time elapsed: 0.209 s
04:30:14 testRunMethodInAnonymous7 - 1.8(org.eclipse.jdt.core.tests.eval.CodeSnippetTest)  Time elapsed: 0.209 s
04:30:14 testRunMethodInAnonymous8 - 1.8(org.eclipse.jdt.core.tests.eval.CodeSnippetTest)  Time elapsed: 0.209 s
04:30:14 testExpressionInInnerClass - 1.8(org.eclipse.jdt.core.tests.eval.NegativeCodeSnippetTest)  Time elapsed: 0.001 s
04:30:14 testExtraClosingCurlyBracket - 1.8(org.eclipse.jdt.core.tests.eval.NegativeCodeSnippetTest)  Time elapsed: 0.001 s
04:30:14 testExtraOpenRoundBracket - 1.8(org.eclipse.jdt.core.tests.eval.NegativeCodeSnippetTest)  Time elapsed: 0.001 s
04:30:14 testExtraSemiColonInExpression - 1.8(org.eclipse.jdt.core.tests.eval.NegativeCodeSnippetTest)  Time elapsed: 0.001 s
04:30:14 testInvalidField - 1.8(org.eclipse.jdt.core.tests.eval.NegativeCodeSnippetTest)  Time elapsed: 0.002 s
04:30:14 testInvalidImport - 1.8(org.eclipse.jdt.core.tests.eval.NegativeCodeSnippetTest)  Time elapsed: 0.002 s
04:30:14 testInvalidUseOfThisInSnippet - 1.8(org.eclipse.jdt.core.tests.eval.NegativeCodeSnippetTest)  Time elapsed: 0.002 s
04:30:14 testInvalidUseOfThisInSnippet2 - 1.8(org.eclipse.jdt.core.tests.eval.NegativeCodeSnippetTest)  Time elapsed: 0.001 s
04:30:14 testMissingClosingRoundBracket - 1.8(org.eclipse.jdt.core.tests.eval.NegativeCodeSnippetTest)  Time elapsed: 0.001 s
04:30:14 testMissingDoubleQuote - 1.8(org.eclipse.jdt.core.tests.eval.NegativeCodeSnippetTest)  Time elapsed: 0.001 s
04:30:14 testNonLastExpressionStatement - 1.8(org.eclipse.jdt.core.tests.eval.NegativeCodeSnippetTest)  Time elapsed: 0 s
04:30:14 testProblemInExpression - 1.8(org.eclipse.jdt.core.tests.eval.NegativeCodeSnippetTest)  Time elapsed: 0.001 s
04:30:14 testProblemInExpression2 - 1.8(org.eclipse.jdt.core.tests.eval.NegativeCodeSnippetTest)  Time elapsed: 0.001 s
04:30:14 testProblemInInnerClass - 1.8(org.eclipse.jdt.core.tests.eval.NegativeCodeSnippetTest)  Time elapsed: 0.008 s
04:30:14 testProblemInPreviousStatement - 1.8(org.eclipse.jdt.core.tests.eval.NegativeCodeSnippetTest)  Time elapsed: 0.001 s
04:30:14 testProblemInReturnStatement - 1.8(org.eclipse.jdt.core.tests.eval.NegativeCodeSnippetTest)  Time elapsed: 0.001 s
04:30:14 testRemoveImport - 1.8(org.eclipse.jdt.core.tests.eval.NegativeCodeSnippetTest)  Time elapsed: 0.008 s
04:30:14 testRemoveVariable - 1.8(org.eclipse.jdt.core.tests.eval.NegativeCodeSnippetTest)  Time elapsed: 0.008 s
04:30:14 testUnreachableExpression - 1.8(org.eclipse.jdt.core.tests.eval.NegativeCodeSnippetTest)  Time elapsed: 0.001 s
04:30:14 testUnusedImport - 1.8(org.eclipse.jdt.core.tests.eval.NegativeCodeSnippetTest)  Time elapsed: 0.009 s
04:30:14 testWarning - 1.8(org.eclipse.jdt.core.tests.eval.NegativeCodeSnippetTest)  Time elapsed: 0.004 s
04:30:14 testInitializerProblem - 1.8(org.eclipse.jdt.core.tests.eval.NegativeVariableTest)  Time elapsed: 0.004 s
04:30:14 testUnknownType - 1.8(org.eclipse.jdt.core.tests.eval.NegativeVariableTest)  Time elapsed: 0.002 s
04:30:14 test001 - 1.8(org.eclipse.jdt.core.tests.eval.DebugEvaluationTest)  Time elapsed: 0.149 s
04:30:14 test002 - 1.8(org.eclipse.jdt.core.tests.eval.DebugEvaluationTest)  Time elapsed: 0.143 s
04:30:14 test003 - 1.8(org.eclipse.jdt.core.tests.eval.DebugEvaluationTest)  Time elapsed: 0.033 s
04:30:14 test004 - 1.8(org.eclipse.jdt.core.tests.eval.DebugEvaluationTest)  Time elapsed: 0.132 s
04:30:14 test005 - 1.8(org.eclipse.jdt.core.tests.eval.DebugEvaluationTest)  Time elapsed: 0.142 s
04:30:14 test006 - 1.8(org.eclipse.jdt.core.tests.eval.DebugEvaluationTest)  Time elapsed: 0.143 s
04:30:14 test007 - 1.8(org.eclipse.jdt.core.tests.eval.DebugEvaluationTest)  Time elapsed: 0.143 s
04:30:14 test008 - 1.8(org.eclipse.jdt.core.tests.eval.DebugEvaluationTest)  Time elapsed: 0.143 s
04:30:14 test009 - 1.8(org.eclipse.jdt.core.tests.eval.DebugEvaluationTest)  Time elapsed: 0.132 s
04:30:14 test010 - 1.8(org.eclipse.jdt.core.tests.eval.DebugEvaluationTest)  Time elapsed: 0.148 s
04:30:14 test011 - 1.8(org.eclipse.jdt.core.tests.eval.DebugEvaluationTest)  Time elapsed: 0.038 s
04:30:14 test016 - 1.8(org.eclipse.jdt.core.tests.eval.DebugEvaluationTest)  Time elapsed: 0.239 s
04:30:14 test017 - 1.8(org.eclipse.jdt.core.tests.eval.DebugEvaluationTest)  Time elapsed: 0.124 s
04:30:14 test018 - 1.8(org.eclipse.jdt.core.tests.eval.DebugEvaluationTest)  Time elapsed: 0.262 s
04:30:14 test019 - 1.8(org.eclipse.jdt.core.tests.eval.DebugEvaluationTest)  Time elapsed: 0.031 s
04:30:14 test020 - 1.8(org.eclipse.jdt.core.tests.eval.DebugEvaluationTest)  Time elapsed: 0.148 s
04:30:14 test021 - 1.8(org.eclipse.jdt.core.tests.eval.DebugEvaluationTest)  Time elapsed: 0.263 s
04:30:14 test022 - 1.8(org.eclipse.jdt.core.tests.eval.DebugEvaluationTest)  Time elapsed: 0.275 s
04:30:14 test023 - 1.8(org.eclipse.jdt.core.tests.eval.DebugEvaluationTest)  Time elapsed: 0.278 s
04:30:14 test024 - 1.8(org.eclipse.jdt.core.tests.eval.DebugEvaluationTest)  Time elapsed: 0.284 s
04:30:14 test025 - 1.8(org.eclipse.jdt.core.tests.eval.DebugEvaluationTest)  Time elapsed: 0.272 s
04:30:14 test026 - 1.8(org.eclipse.jdt.core.tests.eval.DebugEvaluationTest)  Time elapsed: 0.151 s
04:30:14 test027 - 1.8(org.eclipse.jdt.core.tests.eval.DebugEvaluationTest)  Time elapsed: 0.149 s
04:30:14 test028 - 1.8(org.eclipse.jdt.core.tests.eval.DebugEvaluationTest)  Time elapsed: 0.146 s
04:30:14 test029 - 1.8(org.eclipse.jdt.core.tests.eval.DebugEvaluationTest)  Time elapsed: 0.148 s
04:30:14 test030 - 1.8(org.eclipse.jdt.core.tests.eval.DebugEvaluationTest)  Time elapsed: 0.146 s
04:30:14 test031 - 1.8(org.eclipse.jdt.core.tests.eval.DebugEvaluationTest)  Time elapsed: 0.146 s
04:30:14 test032 - 1.8(org.eclipse.jdt.core.tests.eval.DebugEvaluationTest)  Time elapsed: 0.036 s
04:30:14 test033 - 1.8(org.eclipse.jdt.core.tests.eval.DebugEvaluationTest)  Time elapsed: 0.151 s
04:30:14 test034 - 1.8(org.eclipse.jdt.core.tests.eval.DebugEvaluationTest)  Time elapsed: 0.144 s
04:30:14 test035 - 1.8(org.eclipse.jdt.core.tests.eval.DebugEvaluationTest)  Time elapsed: 0.144 s
04:30:14 test036 - 1.8(org.eclipse.jdt.core.tests.eval.DebugEvaluationTest)  Time elapsed: 0.149 s
04:30:14 test037 - 1.8(org.eclipse.jdt.core.tests.eval.DebugEvaluationTest)  Time elapsed: 0.148 s
04:30:14 test038 - 1.8(org.eclipse.jdt.core.tests.eval.DebugEvaluationTest)  Time elapsed: 0.147 s
04:30:14 test039 - 1.8(org.eclipse.jdt.core.tests.eval.DebugEvaluationTest)  Time elapsed: 0.15 s
04:30:14 test040 - 1.8(org.eclipse.jdt.core.tests.eval.DebugEvaluationTest)  Time elapsed: 0.148 s
04:30:14 test041 - 1.8(org.eclipse.jdt.core.tests.eval.DebugEvaluationTest)  Time elapsed: 0.146 s
04:30:14 test042 - 1.8(org.eclipse.jdt.core.tests.eval.DebugEvaluationTest)  Time elapsed: 0.144 s
04:30:14 test043 - 1.8(org.eclipse.jdt.core.tests.eval.DebugEvaluationTest)  Time elapsed: 0.141 s
04:30:14 test044 - 1.8(org.eclipse.jdt.core.tests.eval.DebugEvaluationTest)  Time elapsed: 0.145 s
04:30:14 test045 - 1.8(org.eclipse.jdt.core.tests.eval.DebugEvaluationTest)  Time elapsed: 0.143 s
04:30:14 test046 - 1.8(org.eclipse.jdt.core.tests.eval.DebugEvaluationTest)  Time elapsed: 0.144 s
04:30:14 test047 - 1.8(org.eclipse.jdt.core.tests.eval.DebugEvaluationTest)  Time elapsed: 0.148 s
04:30:14 test048 - 1.8(org.eclipse.jdt.core.tests.eval.DebugEvaluationTest)  Time elapsed: 0.145 s
04:30:14 test049 - 1.8(org.eclipse.jdt.core.tests.eval.DebugEvaluationTest)  Time elapsed: 0.144 s
04:30:14 test050 - 1.8(org.eclipse.jdt.core.tests.eval.DebugEvaluationTest)  Time elapsed: 0.146 s
04:30:14 test051 - 1.8(org.eclipse.jdt.core.tests.eval.DebugEvaluationTest)  Time elapsed: 0.145 s
04:30:14 test052 - 1.8(org.eclipse.jdt.core.tests.eval.DebugEvaluationTest)  Time elapsed: 0.142 s
04:30:14 test053 - 1.8(org.eclipse.jdt.core.tests.eval.DebugEvaluationTest)  Time elapsed: 0.141 s
04:30:14 test054 - 1.8(org.eclipse.jdt.core.tests.eval.DebugEvaluationTest)  Time elapsed: 0.142 s
04:30:14 test055 - 1.8(org.eclipse.jdt.core.tests.eval.DebugEvaluationTest)  Time elapsed: 0.145 s
04:30:14 test056 - 1.8(org.eclipse.jdt.core.tests.eval.DebugEvaluationTest)  Time elapsed: 0.143 s
04:30:14 test057 - 1.8(org.eclipse.jdt.core.tests.eval.DebugEvaluationTest)  Time elapsed: 0.148 s
04:30:14 test058 - 1.8(org.eclipse.jdt.core.tests.eval.DebugEvaluationTest)  Time elapsed: 0.147 s
04:30:14 test059 - 1.8(org.eclipse.jdt.core.tests.eval.DebugEvaluationTest)  Time elapsed: 0.147 s
04:30:14 test060 - 1.8(org.eclipse.jdt.core.tests.eval.DebugEvaluationTest)  Time elapsed: 0.147 s
04:30:14 test061 - 1.8(org.eclipse.jdt.core.tests.eval.DebugEvaluationTest)  Time elapsed: 0.146 s
04:30:14 test062 - 1.8(org.eclipse.jdt.core.tests.eval.DebugEvaluationTest)  Time elapsed: 0.142 s
04:30:14 test063 - 1.8(org.eclipse.jdt.core.tests.eval.DebugEvaluationTest)  Time elapsed: 0.166 s
04:30:14 test065 - 1.8(org.eclipse.jdt.core.tests.eval.DebugEvaluationTest)  Time elapsed: 0.147 s
04:30:14 test066 - 1.8(org.eclipse.jdt.core.tests.eval.DebugEvaluationTest)  Time elapsed: 0.146 s
04:30:14 test067 - 1.8(org.eclipse.jdt.core.tests.eval.DebugEvaluationTest)  Time elapsed: 0.148 s
04:30:14 test068 - 1.8(org.eclipse.jdt.core.tests.eval.DebugEvaluationTest)  Time elapsed: 0.043 s
04:30:14 test069 - 1.8(org.eclipse.jdt.core.tests.eval.DebugEvaluationTest)  Time elapsed: 0.045 s
04:30:14 testNegative001 - 1.8(org.eclipse.jdt.core.tests.eval.DebugEvaluationTest)  Time elapsed: 0.037 s
04:30:14 testNegative002 - 1.8(org.eclipse.jdt.core.tests.eval.DebugEvaluationTest)  Time elapsed: 0.034 s
04:30:14 testNegative003 - 1.8(org.eclipse.jdt.core.tests.eval.DebugEvaluationTest)  Time elapsed: 0.034 s
04:30:14 testNegative004 - 1.8(org.eclipse.jdt.core.tests.eval.DebugEvaluationTest)  Time elapsed: 0.014 s
04:30:14 testNegative005 - 1.8(org.eclipse.jdt.core.tests.eval.DebugEvaluationTest)  Time elapsed: 0.014 s
04:30:14 testAllVariables - 13(org.eclipse.jdt.core.tests.eval.SanityTestEvaluationContext)  Time elapsed: 0 s
04:30:14 testEvaluate - 13(org.eclipse.jdt.core.tests.eval.SanityTestEvaluationContext)  Time elapsed: 0.015 s
04:30:14 testEvaluateImports - 13(org.eclipse.jdt.core.tests.eval.SanityTestEvaluationContext)  Time elapsed: 0 s
04:30:14 testEvaluateVariable - 13(org.eclipse.jdt.core.tests.eval.SanityTestEvaluationContext)  Time elapsed: 0.012 s
04:30:14 testEvaluateVariables - 13(org.eclipse.jdt.core.tests.eval.SanityTestEvaluationContext)  Time elapsed: 0.004 s
04:30:14 testGetSetImports - 13(org.eclipse.jdt.core.tests.eval.SanityTestEvaluationContext)  Time elapsed: 0.001 s
04:30:14 testGetSetPackageName - 13(org.eclipse.jdt.core.tests.eval.SanityTestEvaluationContext)  Time elapsed: 0 s
04:30:14 testNewDeleteVariable - 13(org.eclipse.jdt.core.tests.eval.SanityTestEvaluationContext)  Time elapsed: 0 s
04:30:14 testGetEvaluationType - 13(org.eclipse.jdt.core.tests.eval.SanityTestEvaluationResult)  Time elapsed: 0.008 s
04:30:14 testGetProblems - 13(org.eclipse.jdt.core.tests.eval.SanityTestEvaluationResult)  Time elapsed: 0.006 s
04:30:14 testGetValue - 13(org.eclipse.jdt.core.tests.eval.SanityTestEvaluationResult)  Time elapsed: 0.006 s
04:30:14 testGetValueDisplayString - 13(org.eclipse.jdt.core.tests.eval.SanityTestEvaluationResult)  Time elapsed: 0.005 s
04:30:14 testGetValueTypeName - 13(org.eclipse.jdt.core.tests.eval.SanityTestEvaluationResult)  Time elapsed: 0.005 s
04:30:14 testHasErrors - 13(org.eclipse.jdt.core.tests.eval.SanityTestEvaluationResult)  Time elapsed: 0.005 s
04:30:14 testHasProblems - 13(org.eclipse.jdt.core.tests.eval.SanityTestEvaluationResult)  Time elapsed: 0.005 s
04:30:14 testHasValue - 13(org.eclipse.jdt.core.tests.eval.SanityTestEvaluationResult)  Time elapsed: 0.005 s
04:30:14 testHasWarnings - 13(org.eclipse.jdt.core.tests.eval.SanityTestEvaluationResult)  Time elapsed: 0.024 s
04:30:14 testAllKindOfValues - 13(org.eclipse.jdt.core.tests.eval.VariableTest)  Time elapsed: 0.074 s
04:30:14 testCodeSnippetVarAssign - 13(org.eclipse.jdt.core.tests.eval.VariableTest)  Time elapsed: 0.152 s
04:30:14 testCodeSnippetVarRetrieval - 13(org.eclipse.jdt.core.tests.eval.VariableTest)  Time elapsed: 0.078 s
04:30:14 testImports - 13(org.eclipse.jdt.core.tests.eval.VariableTest)  Time elapsed: 0.033 s
04:30:14 testSeveralVariableInstallations - 13(org.eclipse.jdt.core.tests.eval.VariableTest)  Time elapsed: 0.134 s
04:30:14 testBug345334 - 13(org.eclipse.jdt.core.tests.eval.CodeSnippetTest)  Time elapsed: 0.03 s
04:30:14 testBug464656 - 13(org.eclipse.jdt.core.tests.eval.CodeSnippetTest)  Time elapsed: 0.021 s
04:30:14 testCheckedException - 13(org.eclipse.jdt.core.tests.eval.CodeSnippetTest)  Time elapsed: 0.005 s
04:30:14 testDiamond - 13(org.eclipse.jdt.core.tests.eval.CodeSnippetTest)  Time elapsed: 0.008 s
04:30:14 testEmptyStatement - 13(org.eclipse.jdt.core.tests.eval.CodeSnippetTest)  Time elapsed: 0.006 s
04:30:14 testEvaluateEmptyImport - 13(org.eclipse.jdt.core.tests.eval.CodeSnippetTest)  Time elapsed: 0 s
04:30:14 testEvaluateExistingPackageAndNonExistingTypeImports - 13(org.eclipse.jdt.core.tests.eval.CodeSnippetTest)  Time elapsed: 0 s
04:30:14 testEvaluateNonExistingPackageAndExistingTypeImports - 13(org.eclipse.jdt.core.tests.eval.CodeSnippetTest)  Time elapsed: 0.001 s
04:30:14 testEvaluateNonExistingPackageImport - 13(org.eclipse.jdt.core.tests.eval.CodeSnippetTest)  Time elapsed: 0 s
04:30:14 testEvaluateNonExistingTypeImport - 13(org.eclipse.jdt.core.tests.eval.CodeSnippetTest)  Time elapsed: 0 s
04:30:14 testEvaluateValidPackageAndTypeImports - 13(org.eclipse.jdt.core.tests.eval.CodeSnippetTest)  Time elapsed: 0 s
04:30:14 testEvaluateValidPackageImport - 13(org.eclipse.jdt.core.tests.eval.CodeSnippetTest)  Time elapsed: 0 s
04:30:14 testEvaluateValidTypeImport - 13(org.eclipse.jdt.core.tests.eval.CodeSnippetTest)  Time elapsed: 0 s
04:30:14 testFinallyError - 13(org.eclipse.jdt.core.tests.eval.CodeSnippetTest)  Time elapsed: 0.006 s
04:30:14 testFinallyOneBlock - 13(org.eclipse.jdt.core.tests.eval.CodeSnippetTest)  Time elapsed: 0.005 s
04:30:14 testFinallyTwoBlock - 13(org.eclipse.jdt.core.tests.eval.CodeSnippetTest)  Time elapsed: 0.005 s
04:30:14 testFor89632 - 13(org.eclipse.jdt.core.tests.eval.CodeSnippetTest)  Time elapsed: 0.048 s
04:30:14 testFreeReturnAnonymous - 13(org.eclipse.jdt.core.tests.eval.CodeSnippetTest)  Time elapsed: 0.008 s
04:30:14 testFreeReturnClassDeclaration - 13(org.eclipse.jdt.core.tests.eval.CodeSnippetTest)  Time elapsed: 0.006 s
04:30:14 testFreeReturnExpression - 13(org.eclipse.jdt.core.tests.eval.CodeSnippetTest)  Time elapsed: 0.004 s
04:30:14 testFreeReturnInteger - 13(org.eclipse.jdt.core.tests.eval.CodeSnippetTest)  Time elapsed: 0.005 s
04:30:14 testFreeReturnLocalVar - 13(org.eclipse.jdt.core.tests.eval.CodeSnippetTest)  Time elapsed: 0.004 s
04:30:14 testFreeReturnStatement - 13(org.eclipse.jdt.core.tests.eval.CodeSnippetTest)  Time elapsed: 0.004 s
04:30:14 testImportPackage - 13(org.eclipse.jdt.core.tests.eval.CodeSnippetTest)  Time elapsed: 0.008 s
04:30:14 testImportType - 13(org.eclipse.jdt.core.tests.eval.CodeSnippetTest)  Time elapsed: 0.009 s
04:30:14 testImportTypeAndPackage - 13(org.eclipse.jdt.core.tests.eval.CodeSnippetTest)  Time elapsed: 0.008 s
04:30:14 testInnerClassAnonymous - 13(org.eclipse.jdt.core.tests.eval.CodeSnippetTest)  Time elapsed: 0.007 s
04:30:14 testInnerClassNamed - 13(org.eclipse.jdt.core.tests.eval.CodeSnippetTest)  Time elapsed: 0.006 s
04:30:14 testReturnDisplayStringBoolean - 13(org.eclipse.jdt.core.tests.eval.CodeSnippetTest)  Time elapsed: 0.004 s
04:30:14 testReturnDisplayStringCharacter - 13(org.eclipse.jdt.core.tests.eval.CodeSnippetTest)  Time elapsed: 0.005 s
04:30:14 testReturnDisplayStringDouble - 13(org.eclipse.jdt.core.tests.eval.CodeSnippetTest)  Time elapsed: 0.004 s
04:30:14 testReturnDisplayStringEmptyCodeSnippet - 13(org.eclipse.jdt.core.tests.eval.CodeSnippetTest)  Time elapsed: 0.01 s
04:30:14 testReturnDisplayStringFloat - 13(org.eclipse.jdt.core.tests.eval.CodeSnippetTest)  Time elapsed: 0.005 s
04:30:14 testReturnDisplayStringInteger - 13(org.eclipse.jdt.core.tests.eval.CodeSnippetTest)  Time elapsed: 0.004 s
04:30:14 testReturnDisplayStringLong - 13(org.eclipse.jdt.core.tests.eval.CodeSnippetTest)  Time elapsed: 0.004 s
04:30:14 testReturnDisplayStringNoExplicitReturnedValue - 13(org.eclipse.jdt.core.tests.eval.CodeSnippetTest)  Time elapsed: 0.005 s
04:30:14 testReturnDisplayStringObject - 13(org.eclipse.jdt.core.tests.eval.CodeSnippetTest)  Time elapsed: 0.006 s
04:30:14 testReturnDisplayStringShort - 13(org.eclipse.jdt.core.tests.eval.CodeSnippetTest)  Time elapsed: 0.004 s
04:30:14 testReturnDisplayStringString - 13(org.eclipse.jdt.core.tests.eval.CodeSnippetTest)  Time elapsed: 0.005 s
04:30:14 testReturnDisplayStringVoid - 13(org.eclipse.jdt.core.tests.eval.CodeSnippetTest)  Time elapsed: 0.004 s
04:30:14 testReturnTypeBoolean - 13(org.eclipse.jdt.core.tests.eval.CodeSnippetTest)  Time elapsed: 0.004 s
04:30:14 testReturnTypeBooleanArray - 13(org.eclipse.jdt.core.tests.eval.CodeSnippetTest)  Time elapsed: 0.006 s
04:30:14 testReturnTypeBooleanObject - 13(org.eclipse.jdt.core.tests.eval.CodeSnippetTest)  Time elapsed: 0.005 s
04:30:14 testReturnTypeChar - 13(org.eclipse.jdt.core.tests.eval.CodeSnippetTest)  Time elapsed: 0.004 s
04:30:14 testReturnTypeCharArray - 13(org.eclipse.jdt.core.tests.eval.CodeSnippetTest)  Time elapsed: 0.005 s
04:30:14 testReturnTypeCharacterObject - 13(org.eclipse.jdt.core.tests.eval.CodeSnippetTest)  Time elapsed: 0.005 s
04:30:14 testReturnTypeDouble - 13(org.eclipse.jdt.core.tests.eval.CodeSnippetTest)  Time elapsed: 0.004 s
04:30:14 testReturnTypeDoubleArray - 13(org.eclipse.jdt.core.tests.eval.CodeSnippetTest)  Time elapsed: 0.031 s
04:30:14 testReturnTypeDoubleObject - 13(org.eclipse.jdt.core.tests.eval.CodeSnippetTest)  Time elapsed: 0.004 s
04:30:14 testReturnTypeEmptyCodeSnippet - 13(org.eclipse.jdt.core.tests.eval.CodeSnippetTest)  Time elapsed: 0.004 s
04:30:14 testReturnTypeFloat - 13(org.eclipse.jdt.core.tests.eval.CodeSnippetTest)  Time elapsed: 0.004 s
04:30:14 testReturnTypeFloatArray - 13(org.eclipse.jdt.core.tests.eval.CodeSnippetTest)  Time elapsed: 0.005 s
04:30:14 testReturnTypeFloatObject - 13(org.eclipse.jdt.core.tests.eval.CodeSnippetTest)  Time elapsed: 0.005 s
04:30:14 testReturnTypeInt - 13(org.eclipse.jdt.core.tests.eval.CodeSnippetTest)  Time elapsed: 0.004 s
04:30:14 testReturnTypeIntegerObject - 13(org.eclipse.jdt.core.tests.eval.CodeSnippetTest)  Time elapsed: 0.005 s
04:30:14 testReturnTypeLong - 13(org.eclipse.jdt.core.tests.eval.CodeSnippetTest)  Time elapsed: 0.004 s
04:30:14 testReturnTypeLongArray - 13(org.eclipse.jdt.core.tests.eval.CodeSnippetTest)  Time elapsed: 0.004 s
04:30:14 testReturnTypeLongObject - 13(org.eclipse.jdt.core.tests.eval.CodeSnippetTest)  Time elapsed: 0.006 s
04:30:14 testReturnTypeNoExplicitReturnedValue - 13(org.eclipse.jdt.core.tests.eval.CodeSnippetTest)  Time elapsed: 0.005 s
04:30:14 testReturnTypeObject - 13(org.eclipse.jdt.core.tests.eval.CodeSnippetTest)  Time elapsed: 0.004 s
04:30:14 testReturnTypeObjectArray - 13(org.eclipse.jdt.core.tests.eval.CodeSnippetTest)  Time elapsed: 0.005 s
04:30:14 testReturnTypeShort - 13(org.eclipse.jdt.core.tests.eval.CodeSnippetTest)  Time elapsed: 0.004 s
04:30:14 testReturnTypeShortArray - 13(org.eclipse.jdt.core.tests.eval.CodeSnippetTest)  Time elapsed: 0.005 s
04:30:14 testReturnTypeShortObject - 13(org.eclipse.jdt.core.tests.eval.CodeSnippetTest)  Time elapsed: 0.005 s
04:30:14 testReturnTypeString - 13(org.eclipse.jdt.core.tests.eval.CodeSnippetTest)  Time elapsed: 0.004 s
04:30:14 testReturnTypeStringArray - 13(org.eclipse.jdt.core.tests.eval.CodeSnippetTest)  Time elapsed: 0.006 s
04:30:14 testReturnTypeVoid - 13(org.eclipse.jdt.core.tests.eval.CodeSnippetTest)  Time elapsed: 0.005 s
04:30:14 testReturnTypesIntArray - 13(org.eclipse.jdt.core.tests.eval.CodeSnippetTest)  Time elapsed: 0.011 s
04:30:14 testRunMethodInAnonymous - 13(org.eclipse.jdt.core.tests.eval.CodeSnippetTest)  Time elapsed: 0.21 s
04:30:14 testRunMethodInAnonymous2 - 13(org.eclipse.jdt.core.tests.eval.CodeSnippetTest)  Time elapsed: 0.21 s
04:30:14 testRunMethodInAnonymous3 - 13(org.eclipse.jdt.core.tests.eval.CodeSnippetTest)  Time elapsed: 0.21 s
04:30:14 testRunMethodInAnonymous4 - 13(org.eclipse.jdt.core.tests.eval.CodeSnippetTest)  Time elapsed: 0.21 s
04:30:14 testRunMethodInAnonymous5 - 13(org.eclipse.jdt.core.tests.eval.CodeSnippetTest)  Time elapsed: 0.211 s
04:30:14 testRunMethodInAnonymous6 - 13(org.eclipse.jdt.core.tests.eval.CodeSnippetTest)  Time elapsed: 0.21 s
04:30:14 testRunMethodInAnonymous7 - 13(org.eclipse.jdt.core.tests.eval.CodeSnippetTest)  Time elapsed: 0.21 s
04:30:14 testRunMethodInAnonymous8 - 13(org.eclipse.jdt.core.tests.eval.CodeSnippetTest)  Time elapsed: 0.211 s
04:30:14 testExpressionInInnerClass - 13(org.eclipse.jdt.core.tests.eval.NegativeCodeSnippetTest)  Time elapsed: 0.002 s
04:30:14 testExtraClosingCurlyBracket - 13(org.eclipse.jdt.core.tests.eval.NegativeCodeSnippetTest)  Time elapsed: 0.003 s
04:30:14 testExtraOpenRoundBracket - 13(org.eclipse.jdt.core.tests.eval.NegativeCodeSnippetTest)  Time elapsed: 0.002 s
04:30:14 testExtraSemiColonInExpression - 13(org.eclipse.jdt.core.tests.eval.NegativeCodeSnippetTest)  Time elapsed: 0.001 s
04:30:14 testInvalidField - 13(org.eclipse.jdt.core.tests.eval.NegativeCodeSnippetTest)  Time elapsed: 0.003 s
04:30:14 testInvalidImport - 13(org.eclipse.jdt.core.tests.eval.NegativeCodeSnippetTest)  Time elapsed: 0.003 s
04:30:14 testInvalidUseOfThisInSnippet - 13(org.eclipse.jdt.core.tests.eval.NegativeCodeSnippetTest)  Time elapsed: 0.004 s
04:30:14 testInvalidUseOfThisInSnippet2 - 13(org.eclipse.jdt.core.tests.eval.NegativeCodeSnippetTest)  Time elapsed: 0.002 s
04:30:14 testMissingClosingRoundBracket - 13(org.eclipse.jdt.core.tests.eval.NegativeCodeSnippetTest)  Time elapsed: 0.002 s
04:30:14 testMissingDoubleQuote - 13(org.eclipse.jdt.core.tests.eval.NegativeCodeSnippetTest)  Time elapsed: 0.002 s
04:30:14 testNonLastExpressionStatement - 13(org.eclipse.jdt.core.tests.eval.NegativeCodeSnippetTest)  Time elapsed: 0.001 s
04:30:14 testProblemInExpression - 13(org.eclipse.jdt.core.tests.eval.NegativeCodeSnippetTest)  Time elapsed: 0.001 s
04:30:14 testProblemInExpression2 - 13(org.eclipse.jdt.core.tests.eval.NegativeCodeSnippetTest)  Time elapsed: 0.002 s
04:30:14 testProblemInInnerClass - 13(org.eclipse.jdt.core.tests.eval.NegativeCodeSnippetTest)  Time elapsed: 0.009 s
04:30:14 testProblemInPreviousStatement - 13(org.eclipse.jdt.core.tests.eval.NegativeCodeSnippetTest)  Time elapsed: 0.002 s
04:30:14 testProblemInReturnStatement - 13(org.eclipse.jdt.core.tests.eval.NegativeCodeSnippetTest)  Time elapsed: 0.001 s
04:30:14 testRemoveImport - 13(org.eclipse.jdt.core.tests.eval.NegativeCodeSnippetTest)  Time elapsed: 0.019 s
04:30:14 testRemoveVariable - 13(org.eclipse.jdt.core.tests.eval.NegativeCodeSnippetTest)  Time elapsed: 0.012 s
04:30:14 testUnreachableExpression - 13(org.eclipse.jdt.core.tests.eval.NegativeCodeSnippetTest)  Time elapsed: 0.003 s
04:30:14 testUnusedImport - 13(org.eclipse.jdt.core.tests.eval.NegativeCodeSnippetTest)  Time elapsed: 0.011 s
04:30:14 testWarning - 13(org.eclipse.jdt.core.tests.eval.NegativeCodeSnippetTest)  Time elapsed: 0.007 s
04:30:14 testInitializerProblem - 13(org.eclipse.jdt.core.tests.eval.NegativeVariableTest)  Time elapsed: 0.005 s
04:30:14 testUnknownType - 13(org.eclipse.jdt.core.tests.eval.NegativeVariableTest)  Time elapsed: 0.003 s
04:30:14 test001 - 13(org.eclipse.jdt.core.tests.eval.DebugEvaluationTest)  Time elapsed: 0.153 s
04:30:14 test002 - 13(org.eclipse.jdt.core.tests.eval.DebugEvaluationTest)  Time elapsed: 0.15 s
04:30:14 test003 - 13(org.eclipse.jdt.core.tests.eval.DebugEvaluationTest)  Time elapsed: 0.034 s
04:30:14 test004 - 13(org.eclipse.jdt.core.tests.eval.DebugEvaluationTest)  Time elapsed: 0.133 s
04:30:14 test005 - 13(org.eclipse.jdt.core.tests.eval.DebugEvaluationTest)  Time elapsed: 0.148 s
04:30:14 test006 - 13(org.eclipse.jdt.core.tests.eval.DebugEvaluationTest)  Time elapsed: 0.147 s
04:30:14 test007 - 13(org.eclipse.jdt.core.tests.eval.DebugEvaluationTest)  Time elapsed: 0.148 s
04:30:14 test008 - 13(org.eclipse.jdt.core.tests.eval.DebugEvaluationTest)  Time elapsed: 0.15 s
04:30:14 test009 - 13(org.eclipse.jdt.core.tests.eval.DebugEvaluationTest)  Time elapsed: 0.134 s
04:30:14 test010 - 13(org.eclipse.jdt.core.tests.eval.DebugEvaluationTest)  Time elapsed: 0.153 s
04:30:14 test011 - 13(org.eclipse.jdt.core.tests.eval.DebugEvaluationTest)  Time elapsed: 0.14 s
04:30:14 test016 - 13(org.eclipse.jdt.core.tests.eval.DebugEvaluationTest)  Time elapsed: 0.239 s
04:30:14 test017 - 13(org.eclipse.jdt.core.tests.eval.DebugEvaluationTest)  Time elapsed: 0.126 s
04:30:14 test018 - 13(org.eclipse.jdt.core.tests.eval.DebugEvaluationTest)  Time elapsed: 0.268 s
04:30:14 test019 - 13(org.eclipse.jdt.core.tests.eval.DebugEvaluationTest)  Time elapsed: 0.034 s
04:30:14 test020 - 13(org.eclipse.jdt.core.tests.eval.DebugEvaluationTest)  Time elapsed: 0.145 s
04:30:14 test021 - 13(org.eclipse.jdt.core.tests.eval.DebugEvaluationTest)  Time elapsed: 0.265 s
04:30:14 test022 - 13(org.eclipse.jdt.core.tests.eval.DebugEvaluationTest)  Time elapsed: 0.273 s
04:30:14 test023 - 13(org.eclipse.jdt.core.tests.eval.DebugEvaluationTest)  Time elapsed: 0.277 s
04:30:14 test024 - 13(org.eclipse.jdt.core.tests.eval.DebugEvaluationTest)  Time elapsed: 0.285 s
04:30:14 test025 - 13(org.eclipse.jdt.core.tests.eval.DebugEvaluationTest)  Time elapsed: 0.291 s
04:30:14 test026 - 13(org.eclipse.jdt.core.tests.eval.DebugEvaluationTest)  Time elapsed: 0.152 s
04:30:14 test027 - 13(org.eclipse.jdt.core.tests.eval.DebugEvaluationTest)  Time elapsed: 0.15 s
04:30:14 test028 - 13(org.eclipse.jdt.core.tests.eval.DebugEvaluationTest)  Time elapsed: 0.158 s
04:30:14 test029 - 13(org.eclipse.jdt.core.tests.eval.DebugEvaluationTest)  Time elapsed: 0.152 s
04:30:14 test030 - 13(org.eclipse.jdt.core.tests.eval.DebugEvaluationTest)  Time elapsed: 0.153 s
04:30:14 test031 - 13(org.eclipse.jdt.core.tests.eval.DebugEvaluationTest)  Time elapsed: 0.152 s
04:30:14 test032 - 13(org.eclipse.jdt.core.tests.eval.DebugEvaluationTest)  Time elapsed: 0.043 s
04:30:14 test033 - 13(org.eclipse.jdt.core.tests.eval.DebugEvaluationTest)  Time elapsed: 0.157 s
04:30:14 test034 - 13(org.eclipse.jdt.core.tests.eval.DebugEvaluationTest)  Time elapsed: 0.148 s
04:30:14 test035 - 13(org.eclipse.jdt.core.tests.eval.DebugEvaluationTest)  Time elapsed: 0.055 s
04:30:14 test036 - 13(org.eclipse.jdt.core.tests.eval.DebugEvaluationTest)  Time elapsed: 0.154 s
04:30:14 test037 - 13(org.eclipse.jdt.core.tests.eval.DebugEvaluationTest)  Time elapsed: 0.151 s
04:30:14 test038 - 13(org.eclipse.jdt.core.tests.eval.DebugEvaluationTest)  Time elapsed: 0.148 s
04:30:14 test039 - 13(org.eclipse.jdt.core.tests.eval.DebugEvaluationTest)  Time elapsed: 0.153 s
04:30:14 test040 - 13(org.eclipse.jdt.core.tests.eval.DebugEvaluationTest)  Time elapsed: 0.149 s
04:30:14 test041 - 13(org.eclipse.jdt.core.tests.eval.DebugEvaluationTest)  Time elapsed: 0.15 s
04:30:14 test042 - 13(org.eclipse.jdt.core.tests.eval.DebugEvaluationTest)  Time elapsed: 0.152 s
04:30:14 test043 - 13(org.eclipse.jdt.core.tests.eval.DebugEvaluationTest)  Time elapsed: 0.151 s
04:30:14 test044 - 13(org.eclipse.jdt.core.tests.eval.DebugEvaluationTest)  Time elapsed: 0.154 s
04:30:14 test045 - 13(org.eclipse.jdt.core.tests.eval.DebugEvaluationTest)  Time elapsed: 0.149 s
04:30:14 test046 - 13(org.eclipse.jdt.core.tests.eval.DebugEvaluationTest)  Time elapsed: 0.154 s
04:30:14 test047 - 13(org.eclipse.jdt.core.tests.eval.DebugEvaluationTest)  Time elapsed: 0.152 s
04:30:14 test048 - 13(org.eclipse.jdt.core.tests.eval.DebugEvaluationTest)  Time elapsed: 0.047 s
04:30:14 test049 - 13(org.eclipse.jdt.core.tests.eval.DebugEvaluationTest)  Time elapsed: 0.147 s
04:30:14 test050 - 13(org.eclipse.jdt.core.tests.eval.DebugEvaluationTest)  Time elapsed: 0.148 s
04:30:14 test051 - 13(org.eclipse.jdt.core.tests.eval.DebugEvaluationTest)  Time elapsed: 0.151 s
04:30:14 test052 - 13(org.eclipse.jdt.core.tests.eval.DebugEvaluationTest)  Time elapsed: 0.156 s
04:30:14 test053 - 13(org.eclipse.jdt.core.tests.eval.DebugEvaluationTest)  Time elapsed: 0.155 s
04:30:14 test054 - 13(org.eclipse.jdt.core.tests.eval.DebugEvaluationTest)  Time elapsed: 0.156 s
04:30:14 test055 - 13(org.eclipse.jdt.core.tests.eval.DebugEvaluationTest)  Time elapsed: 0.154 s
04:30:14 test056 - 13(org.eclipse.jdt.core.tests.eval.DebugEvaluationTest)  Time elapsed: 0.156 s
04:30:14 test057 - 13(org.eclipse.jdt.core.tests.eval.DebugEvaluationTest)  Time elapsed: 0.155 s
04:30:14 test058 - 13(org.eclipse.jdt.core.tests.eval.DebugEvaluationTest)  Time elapsed: 0.153 s
04:30:14 test059 - 13(org.eclipse.jdt.core.tests.eval.DebugEvaluationTest)  Time elapsed: 0.053 s
04:30:14 test060 - 13(org.eclipse.jdt.core.tests.eval.DebugEvaluationTest)  Time elapsed: 0.152 s
04:30:14 test061 - 13(org.eclipse.jdt.core.tests.eval.DebugEvaluationTest)  Time elapsed: 0.151 s
04:30:14 test062 - 13(org.eclipse.jdt.core.tests.eval.DebugEvaluationTest)  Time elapsed: 0.15 s
04:30:14 test063 - 13(org.eclipse.jdt.core.tests.eval.DebugEvaluationTest)  Time elapsed: 0.15 s
04:30:14 test065 - 13(org.eclipse.jdt.core.tests.eval.DebugEvaluationTest)  Time elapsed: 0.157 s
04:30:14 test066 - 13(org.eclipse.jdt.core.tests.eval.DebugEvaluationTest)  Time elapsed: 0.152 s
04:30:14 test067 - 13(org.eclipse.jdt.core.tests.eval.DebugEvaluationTest)  Time elapsed: 0.167 s
04:30:14 test068 - 13(org.eclipse.jdt.core.tests.eval.DebugEvaluationTest)  Time elapsed: 0.05 s
04:30:14 test069 - 13(org.eclipse.jdt.core.tests.eval.DebugEvaluationTest)  Time elapsed: 0.051 s
04:30:14 testNegative001 - 13(org.eclipse.jdt.core.tests.eval.DebugEvaluationTest)  Time elapsed: 0.041 s
04:30:14 testNegative002 - 13(org.eclipse.jdt.core.tests.eval.DebugEvaluationTest)  Time elapsed: 0.046 s
04:30:14 testNegative003 - 13(org.eclipse.jdt.core.tests.eval.DebugEvaluationTest)  Time elapsed: 0.038 s
04:30:14 testNegative004 - 13(org.eclipse.jdt.core.tests.eval.DebugEvaluationTest)  Time elapsed: 0.019 s
04:30:14 testNegative005 - 13(org.eclipse.jdt.core.tests.eval.DebugEvaluationTest)  Time elapsed: 0.019 s
04:30:15 
04:30:15 Results:
04:30:15 
04:30:15 Failures: 
04:30:15   SwitchExpressionsYieldTest>TestCase.runTest:964->testBug544073_000:96->runConformTest:59->runConformTest:71->AbstractRegressionTest.access$0:3140->AbstractRegressionTest.runTest:3281->TestCase.assertEquals:242->TestCase.assertStringEquals:266 Unexpected error running resulting class file for X.java:
04:30:15 --[START]--
04:30:15 Error: LinkageError occurred while loading main class X
04:30:15 	java.lang.UnsupportedClassVersionError: X has been compiled by a more recent version of the Java Runtime (class file version 58.65535), this version of the Java Runtime only recognizes class file versions up to 57.0
04:30:15 ---[END]---
04:30:15 .
04:30:15 ----------- Expected ------------
04:30:15 
04:30:15 ------------ but was ------------
04:30:15 Error: LinkageError occurred while loading main class X\n
04:30:15 	java.lang.UnsupportedClassVersionError: X has been compiled by a more recent version of the Java Runtime (class file version 58.65535), this version of the Java Runtime only recognizes class file versions up to 57.0\n
04:30:15 
04:30:15 --------- Difference is ----------
04:30:15  expected:<[]> but was:<[Error: LinkageError occurred while loading main class X\n
04:30:15 	java.lang.UnsupportedClassVersionError: X has been compiled by a more recent version of the Java Runtime (class file version 58.65535), this version of the Java Runtime only recognizes class file versions up to 57.0\n
04:30:15 ]>
04:30:15   SwitchExpressionsYieldTest>TestCase.runTest:964->testBug544073_001:120->runConformTest:59->runConformTest:71->AbstractRegressionTest.access$0:3140->AbstractRegressionTest.runTest:3281->TestCase.assertEquals:242->TestCase.assertStringEquals:266 Unexpected error running resulting class file for X.java:
04:30:15 --[START]--
04:30:15 Error: LinkageError occurred while loading main class X
04:30:15 	java.lang.UnsupportedClassVersionError: X has been compiled by a more recent version of the Java Runtime (class file version 58.65535), this version of the Java Runtime only recognizes class file versions up to 57.0
04:30:15 ---[END]---
04:30:15 .
04:30:15 ----------- Expected ------------
04:30:15 
04:30:15 ------------ but was ------------
04:30:15 Error: LinkageError occurred while loading main class X\n
04:30:15 	java.lang.UnsupportedClassVersionError: X has been compiled by a more recent version of the Java Runtime (class file version 58.65535), this version of the Java Runtime only recognizes class file versions up to 57.0\n
04:30:15 
04:30:15 --------- Difference is ----------
04:30:15  expected:<[]> but was:<[Error: LinkageError occurred while loading main class X\n
04:30:15 	java.lang.UnsupportedClassVersionError: X has been compiled by a more recent version of the Java Runtime (class file version 58.65535), this version of the Java Runtime only recognizes class file versions up to 57.0\n
04:30:15 ]>
04:30:15   SwitchExpressionsYieldTest>TestCase.runTest:964->testBug544073_002:140->runConformTest:59->runConformTest:71->AbstractRegressionTest.access$0:3140->AbstractRegressionTest.runTest:3281->TestCase.assertEquals:242->TestCase.assertStringEquals:266 Unexpected error running resulting class file for X.java:
04:30:15 --[START]--
04:30:15 Error: LinkageError occurred while loading main class X
04:30:15 	java.lang.UnsupportedClassVersionError: X has been compiled by a more recent version of the Java Runtime (class file version 58.65535), this version of the Java Runtime only recognizes class file versions up to 57.0
04:30:15 ---[END]---
04:30:15 .
04:30:15 ----------- Expected ------------
04:30:15 
04:30:15 ------------ but was ------------
04:30:15 Error: LinkageError occurred while loading main class X\n
04:30:15 	java.lang.UnsupportedClassVersionError: X has been compiled by a more recent version of the Java Runtime (class file version 58.65535), this version of the Java Runtime only recognizes class file versions up to 57.0\n
04:30:15 
04:30:15 --------- Difference is ----------
04:30:15  expected:<[]> but was:<[Error: LinkageError occurred while loading main class X\n
04:30:15 	java.lang.UnsupportedClassVersionError: X has been compiled by a more recent version of the Java Runtime (class file version 58.65535), this version of the Java Runtime only recognizes class file versions up to 57.0\n
04:30:15 ]>
04:30:15   SwitchExpressionsYieldTest>TestCase.runTest:964->testBug544073_007:301->runConformTest:59->runConformTest:71->AbstractRegressionTest.access$0:3140->AbstractRegressionTest.runTest:3281->TestCase.assertEquals:242->TestCase.assertStringEquals:266 Unexpected error running resulting class file for X.java:
04:30:15 --[START]--
04:30:15 Error: LinkageError occurred while loading main class X
04:30:15 	java.lang.UnsupportedClassVersionError: X has been compiled by a more recent version of the Java Runtime (class file version 58.65535), this version of the Java Runtime only recognizes class file versions up to 57.0
04:30:15 ---[END]---
04:30:15 .
04:30:15 ----------- Expected ------------
04:30:15 
04:30:15 ------------ but was ------------
04:30:15 Error: LinkageError occurred while loading main class X\n
04:30:15 	java.lang.UnsupportedClassVersionError: X has been compiled by a more recent version of the Java Runtime (class file version 58.65535), this version of the Java Runtime only recognizes class file versions up to 57.0\n
04:30:15 
04:30:15 --------- Difference is ----------
04:30:15  expected:<[]> but was:<[Error: LinkageError occurred while loading main class X\n
04:30:15 	java.lang.UnsupportedClassVersionError: X has been compiled by a more recent version of the Java Runtime (class file version 58.65535), this version of the Java Runtime only recognizes class file versions up to 57.0\n
04:30:15 ]>
04:30:15   SwitchExpressionsYieldTest>TestCase.runTest:964->testBug544073_009:381->runConformTest:59->runConformTest:71->AbstractRegressionTest.access$0:3140->AbstractRegressionTest.runTest:3281->TestCase.assertEquals:242->TestCase.assertStringEquals:266 Unexpected error running resulting class file for X.java:
04:30:15 --[START]--
04:30:15 Error: LinkageError occurred while loading main class X
04:30:15 	java.lang.UnsupportedClassVersionError: X has been compiled by a more recent version of the Java Runtime (class file version 58.65535), this version of the Java Runtime only recognizes class file versions up to 57.0
04:30:15 ---[END]---
04:30:15 .
04:30:15 ----------- Expected ------------
04:30:15 
04:30:15 ------------ but was ------------
04:30:15 Error: LinkageError occurred while loading main class X\n
04:30:15 	java.lang.UnsupportedClassVersionError: X has been compiled by a more recent version of the Java Runtime (class file version 58.65535), this version of the Java Runtime only recognizes class file versions up to 57.0\n
04:30:15 
04:30:15 --------- Difference is ----------
04:30:15  expected:<[]> but was:<[Error: LinkageError occurred while loading main class X\n
04:30:15 	java.lang.UnsupportedClassVersionError: X has been compiled by a more recent version of the Java Runtime (class file version 58.65535), this version of the Java Runtime only recognizes class file versions up to 57.0\n
04:30:15 ]>
04:30:15   SwitchExpressionsYieldTest>TestCase.runTest:964->testBug544073_016:611->runConformTest:59->runConformTest:71->AbstractRegressionTest.access$0:3140->AbstractRegressionTest.runTest:3281->TestCase.assertEquals:242->TestCase.assertStringEquals:266 Unexpected error running resulting class file for X.java:
04:30:15 --[START]--
04:30:15 Error: LinkageError occurred while loading main class X
04:30:15 	java.lang.UnsupportedClassVersionError: X has been compiled by a more recent version of the Java Runtime (class file version 58.65535), this version of the Java Runtime only recognizes class file versions up to 57.0
04:30:15 ---[END]---
04:30:15 .
04:30:15 ----------- Expected ------------
04:30:15 
04:30:15 ------------ but was ------------
04:30:15 Error: LinkageError occurred while loading main class X\n
04:30:15 	java.lang.UnsupportedClassVersionError: X has been compiled by a more recent version of the Java Runtime (class file version 58.65535), this version of the Java Runtime only recognizes class file versions up to 57.0\n
04:30:15 
04:30:15 --------- Difference is ----------
04:30:15  expected:<[]> but was:<[Error: LinkageError occurred while loading main class X\n
04:30:15 	java.lang.UnsupportedClassVersionError: X has been compiled by a more recent version of the Java Runtime (class file version 58.65535), this version of the Java Runtime only recognizes class file versions up to 57.0\n
04:30:15 ]>
04:30:15   SwitchExpressionsYieldTest>TestCase.runTest:964->testBug544073_017:660->runConformTest:59->runConformTest:71->AbstractRegressionTest.access$0:3140->AbstractRegressionTest.runTest:3281->TestCase.assertEquals:242->TestCase.assertStringEquals:266 Unexpected error running resulting class file for X.java:
04:30:15 --[START]--
04:30:15 Error: LinkageError occurred while loading main class X
04:30:15 	java.lang.UnsupportedClassVersionError: X has been compiled by a more recent version of the Java Runtime (class file version 58.65535), this version of the Java Runtime only recognizes class file versions up to 57.0
04:30:15 ---[END]---
04:30:15 .
04:30:15 ----------- Expected ------------
04:30:15 
04:30:15 ------------ but was ------------
04:30:15 Error: LinkageError occurred while loading main class X\n
04:30:15 	java.lang.UnsupportedClassVersionError: X has been compiled by a more recent version of the Java Runtime (class file version 58.65535), this version of the Java Runtime only recognizes class file versions up to 57.0\n
04:30:15 
04:30:15 --------- Difference is ----------
04:30:15  expected:<[]> but was:<[Error: LinkageError occurred while loading main class X\n
04:30:15 	java.lang.UnsupportedClassVersionError: X has been compiled by a more recent version of the Java Runtime (class file version 58.65535), this version of the Java Runtime only recognizes class file versions up to 57.0\n
04:30:15 ]>
04:30:15   SwitchExpressionsYieldTest>TestCase.runTest:964->testBug544073_018:693->runWarningTest:78->runWarningTest:81->runWarningTest:93->AbstractRegressionTest.access$0:3140->AbstractRegressionTest.runTest:3281->TestCase.assertEquals:242->TestCase.assertStringEquals:266 Unexpected error running resulting class file for X.java:
04:30:15 --[START]--
04:30:15 Error: LinkageError occurred while loading main class X
04:30:15 	java.lang.UnsupportedClassVersionError: X has been compiled by a more recent version of the Java Runtime (class file version 58.65535), this version of the Java Runtime only recognizes class file versions up to 57.0
04:30:15 ---[END]---
04:30:15 .
04:30:15 ----------- Expected ------------
04:30:15 
04:30:15 ------------ but was ------------
04:30:15 Error: LinkageError occurred while loading main class X\n
04:30:15 	java.lang.UnsupportedClassVersionError: X has been compiled by a more recent version of the Java Runtime (class file version 58.65535), this version of the Java Runtime only recognizes class file versions up to 57.0\n
04:30:15 
04:30:15 --------- Difference is ----------
04:30:15  expected:<[]> but was:<[Error: LinkageError occurred while loading main class X\n
04:30:15 	java.lang.UnsupportedClassVersionError: X has been compiled by a more recent version of the Java Runtime (class file version 58.65535), this version of the Java Runtime only recognizes class file versions up to 57.0\n
04:30:15 ]>
04:30:15   SwitchExpressionsYieldTest>TestCase.runTest:964->testBug544073_021:813->runWarningTest:78->runWarningTest:81->runWarningTest:93->AbstractRegressionTest.access$0:3140->AbstractRegressionTest.runTest:3281->TestCase.assertEquals:242->TestCase.assertStringEquals:266 Unexpected error running resulting class file for X.java:
04:30:15 --[START]--
04:30:15 Error: LinkageError occurred while loading main class X
04:30:15 	java.lang.UnsupportedClassVersionError: X has been compiled by a more recent version of the Java Runtime (class file version 58.65535), this version of the Java Runtime only recognizes class file versions up to 57.0
04:30:15 ---[END]---
04:30:15 .
04:30:15 ----------- Expected ------------
04:30:15 
04:30:15 ------------ but was ------------
04:30:15 Error: LinkageError occurred while loading main class X\n
04:30:15 	java.lang.UnsupportedClassVersionError: X has been compiled by a more recent version of the Java Runtime (class file version 58.65535), this version of the Java Runtime only recognizes class file versions up to 57.0\n
04:30:15 
04:30:15 --------- Difference is ----------
04:30:15  expected:<[]> but was:<[Error: LinkageError occurred while loading main class X\n
04:30:15 	java.lang.UnsupportedClassVersionError: X has been compiled by a more recent version of the Java Runtime (class file version 58.65535), this version of the Java Runtime only recognizes class file versions up to 57.0\n
04:30:15 ]>
04:30:15   SwitchExpressionsYieldTest>TestCase.runTest:964->testBug544073_022:843->runConformTest:59->runConformTest:71->AbstractRegressionTest.access$0:3140->AbstractRegressionTest.runTest:3281->TestCase.assertEquals:242->TestCase.assertStringEquals:266 Unexpected error running resulting class file for X.java:
04:30:15 --[START]--
04:30:15 Error: LinkageError occurred while loading main class X
04:30:15 	java.lang.UnsupportedClassVersionError: X has been compiled by a more recent version of the Java Runtime (class file version 58.65535), this version of the Java Runtime only recognizes class file versions up to 57.0
04:30:15 ---[END]---
04:30:15 .
04:30:15 ----------- Expected ------------
04:30:15 
04:30:15 ------------ but was ------------
04:30:15 Error: LinkageError occurred while loading main class X\n
04:30:15 	java.lang.UnsupportedClassVersionError: X has been compiled by a more recent version of the Java Runtime (class file version 58.65535), this version of the Java Runtime only recognizes class file versions up to 57.0\n
04:30:15 
04:30:15 --------- Difference is ----------
04:30:15  expected:<[]> but was:<[Error: LinkageError occurred while loading main class X\n
04:30:15 	java.lang.UnsupportedClassVersionError: X has been compiled by a more recent version of the Java Runtime (class file version 58.65535), this version of the Java Runtime only recognizes class file versions up to 57.0\n
04:30:15 ]>
04:30:15   SwitchExpressionsYieldTest>TestCase.runTest:964->testBug544073_023:883->runConformTest:59->runConformTest:71->AbstractRegressionTest.access$0:3140->AbstractRegressionTest.runTest:3281->TestCase.assertEquals:242->TestCase.assertStringEquals:266 Unexpected error running resulting class file for X.java:
04:30:15 --[START]--
04:30:15 Error: LinkageError occurred while loading main class X
04:30:15 	java.lang.UnsupportedClassVersionError: X has been compiled by a more recent version of the Java Runtime (class file version 58.65535), this version of the Java Runtime only recognizes class file versions up to 57.0
04:30:15 ---[END]---
04:30:15 .
04:30:15 ----------- Expected ------------
04:30:15 
04:30:15 ------------ but was ------------
04:30:15 Error: LinkageError occurred while loading main class X\n
04:30:15 	java.lang.UnsupportedClassVersionError: X has been compiled by a more recent version of the Java Runtime (class file version 58.65535), this version of the Java Runtime only recognizes class file versions up to 57.0\n
04:30:15 
04:30:15 --------- Difference is ----------
04:30:15  expected:<[]> but was:<[Error: LinkageError occurred while loading main class X\n
04:30:15 	java.lang.UnsupportedClassVersionError: X has been compiled by a more recent version of the Java Runtime (class file version 58.65535), this version of the Java Runtime only recognizes class file versions up to 57.0\n
04:30:15 ]>
04:30:15   SwitchExpressionsYieldTest>TestCase.runTest:964->testBug544073_024:916->runConformTest:59->runConformTest:71->AbstractRegressionTest.access$0:3140->AbstractRegressionTest.runTest:3281->TestCase.assertEquals:242->TestCase.assertStringEquals:266 Unexpected error running resulting class file for X.java:
04:30:15 --[START]--
04:30:15 Error: LinkageError occurred while loading main class X
04:30:15 	java.lang.UnsupportedClassVersionError: X has been compiled by a more recent version of the Java Runtime (class file version 58.65535), this version of the Java Runtime only recognizes class file versions up to 57.0
04:30:15 ---[END]---
04:30:15 .
04:30:15 ----------- Expected ------------
04:30:15 
04:30:15 ------------ but was ------------
04:30:15 Error: LinkageError occurred while loading main class X\n
04:30:15 	java.lang.UnsupportedClassVersionError: X has been compiled by a more recent version of the Java Runtime (class file version 58.65535), this version of the Java Runtime only recognizes class file versions up to 57.0\n
04:30:15 
04:30:15 --------- Difference is ----------
04:30:15  expected:<[]> but was:<[Error: LinkageError occurred while loading main class X\n
04:30:15 	java.lang.UnsupportedClassVersionError: X has been compiled by a more recent version of the Java Runtime (class file version 58.65535), this version of the Java Runtime only recognizes class file versions up to 57.0\n
04:30:15 ]>
04:30:15   SwitchExpressionsYieldTest>TestCase.runTest:964->testBug544073_025:953->runConformTest:59->runConformTest:71->AbstractRegressionTest.access$0:3140->AbstractRegressionTest.runTest:3281->TestCase.assertEquals:242->TestCase.assertStringEquals:266 Unexpected error running resulting class file for X.java:
04:30:15 --[START]--
04:30:15 Error: LinkageError occurred while loading main class X
04:30:15 	java.lang.UnsupportedClassVersionError: X has been compiled by a more recent version of the Java Runtime (class file version 58.65535), this version of the Java Runtime only recognizes class file versions up to 57.0
04:30:15 ---[END]---
04:30:15 .
04:30:15 ----------- Expected ------------
04:30:15 
04:30:15 ------------ but was ------------
04:30:15 Error: LinkageError occurred while loading main class X\n
04:30:15 	java.lang.UnsupportedClassVersionError: X has been compiled by a more recent version of the Java Runtime (class file version 58.65535), this version of the Java Runtime only recognizes class file versions up to 57.0\n
04:30:15 
04:30:15 --------- Difference is ----------
04:30:15  expected:<[]> but was:<[Error: LinkageError occurred while loading main class X\n
04:30:15 	java.lang.UnsupportedClassVersionError: X has been compiled by a more recent version of the Java Runtime (class file version 58.65535), this version of the Java Runtime only recognizes class file versions up to 57.0\n
04:30:15 ]>
04:30:15   SwitchExpressionsYieldTest>TestCase.runTest:964->testBug544073_026:994->runConformTest:59->runConformTest:71->AbstractRegressionTest.access$0:3140->AbstractRegressionTest.runTest:3281->TestCase.assertEquals:242->TestCase.assertStringEquals:266 Unexpected error running resulting class file for X.java:
04:30:15 --[START]--
04:30:15 Error: LinkageError occurred while loading main class X
04:30:15 	java.lang.UnsupportedClassVersionError: X has been compiled by a more recent version of the Java Runtime (class file version 58.65535), this version of the Java Runtime only recognizes class file versions up to 57.0
04:30:15 ---[END]---
04:30:15 .
04:30:15 ----------- Expected ------------
04:30:15 
04:30:15 ------------ but was ------------
04:30:15 Error: LinkageError occurred while loading main class X\n
04:30:15 	java.lang.UnsupportedClassVersionError: X has been compiled by a more recent version of the Java Runtime (class file version 58.65535), this version of the Java Runtime only recognizes class file versions up to 57.0\n
04:30:15 
04:30:15 --------- Difference is ----------
04:30:15  expected:<[]> but was:<[Error: LinkageError occurred while loading main class X\n
04:30:15 	java.lang.UnsupportedClassVersionError: X has been compiled by a more recent version of the Java Runtime (class file version 58.65535), this version of the Java Runtime only recognizes class file versions up to 57.0\n
04:30:15 ]>
04:30:15   SwitchExpressionsYieldTest>TestCase.runTest:964->testBug544073_028:1071->runWarningTest:93->AbstractRegressionTest.access$0:3140->AbstractRegressionTest.runTest:3281->TestCase.assertEquals:242->TestCase.assertStringEquals:266 Unexpected error running resulting class file for X.java:
04:30:15 --[START]--
04:30:15 Error: LinkageError occurred while loading main class X
04:30:15 	java.lang.UnsupportedClassVersionError: X has been compiled by a more recent version of the Java Runtime (class file version 58.65535), this version of the Java Runtime only recognizes class file versions up to 57.0
04:30:15 ---[END]---
04:30:15 .
04:30:15 ----------- Expected ------------
04:30:15 
04:30:15 ------------ but was ------------
04:30:15 Error: LinkageError occurred while loading main class X\n
04:30:15 	java.lang.UnsupportedClassVersionError: X has been compiled by a more recent version of the Java Runtime (class file version 58.65535), this version of the Java Runtime only recognizes class file versions up to 57.0\n
04:30:15 
04:30:15 --------- Difference is ----------
04:30:15  expected:<[]> but was:<[Error: LinkageError occurred while loading main class X\n
04:30:15 	java.lang.UnsupportedClassVersionError: X has been compiled by a more recent version of the Java Runtime (class file version 58.65535), this version of the Java Runtime only recognizes class file versions up to 57.0\n
04:30:15 ]>
04:30:15   SwitchExpressionsYieldTest>TestCase.runTest:964->testBug544073_029:1107->runWarningTest:81->runWarningTest:93->AbstractRegressionTest.access$0:3140->AbstractRegressionTest.runTest:3281->TestCase.assertEquals:242->TestCase.assertStringEquals:266 Unexpected error running resulting class file for X.java:
04:30:15 --[START]--
04:30:15 Error: LinkageError occurred while loading main class X
04:30:15 	java.lang.UnsupportedClassVersionError: X has been compiled by a more recent version of the Java Runtime (class file version 58.65535), this version of the Java Runtime only recognizes class file versions up to 57.0
04:30:15 ---[END]---
04:30:15 .
04:30:15 ----------- Expected ------------
04:30:15 
04:30:15 ------------ but was ------------
04:30:15 Error: LinkageError occurred while loading main class X\n
04:30:15 	java.lang.UnsupportedClassVersionError: X has been compiled by a more recent version of the Java Runtime (class file version 58.65535), this version of the Java Runtime only recognizes class file versions up to 57.0\n
04:30:15 
04:30:15 --------- Difference is ----------
04:30:15  expected:<[]> but was:<[Error: LinkageError occurred while loading main class X\n
04:30:15 	java.lang.UnsupportedClassVersionError: X has been compiled by a more recent version of the Java Runtime (class file version 58.65535), this version of the Java Runtime only recognizes class file versions up to 57.0\n
04:30:15 ]>
04:30:15   SwitchExpressionsYieldTest>TestCase.runTest:964->testBug544073_034:1273->runConformTest:59->runConformTest:71->AbstractRegressionTest.access$0:3140->AbstractRegressionTest.runTest:3281->TestCase.assertEquals:242->TestCase.assertStringEquals:266 Unexpected error running resulting class file for X.java:
04:30:15 --[START]--
04:30:15 Error: LinkageError occurred while loading main class X
04:30:15 	java.lang.UnsupportedClassVersionError: X has been compiled by a more recent version of the Java Runtime (class file version 58.65535), this version of the Java Runtime only recognizes class file versions up to 57.0
04:30:15 ---[END]---
04:30:15 .
04:30:15 ----------- Expected ------------
04:30:15 
04:30:15 ------------ but was ------------
04:30:15 Error: LinkageError occurred while loading main class X\n
04:30:15 	java.lang.UnsupportedClassVersionError: X has been compiled by a more recent version of the Java Runtime (class file version 58.65535), this version of the Java Runtime only recognizes class file versions up to 57.0\n
04:30:15 
04:30:15 --------- Difference is ----------
04:30:15  expected:<[]> but was:<[Error: LinkageError occurred while loading main class X\n
04:30:15 	java.lang.UnsupportedClassVersionError: X has been compiled by a more recent version of the Java Runtime (class file version 58.65535), this version of the Java Runtime only recognizes class file versions up to 57.0\n
04:30:15 ]>
04:30:15   SwitchExpressionsYieldTest>TestCase.runTest:964->testBug544073_037:1371->runConformTest:71->AbstractRegressionTest.access$0:3140->AbstractRegressionTest.runTest:3281->TestCase.assertEquals:242->TestCase.assertStringEquals:266 Unexpected error running resulting class file for X.java:
04:30:15 --[START]--
04:30:15 Error: LinkageError occurred while loading main class X
04:30:15 	java.lang.UnsupportedClassVersionError: X has been compiled by a more recent version of the Java Runtime (class file version 58.65535), this version of the Java Runtime only recognizes class file versions up to 57.0
04:30:15 ---[END]---
04:30:15 .
04:30:15 ----------- Expected ------------
04:30:15 
04:30:15 ------------ but was ------------
04:30:15 Error: LinkageError occurred while loading main class X\n
04:30:15 	java.lang.UnsupportedClassVersionError: X has been compiled by a more recent version of the Java Runtime (class file version 58.65535), this version of the Java Runtime only recognizes class file versions up to 57.0\n
04:30:15 
04:30:15 --------- Difference is ----------
04:30:15  expected:<[]> but was:<[Error: LinkageError occurred while loading main class X\n
04:30:15 	java.lang.UnsupportedClassVersionError: X has been compiled by a more recent version of the Java Runtime (class file version 58.65535), this version of the Java Runtime only recognizes class file versions up to 57.0\n
04:30:15 ]>
04:30:15   SwitchExpressionsYieldTest>TestCase.runTest:964->testBug544073_038:1395->runConformTest:71->AbstractRegressionTest.access$0:3140->AbstractRegressionTest.runTest:3281->TestCase.assertEquals:242->TestCase.assertStringEquals:266 Unexpected error running resulting class file for X.java:
04:30:15 --[START]--
04:30:15 Error: LinkageError occurred while loading main class X
04:30:15 	java.lang.UnsupportedClassVersionError: X has been compiled by a more recent version of the Java Runtime (class file version 58.65535), this version of the Java Runtime only recognizes class file versions up to 57.0
04:30:15 ---[END]---
04:30:15 .
04:30:15 ----------- Expected ------------
04:30:15 
04:30:15 ------------ but was ------------
04:30:15 Error: LinkageError occurred while loading main class X\n
04:30:15 	java.lang.UnsupportedClassVersionError: X has been compiled by a more recent version of the Java Runtime (class file version 58.65535), this version of the Java Runtime only recognizes class file versions up to 57.0\n
04:30:15 
04:30:15 --------- Difference is ----------
04:30:15  expected:<[]> but was:<[Error: LinkageError occurred while loading main class X\n
04:30:15 	java.lang.UnsupportedClassVersionError: X has been compiled by a more recent version of the Java Runtime (class file version 58.65535), this version of the Java Runtime only recognizes class file versions up to 57.0\n
04:30:15 ]>
04:30:15   SwitchExpressionsYieldTest>TestCase.runTest:964->testBug544073_039:1426->runConformTest:71->AbstractRegressionTest.access$0:3140->AbstractRegressionTest.runTest:3281->TestCase.assertEquals:242->TestCase.assertStringEquals:266 Unexpected error running resulting class file for X.java:
04:30:15 --[START]--
04:30:15 Error: LinkageError occurred while loading main class X
04:30:15 	java.lang.UnsupportedClassVersionError: X has been compiled by a more recent version of the Java Runtime (class file version 58.65535), this version of the Java Runtime only recognizes class file versions up to 57.0
04:30:15 ---[END]---
04:30:15 .
04:30:15 ----------- Expected ------------
04:30:15 
04:30:15 ------------ but was ------------
04:30:15 Error: LinkageError occurred while loading main class X\n
04:30:15 	java.lang.UnsupportedClassVersionError: X has been compiled by a more recent version of the Java Runtime (class file version 58.65535), this version of the Java Runtime only recognizes class file versions up to 57.0\n
04:30:15 
04:30:15 --------- Difference is ----------
04:30:15  expected:<[]> but was:<[Error: LinkageError occurred while loading main class X\n
04:30:15 	java.lang.UnsupportedClassVersionError: X has been compiled by a more recent version of the Java Runtime (class file version 58.65535), this version of the Java Runtime only recognizes class file versions up to 57.0\n
04:30:15 ]>
04:30:15   SwitchExpressionsYieldTest>TestCase.runTest:964->testBug544073_040:1458->runConformTest:71->AbstractRegressionTest.access$0:3140->AbstractRegressionTest.runTest:3281->TestCase.assertEquals:242->TestCase.assertStringEquals:266 Unexpected error running resulting class file for X.java:
04:30:15 --[START]--
04:30:15 Error: LinkageError occurred while loading main class X
04:30:15 	java.lang.UnsupportedClassVersionError: X has been compiled by a more recent version of the Java Runtime (class file version 58.65535), this version of the Java Runtime only recognizes class file versions up to 57.0
04:30:15 ---[END]---
04:30:15 .
04:30:15 ----------- Expected ------------
04:30:15 
04:30:15 ------------ but was ------------
04:30:15 Error: LinkageError occurred while loading main class X\n
04:30:15 	java.lang.UnsupportedClassVersionError: X has been compiled by a more recent version of the Java Runtime (class file version 58.65535), this version of the Java Runtime only recognizes class file versions up to 57.0\n
04:30:15 
04:30:15 --------- Difference is ----------
04:30:15  expected:<[]> but was:<[Error: LinkageError occurred while loading main class X\n
04:30:15 	java.lang.UnsupportedClassVersionError: X has been compiled by a more recent version of the Java Runtime (class file version 58.65535), this version of the Java Runtime only recognizes class file versions up to 57.0\n
04:30:15 ]>
04:30:15   SwitchExpressionsYieldTest>TestCase.runTest:964->testBug544073_041:1483->runConformTest:71->AbstractRegressionTest.access$0:3140->AbstractRegressionTest.runTest:3281->TestCase.assertEquals:242->TestCase.assertStringEquals:266 Unexpected error running resulting class file for X.java:
04:30:15 --[START]--
04:30:15 Error: LinkageError occurred while loading main class X
04:30:15 	java.lang.UnsupportedClassVersionError: X has been compiled by a more recent version of the Java Runtime (class file version 58.65535), this version of the Java Runtime only recognizes class file versions up to 57.0
04:30:15 ---[END]---
04:30:15 .
04:30:15 ----------- Expected ------------
04:30:15 
04:30:15 ------------ but was ------------
04:30:15 Error: LinkageError occurred while loading main class X\n
04:30:15 	java.lang.UnsupportedClassVersionError: X has been compiled by a more recent version of the Java Runtime (class file version 58.65535), this version of the Java Runtime only recognizes class file versions up to 57.0\n
04:30:15 
04:30:15 --------- Difference is ----------
04:30:15  expected:<[]> but was:<[Error: LinkageError occurred while loading main class X\n
04:30:15 	java.lang.UnsupportedClassVersionError: X has been compiled by a more recent version of the Java Runtime (class file version 58.65535), this version of the Java Runtime only recognizes class file versions up to 57.0\n
04:30:15 ]>
04:30:15   SwitchExpressionsYieldTest>TestCase.runTest:964->testBug544073_042:1486->runConformTest:59->runConformTest:71->AbstractRegressionTest.access$0:3140->AbstractRegressionTest.runTest:3281->TestCase.assertEquals:242->TestCase.assertStringEquals:266 Unexpected error running resulting class file for X.java:
04:30:15 --[START]--
04:30:15 Error: LinkageError occurred while loading main class X
04:30:15 	java.lang.UnsupportedClassVersionError: X has been compiled by a more recent version of the Java Runtime (class file version 58.65535), this version of the Java Runtime only recognizes class file versions up to 57.0
04:30:15 ---[END]---
04:30:15 .
04:30:15 ----------- Expected ------------
04:30:15 
04:30:15 ------------ but was ------------
04:30:15 Error: LinkageError occurred while loading main class X\n
04:30:15 	java.lang.UnsupportedClassVersionError: X has been compiled by a more recent version of the Java Runtime (class file version 58.65535), this version of the Java Runtime only recognizes class file versions up to 57.0\n
04:30:15 
04:30:15 --------- Difference is ----------
04:30:15  expected:<[]> but was:<[Error: LinkageError occurred while loading main class X\n
04:30:15 	java.lang.UnsupportedClassVersionError: X has been compiled by a more recent version of the Java Runtime (class file version 58.65535), this version of the Java Runtime only recognizes class file versions up to 57.0\n
04:30:15 ]>
04:30:15   SwitchExpressionsYieldTest>TestCase.runTest:964->testBug544073_043:1517->runConformTest:59->runConformTest:71->AbstractRegressionTest.access$0:3140->AbstractRegressionTest.runTest:3281->TestCase.assertEquals:242->TestCase.assertStringEquals:266 Unexpected error running resulting class file for X.java:
04:30:15 --[START]--
04:30:15 Error: LinkageError occurred while loading main class X
04:30:15 	java.lang.UnsupportedClassVersionError: X has been compiled by a more recent version of the Java Runtime (class file version 58.65535), this version of the Java Runtime only recognizes class file versions up to 57.0
04:30:15 ---[END]---
04:30:15 .
04:30:15 ----------- Expected ------------
04:30:15 
04:30:15 ------------ but was ------------
04:30:15 Error: LinkageError occurred while loading main class X\n
04:30:15 	java.lang.UnsupportedClassVersionError: X has been compiled by a more recent version of the Java Runtime (class file version 58.65535), this version of the Java Runtime only recognizes class file versions up to 57.0\n
04:30:15 
04:30:15 --------- Difference is ----------
04:30:15  expected:<[]> but was:<[Error: LinkageError occurred while loading main class X\n
04:30:15 	java.lang.UnsupportedClassVersionError: X has been compiled by a more recent version of the Java Runtime (class file version 58.65535), this version of the Java Runtime only recognizes class file versions up to 57.0\n
04:30:15 ]>
04:30:15   SwitchExpressionsYieldTest>TestCase.runTest:964->testBug544073_045:1576->runConformTest:59->runConformTest:71->AbstractRegressionTest.access$0:3140->AbstractRegressionTest.runTest:3281->TestCase.assertEquals:242->TestCase.assertStringEquals:266 Unexpected error running resulting class file for X.java:
04:30:15 --[START]--
04:30:15 Error: LinkageError occurred while loading main class X
04:30:15 	java.lang.UnsupportedClassVersionError: X has been compiled by a more recent version of the Java Runtime (class file version 58.65535), this version of the Java Runtime only recognizes class file versions up to 57.0
04:30:15 ---[END]---
04:30:15 .
04:30:15 ----------- Expected ------------
04:30:15 
04:30:15 ------------ but was ------------
04:30:15 Error: LinkageError occurred while loading main class X\n
04:30:15 	java.lang.UnsupportedClassVersionError: X has been compiled by a more recent version of the Java Runtime (class file version 58.65535), this version of the Java Runtime only recognizes class file versions up to 57.0\n
04:30:15 
04:30:15 --------- Difference is ----------
04:30:15  expected:<[]> but was:<[Error: LinkageError occurred while loading main class X\n
04:30:15 	java.lang.UnsupportedClassVersionError: X has been compiled by a more recent version of the Java Runtime (class file version 58.65535), this version of the Java Runtime only recognizes class file versions up to 57.0\n
04:30:15 ]>
04:30:15   SwitchExpressionsYieldTest>TestCase.runTest:964->testBug544073_046:1596->runConformTest:59->runConformTest:71->AbstractRegressionTest.access$0:3140->AbstractRegressionTest.runTest:3281->TestCase.assertEquals:242->TestCase.assertStringEquals:266 Unexpected error running resulting class file for X.java:
04:30:15 --[START]--
04:30:15 Error: LinkageError occurred while loading main class X
04:30:15 	java.lang.UnsupportedClassVersionError: X has been compiled by a more recent version of the Java Runtime (class file version 58.65535), this version of the Java Runtime only recognizes class file versions up to 57.0
04:30:15 ---[END]---
04:30:15 .
04:30:15 ----------- Expected ------------
04:30:15 
04:30:15 ------------ but was ------------
04:30:15 Error: LinkageError occurred while loading main class X\n
04:30:15 	java.lang.UnsupportedClassVersionError: X has been compiled by a more recent version of the Java Runtime (class file version 58.65535), this version of the Java Runtime only recognizes class file versions up to 57.0\n
04:30:15 
04:30:15 --------- Difference is ----------
04:30:15  expected:<[]> but was:<[Error: LinkageError occurred while loading main class X\n
04:30:15 	java.lang.UnsupportedClassVersionError: X has been compiled by a more recent version of the Java Runtime (class file version 58.65535), this version of the Java Runtime only recognizes class file versions up to 57.0\n
04:30:15 ]>
04:30:15   SwitchExpressionsYieldTest>TestCase.runTest:964->testBug544073_047:1616->runConformTest:59->runConformTest:71->AbstractRegressionTest.access$0:3140->AbstractRegressionTest.runTest:3281->TestCase.assertEquals:242->TestCase.assertStringEquals:266 Unexpected error running resulting class file for X.java:
04:30:15 --[START]--
04:30:15 Error: LinkageError occurred while loading main class X
04:30:15 	java.lang.UnsupportedClassVersionError: X has been compiled by a more recent version of the Java Runtime (class file version 58.65535), this version of the Java Runtime only recognizes class file versions up to 57.0
04:30:15 ---[END]---
04:30:15 .
04:30:15 ----------- Expected ------------
04:30:15 
04:30:15 ------------ but was ------------
04:30:15 Error: LinkageError occurred while loading main class X\n
04:30:15 	java.lang.UnsupportedClassVersionError: X has been compiled by a more recent version of the Java Runtime (class file version 58.65535), this version of the Java Runtime only recognizes class file versions up to 57.0\n
04:30:15 
04:30:15 --------- Difference is ----------
04:30:15  expected:<[]> but was:<[Error: LinkageError occurred while loading main class X\n
04:30:15 	java.lang.UnsupportedClassVersionError: X has been compiled by a more recent version of the Java Runtime (class file version 58.65535), this version of the Java Runtime only recognizes class file versions up to 57.0\n
04:30:15 ]>
04:30:15   SwitchExpressionsYieldTest>TestCase.runTest:964->testBug544073_049:1678->runConformTest:59->runConformTest:71->AbstractRegressionTest.access$0:3140->AbstractRegressionTest.runTest:3281->TestCase.assertEquals:242->TestCase.assertStringEquals:266 Unexpected error running resulting class file for X.java:
04:30:15 --[START]--
04:30:15 Error: LinkageError occurred while loading main class X
04:30:15 	java.lang.UnsupportedClassVersionError: X has been compiled by a more recent version of the Java Runtime (class file version 58.65535), this version of the Java Runtime only recognizes class file versions up to 57.0
04:30:15 ---[END]---
04:30:15 .
04:30:15 ----------- Expected ------------
04:30:15 
04:30:15 ------------ but was ------------
04:30:15 Error: LinkageError occurred while loading main class X\n
04:30:15 	java.lang.UnsupportedClassVersionError: X has been compiled by a more recent version of the Java Runtime (class file version 58.65535), this version of the Java Runtime only recognizes class file versions up to 57.0\n
04:30:15 
04:30:15 --------- Difference is ----------
04:30:15  expected:<[]> but was:<[Error: LinkageError occurred while loading main class X\n
04:30:15 	java.lang.UnsupportedClassVersionError: X has been compiled by a more recent version of the Java Runtime (class file version 58.65535), this version of the Java Runtime only recognizes class file versions up to 57.0\n
04:30:15 ]>
04:30:15   SwitchExpressionsYieldTest>TestCase.runTest:964->testBug544073_050:1697->runConformTest:59->runConformTest:71->AbstractRegressionTest.access$0:3140->AbstractRegressionTest.runTest:3281->TestCase.assertEquals:242->TestCase.assertStringEquals:266 Unexpected error running resulting class file for X.java:
04:30:15 --[START]--
04:30:15 Error: LinkageError occurred while loading main class X
04:30:15 	java.lang.UnsupportedClassVersionError: X has been compiled by a more recent version of the Java Runtime (class file version 58.65535), this version of the Java Runtime only recognizes class file versions up to 57.0
04:30:15 ---[END]---
04:30:15 .
04:30:15 ----------- Expected ------------
04:30:15 
04:30:15 ------------ but was ------------
04:30:15 Error: LinkageError occurred while loading main class X\n
04:30:15 	java.lang.UnsupportedClassVersionError: X has been compiled by a more recent version of the Java Runtime (class file version 58.65535), this version of the Java Runtime only recognizes class file versions up to 57.0\n
04:30:15 
04:30:15 --------- Difference is ----------
04:30:15  expected:<[]> but was:<[Error: LinkageError occurred while loading main class X\n
04:30:15 	java.lang.UnsupportedClassVersionError: X has been compiled by a more recent version of the Java Runtime (class file version 58.65535), this version of the Java Runtime only recognizes class file versions up to 57.0\n
04:30:15 ]>
04:30:15   SwitchExpressionsYieldTest>TestCase.runTest:964->testBug544073_051:1721->runConformTest:59->runConformTest:71->AbstractRegressionTest.access$0:3140->AbstractRegressionTest.runTest:3281->TestCase.assertEquals:242->TestCase.assertStringEquals:266 Unexpected error running resulting class file for X.java:
04:30:15 --[START]--
04:30:15 Error: LinkageError occurred while loading main class X
04:30:15 	java.lang.UnsupportedClassVersionError: X has been compiled by a more recent version of the Java Runtime (class file version 58.65535), this version of the Java Runtime only recognizes class file versions up to 57.0
04:30:15 ---[END]---
04:30:15 .
04:30:15 ----------- Expected ------------
04:30:15 
04:30:15 ------------ but was ------------
04:30:15 Error: LinkageError occurred while loading main class X\n
04:30:15 	java.lang.UnsupportedClassVersionError: X has been compiled by a more recent version of the Java Runtime (class file version 58.65535), this version of the Java Runtime only recognizes class file versions up to 57.0\n
04:30:15 
04:30:15 --------- Difference is ----------
04:30:15  expected:<[]> but was:<[Error: LinkageError occurred while loading main class X\n
04:30:15 	java.lang.UnsupportedClassVersionError: X has been compiled by a more recent version of the Java Runtime (class file version 58.65535), this version of the Java Runtime only recognizes class file versions up to 57.0\n
04:30:15 ]>
04:30:15   SwitchExpressionsYieldTest>TestCase.runTest:964->testBug544073_052:1745->runConformTest:59->runConformTest:71->AbstractRegressionTest.access$0:3140->AbstractRegressionTest.runTest:3281->TestCase.assertEquals:242->TestCase.assertStringEquals:266 Unexpected error running resulting class file for X.java:
04:30:15 --[START]--
04:30:15 Error: LinkageError occurred while loading main class X
04:30:15 	java.lang.UnsupportedClassVersionError: X has been compiled by a more recent version of the Java Runtime (class file version 58.65535), this version of the Java Runtime only recognizes class file versions up to 57.0
04:30:15 ---[END]---
04:30:15 .
04:30:15 ----------- Expected ------------
04:30:15 
04:30:15 ------------ but was ------------
04:30:15 Error: LinkageError occurred while loading main class X\n
04:30:15 	java.lang.UnsupportedClassVersionError: X has been compiled by a more recent version of the Java Runtime (class file version 58.65535), this version of the Java Runtime only recognizes class file versions up to 57.0\n
04:30:15 
04:30:15 --------- Difference is ----------
04:30:15  expected:<[]> but was:<[Error: LinkageError occurred while loading main class X\n
04:30:15 	java.lang.UnsupportedClassVersionError: X has been compiled by a more recent version of the Java Runtime (class file version 58.65535), this version of the Java Runtime only recognizes class file versions up to 57.0\n
04:30:15 ]>
04:30:15   SwitchExpressionsYieldTest>TestCase.runTest:964->testBug544073_053:1769->runConformTest:71->AbstractRegressionTest.access$0:3140->AbstractRegressionTest.runTest:3281->TestCase.assertEquals:242->TestCase.assertStringEquals:266 Unexpected error running resulting class file for X.java:
04:30:15 --[START]--
04:30:15 Error: LinkageError occurred while loading main class X
04:30:15 	java.lang.UnsupportedClassVersionError: X has been compiled by a more recent version of the Java Runtime (class file version 58.65535), this version of the Java Runtime only recognizes class file versions up to 57.0
04:30:15 ---[END]---
04:30:15 .
04:30:15 ----------- Expected ------------
04:30:15 
04:30:15 ------------ but was ------------
04:30:15 Error: LinkageError occurred while loading main class X\n
04:30:15 	java.lang.UnsupportedClassVersionError: X has been compiled by a more recent version of the Java Runtime (class file version 58.65535), this version of the Java Runtime only recognizes class file versions up to 57.0\n
04:30:15 
04:30:15 --------- Difference is ----------
04:30:15  expected:<[]> but was:<[Error: LinkageError occurred while loading main class X\n
04:30:15 	java.lang.UnsupportedClassVersionError: X has been compiled by a more recent version of the Java Runtime (class file version 58.65535), this version of the Java Runtime only recognizes class file versions up to 57.0\n
04:30:15 ]>
04:30:15   SwitchExpressionsYieldTest>TestCase.runTest:964->testBug544073_054:1789->runConformTest:59->runConformTest:71->AbstractRegressionTest.access$0:3140->AbstractRegressionTest.runTest:3281->TestCase.assertEquals:242->TestCase.assertStringEquals:266 Unexpected error running resulting class file for X.java:
04:30:15 --[START]--
04:30:15 Error: LinkageError occurred while loading main class X
04:30:15 	java.lang.UnsupportedClassVersionError: X has been compiled by a more recent version of the Java Runtime (class file version 58.65535), this version of the Java Runtime only recognizes class file versions up to 57.0
04:30:15 ---[END]---
04:30:15 .
04:30:15 ----------- Expected ------------
04:30:15 
04:30:15 ------------ but was ------------
04:30:15 Error: LinkageError occurred while loading main class X\n
04:30:15 	java.lang.UnsupportedClassVersionError: X has been compiled by a more recent version of the Java Runtime (class file version 58.65535), this version of the Java Runtime only recognizes class file versions up to 57.0\n
04:30:15 
04:30:15 --------- Difference is ----------
04:30:15  expected:<[]> but was:<[Error: LinkageError occurred while loading main class X\n
04:30:15 	java.lang.UnsupportedClassVersionError: X has been compiled by a more recent version of the Java Runtime (class file version 58.65535), this version of the Java Runtime only recognizes class file versions up to 57.0\n
04:30:15 ]>
04:30:15   SwitchExpressionsYieldTest>TestCase.runTest:964->testBug544073_055:1812->runConformTest:59->runConformTest:71->AbstractRegressionTest.access$0:3140->AbstractRegressionTest.runTest:3281->TestCase.assertEquals:242->TestCase.assertStringEquals:266 Unexpected error running resulting class file for X.java:
04:30:15 --[START]--
04:30:15 Error: LinkageError occurred while loading main class X
04:30:15 	java.lang.UnsupportedClassVersionError: X has been compiled by a more recent version of the Java Runtime (class file version 58.65535), this version of the Java Runtime only recognizes class file versions up to 57.0
04:30:15 ---[END]---
04:30:15 .
04:30:15 ----------- Expected ------------
04:30:15 
04:30:15 ------------ but was ------------
04:30:15 Error: LinkageError occurred while loading main class X\n
04:30:15 	java.lang.UnsupportedClassVersionError: X has been compiled by a more recent version of the Java Runtime (class file version 58.65535), this version of the Java Runtime only recognizes class file versions up to 57.0\n
04:30:15 
04:30:15 --------- Difference is ----------
04:30:15  expected:<[]> but was:<[Error: LinkageError occurred while loading main class X\n
04:30:15 	java.lang.UnsupportedClassVersionError: X has been compiled by a more recent version of the Java Runtime (class file version 58.65535), this version of the Java Runtime only recognizes class file versions up to 57.0\n
04:30:15 ]>
04:30:15   SwitchExpressionsYieldTest>TestCase.runTest:964->testBug544073_057:1870->runConformTest:59->runConformTest:71->AbstractRegressionTest.access$0:3140->AbstractRegressionTest.runTest:3281->TestCase.assertEquals:242->TestCase.assertStringEquals:266 Unexpected error running resulting class file for X.java:
04:30:15 --[START]--
04:30:15 Error: LinkageError occurred while loading main class X
04:30:15 	java.lang.UnsupportedClassVersionError: X has been compiled by a more recent version of the Java Runtime (class file version 58.65535), this version of the Java Runtime only recognizes class file versions up to 57.0
04:30:15 ---[END]---
04:30:15 .
04:30:15 ----------- Expected ------------
04:30:15 
04:30:15 ------------ but was ------------
04:30:15 Error: LinkageError occurred while loading main class X\n
04:30:15 	java.lang.UnsupportedClassVersionError: X has been compiled by a more recent version of the Java Runtime (class file version 58.65535), this version of the Java Runtime only recognizes class file versions up to 57.0\n
04:30:15 
04:30:15 --------- Difference is ----------
04:30:15  expected:<[]> but was:<[Error: LinkageError occurred while loading main class X\n
04:30:15 	java.lang.UnsupportedClassVersionError: X has been compiled by a more recent version of the Java Runtime (class file version 58.65535), this version of the Java Runtime only recognizes class file versions up to 57.0\n
04:30:15 ]>
04:30:15   SwitchExpressionsYieldTest>TestCase.runTest:964->testBug544073_058:1893->runConformTest:59->runConformTest:71->AbstractRegressionTest.access$0:3140->AbstractRegressionTest.runTest:3281->TestCase.assertEquals:242->TestCase.assertStringEquals:266 Unexpected error running resulting class file for X.java:
04:30:15 --[START]--
04:30:15 Error: LinkageError occurred while loading main class X
04:30:15 	java.lang.UnsupportedClassVersionError: X has been compiled by a more recent version of the Java Runtime (class file version 58.65535), this version of the Java Runtime only recognizes class file versions up to 57.0
04:30:15 ---[END]---
04:30:15 .
04:30:15 ----------- Expected ------------
04:30:15 
04:30:15 ------------ but was ------------
04:30:15 Error: LinkageError occurred while loading main class X\n
04:30:15 	java.lang.UnsupportedClassVersionError: X has been compiled by a more recent version of the Java Runtime (class file version 58.65535), this version of the Java Runtime only recognizes class file versions up to 57.0\n
04:30:15 
04:30:15 --------- Difference is ----------
04:30:15  expected:<[]> but was:<[Error: LinkageError occurred while loading main class X\n
04:30:15 	java.lang.UnsupportedClassVersionError: X has been compiled by a more recent version of the Java Runtime (class file version 58.65535), this version of the Java Runtime only recognizes class file versions up to 57.0\n
04:30:15 ]>
04:30:15   SwitchExpressionsYieldTest>TestCase.runTest:964->testBug544073_059:1915->runConformTest:59->runConformTest:71->AbstractRegressionTest.access$0:3140->AbstractRegressionTest.runTest:3281->TestCase.assertEquals:242->TestCase.assertStringEquals:266 Unexpected error running resulting class file for X.java:
04:30:15 --[START]--
04:30:15 Error: LinkageError occurred while loading main class X
04:30:15 	java.lang.UnsupportedClassVersionError: X has been compiled by a more recent version of the Java Runtime (class file version 58.65535), this version of the Java Runtime only recognizes class file versions up to 57.0
04:30:15 ---[END]---
04:30:15 .
04:30:15 ----------- Expected ------------
04:30:15 
04:30:15 ------------ but was ------------
04:30:15 Error: LinkageError occurred while loading main class X\n
04:30:15 	java.lang.UnsupportedClassVersionError: X has been compiled by a more recent version of the Java Runtime (class file version 58.65535), this version of the Java Runtime only recognizes class file versions up to 57.0\n
04:30:15 
04:30:15 --------- Difference is ----------
04:30:15  expected:<[]> but was:<[Error: LinkageError occurred while loading main class X\n
04:30:15 	java.lang.UnsupportedClassVersionError: X has been compiled by a more recent version of the Java Runtime (class file version 58.65535), this version of the Java Runtime only recognizes class file versions up to 57.0\n
04:30:15 ]>
04:30:15   SwitchExpressionsYieldTest>TestCase.runTest:964->testBug544073_060:1934->runConformTest:59->runConformTest:71->AbstractRegressionTest.access$0:3140->AbstractRegressionTest.runTest:3281->TestCase.assertEquals:242->TestCase.assertStringEquals:266 Unexpected error running resulting class file for X.java:
04:30:15 --[START]--
04:30:15 Error: LinkageError occurred while loading main class X
04:30:15 	java.lang.UnsupportedClassVersionError: X has been compiled by a more recent version of the Java Runtime (class file version 58.65535), this version of the Java Runtime only recognizes class file versions up to 57.0
04:30:15 ---[END]---
04:30:15 .
04:30:15 ----------- Expected ------------
04:30:15 
04:30:15 ------------ but was ------------
04:30:15 Error: LinkageError occurred while loading main class X\n
04:30:15 	java.lang.UnsupportedClassVersionError: X has been compiled by a more recent version of the Java Runtime (class file version 58.65535), this version of the Java Runtime only recognizes class file versions up to 57.0\n
04:30:15 
04:30:15 --------- Difference is ----------
04:30:15  expected:<[]> but was:<[Error: LinkageError occurred while loading main class X\n
04:30:15 	java.lang.UnsupportedClassVersionError: X has been compiled by a more recent version of the Java Runtime (class file version 58.65535), this version of the Java Runtime only recognizes class file versions up to 57.0\n
04:30:15 ]>
04:30:15   SwitchExpressionsYieldTest>TestCase.runTest:964->testBug544073_061:1953->runConformTest:59->runConformTest:71->AbstractRegressionTest.access$0:3140->AbstractRegressionTest.runTest:3281->TestCase.assertEquals:242->TestCase.assertStringEquals:266 Unexpected error running resulting class file for X.java:
04:30:15 --[START]--
04:30:15 Error: LinkageError occurred while loading main class X
04:30:15 	java.lang.UnsupportedClassVersionError: X has been compiled by a more recent version of the Java Runtime (class file version 58.65535), this version of the Java Runtime only recognizes class file versions up to 57.0
04:30:15 ---[END]---
04:30:15 .
04:30:15 ----------- Expected ------------
04:30:15 
04:30:15 ------------ but was ------------
04:30:15 Error: LinkageError occurred while loading main class X\n
04:30:15 	java.lang.UnsupportedClassVersionError: X has been compiled by a more recent version of the Java Runtime (class file version 58.65535), this version of the Java Runtime only recognizes class file versions up to 57.0\n
04:30:15 
04:30:15 --------- Difference is ----------
04:30:15  expected:<[]> but was:<[Error: LinkageError occurred while loading main class X\n
04:30:15 	java.lang.UnsupportedClassVersionError: X has been compiled by a more recent version of the Java Runtime (class file version 58.65535), this version of the Java Runtime only recognizes class file versions up to 57.0\n
04:30:15 ]>
04:30:15   SwitchExpressionsYieldTest>TestCase.runTest:964->testBug544073_062:1972->runConformTest:59->runConformTest:71->AbstractRegressionTest.access$0:3140->AbstractRegressionTest.runTest:3281->TestCase.assertEquals:242->TestCase.assertStringEquals:266 Unexpected error running resulting class file for X.java:
04:30:15 --[START]--
04:30:15 Error: LinkageError occurred while loading main class X
04:30:15 	java.lang.UnsupportedClassVersionError: X has been compiled by a more recent version of the Java Runtime (class file version 58.65535), this version of the Java Runtime only recognizes class file versions up to 57.0
04:30:15 ---[END]---
04:30:15 .
04:30:15 ----------- Expected ------------
04:30:15 
04:30:15 ------------ but was ------------
04:30:15 Error: LinkageError occurred while loading main class X\n
04:30:15 	java.lang.UnsupportedClassVersionError: X has been compiled by a more recent version of the Java Runtime (class file version 58.65535), this version of the Java Runtime only recognizes class file versions up to 57.0\n
04:30:15 
04:30:15 --------- Difference is ----------
04:30:15  expected:<[]> but was:<[Error: LinkageError occurred while loading main class X\n
04:30:15 	java.lang.UnsupportedClassVersionError: X has been compiled by a more recent version of the Java Runtime (class file version 58.65535), this version of the Java Runtime only recognizes class file versions up to 57.0\n
04:30:15 ]>
04:30:15   SwitchExpressionsYieldTest>TestCase.runTest:964->testBug544073_063:1991->runConformTest:59->runConformTest:71->AbstractRegressionTest.access$0:3140->AbstractRegressionTest.runTest:3281->TestCase.assertEquals:242->TestCase.assertStringEquals:266 Unexpected error running resulting class file for X.java:
04:30:15 --[START]--
04:30:15 Error: LinkageError occurred while loading main class X
04:30:15 	java.lang.UnsupportedClassVersionError: X has been compiled by a more recent version of the Java Runtime (class file version 58.65535), this version of the Java Runtime only recognizes class file versions up to 57.0
04:30:15 ---[END]---
04:30:15 .
04:30:15 ----------- Expected ------------
04:30:15 
04:30:15 ------------ but was ------------
04:30:15 Error: LinkageError occurred while loading main class X\n
04:30:15 	java.lang.UnsupportedClassVersionError: X has been compiled by a more recent version of the Java Runtime (class file version 58.65535), this version of the Java Runtime only recognizes class file versions up to 57.0\n
04:30:15 
04:30:15 --------- Difference is ----------
04:30:15  expected:<[]> but was:<[Error: LinkageError occurred while loading main class X\n
04:30:15 	java.lang.UnsupportedClassVersionError: X has been compiled by a more recent version of the Java Runtime (class file version 58.65535), this version of the Java Runtime only recognizes class file versions up to 57.0\n
04:30:15 ]>
04:30:15   SwitchExpressionsYieldTest>TestCase.runTest:964->testBug544073_064:2010->runConformTest:59->runConformTest:71->AbstractRegressionTest.access$0:3140->AbstractRegressionTest.runTest:3281->TestCase.assertEquals:242->TestCase.assertStringEquals:266 Unexpected error running resulting class file for X.java:
04:30:15 --[START]--
04:30:15 Error: LinkageError occurred while loading main class X
04:30:15 	java.lang.UnsupportedClassVersionError: X has been compiled by a more recent version of the Java Runtime (class file version 58.65535), this version of the Java Runtime only recognizes class file versions up to 57.0
04:30:15 ---[END]---
04:30:15 .
04:30:15 ----------- Expected ------------
04:30:15 
04:30:15 ------------ but was ------------
04:30:15 Error: LinkageError occurred while loading main class X\n
04:30:15 	java.lang.UnsupportedClassVersionError: X has been compiled by a more recent version of the Java Runtime (class file version 58.65535), this version of the Java Runtime only recognizes class file versions up to 57.0\n
04:30:15 
04:30:15 --------- Difference is ----------
04:30:15  expected:<[]> but was:<[Error: LinkageError occurred while loading main class X\n
04:30:15 	java.lang.UnsupportedClassVersionError: X has been compiled by a more recent version of the Java Runtime (class file version 58.65535), this version of the Java Runtime only recognizes class file versions up to 57.0\n
04:30:15 ]>
04:30:15   SwitchExpressionsYieldTest>TestCase.runTest:964->testBug544073_065:2039->runConformTest:59->runConformTest:71->AbstractRegressionTest.access$0:3140->AbstractRegressionTest.runTest:3281->TestCase.assertEquals:242->TestCase.assertStringEquals:266 Unexpected error running resulting class file for X.java:
04:30:15 --[START]--
04:30:15 Error: LinkageError occurred while loading main class X
04:30:15 	java.lang.UnsupportedClassVersionError: X has been compiled by a more recent version of the Java Runtime (class file version 58.65535), this version of the Java Runtime only recognizes class file versions up to 57.0
04:30:15 ---[END]---
04:30:15 .
04:30:15 ----------- Expected ------------
04:30:15 
04:30:15 ------------ but was ------------
04:30:15 Error: LinkageError occurred while loading main class X\n
04:30:15 	java.lang.UnsupportedClassVersionError: X has been compiled by a more recent version of the Java Runtime (class file version 58.65535), this version of the Java Runtime only recognizes class file versions up to 57.0\n
04:30:15 
04:30:15 --------- Difference is ----------
04:30:15  expected:<[]> but was:<[Error: LinkageError occurred while loading main class X\n
04:30:15 	java.lang.UnsupportedClassVersionError: X has been compiled by a more recent version of the Java Runtime (class file version 58.65535), this version of the Java Runtime only recognizes class file versions up to 57.0\n
04:30:15 ]>
04:30:15   SwitchExpressionsYieldTest>TestCase.runTest:964->testBug544073_066:2063->runConformTest:59->runConformTest:71->AbstractRegressionTest.access$0:3140->AbstractRegressionTest.runTest:3281->TestCase.assertEquals:242->TestCase.assertStringEquals:266 Unexpected error running resulting class file for X.java:
04:30:15 --[START]--
04:30:15 Error: LinkageError occurred while loading main class X
04:30:15 	java.lang.UnsupportedClassVersionError: X has been compiled by a more recent version of the Java Runtime (class file version 58.65535), this version of the Java Runtime only recognizes class file versions up to 57.0
04:30:15 ---[END]---
04:30:15 .
04:30:15 ----------- Expected ------------
04:30:15 
04:30:15 ------------ but was ------------
04:30:15 Error: LinkageError occurred while loading main class X\n
04:30:15 	java.lang.UnsupportedClassVersionError: X has been compiled by a more recent version of the Java Runtime (class file version 58.65535), this version of the Java Runtime only recognizes class file versions up to 57.0\n
04:30:15 
04:30:15 --------- Difference is ----------
04:30:15  expected:<[]> but was:<[Error: LinkageError occurred while loading main class X\n
04:30:15 	java.lang.UnsupportedClassVersionError: X has been compiled by a more recent version of the Java Runtime (class file version 58.65535), this version of the Java Runtime only recognizes class file versions up to 57.0\n
04:30:15 ]>
04:30:15   SwitchExpressionsYieldTest>TestCase.runTest:964->testBug544073_067:2085->runConformTest:59->runConformTest:71->AbstractRegressionTest.access$0:3140->AbstractRegressionTest.runTest:3281->TestCase.assertEquals:242->TestCase.assertStringEquals:266 Unexpected error running resulting class file for X.java:
04:30:15 --[START]--
04:30:15 Error: LinkageError occurred while loading main class X
04:30:15 	java.lang.UnsupportedClassVersionError: X has been compiled by a more recent version of the Java Runtime (class file version 58.65535), this version of the Java Runtime only recognizes class file versions up to 57.0
04:30:15 ---[END]---
04:30:15 .
04:30:15 ----------- Expected ------------
04:30:15 
04:30:15 ------------ but was ------------
04:30:15 Error: LinkageError occurred while loading main class X\n
04:30:15 	java.lang.UnsupportedClassVersionError: X has been compiled by a more recent version of the Java Runtime (class file version 58.65535), this version of the Java Runtime only recognizes class file versions up to 57.0\n
04:30:15 
04:30:15 --------- Difference is ----------
04:30:15  expected:<[]> but was:<[Error: LinkageError occurred while loading main class X\n
04:30:15 	java.lang.UnsupportedClassVersionError: X has been compiled by a more recent version of the Java Runtime (class file version 58.65535), this version of the Java Runtime only recognizes class file versions up to 57.0\n
04:30:15 ]>
04:30:15   SwitchExpressionsYieldTest>TestCase.runTest:964->testBug544073_068:2111->runConformTest:59->runConformTest:71->AbstractRegressionTest.access$0:3140->AbstractRegressionTest.runTest:3281->TestCase.assertEquals:242->TestCase.assertStringEquals:266 Unexpected error running resulting class file for X.java:
04:30:15 --[START]--
04:30:15 Error: LinkageError occurred while loading main class X
04:30:15 	java.lang.UnsupportedClassVersionError: X has been compiled by a more recent version of the Java Runtime (class file version 58.65535), this version of the Java Runtime only recognizes class file versions up to 57.0
04:30:15 ---[END]---
04:30:15 .
04:30:15 ----------- Expected ------------
04:30:15 
04:30:15 ------------ but was ------------
04:30:15 Error: LinkageError occurred while loading main class X\n
04:30:15 	java.lang.UnsupportedClassVersionError: X has been compiled by a more recent version of the Java Runtime (class file version 58.65535), this version of the Java Runtime only recognizes class file versions up to 57.0\n
04:30:15 
04:30:15 --------- Difference is ----------
04:30:15  expected:<[]> but was:<[Error: LinkageError occurred while loading main class X\n
04:30:15 	java.lang.UnsupportedClassVersionError: X has been compiled by a more recent version of the Java Runtime (class file version 58.65535), this version of the Java Runtime only recognizes class file versions up to 57.0\n
04:30:15 ]>
04:30:15   SwitchExpressionsYieldTest>TestCase.runTest:964->testBug544073_071:2216->runWarningTest:93->AbstractRegressionTest.access$0:3140->AbstractRegressionTest.runTest:3281->TestCase.assertEquals:242->TestCase.assertStringEquals:266 Unexpected error running resulting class file for X.java:
04:30:15 --[START]--
04:30:15 Error: LinkageError occurred while loading main class X
04:30:15 	java.lang.UnsupportedClassVersionError: X has been compiled by a more recent version of the Java Runtime (class file version 58.65535), this version of the Java Runtime only recognizes class file versions up to 57.0
04:30:15 ---[END]---
04:30:15 .
04:30:15 ----------- Expected ------------
04:30:15 
04:30:15 ------------ but was ------------
04:30:15 Error: LinkageError occurred while loading main class X\n
04:30:15 	java.lang.UnsupportedClassVersionError: X has been compiled by a more recent version of the Java Runtime (class file version 58.65535), this version of the Java Runtime only recognizes class file versions up to 57.0\n
04:30:15 
04:30:15 --------- Difference is ----------
04:30:15  expected:<[]> but was:<[Error: LinkageError occurred while loading main class X\n
04:30:15 	java.lang.UnsupportedClassVersionError: X has been compiled by a more recent version of the Java Runtime (class file version 58.65535), this version of the Java Runtime only recognizes class file versions up to 57.0\n
04:30:15 ]>
04:30:15   SwitchExpressionsYieldTest>TestCase.runTest:964->testBug544073_072:2242->runWarningTest:78->runWarningTest:81->runWarningTest:93->AbstractRegressionTest.access$0:3140->AbstractRegressionTest.runTest:3281->TestCase.assertEquals:242->TestCase.assertStringEquals:266 Unexpected error running resulting class file for X.java:
04:30:15 --[START]--
04:30:15 Error: LinkageError occurred while loading main class X
04:30:15 	java.lang.UnsupportedClassVersionError: X has been compiled by a more recent version of the Java Runtime (class file version 58.65535), this version of the Java Runtime only recognizes class file versions up to 57.0
04:30:15 ---[END]---
04:30:15 .
04:30:15 ----------- Expected ------------
04:30:15 
04:30:15 ------------ but was ------------
04:30:15 Error: LinkageError occurred while loading main class X\n
04:30:15 	java.lang.UnsupportedClassVersionError: X has been compiled by a more recent version of the Java Runtime (class file version 58.65535), this version of the Java Runtime only recognizes class file versions up to 57.0\n
04:30:15 
04:30:15 --------- Difference is ----------
04:30:15  expected:<[]> but was:<[Error: LinkageError occurred while loading main class X\n
04:30:15 	java.lang.UnsupportedClassVersionError: X has been compiled by a more recent version of the Java Runtime (class file version 58.65535), this version of the Java Runtime only recognizes class file versions up to 57.0\n
04:30:15 ]>
04:30:15   SwitchExpressionsYieldTest>TestCase.runTest:964->testBug544073_074:2287->runConformTest:59->runConformTest:71->AbstractRegressionTest.access$0:3140->AbstractRegressionTest.runTest:3281->TestCase.assertEquals:242->TestCase.assertStringEquals:266 Unexpected error running resulting class file for X.java:
04:30:15 --[START]--
04:30:15 Error: LinkageError occurred while loading main class X
04:30:15 	java.lang.UnsupportedClassVersionError: X has been compiled by a more recent version of the Java Runtime (class file version 58.65535), this version of the Java Runtime only recognizes class file versions up to 57.0
04:30:15 ---[END]---
04:30:15 .
04:30:15 ----------- Expected ------------
04:30:15 
04:30:15 ------------ but was ------------
04:30:15 Error: LinkageError occurred while loading main class X\n
04:30:15 	java.lang.UnsupportedClassVersionError: X has been compiled by a more recent version of the Java Runtime (class file version 58.65535), this version of the Java Runtime only recognizes class file versions up to 57.0\n
04:30:15 
04:30:15 --------- Difference is ----------
04:30:15  expected:<[]> but was:<[Error: LinkageError occurred while loading main class X\n
04:30:15 	java.lang.UnsupportedClassVersionError: X has been compiled by a more recent version of the Java Runtime (class file version 58.65535), this version of the Java Runtime only recognizes class file versions up to 57.0\n
04:30:15 ]>
04:30:15   SwitchExpressionsYieldTest>TestCase.runTest:964->testBug544073_075:2308->runConformTest:59->runConformTest:71->AbstractRegressionTest.access$0:3140->AbstractRegressionTest.runTest:3281->TestCase.assertEquals:242->TestCase.assertStringEquals:266 Unexpected error running resulting class file for X.java:
04:30:15 --[START]--
04:30:15 Error: LinkageError occurred while loading main class X
04:30:15 	java.lang.UnsupportedClassVersionError: X has been compiled by a more recent version of the Java Runtime (class file version 58.65535), this version of the Java Runtime only recognizes class file versions up to 57.0
04:30:15 ---[END]---
04:30:15 .
04:30:15 ----------- Expected ------------
04:30:15 
04:30:15 ------------ but was ------------
04:30:15 Error: LinkageError occurred while loading main class X\n
04:30:15 	java.lang.UnsupportedClassVersionError: X has been compiled by a more recent version of the Java Runtime (class file version 58.65535), this version of the Java Runtime only recognizes class file versions up to 57.0\n
04:30:15 
04:30:15 --------- Difference is ----------
04:30:15  expected:<[]> but was:<[Error: LinkageError occurred while loading main class X\n
04:30:15 	java.lang.UnsupportedClassVersionError: X has been compiled by a more recent version of the Java Runtime (class file version 58.65535), this version of the Java Runtime only recognizes class file versions up to 57.0\n
04:30:15 ]>
04:30:15   SwitchExpressionsYieldTest>TestCase.runTest:964->testBug544073_80:2457->runConformTest:59->runConformTest:71->AbstractRegressionTest.access$0:3140->AbstractRegressionTest.runTest:3281->TestCase.assertEquals:242->TestCase.assertStringEquals:266 Unexpected error running resulting class file for X.java:
04:30:15 --[START]--
04:30:15 Error: LinkageError occurred while loading main class X
04:30:15 	java.lang.UnsupportedClassVersionError: X has been compiled by a more recent version of the Java Runtime (class file version 58.65535), this version of the Java Runtime only recognizes class file versions up to 57.0
04:30:15 ---[END]---
04:30:15 .
04:30:15 ----------- Expected ------------
04:30:15 
04:30:15 ------------ but was ------------
04:30:15 Error: LinkageError occurred while loading main class X\n
04:30:15 	java.lang.UnsupportedClassVersionError: X has been compiled by a more recent version of the Java Runtime (class file version 58.65535), this version of the Java Runtime only recognizes class file versions up to 57.0\n
04:30:15 
04:30:15 --------- Difference is ----------
04:30:15  expected:<[]> but was:<[Error: LinkageError occurred while loading main class X\n
04:30:15 	java.lang.UnsupportedClassVersionError: X has been compiled by a more recent version of the Java Runtime (class file version 58.65535), this version of the Java Runtime only recognizes class file versions up to 57.0\n
04:30:15 ]>
04:30:15   SwitchExpressionsYieldTest>TestCase.runTest:964->testBug547891_17:3036->runConformTest:59->runConformTest:71->AbstractRegressionTest.access$0:3140->AbstractRegressionTest.runTest:3281->TestCase.assertEquals:242->TestCase.assertStringEquals:266 Unexpected error running resulting class file for X.java:
04:30:15 --[START]--
04:30:15 Error: LinkageError occurred while loading main class X
04:30:15 	java.lang.UnsupportedClassVersionError: X has been compiled by a more recent version of the Java Runtime (class file version 58.65535), this version of the Java Runtime only recognizes class file versions up to 57.0
04:30:15 ---[END]---
04:30:15 .
04:30:15 ----------- Expected ------------
04:30:15 
04:30:15 ------------ but was ------------
04:30:15 Error: LinkageError occurred while loading main class X\n
04:30:15 	java.lang.UnsupportedClassVersionError: X has been compiled by a more recent version of the Java Runtime (class file version 58.65535), this version of the Java Runtime only recognizes class file versions up to 57.0\n
04:30:15 
04:30:15 --------- Difference is ----------
04:30:15  expected:<[]> but was:<[Error: LinkageError occurred while loading main class X\n
04:30:15 	java.lang.UnsupportedClassVersionError: X has been compiled by a more recent version of the Java Runtime (class file version 58.65535), this version of the Java Runtime only recognizes class file versions up to 57.0\n
04:30:15 ]>
04:30:15   SwitchExpressionsYieldTest>TestCase.runTest:964->testBug547891_18:3060->runConformTest:59->runConformTest:71->AbstractRegressionTest.access$0:3140->AbstractRegressionTest.runTest:3281->TestCase.assertEquals:242->TestCase.assertStringEquals:266 Unexpected error running resulting class file for X.java:
04:30:15 --[START]--
04:30:15 Error: LinkageError occurred while loading main class X
04:30:15 	java.lang.UnsupportedClassVersionError: X has been compiled by a more recent version of the Java Runtime (class file version 58.65535), this version of the Java Runtime only recognizes class file versions up to 57.0
04:30:15 ---[END]---
04:30:15 .
04:30:15 ----------- Expected ------------
04:30:15 
04:30:15 ------------ but was ------------
04:30:15 Error: LinkageError occurred while loading main class X\n
04:30:15 	java.lang.UnsupportedClassVersionError: X has been compiled by a more recent version of the Java Runtime (class file version 58.65535), this version of the Java Runtime only recognizes class file versions up to 57.0\n
04:30:15 
04:30:15 --------- Difference is ----------
04:30:15  expected:<[]> but was:<[Error: LinkageError occurred while loading main class X\n
04:30:15 	java.lang.UnsupportedClassVersionError: X has been compiled by a more recent version of the Java Runtime (class file version 58.65535), this version of the Java Runtime only recognizes class file versions up to 57.0\n
04:30:15 ]>
04:30:15   SwitchExpressionsYieldTest>TestCase.runTest:964->testBug547891_19:3084->runConformTest:59->runConformTest:71->AbstractRegressionTest.access$0:3140->AbstractRegressionTest.runTest:3281->TestCase.assertEquals:242->TestCase.assertStringEquals:266 Unexpected error running resulting class file for X.java:
04:30:15 --[START]--
04:30:15 Error: LinkageError occurred while loading main class X
04:30:15 	java.lang.UnsupportedClassVersionError: X has been compiled by a more recent version of the Java Runtime (class file version 58.65535), this version of the Java Runtime only recognizes class file versions up to 57.0
04:30:15 ---[END]---
04:30:15 .
04:30:15 ----------- Expected ------------
04:30:15 
04:30:15 ------------ but was ------------
04:30:15 Error: LinkageError occurred while loading main class X\n
04:30:15 	java.lang.UnsupportedClassVersionError: X has been compiled by a more recent version of the Java Runtime (class file version 58.65535), this version of the Java Runtime only recognizes class file versions up to 57.0\n
04:30:15 
04:30:15 --------- Difference is ----------
04:30:15  expected:<[]> but was:<[Error: LinkageError occurred while loading main class X\n
04:30:15 	java.lang.UnsupportedClassVersionError: X has been compiled by a more recent version of the Java Runtime (class file version 58.65535), this version of the Java Runtime only recognizes class file versions up to 57.0\n
04:30:15 ]>
04:30:15   SwitchExpressionsYieldTest>TestCase.runTest:964->testBug547891_20:3108->runConformTest:59->runConformTest:71->AbstractRegressionTest.access$0:3140->AbstractRegressionTest.runTest:3281->TestCase.assertEquals:242->TestCase.assertStringEquals:266 Unexpected error running resulting class file for X.java:
04:30:15 --[START]--
04:30:15 Error: LinkageError occurred while loading main class X
04:30:15 	java.lang.UnsupportedClassVersionError: X has been compiled by a more recent version of the Java Runtime (class file version 58.65535), this version of the Java Runtime only recognizes class file versions up to 57.0
04:30:15 ---[END]---
04:30:15 .
04:30:15 ----------- Expected ------------
04:30:15 
04:30:15 ------------ but was ------------
04:30:15 Error: LinkageError occurred while loading main class X\n
04:30:15 	java.lang.UnsupportedClassVersionError: X has been compiled by a more recent version of the Java Runtime (class file version 58.65535), this version of the Java Runtime only recognizes class file versions up to 57.0\n
04:30:15 
04:30:15 --------- Difference is ----------
04:30:15  expected:<[]> but was:<[Error: LinkageError occurred while loading main class X\n
04:30:15 	java.lang.UnsupportedClassVersionError: X has been compiled by a more recent version of the Java Runtime (class file version 58.65535), this version of the Java Runtime only recognizes class file versions up to 57.0\n
04:30:15 ]>
04:30:15   SwitchExpressionsYieldTest>TestCase.runTest:964->testBug547891_22:3172->runConformTest:59->runConformTest:71->AbstractRegressionTest.access$0:3140->AbstractRegressionTest.runTest:3281->TestCase.assertEquals:242->TestCase.assertStringEquals:266 Unexpected error running resulting class file for X.java:
04:30:15 --[START]--
04:30:15 Error: LinkageError occurred while loading main class X
04:30:15 	java.lang.UnsupportedClassVersionError: X has been compiled by a more recent version of the Java Runtime (class file version 58.65535), this version of the Java Runtime only recognizes class file versions up to 57.0
04:30:15 ---[END]---
04:30:15 .
04:30:15 ----------- Expected ------------
04:30:15 
04:30:15 ------------ but was ------------
04:30:15 Error: LinkageError occurred while loading main class X\n
04:30:15 	java.lang.UnsupportedClassVersionError: X has been compiled by a more recent version of the Java Runtime (class file version 58.65535), this version of the Java Runtime only recognizes class file versions up to 57.0\n
04:30:15 
04:30:15 --------- Difference is ----------
04:30:15  expected:<[]> but was:<[Error: LinkageError occurred while loading main class X\n
04:30:15 	java.lang.UnsupportedClassVersionError: X has been compiled by a more recent version of the Java Runtime (class file version 58.65535), this version of the Java Runtime only recognizes class file versions up to 57.0\n
04:30:15 ]>
04:30:15   SwitchExpressionsYieldTest>TestCase.runTest:964->testBug547891_23:3200->runConformTest:59->runConformTest:71->AbstractRegressionTest.access$0:3140->AbstractRegressionTest.runTest:3281->TestCase.assertEquals:242->TestCase.assertStringEquals:266 Unexpected error running resulting class file for X.java:
04:30:15 --[START]--
04:30:15 Error: LinkageError occurred while loading main class X
04:30:15 	java.lang.UnsupportedClassVersionError: X has been compiled by a more recent version of the Java Runtime (class file version 58.65535), this version of the Java Runtime only recognizes class file versions up to 57.0
04:30:15 ---[END]---
04:30:15 .
04:30:15 ----------- Expected ------------
04:30:15 
04:30:15 ------------ but was ------------
04:30:15 Error: LinkageError occurred while loading main class X\n
04:30:15 	java.lang.UnsupportedClassVersionError: X has been compiled by a more recent version of the Java Runtime (class file version 58.65535), this version of the Java Runtime only recognizes class file versions up to 57.0\n
04:30:15 
04:30:15 --------- Difference is ----------
04:30:15  expected:<[]> but was:<[Error: LinkageError occurred while loading main class X\n
04:30:15 	java.lang.UnsupportedClassVersionError: X has been compiled by a more recent version of the Java Runtime (class file version 58.65535), this version of the Java Runtime only recognizes class file versions up to 57.0\n
04:30:15 ]>
04:30:15   SwitchExpressionsYieldTest>TestCase.runTest:964->testBug547891_24:3229->runConformTest:59->runConformTest:71->AbstractRegressionTest.access$0:3140->AbstractRegressionTest.runTest:3281->TestCase.assertEquals:242->TestCase.assertStringEquals:266 Unexpected error running resulting class file for X.java:
04:30:15 --[START]--
04:30:15 Error: LinkageError occurred while loading main class X
04:30:15 	java.lang.UnsupportedClassVersionError: X has been compiled by a more recent version of the Java Runtime (class file version 58.65535), this version of the Java Runtime only recognizes class file versions up to 57.0
04:30:15 ---[END]---
04:30:15 .
04:30:15 ----------- Expected ------------
04:30:15 
04:30:15 ------------ but was ------------
04:30:15 Error: LinkageError occurred while loading main class X\n
04:30:15 	java.lang.UnsupportedClassVersionError: X has been compiled by a more recent version of the Java Runtime (class file version 58.65535), this version of the Java Runtime only recognizes class file versions up to 57.0\n
04:30:15 
04:30:15 --------- Difference is ----------
04:30:15  expected:<[]> but was:<[Error: LinkageError occurred while loading main class X\n
04:30:15 	java.lang.UnsupportedClassVersionError: X has been compiled by a more recent version of the Java Runtime (class file version 58.65535), this version of the Java Runtime only recognizes class file versions up to 57.0\n
04:30:15 ]>
04:30:15   SwitchExpressionsYieldTest>TestCase.runTest:964->testBug547891_25:3250->runConformTest:59->runConformTest:71->AbstractRegressionTest.access$0:3140->AbstractRegressionTest.runTest:3281->TestCase.assertEquals:242->TestCase.assertStringEquals:266 Unexpected error running resulting class file for X.java:
04:30:15 --[START]--
04:30:15 Error: LinkageError occurred while loading main class X
04:30:15 	java.lang.UnsupportedClassVersionError: X has been compiled by a more recent version of the Java Runtime (class file version 58.65535), this version of the Java Runtime only recognizes class file versions up to 57.0
04:30:15 ---[END]---
04:30:15 .
04:30:15 ----------- Expected ------------
04:30:15 
04:30:15 ------------ but was ------------
04:30:15 Error: LinkageError occurred while loading main class X\n
04:30:15 	java.lang.UnsupportedClassVersionError: X has been compiled by a more recent version of the Java Runtime (class file version 58.65535), this version of the Java Runtime only recognizes class file versions up to 57.0\n
04:30:15 
04:30:15 --------- Difference is ----------
04:30:15  expected:<[]> but was:<[Error: LinkageError occurred while loading main class X\n
04:30:15 	java.lang.UnsupportedClassVersionError: X has been compiled by a more recent version of the Java Runtime (class file version 58.65535), this version of the Java Runtime only recognizes class file versions up to 57.0\n
04:30:15 ]>
04:30:15   SwitchExpressionsYieldTest>TestCase.runTest:964->testBug547891_26:3271->runConformTest:59->runConformTest:71->AbstractRegressionTest.access$0:3140->AbstractRegressionTest.runTest:3281->TestCase.assertEquals:242->TestCase.assertStringEquals:266 Unexpected error running resulting class file for X.java:
04:30:15 --[START]--
04:30:15 Error: LinkageError occurred while loading main class X
04:30:15 	java.lang.UnsupportedClassVersionError: X has been compiled by a more recent version of the Java Runtime (class file version 58.65535), this version of the Java Runtime only recognizes class file versions up to 57.0
04:30:15 ---[END]---
04:30:15 .
04:30:15 ----------- Expected ------------
04:30:15 
04:30:15 ------------ but was ------------
04:30:15 Error: LinkageError occurred while loading main class X\n
04:30:15 	java.lang.UnsupportedClassVersionError: X has been compiled by a more recent version of the Java Runtime (class file version 58.65535), this version of the Java Runtime only recognizes class file versions up to 57.0\n
04:30:15 
04:30:15 --------- Difference is ----------
04:30:15  expected:<[]> but was:<[Error: LinkageError occurred while loading main class X\n
04:30:15 	java.lang.UnsupportedClassVersionError: X has been compiled by a more recent version of the Java Runtime (class file version 58.65535), this version of the Java Runtime only recognizes class file versions up to 57.0\n
04:30:15 ]>
04:30:15   SwitchExpressionsYieldTest>TestCase.runTest:964->testBug547891_27:3292->runConformTest:59->runConformTest:71->AbstractRegressionTest.access$0:3140->AbstractRegressionTest.runTest:3281->TestCase.assertEquals:242->TestCase.assertStringEquals:266 Unexpected error running resulting class file for X.java:
04:30:15 --[START]--
04:30:15 Error: LinkageError occurred while loading main class X
04:30:15 	java.lang.UnsupportedClassVersionError: X has been compiled by a more recent version of the Java Runtime (class file version 58.65535), this version of the Java Runtime only recognizes class file versions up to 57.0
04:30:15 ---[END]---
04:30:15 .
04:30:15 ----------- Expected ------------
04:30:15 
04:30:15 ------------ but was ------------
04:30:15 Error: LinkageError occurred while loading main class X\n
04:30:15 	java.lang.UnsupportedClassVersionError: X has been compiled by a more recent version of the Java Runtime (class file version 58.65535), this version of the Java Runtime only recognizes class file versions up to 57.0\n
04:30:15 
04:30:15 --------- Difference is ----------
04:30:15  expected:<[]> but was:<[Error: LinkageError occurred while loading main class X\n
04:30:15 	java.lang.UnsupportedClassVersionError: X has been compiled by a more recent version of the Java Runtime (class file version 58.65535), this version of the Java Runtime only recognizes class file versions up to 57.0\n
04:30:15 ]>
04:30:15   SwitchExpressionsYieldTest>TestCase.runTest:964->testBug547891_28:3313->runConformTest:59->runConformTest:71->AbstractRegressionTest.access$0:3140->AbstractRegressionTest.runTest:3281->TestCase.assertEquals:242->TestCase.assertStringEquals:266 Unexpected error running resulting class file for X.java:
04:30:15 --[START]--
04:30:15 Error: LinkageError occurred while loading main class X
04:30:15 	java.lang.UnsupportedClassVersionError: X has been compiled by a more recent version of the Java Runtime (class file version 58.65535), this version of the Java Runtime only recognizes class file versions up to 57.0
04:30:15 ---[END]---
04:30:15 .
04:30:15 ----------- Expected ------------
04:30:15 
04:30:15 ------------ but was ------------
04:30:15 Error: LinkageError occurred while loading main class X\n
04:30:15 	java.lang.UnsupportedClassVersionError: X has been compiled by a more recent version of the Java Runtime (class file version 58.65535), this version of the Java Runtime only recognizes class file versions up to 57.0\n
04:30:15 
04:30:15 --------- Difference is ----------
04:30:15  expected:<[]> but was:<[Error: LinkageError occurred while loading main class X\n
04:30:15 	java.lang.UnsupportedClassVersionError: X has been compiled by a more recent version of the Java Runtime (class file version 58.65535), this version of the Java Runtime only recognizes class file versions up to 57.0\n
04:30:15 ]>
04:30:15   SwitchExpressionsYieldTest>TestCase.runTest:964->testBug547891_29:3335->runConformTest:59->runConformTest:71->AbstractRegressionTest.access$0:3140->AbstractRegressionTest.runTest:3281->TestCase.assertEquals:242->TestCase.assertStringEquals:266 Unexpected error running resulting class file for X.java:
04:30:15 --[START]--
04:30:15 Error: LinkageError occurred while loading main class X
04:30:15 	java.lang.UnsupportedClassVersionError: X has been compiled by a more recent version of the Java Runtime (class file version 58.65535), this version of the Java Runtime only recognizes class file versions up to 57.0
04:30:15 ---[END]---
04:30:15 .
04:30:15 ----------- Expected ------------
04:30:15 
04:30:15 ------------ but was ------------
04:30:15 Error: LinkageError occurred while loading main class X\n
04:30:15 	java.lang.UnsupportedClassVersionError: X has been compiled by a more recent version of the Java Runtime (class file version 58.65535), this version of the Java Runtime only recognizes class file versions up to 57.0\n
04:30:15 
04:30:15 --------- Difference is ----------
04:30:15  expected:<[]> but was:<[Error: LinkageError occurred while loading main class X\n
04:30:15 	java.lang.UnsupportedClassVersionError: X has been compiled by a more recent version of the Java Runtime (class file version 58.65535), this version of the Java Runtime only recognizes class file versions up to 57.0\n
04:30:15 ]>
04:30:15   SwitchExpressionsYieldTest>TestCase.runTest:964->testBug548418_01:3377->runConformTest:59->runConformTest:71->AbstractRegressionTest.access$0:3140->AbstractRegressionTest.runTest:3281->TestCase.assertEquals:242->TestCase.assertStringEquals:266 Unexpected error running resulting class file for X.java:
04:30:15 --[START]--
04:30:15 Error: LinkageError occurred while loading main class X
04:30:15 	java.lang.UnsupportedClassVersionError: X has been compiled by a more recent version of the Java Runtime (class file version 58.65535), this version of the Java Runtime only recognizes class file versions up to 57.0
04:30:15 ---[END]---
04:30:15 .
04:30:15 ----------- Expected ------------
04:30:15 
04:30:15 ------------ but was ------------
04:30:15 Error: LinkageError occurred while loading main class X\n
04:30:15 	java.lang.UnsupportedClassVersionError: X has been compiled by a more recent version of the Java Runtime (class file version 58.65535), this version of the Java Runtime only recognizes class file versions up to 57.0\n
04:30:15 
04:30:15 --------- Difference is ----------
04:30:15  expected:<[]> but was:<[Error: LinkageError occurred while loading main class X\n
04:30:15 	java.lang.UnsupportedClassVersionError: X has been compiled by a more recent version of the Java Runtime (class file version 58.65535), this version of the Java Runtime only recognizes class file versions up to 57.0\n
04:30:15 ]>
04:30:15   SwitchExpressionsYieldTest>TestCase.runTest:964->testBug550354_01:3357->runConformTest:59->runConformTest:71->AbstractRegressionTest.access$0:3140->AbstractRegressionTest.runTest:3281->TestCase.assertEquals:242->TestCase.assertStringEquals:266 Unexpected error running resulting class file for X.java:
04:30:15 --[START]--
04:30:15 Error: LinkageError occurred while loading main class X
04:30:15 	java.lang.UnsupportedClassVersionError: X has been compiled by a more recent version of the Java Runtime (class file version 58.65535), this version of the Java Runtime only recognizes class file versions up to 57.0
04:30:15 ---[END]---
04:30:15 .
04:30:15 ----------- Expected ------------
04:30:15 
04:30:15 ------------ but was ------------
04:30:15 Error: LinkageError occurred while loading main class X\n
04:30:15 	java.lang.UnsupportedClassVersionError: X has been compiled by a more recent version of the Java Runtime (class file version 58.65535), this version of the Java Runtime only recognizes class file versions up to 57.0\n
04:30:15 
04:30:15 --------- Difference is ----------
04:30:15  expected:<[]> but was:<[Error: LinkageError occurred while loading main class X\n
04:30:15 	java.lang.UnsupportedClassVersionError: X has been compiled by a more recent version of the Java Runtime (class file version 58.65535), this version of the Java Runtime only recognizes class file versions up to 57.0\n
04:30:15 ]>
04:30:15   SwitchExpressionsYieldTest>TestCase.runTest:964->testBug550853_01:3399->runConformTest:59->runConformTest:71->AbstractRegressionTest.access$0:3140->AbstractRegressionTest.runTest:3281->TestCase.assertEquals:242->TestCase.assertStringEquals:266 Unexpected error running resulting class file for X.java:
04:30:15 --[START]--
04:30:15 Error: LinkageError occurred while loading main class X
04:30:15 	java.lang.UnsupportedClassVersionError: X has been compiled by a more recent version of the Java Runtime (class file version 58.65535), this version of the Java Runtime only recognizes class file versions up to 57.0
04:30:15 ---[END]---
04:30:15 .
04:30:15 ----------- Expected ------------
04:30:15 
04:30:15 ------------ but was ------------
04:30:15 Error: LinkageError occurred while loading main class X\n
04:30:15 	java.lang.UnsupportedClassVersionError: X has been compiled by a more recent version of the Java Runtime (class file version 58.65535), this version of the Java Runtime only recognizes class file versions up to 57.0\n
04:30:15 
04:30:15 --------- Difference is ----------
04:30:15  expected:<[]> but was:<[Error: LinkageError occurred while loading main class X\n
04:30:15 	java.lang.UnsupportedClassVersionError: X has been compiled by a more recent version of the Java Runtime (class file version 58.65535), this version of the Java Runtime only recognizes class file versions up to 57.0\n
04:30:15 ]>
04:30:15   SwitchExpressionsYieldTest>TestCase.runTest:964->testBug550861_01:3421->runConformTest:59->runConformTest:71->AbstractRegressionTest.access$0:3140->AbstractRegressionTest.runTest:3281->TestCase.assertEquals:242->TestCase.assertStringEquals:266 Unexpected error running resulting class file for X.java:
04:30:15 --[START]--
04:30:15 Error: LinkageError occurred while loading main class X
04:30:15 	java.lang.UnsupportedClassVersionError: X has been compiled by a more recent version of the Java Runtime (class file version 58.65535), this version of the Java Runtime only recognizes class file versions up to 57.0
04:30:15 ---[END]---
04:30:15 .
04:30:15 ----------- Expected ------------
04:30:15 
04:30:15 ------------ but was ------------
04:30:15 Error: LinkageError occurred while loading main class X\n
04:30:15 	java.lang.UnsupportedClassVersionError: X has been compiled by a more recent version of the Java Runtime (class file version 58.65535), this version of the Java Runtime only recognizes class file versions up to 57.0\n
04:30:15 
04:30:15 --------- Difference is ----------
04:30:15  expected:<[]> but was:<[Error: LinkageError occurred while loading main class X\n
04:30:15 	java.lang.UnsupportedClassVersionError: X has been compiled by a more recent version of the Java Runtime (class file version 58.65535), this version of the Java Runtime only recognizes class file versions up to 57.0\n
04:30:15 ]>
04:30:15 
04:30:15 Tests run: 40927, Failures: 67, Errors: 0, Skipped: 0
04:30:15 
04:30:16 [INFO] ------------------------------------------------------------------------
04:30:16 [INFO] Reactor Summary:
04:30:16 [INFO] 
04:30:16 [INFO] eclipse.jdt.core 4.14.0-SNAPSHOT ................... SUCCESS [ 25.909 s]
04:30:16 [INFO] org.eclipse.jdt.annotation 2.2.300-SNAPSHOT ........ SUCCESS [01:10 min]
04:30:16 [INFO] org.eclipse.jdt.annotation 1.1.400-SNAPSHOT ........ SUCCESS [  9.341 s]
04:30:16 [INFO] org.eclipse.jdt.core 3.20.0-SNAPSHOT ............... SUCCESS [ 54.133 s]
04:30:16 [INFO] org.eclipse.jdt.compiler.tool 1.2.550-SNAPSHOT ..... SUCCESS [  9.732 s]
04:30:16 [INFO] org.eclipse.jdt.compiler.apt 1.3.800-SNAPSHOT ...... SUCCESS [  9.865 s]
04:30:16 [INFO] org.eclipse.jdt.core.tests.compiler 3.12.1000-SNAPSHOT FAILURE [08:34 min]
04:30:16 [INFO] org.eclipse.jdt.compiler.tool.tests 1.2.550-SNAPSHOT SKIPPED
04:30:16 [INFO] org.eclipse.jdt.core.tests.builder 3.10.750-SNAPSHOT SKIPPED
04:30:16 [INFO] org.eclipse.jdt.compiler.apt.tests 1.1.850-SNAPSHOT  SKIPPED
04:30:16 [INFO] org.eclipse.jdt.core.tests.model 3.10.1000-SNAPSHOT  SKIPPED
04:30:16 [INFO] org.eclipse.jdt.core.tests.performance 3.10.650-SNAPSHOT SKIPPED
04:30:16 [INFO] org.eclipse.jdt.apt.core 3.6.550-SNAPSHOT .......... SKIPPED
04:30:16 [INFO] org.eclipse.jdt.apt.pluggable.core 1.2.400-SNAPSHOT  SKIPPED
04:30:16 [INFO] org.eclipse.jdt.apt.ui 3.6.300-SNAPSHOT ............ SKIPPED
04:30:16 [INFO] org.eclipse.jdt.apt.pluggable.tests 3.4.600-SNAPSHOT SKIPPED
04:30:16 [INFO] org.eclipse.jdt.apt.tests 3.4.550-SNAPSHOT ......... SKIPPED
04:30:16 [INFO] ------------------------------------------------------------------------
04:30:16 [INFO] BUILD FAILURE
04:30:16 [INFO] ------------------------------------------------------------------------
04:30:16 [INFO] Total time:  14:04 min
04:30:16 [INFO] Finished at: 2019-10-11T08:30:16Z
04:30:16 [INFO] ------------------------------------------------------------------------
04:30:16 [ERROR] Failed to execute goal org.eclipse.tycho:tycho-surefire-plugin:1.5.0-SNAPSHOT:test (default-test) on project org.eclipse.jdt.core.tests.compiler: There are test failures.
04:30:16 [ERROR] 
04:30:16 [ERROR] Please refer to /home/jenkins/agent/workspace/eclipse.jdt.core-Gerrit-BETA/org.eclipse.jdt.core.tests.compiler/target/surefire-reports for the individual test results.
04:30:16 [ERROR] -> [Help 1]
04:30:16 [ERROR] 
04:30:16 [ERROR] To see the full stack trace of the errors, re-run Maven with the -e switch.
04:30:16 [ERROR] Re-run Maven using the -X switch to enable full debug logging.
04:30:16 [ERROR] 
04:30:16 [ERROR] For more information about the errors and possible solutions, please read the following articles:
04:30:16 [ERROR] [Help 1] http://cwiki.apache.org/confluence/display/MAVEN/MojoFailureException
04:30:16 [ERROR] 
04:30:16 [ERROR] After correcting the problems, you can resume the build with the command
04:30:16 [ERROR]   mvn <goals> -rf :org.eclipse.jdt.core.tests.compiler
04:30:19 Build step 'Invoke top-level Maven targets' marked build as failure
04:30:20 Recording test results
04:30:23 Archiving artifacts
04:30:24 Finished: FAILURE