FailedConsole Output

Skipping 5,325 KB.. Full Log
01 s
04:27:49 test0002 - 13(org.eclipse.jdt.core.tests.compiler.parser.AnnotationDietRecoveryTest)  Time elapsed: 0.001 s
04:27:49 test0003 - 13(org.eclipse.jdt.core.tests.compiler.parser.AnnotationDietRecoveryTest)  Time elapsed: 0.003 s
04:27:49 test0004 - 13(org.eclipse.jdt.core.tests.compiler.parser.AnnotationDietRecoveryTest)  Time elapsed: 0.002 s
04:27:49 test0005 - 13(org.eclipse.jdt.core.tests.compiler.parser.AnnotationDietRecoveryTest)  Time elapsed: 0.002 s
04:27:49 test0006 - 13(org.eclipse.jdt.core.tests.compiler.parser.AnnotationDietRecoveryTest)  Time elapsed: 0.003 s
04:27:49 test0007 - 13(org.eclipse.jdt.core.tests.compiler.parser.AnnotationDietRecoveryTest)  Time elapsed: 0.002 s
04:27:49 test0008 - 13(org.eclipse.jdt.core.tests.compiler.parser.AnnotationDietRecoveryTest)  Time elapsed: 0.003 s
04:27:49 test0009 - 13(org.eclipse.jdt.core.tests.compiler.parser.AnnotationDietRecoveryTest)  Time elapsed: 0.004 s
04:27:49 test0010 - 13(org.eclipse.jdt.core.tests.compiler.parser.AnnotationDietRecoveryTest)  Time elapsed: 0.002 s
04:27:49 test0011 - 13(org.eclipse.jdt.core.tests.compiler.parser.AnnotationDietRecoveryTest)  Time elapsed: 0.002 s
04:27:49 test0012 - 13(org.eclipse.jdt.core.tests.compiler.parser.AnnotationDietRecoveryTest)  Time elapsed: 0.004 s
04:27:49 test0013 - 13(org.eclipse.jdt.core.tests.compiler.parser.AnnotationDietRecoveryTest)  Time elapsed: 0.001 s
04:27:49 test0014 - 13(org.eclipse.jdt.core.tests.compiler.parser.AnnotationDietRecoveryTest)  Time elapsed: 0.002 s
04:27:49 test0015 - 13(org.eclipse.jdt.core.tests.compiler.parser.AnnotationDietRecoveryTest)  Time elapsed: 0.001 s
04:27:49 test0016 - 13(org.eclipse.jdt.core.tests.compiler.parser.AnnotationDietRecoveryTest)  Time elapsed: 0.005 s
04:27:49 test0017 - 13(org.eclipse.jdt.core.tests.compiler.parser.AnnotationDietRecoveryTest)  Time elapsed: 0.004 s
04:27:49 test0018 - 13(org.eclipse.jdt.core.tests.compiler.parser.AnnotationDietRecoveryTest)  Time elapsed: 0.004 s
04:27:49 test0019 - 13(org.eclipse.jdt.core.tests.compiler.parser.AnnotationDietRecoveryTest)  Time elapsed: 0.003 s
04:27:49 test0020 - 13(org.eclipse.jdt.core.tests.compiler.parser.AnnotationDietRecoveryTest)  Time elapsed: 0.006 s
04:27:49 test0021 - 13(org.eclipse.jdt.core.tests.compiler.parser.AnnotationDietRecoveryTest)  Time elapsed: 0.005 s
04:27:49 test0022 - 13(org.eclipse.jdt.core.tests.compiler.parser.AnnotationDietRecoveryTest)  Time elapsed: 0.005 s
04:27:49 test0023 - 13(org.eclipse.jdt.core.tests.compiler.parser.AnnotationDietRecoveryTest)  Time elapsed: 0.005 s
04:27:49 test0024 - 13(org.eclipse.jdt.core.tests.compiler.parser.AnnotationDietRecoveryTest)  Time elapsed: 0.005 s
04:27:49 test0025 - 13(org.eclipse.jdt.core.tests.compiler.parser.AnnotationDietRecoveryTest)  Time elapsed: 0.004 s
04:27:49 test0026 - 13(org.eclipse.jdt.core.tests.compiler.parser.AnnotationDietRecoveryTest)  Time elapsed: 0.002 s
04:27:49 test0027 - 13(org.eclipse.jdt.core.tests.compiler.parser.AnnotationDietRecoveryTest)  Time elapsed: 0.003 s
04:27:49 test0028 - 13(org.eclipse.jdt.core.tests.compiler.parser.AnnotationDietRecoveryTest)  Time elapsed: 0.002 s
04:27:49 test0030 - 13(org.eclipse.jdt.core.tests.compiler.parser.AnnotationDietRecoveryTest)  Time elapsed: 0.003 s
04:27:49 test0031 - 13(org.eclipse.jdt.core.tests.compiler.parser.AnnotationDietRecoveryTest)  Time elapsed: 0.005 s
04:27:49 test0032 - 13(org.eclipse.jdt.core.tests.compiler.parser.AnnotationDietRecoveryTest)  Time elapsed: 0.003 s
04:27:49 test0033 - 13(org.eclipse.jdt.core.tests.compiler.parser.AnnotationDietRecoveryTest)  Time elapsed: 0.003 s
04:27:49 test0034 - 13(org.eclipse.jdt.core.tests.compiler.parser.AnnotationDietRecoveryTest)  Time elapsed: 0.003 s
04:27:49 test0035 - 13(org.eclipse.jdt.core.tests.compiler.parser.AnnotationDietRecoveryTest)  Time elapsed: 0.003 s
04:27:49 test0036 - 13(org.eclipse.jdt.core.tests.compiler.parser.AnnotationDietRecoveryTest)  Time elapsed: 0.002 s
04:27:49 test0037 - 13(org.eclipse.jdt.core.tests.compiler.parser.AnnotationDietRecoveryTest)  Time elapsed: 0.002 s
04:27:49 test0038 - 13(org.eclipse.jdt.core.tests.compiler.parser.AnnotationDietRecoveryTest)  Time elapsed: 0.004 s
04:27:49 test0039 - 13(org.eclipse.jdt.core.tests.compiler.parser.AnnotationDietRecoveryTest)  Time elapsed: 0.001 s
04:27:49 test0040 - 13(org.eclipse.jdt.core.tests.compiler.parser.AnnotationDietRecoveryTest)  Time elapsed: 0.001 s
04:27:49 test0041 - 13(org.eclipse.jdt.core.tests.compiler.parser.AnnotationDietRecoveryTest)  Time elapsed: 0.003 s
04:27:49 test0001 - 13(org.eclipse.jdt.core.tests.compiler.parser.StatementRecoveryTest_1_5)  Time elapsed: 0.003 s
04:27:49 test0002 - 13(org.eclipse.jdt.core.tests.compiler.parser.StatementRecoveryTest_1_5)  Time elapsed: 0.004 s
04:27:49 test0003 - 13(org.eclipse.jdt.core.tests.compiler.parser.StatementRecoveryTest_1_5)  Time elapsed: 0.004 s
04:27:49 test0004 - 13(org.eclipse.jdt.core.tests.compiler.parser.StatementRecoveryTest_1_5)  Time elapsed: 0.004 s
04:27:49 test0005 - 13(org.eclipse.jdt.core.tests.compiler.parser.StatementRecoveryTest_1_5)  Time elapsed: 0.004 s
04:27:49 test0006 - 13(org.eclipse.jdt.core.tests.compiler.parser.StatementRecoveryTest_1_5)  Time elapsed: 0.003 s
04:27:49 test0007 - 13(org.eclipse.jdt.core.tests.compiler.parser.StatementRecoveryTest_1_5)  Time elapsed: 0.004 s
04:27:49 test0008 - 13(org.eclipse.jdt.core.tests.compiler.parser.StatementRecoveryTest_1_5)  Time elapsed: 0.002 s
04:27:49 test0001 - 13(org.eclipse.jdt.core.tests.compiler.parser.ParserTest1_7)  Time elapsed: 0.001 s
04:27:49 test0002 - 13(org.eclipse.jdt.core.tests.compiler.parser.ParserTest1_7)  Time elapsed: 0.001 s
04:27:49 test0003 - 13(org.eclipse.jdt.core.tests.compiler.parser.ParserTest1_7)  Time elapsed: 0.001 s
04:27:49 test0004 - 13(org.eclipse.jdt.core.tests.compiler.parser.ParserTest1_7)  Time elapsed: 0.001 s
04:27:49 test0005 - 13(org.eclipse.jdt.core.tests.compiler.parser.ParserTest1_7)  Time elapsed: 0.001 s
04:27:49 test0006 - 13(org.eclipse.jdt.core.tests.compiler.parser.ParserTest1_7)  Time elapsed: 0.001 s
04:27:49 test0007 - 13(org.eclipse.jdt.core.tests.compiler.parser.ParserTest1_7)  Time elapsed: 0.001 s
04:27:49 test0008 - 13(org.eclipse.jdt.core.tests.compiler.parser.ParserTest1_7)  Time elapsed: 0.001 s
04:27:49 test0009 - 13(org.eclipse.jdt.core.tests.compiler.parser.ParserTest1_7)  Time elapsed: 0.001 s
04:27:49 test0010 - 13(org.eclipse.jdt.core.tests.compiler.parser.ParserTest1_7)  Time elapsed: 0.001 s
04:27:49 test0011 - 13(org.eclipse.jdt.core.tests.compiler.parser.ParserTest1_7)  Time elapsed: 0.001 s
04:27:49 test0012 - 13(org.eclipse.jdt.core.tests.compiler.parser.ParserTest1_7)  Time elapsed: 0.001 s
04:27:49 test0001 - 13(org.eclipse.jdt.core.tests.compiler.parser.LambdaExpressionSyntaxTest)  Time elapsed: 0.001 s
04:27:49 test00010 - 13(org.eclipse.jdt.core.tests.compiler.parser.LambdaExpressionSyntaxTest)  Time elapsed: 0 s
04:27:49 test0002 - 13(org.eclipse.jdt.core.tests.compiler.parser.LambdaExpressionSyntaxTest)  Time elapsed: 0 s
04:27:49 test0003 - 13(org.eclipse.jdt.core.tests.compiler.parser.LambdaExpressionSyntaxTest)  Time elapsed: 0 s
04:27:49 test0004 - 13(org.eclipse.jdt.core.tests.compiler.parser.LambdaExpressionSyntaxTest)  Time elapsed: 0 s
04:27:49 test0005 - 13(org.eclipse.jdt.core.tests.compiler.parser.LambdaExpressionSyntaxTest)  Time elapsed: 0.001 s
04:27:49 test0006 - 13(org.eclipse.jdt.core.tests.compiler.parser.LambdaExpressionSyntaxTest)  Time elapsed: 0 s
04:27:49 test0007 - 13(org.eclipse.jdt.core.tests.compiler.parser.LambdaExpressionSyntaxTest)  Time elapsed: 0 s
04:27:49 test0008 - 13(org.eclipse.jdt.core.tests.compiler.parser.LambdaExpressionSyntaxTest)  Time elapsed: 0 s
04:27:49 test0009 - 13(org.eclipse.jdt.core.tests.compiler.parser.LambdaExpressionSyntaxTest)  Time elapsed: 0.001 s
04:27:49 test0011 - 13(org.eclipse.jdt.core.tests.compiler.parser.LambdaExpressionSyntaxTest)  Time elapsed: 0 s
04:27:49 test0012 - 13(org.eclipse.jdt.core.tests.compiler.parser.LambdaExpressionSyntaxTest)  Time elapsed: 0 s
04:27:49 test0013 - 13(org.eclipse.jdt.core.tests.compiler.parser.LambdaExpressionSyntaxTest)  Time elapsed: 0.001 s
04:27:49 test0014 - 13(org.eclipse.jdt.core.tests.compiler.parser.LambdaExpressionSyntaxTest)  Time elapsed: 0 s
04:27:49 test0015 - 13(org.eclipse.jdt.core.tests.compiler.parser.LambdaExpressionSyntaxTest)  Time elapsed: 0 s
04:27:49 test0016 - 13(org.eclipse.jdt.core.tests.compiler.parser.LambdaExpressionSyntaxTest)  Time elapsed: 0 s
04:27:49 test0017 - 13(org.eclipse.jdt.core.tests.compiler.parser.LambdaExpressionSyntaxTest)  Time elapsed: 0.001 s
04:27:49 test0018 - 13(org.eclipse.jdt.core.tests.compiler.parser.LambdaExpressionSyntaxTest)  Time elapsed: 0 s
04:27:49 test0019 - 13(org.eclipse.jdt.core.tests.compiler.parser.LambdaExpressionSyntaxTest)  Time elapsed: 0 s
04:27:49 test385132 - 13(org.eclipse.jdt.core.tests.compiler.parser.LambdaExpressionSyntaxTest)  Time elapsed: 0.001 s
04:27:49 testNestedLambda01 - 13(org.eclipse.jdt.core.tests.compiler.parser.LambdaExpressionSyntaxTest)  Time elapsed: 0 s
04:27:49 test0001 - 13(org.eclipse.jdt.core.tests.compiler.parser.ReferenceExpressionSyntaxTest)  Time elapsed: 0 s
04:27:49 test0002 - 13(org.eclipse.jdt.core.tests.compiler.parser.ReferenceExpressionSyntaxTest)  Time elapsed: 0.001 s
04:27:49 test0003 - 13(org.eclipse.jdt.core.tests.compiler.parser.ReferenceExpressionSyntaxTest)  Time elapsed: 0 s
04:27:49 test0004 - 13(org.eclipse.jdt.core.tests.compiler.parser.ReferenceExpressionSyntaxTest)  Time elapsed: 0 s
04:27:49 test0005 - 13(org.eclipse.jdt.core.tests.compiler.parser.ReferenceExpressionSyntaxTest)  Time elapsed: 0 s
04:27:49 test0006 - 13(org.eclipse.jdt.core.tests.compiler.parser.ReferenceExpressionSyntaxTest)  Time elapsed: 0.001 s
04:27:49 test0007 - 13(org.eclipse.jdt.core.tests.compiler.parser.ReferenceExpressionSyntaxTest)  Time elapsed: 0 s
04:27:49 test0008 - 13(org.eclipse.jdt.core.tests.compiler.parser.ReferenceExpressionSyntaxTest)  Time elapsed: 0 s
04:27:49 test0009 - 13(org.eclipse.jdt.core.tests.compiler.parser.ReferenceExpressionSyntaxTest)  Time elapsed: 0 s
04:27:49 test0010 - 13(org.eclipse.jdt.core.tests.compiler.parser.ReferenceExpressionSyntaxTest)  Time elapsed: 0.001 s
04:27:49 test0011 - 13(org.eclipse.jdt.core.tests.compiler.parser.ReferenceExpressionSyntaxTest)  Time elapsed: 0 s
04:27:49 test0012 - 13(org.eclipse.jdt.core.tests.compiler.parser.ReferenceExpressionSyntaxTest)  Time elapsed: 0 s
04:27:49 test0013 - 13(org.eclipse.jdt.core.tests.compiler.parser.ReferenceExpressionSyntaxTest)  Time elapsed: 0.001 s
04:27:49 test0014 - 13(org.eclipse.jdt.core.tests.compiler.parser.ReferenceExpressionSyntaxTest)  Time elapsed: 0 s
04:27:49 test0015 - 13(org.eclipse.jdt.core.tests.compiler.parser.ReferenceExpressionSyntaxTest)  Time elapsed: 0 s
04:27:49 test0016 - 13(org.eclipse.jdt.core.tests.compiler.parser.ReferenceExpressionSyntaxTest)  Time elapsed: 0 s
04:27:49 test0017 - 13(org.eclipse.jdt.core.tests.compiler.parser.ReferenceExpressionSyntaxTest)  Time elapsed: 0.001 s
04:27:49 test0018 - 13(org.eclipse.jdt.core.tests.compiler.parser.ReferenceExpressionSyntaxTest)  Time elapsed: 0 s
04:27:49 test0019 - 13(org.eclipse.jdt.core.tests.compiler.parser.ReferenceExpressionSyntaxTest)  Time elapsed: 0 s
04:27:49 test0020 - 13(org.eclipse.jdt.core.tests.compiler.parser.ReferenceExpressionSyntaxTest)  Time elapsed: 0.001 s
04:27:49 test385132 - 13(org.eclipse.jdt.core.tests.compiler.parser.ReferenceExpressionSyntaxTest)  Time elapsed: 0 s
04:27:49 test385374 - 13(org.eclipse.jdt.core.tests.compiler.parser.ReferenceExpressionSyntaxTest)  Time elapsed: 0 s
04:27:49 test385374a - 13(org.eclipse.jdt.core.tests.compiler.parser.ReferenceExpressionSyntaxTest)  Time elapsed: 0 s
04:27:49 test0001 - 13(org.eclipse.jdt.core.tests.compiler.parser.TypeAnnotationSyntaxTest)  Time elapsed: 0.002 s
04:27:49 test0002 - 13(org.eclipse.jdt.core.tests.compiler.parser.TypeAnnotationSyntaxTest)  Time elapsed: 0.001 s
04:27:49 test0003 - 13(org.eclipse.jdt.core.tests.compiler.parser.TypeAnnotationSyntaxTest)  Time elapsed: 0.002 s
04:27:49 test0004 - 13(org.eclipse.jdt.core.tests.compiler.parser.TypeAnnotationSyntaxTest)  Time elapsed: 0.001 s
04:27:49 test0005 - 13(org.eclipse.jdt.core.tests.compiler.parser.TypeAnnotationSyntaxTest)  Time elapsed: 0.001 s
04:27:49 test0006 - 13(org.eclipse.jdt.core.tests.compiler.parser.TypeAnnotationSyntaxTest)  Time elapsed: 0.001 s
04:27:49 test0008 - 13(org.eclipse.jdt.core.tests.compiler.parser.TypeAnnotationSyntaxTest)  Time elapsed: 0.001 s
04:27:49 test0009 - 13(org.eclipse.jdt.core.tests.compiler.parser.TypeAnnotationSyntaxTest)  Time elapsed: 0.001 s
04:27:49 test0010 - 13(org.eclipse.jdt.core.tests.compiler.parser.TypeAnnotationSyntaxTest)  Time elapsed: 0.002 s
04:27:49 test0011 - 13(org.eclipse.jdt.core.tests.compiler.parser.TypeAnnotationSyntaxTest)  Time elapsed: 0.001 s
04:27:49 test0012 - 13(org.eclipse.jdt.core.tests.compiler.parser.TypeAnnotationSyntaxTest)  Time elapsed: 0.002 s
04:27:49 test0013 - 13(org.eclipse.jdt.core.tests.compiler.parser.TypeAnnotationSyntaxTest)  Time elapsed: 0.002 s
04:27:49 test0014 - 13(org.eclipse.jdt.core.tests.compiler.parser.TypeAnnotationSyntaxTest)  Time elapsed: 0.002 s
04:27:49 test0015 - 13(org.eclipse.jdt.core.tests.compiler.parser.TypeAnnotationSyntaxTest)  Time elapsed: 0.002 s
04:27:49 test0016 - 13(org.eclipse.jdt.core.tests.compiler.parser.TypeAnnotationSyntaxTest)  Time elapsed: 0.001 s
04:27:49 test0017 - 13(org.eclipse.jdt.core.tests.compiler.parser.TypeAnnotationSyntaxTest)  Time elapsed: 0.001 s
04:27:49 test0018 - 13(org.eclipse.jdt.core.tests.compiler.parser.TypeAnnotationSyntaxTest)  Time elapsed: 0.002 s
04:27:49 test0019 - 13(org.eclipse.jdt.core.tests.compiler.parser.TypeAnnotationSyntaxTest)  Time elapsed: 0.001 s
04:27:49 test0020 - 13(org.eclipse.jdt.core.tests.compiler.parser.TypeAnnotationSyntaxTest)  Time elapsed: 0.002 s
04:27:49 test0021 - 13(org.eclipse.jdt.core.tests.compiler.parser.TypeAnnotationSyntaxTest)  Time elapsed: 0.001 s
04:27:49 test0022 - 13(org.eclipse.jdt.core.tests.compiler.parser.TypeAnnotationSyntaxTest)  Time elapsed: 0.001 s
04:27:49 test0023 - 13(org.eclipse.jdt.core.tests.compiler.parser.TypeAnnotationSyntaxTest)  Time elapsed: 0.002 s
04:27:49 test0024 - 13(org.eclipse.jdt.core.tests.compiler.parser.TypeAnnotationSyntaxTest)  Time elapsed: 0.002 s
04:27:49 test0025 - 13(org.eclipse.jdt.core.tests.compiler.parser.TypeAnnotationSyntaxTest)  Time elapsed: 0.002 s
04:27:49 test0026 - 13(org.eclipse.jdt.core.tests.compiler.parser.TypeAnnotationSyntaxTest)  Time elapsed: 0 s
04:27:49 test0027 - 13(org.eclipse.jdt.core.tests.compiler.parser.TypeAnnotationSyntaxTest)  Time elapsed: 0 s
04:27:49 test0028 - 13(org.eclipse.jdt.core.tests.compiler.parser.TypeAnnotationSyntaxTest)  Time elapsed: 0.001 s
04:27:49 test0029 - 13(org.eclipse.jdt.core.tests.compiler.parser.TypeAnnotationSyntaxTest)  Time elapsed: 0 s
04:27:49 test0030 - 13(org.eclipse.jdt.core.tests.compiler.parser.TypeAnnotationSyntaxTest)  Time elapsed: 0.001 s
04:27:49 test0031 - 13(org.eclipse.jdt.core.tests.compiler.parser.TypeAnnotationSyntaxTest)  Time elapsed: 0 s
04:27:49 test0032 - 13(org.eclipse.jdt.core.tests.compiler.parser.TypeAnnotationSyntaxTest)  Time elapsed: 0 s
04:27:49 test0033 - 13(org.eclipse.jdt.core.tests.compiler.parser.TypeAnnotationSyntaxTest)  Time elapsed: 0.001 s
04:27:49 test0034 - 13(org.eclipse.jdt.core.tests.compiler.parser.TypeAnnotationSyntaxTest)  Time elapsed: 0.002 s
04:27:49 test0035 - 13(org.eclipse.jdt.core.tests.compiler.parser.TypeAnnotationSyntaxTest)  Time elapsed: 0.002 s
04:27:49 test0036 - 13(org.eclipse.jdt.core.tests.compiler.parser.TypeAnnotationSyntaxTest)  Time elapsed: 0.002 s
04:27:49 test0037 - 13(org.eclipse.jdt.core.tests.compiler.parser.TypeAnnotationSyntaxTest)  Time elapsed: 0.001 s
04:27:49 test0038 - 13(org.eclipse.jdt.core.tests.compiler.parser.TypeAnnotationSyntaxTest)  Time elapsed: 0.001 s
04:27:49 test0039 - 13(org.eclipse.jdt.core.tests.compiler.parser.TypeAnnotationSyntaxTest)  Time elapsed: 0.001 s
04:27:49 test0040 - 13(org.eclipse.jdt.core.tests.compiler.parser.TypeAnnotationSyntaxTest)  Time elapsed: 0.002 s
04:27:49 test0041 - 13(org.eclipse.jdt.core.tests.compiler.parser.TypeAnnotationSyntaxTest)  Time elapsed: 0.001 s
04:27:49 test0042 - 13(org.eclipse.jdt.core.tests.compiler.parser.TypeAnnotationSyntaxTest)  Time elapsed: 0.001 s
04:27:49 test0043 - 13(org.eclipse.jdt.core.tests.compiler.parser.TypeAnnotationSyntaxTest)  Time elapsed: 0.001 s
04:27:49 test0044 - 13(org.eclipse.jdt.core.tests.compiler.parser.TypeAnnotationSyntaxTest)  Time elapsed: 0.002 s
04:27:49 test0045 - 13(org.eclipse.jdt.core.tests.compiler.parser.TypeAnnotationSyntaxTest)  Time elapsed: 0.001 s
04:27:49 test0046 - 13(org.eclipse.jdt.core.tests.compiler.parser.TypeAnnotationSyntaxTest)  Time elapsed: 0.002 s
04:27:49 test0047 - 13(org.eclipse.jdt.core.tests.compiler.parser.TypeAnnotationSyntaxTest)  Time elapsed: 0.001 s
04:27:49 test0048 - 13(org.eclipse.jdt.core.tests.compiler.parser.TypeAnnotationSyntaxTest)  Time elapsed: 0.002 s
04:27:49 test0049 - 13(org.eclipse.jdt.core.tests.compiler.parser.TypeAnnotationSyntaxTest)  Time elapsed: 0.001 s
04:27:49 test0050 - 13(org.eclipse.jdt.core.tests.compiler.parser.TypeAnnotationSyntaxTest)  Time elapsed: 0.001 s
04:27:49 test0051 - 13(org.eclipse.jdt.core.tests.compiler.parser.TypeAnnotationSyntaxTest)  Time elapsed: 0.001 s
04:27:49 test0052 - 13(org.eclipse.jdt.core.tests.compiler.parser.TypeAnnotationSyntaxTest)  Time elapsed: 0.001 s
04:27:49 test0053 - 13(org.eclipse.jdt.core.tests.compiler.parser.TypeAnnotationSyntaxTest)  Time elapsed: 0.002 s
04:27:49 test0054 - 13(org.eclipse.jdt.core.tests.compiler.parser.TypeAnnotationSyntaxTest)  Time elapsed: 0.001 s
04:27:49 test0055 - 13(org.eclipse.jdt.core.tests.compiler.parser.TypeAnnotationSyntaxTest)  Time elapsed: 0.001 s
04:27:49 test0056 - 13(org.eclipse.jdt.core.tests.compiler.parser.TypeAnnotationSyntaxTest)  Time elapsed: 0.002 s
04:27:49 test0057 - 13(org.eclipse.jdt.core.tests.compiler.parser.TypeAnnotationSyntaxTest)  Time elapsed: 0.001 s
04:27:49 test0058 - 13(org.eclipse.jdt.core.tests.compiler.parser.TypeAnnotationSyntaxTest)  Time elapsed: 0.002 s
04:27:49 test0059 - 13(org.eclipse.jdt.core.tests.compiler.parser.TypeAnnotationSyntaxTest)  Time elapsed: 0.001 s
04:27:49 test0060 - 13(org.eclipse.jdt.core.tests.compiler.parser.TypeAnnotationSyntaxTest)  Time elapsed: 0.005 s
04:27:49 test0061 - 13(org.eclipse.jdt.core.tests.compiler.parser.TypeAnnotationSyntaxTest)  Time elapsed: 0.004 s
04:27:49 test0062 - 13(org.eclipse.jdt.core.tests.compiler.parser.TypeAnnotationSyntaxTest)  Time elapsed: 0.003 s
04:27:49 test0063 - 13(org.eclipse.jdt.core.tests.compiler.parser.TypeAnnotationSyntaxTest)  Time elapsed: 0.004 s
04:27:49 test0064 - 13(org.eclipse.jdt.core.tests.compiler.parser.TypeAnnotationSyntaxTest)  Time elapsed: 0.002 s
04:27:49 test0066 - 13(org.eclipse.jdt.core.tests.compiler.parser.TypeAnnotationSyntaxTest)  Time elapsed: 0.001 s
04:27:49 test0067 - 13(org.eclipse.jdt.core.tests.compiler.parser.TypeAnnotationSyntaxTest)  Time elapsed: 0.001 s
04:27:49 test0068 - 13(org.eclipse.jdt.core.tests.compiler.parser.TypeAnnotationSyntaxTest)  Time elapsed: 0.002 s
04:27:49 test0069 - 13(org.eclipse.jdt.core.tests.compiler.parser.TypeAnnotationSyntaxTest)  Time elapsed: 0.001 s
04:27:49 test007 - 13(org.eclipse.jdt.core.tests.compiler.parser.TypeAnnotationSyntaxTest)  Time elapsed: 0.001 s
04:27:49 test0070 - 13(org.eclipse.jdt.core.tests.compiler.parser.TypeAnnotationSyntaxTest)  Time elapsed: 0.001 s
04:27:49 test0071 - 13(org.eclipse.jdt.core.tests.compiler.parser.TypeAnnotationSyntaxTest)  Time elapsed: 0.002 s
04:27:49 test0072 - 13(org.eclipse.jdt.core.tests.compiler.parser.TypeAnnotationSyntaxTest)  Time elapsed: 0.001 s
04:27:49 test0073 - 13(org.eclipse.jdt.core.tests.compiler.parser.TypeAnnotationSyntaxTest)  Time elapsed: 0.001 s
04:27:49 test0074 - 13(org.eclipse.jdt.core.tests.compiler.parser.TypeAnnotationSyntaxTest)  Time elapsed: 0.002 s
04:27:49 test0075 - 13(org.eclipse.jdt.core.tests.compiler.parser.TypeAnnotationSyntaxTest)  Time elapsed: 0.001 s
04:27:49 test0076 - 13(org.eclipse.jdt.core.tests.compiler.parser.TypeAnnotationSyntaxTest)  Time elapsed: 0.001 s
04:27:49 test0077 - 13(org.eclipse.jdt.core.tests.compiler.parser.TypeAnnotationSyntaxTest)  Time elapsed: 0.001 s
04:27:49 test0078 - 13(org.eclipse.jdt.core.tests.compiler.parser.TypeAnnotationSyntaxTest)  Time elapsed: 0.001 s
04:27:49 test0079 - 13(org.eclipse.jdt.core.tests.compiler.parser.TypeAnnotationSyntaxTest)  Time elapsed: 0.001 s
04:27:49 test0080 - 13(org.eclipse.jdt.core.tests.compiler.parser.TypeAnnotationSyntaxTest)  Time elapsed: 0.001 s
04:27:49 test0081 - 13(org.eclipse.jdt.core.tests.compiler.parser.TypeAnnotationSyntaxTest)  Time elapsed: 0.002 s
04:27:49 test0082 - 13(org.eclipse.jdt.core.tests.compiler.parser.TypeAnnotationSyntaxTest)  Time elapsed: 0.001 s
04:27:49 test0083 - 13(org.eclipse.jdt.core.tests.compiler.parser.TypeAnnotationSyntaxTest)  Time elapsed: 0.002 s
04:27:49 test0084 - 13(org.eclipse.jdt.core.tests.compiler.parser.TypeAnnotationSyntaxTest)  Time elapsed: 0.001 s
04:27:49 test0085 - 13(org.eclipse.jdt.core.tests.compiler.parser.TypeAnnotationSyntaxTest)  Time elapsed: 0.003 s
04:27:49 test0086 - 13(org.eclipse.jdt.core.tests.compiler.parser.TypeAnnotationSyntaxTest)  Time elapsed: 0.002 s
04:27:49 test0087 - 13(org.eclipse.jdt.core.tests.compiler.parser.TypeAnnotationSyntaxTest)  Time elapsed: 0.002 s
04:27:49 test0088 - 13(org.eclipse.jdt.core.tests.compiler.parser.TypeAnnotationSyntaxTest)  Time elapsed: 0.001 s
04:27:49 test0089 - 13(org.eclipse.jdt.core.tests.compiler.parser.TypeAnnotationSyntaxTest)  Time elapsed: 0.002 s
04:27:49 test0090 - 13(org.eclipse.jdt.core.tests.compiler.parser.TypeAnnotationSyntaxTest)  Time elapsed: 0.001 s
04:27:49 test0091 - 13(org.eclipse.jdt.core.tests.compiler.parser.TypeAnnotationSyntaxTest)  Time elapsed: 0.002 s
04:27:49 test0092 - 13(org.eclipse.jdt.core.tests.compiler.parser.TypeAnnotationSyntaxTest)  Time elapsed: 0.001 s
04:27:49 test0093 - 13(org.eclipse.jdt.core.tests.compiler.parser.TypeAnnotationSyntaxTest)  Time elapsed: 0.002 s
04:27:49 test0094 - 13(org.eclipse.jdt.core.tests.compiler.parser.TypeAnnotationSyntaxTest)  Time elapsed: 0.001 s
04:27:49 test0095 - 13(org.eclipse.jdt.core.tests.compiler.parser.TypeAnnotationSyntaxTest)  Time elapsed: 0.002 s
04:27:49 test0096 - 13(org.eclipse.jdt.core.tests.compiler.parser.TypeAnnotationSyntaxTest)  Time elapsed: 0.002 s
04:27:49 test0097 - 13(org.eclipse.jdt.core.tests.compiler.parser.TypeAnnotationSyntaxTest)  Time elapsed: 0.001 s
04:27:49 test0098 - 13(org.eclipse.jdt.core.tests.compiler.parser.TypeAnnotationSyntaxTest)  Time elapsed: 0.002 s
04:27:49 test0099 - 13(org.eclipse.jdt.core.tests.compiler.parser.TypeAnnotationSyntaxTest)  Time elapsed: 0.001 s
04:27:49 test0100 - 13(org.eclipse.jdt.core.tests.compiler.parser.TypeAnnotationSyntaxTest)  Time elapsed: 0.002 s
04:27:49 test0101 - 13(org.eclipse.jdt.core.tests.compiler.parser.TypeAnnotationSyntaxTest)  Time elapsed: 0.003 s
04:27:49 test0102 - 13(org.eclipse.jdt.core.tests.compiler.parser.TypeAnnotationSyntaxTest)  Time elapsed: 0.003 s
04:27:49 test0103 - 13(org.eclipse.jdt.core.tests.compiler.parser.TypeAnnotationSyntaxTest)  Time elapsed: 0.002 s
04:27:49 test0104 - 13(org.eclipse.jdt.core.tests.compiler.parser.TypeAnnotationSyntaxTest)  Time elapsed: 0.002 s
04:27:49 test0105 - 13(org.eclipse.jdt.core.tests.compiler.parser.TypeAnnotationSyntaxTest)  Time elapsed: 0.002 s
04:27:49 test0106 - 13(org.eclipse.jdt.core.tests.compiler.parser.TypeAnnotationSyntaxTest)  Time elapsed: 0.002 s
04:27:49 test0107 - 13(org.eclipse.jdt.core.tests.compiler.parser.TypeAnnotationSyntaxTest)  Time elapsed: 0.002 s
04:27:49 test0108 - 13(org.eclipse.jdt.core.tests.compiler.parser.TypeAnnotationSyntaxTest)  Time elapsed: 0.001 s
04:27:49 test0109 - 13(org.eclipse.jdt.core.tests.compiler.parser.TypeAnnotationSyntaxTest)  Time elapsed: 0.001 s
04:27:49 test0110 - 13(org.eclipse.jdt.core.tests.compiler.parser.TypeAnnotationSyntaxTest)  Time elapsed: 0.001 s
04:27:49 test0111 - 13(org.eclipse.jdt.core.tests.compiler.parser.TypeAnnotationSyntaxTest)  Time elapsed: 0 s
04:27:49 test0112 - 13(org.eclipse.jdt.core.tests.compiler.parser.TypeAnnotationSyntaxTest)  Time elapsed: 0.001 s
04:27:49 test0113 - 13(org.eclipse.jdt.core.tests.compiler.parser.TypeAnnotationSyntaxTest)  Time elapsed: 0.002 s
04:27:49 test0114 - 13(org.eclipse.jdt.core.tests.compiler.parser.TypeAnnotationSyntaxTest)  Time elapsed: 0.001 s
04:27:49 test0115 - 13(org.eclipse.jdt.core.tests.compiler.parser.TypeAnnotationSyntaxTest)  Time elapsed: 0.001 s
04:27:49 test0116 - 13(org.eclipse.jdt.core.tests.compiler.parser.TypeAnnotationSyntaxTest)  Time elapsed: 0.002 s
04:27:49 test0117 - 13(org.eclipse.jdt.core.tests.compiler.parser.TypeAnnotationSyntaxTest)  Time elapsed: 0.003 s
04:27:49 test0118 - 13(org.eclipse.jdt.core.tests.compiler.parser.TypeAnnotationSyntaxTest)  Time elapsed: 0.001 s
04:27:49 test0119 - 13(org.eclipse.jdt.core.tests.compiler.parser.TypeAnnotationSyntaxTest)  Time elapsed: 0.003 s
04:27:49 test0120 - 13(org.eclipse.jdt.core.tests.compiler.parser.TypeAnnotationSyntaxTest)  Time elapsed: 0.002 s
04:27:49 test0121 - 13(org.eclipse.jdt.core.tests.compiler.parser.TypeAnnotationSyntaxTest)  Time elapsed: 0.002 s
04:27:49 test0122 - 13(org.eclipse.jdt.core.tests.compiler.parser.TypeAnnotationSyntaxTest)  Time elapsed: 0.002 s
04:27:49 test0123 - 13(org.eclipse.jdt.core.tests.compiler.parser.TypeAnnotationSyntaxTest)  Time elapsed: 0.002 s
04:27:49 test0125 - 13(org.eclipse.jdt.core.tests.compiler.parser.TypeAnnotationSyntaxTest)  Time elapsed: 0 s
04:27:49 test0126 - 13(org.eclipse.jdt.core.tests.compiler.parser.TypeAnnotationSyntaxTest)  Time elapsed: 0 s
04:27:49 test0127 - 13(org.eclipse.jdt.core.tests.compiler.parser.TypeAnnotationSyntaxTest)  Time elapsed: 0.001 s
04:27:49 test0128 - 13(org.eclipse.jdt.core.tests.compiler.parser.TypeAnnotationSyntaxTest)  Time elapsed: 0.001 s
04:27:49 test0129 - 13(org.eclipse.jdt.core.tests.compiler.parser.TypeAnnotationSyntaxTest)  Time elapsed: 0.002 s
04:27:49 test0130 - 13(org.eclipse.jdt.core.tests.compiler.parser.TypeAnnotationSyntaxTest)  Time elapsed: 0.001 s
04:27:49 test0131 - 13(org.eclipse.jdt.core.tests.compiler.parser.TypeAnnotationSyntaxTest)  Time elapsed: 0 s
04:27:49 test0132 - 13(org.eclipse.jdt.core.tests.compiler.parser.TypeAnnotationSyntaxTest)  Time elapsed: 0.001 s
04:27:49 test0133 - 13(org.eclipse.jdt.core.tests.compiler.parser.TypeAnnotationSyntaxTest)  Time elapsed: 0 s
04:27:49 test0134 - 13(org.eclipse.jdt.core.tests.compiler.parser.TypeAnnotationSyntaxTest)  Time elapsed: 0 s
04:27:49 test0135 - 13(org.eclipse.jdt.core.tests.compiler.parser.TypeAnnotationSyntaxTest)  Time elapsed: 0.001 s
04:27:49 test0136 - 13(org.eclipse.jdt.core.tests.compiler.parser.TypeAnnotationSyntaxTest)  Time elapsed: 0 s
04:27:49 test0137 - 13(org.eclipse.jdt.core.tests.compiler.parser.TypeAnnotationSyntaxTest)  Time elapsed: 0 s
04:27:49 test0138 - 13(org.eclipse.jdt.core.tests.compiler.parser.TypeAnnotationSyntaxTest)  Time elapsed: 0.001 s
04:27:49 test0139 - 13(org.eclipse.jdt.core.tests.compiler.parser.TypeAnnotationSyntaxTest)  Time elapsed: 0 s
04:27:49 test0001 - 13(org.eclipse.jdt.core.tests.compiler.parser.CompletionParserTest18)  Time elapsed: 0.001 s
04:27:49 test0002 - 13(org.eclipse.jdt.core.tests.compiler.parser.CompletionParserTest18)  Time elapsed: 0 s
04:27:49 test0003 - 13(org.eclipse.jdt.core.tests.compiler.parser.CompletionParserTest18)  Time elapsed: 0.001 s
04:27:49 test0004 - 13(org.eclipse.jdt.core.tests.compiler.parser.CompletionParserTest18)  Time elapsed: 0.001 s
04:27:49 test0005 - 13(org.eclipse.jdt.core.tests.compiler.parser.CompletionParserTest18)  Time elapsed: 0.001 s
04:27:49 test0006 - 13(org.eclipse.jdt.core.tests.compiler.parser.CompletionParserTest18)  Time elapsed: 0 s
04:27:49 test0007 - 13(org.eclipse.jdt.core.tests.compiler.parser.CompletionParserTest18)  Time elapsed: 0.001 s
04:27:49 test0010 - 13(org.eclipse.jdt.core.tests.compiler.parser.CompletionParserTest18)  Time elapsed: 0 s
04:27:49 test402081 - 13(org.eclipse.jdt.core.tests.compiler.parser.CompletionParserTest18)  Time elapsed: 0.001 s
04:27:49 test405126 - 13(org.eclipse.jdt.core.tests.compiler.parser.CompletionParserTest18)  Time elapsed: 0 s
04:27:49 test417935 - 13(org.eclipse.jdt.core.tests.compiler.parser.CompletionParserTest18)  Time elapsed: 0.001 s
04:27:49 test422468 - 13(org.eclipse.jdt.core.tests.compiler.parser.CompletionParserTest18)  Time elapsed: 0.001 s
04:27:49 test424080 - 13(org.eclipse.jdt.core.tests.compiler.parser.CompletionParserTest18)  Time elapsed: 0.002 s
04:27:49 test425084 - 13(org.eclipse.jdt.core.tests.compiler.parser.CompletionParserTest18)  Time elapsed: 0 s
04:27:49 test425084b - 13(org.eclipse.jdt.core.tests.compiler.parser.CompletionParserTest18)  Time elapsed: 0 s
04:27:49 test427117 - 13(org.eclipse.jdt.core.tests.compiler.parser.CompletionParserTest18)  Time elapsed: 0.001 s
04:27:49 test427255 - 13(org.eclipse.jdt.core.tests.compiler.parser.CompletionParserTest18)  Time elapsed: 0 s
04:27:49 test427322 - 13(org.eclipse.jdt.core.tests.compiler.parser.CompletionParserTest18)  Time elapsed: 0.001 s
04:27:49 test427322a - 13(org.eclipse.jdt.core.tests.compiler.parser.CompletionParserTest18)  Time elapsed: 0 s
04:27:49 test427463 - 13(org.eclipse.jdt.core.tests.compiler.parser.CompletionParserTest18)  Time elapsed: 0.001 s
04:27:49 test427532 - 13(org.eclipse.jdt.core.tests.compiler.parser.CompletionParserTest18)  Time elapsed: 0 s
04:27:49 test428735 - 13(org.eclipse.jdt.core.tests.compiler.parser.CompletionParserTest18)  Time elapsed: 0.001 s
04:27:49 test428735a - 13(org.eclipse.jdt.core.tests.compiler.parser.CompletionParserTest18)  Time elapsed: 0 s
04:27:49 test428735b - 13(org.eclipse.jdt.core.tests.compiler.parser.CompletionParserTest18)  Time elapsed: 0.001 s
04:27:49 test428735c - 13(org.eclipse.jdt.core.tests.compiler.parser.CompletionParserTest18)  Time elapsed: 0.001 s
04:27:49 test428735d - 13(org.eclipse.jdt.core.tests.compiler.parser.CompletionParserTest18)  Time elapsed: 0 s
04:27:49 test428735e - 13(org.eclipse.jdt.core.tests.compiler.parser.CompletionParserTest18)  Time elapsed: 0.001 s
04:27:49 test428735f - 13(org.eclipse.jdt.core.tests.compiler.parser.CompletionParserTest18)  Time elapsed: 0 s
04:27:49 test428735g - 13(org.eclipse.jdt.core.tests.compiler.parser.CompletionParserTest18)  Time elapsed: 0.001 s
04:27:49 test428735h - 13(org.eclipse.jdt.core.tests.compiler.parser.CompletionParserTest18)  Time elapsed: 0.001 s
04:27:49 test430656 - 13(org.eclipse.jdt.core.tests.compiler.parser.CompletionParserTest18)  Time elapsed: 0 s
04:27:49 test430667 - 13(org.eclipse.jdt.core.tests.compiler.parser.CompletionParserTest18)  Time elapsed: 0.001 s
04:27:49 test430667a - 13(org.eclipse.jdt.core.tests.compiler.parser.CompletionParserTest18)  Time elapsed: 0.002 s
04:27:49 test430667b - 13(org.eclipse.jdt.core.tests.compiler.parser.CompletionParserTest18)  Time elapsed: 0 s
04:27:49 test430667c - 13(org.eclipse.jdt.core.tests.compiler.parser.CompletionParserTest18)  Time elapsed: 0.001 s
04:27:49 test430667d - 13(org.eclipse.jdt.core.tests.compiler.parser.CompletionParserTest18)  Time elapsed: 0 s
04:27:49 test435219 - 13(org.eclipse.jdt.core.tests.compiler.parser.CompletionParserTest18)  Time elapsed: 0.001 s
04:27:49 test435682 - 13(org.eclipse.jdt.core.tests.compiler.parser.CompletionParserTest18)  Time elapsed: 0 s
04:27:49 test438952 - 13(org.eclipse.jdt.core.tests.compiler.parser.CompletionParserTest18)  Time elapsed: 0.001 s
04:27:49 test446765 - 13(org.eclipse.jdt.core.tests.compiler.parser.CompletionParserTest18)  Time elapsed: 0.002 s
04:27:49 test473008 - 13(org.eclipse.jdt.core.tests.compiler.parser.CompletionParserTest18)  Time elapsed: 0 s
04:27:49 testBrokenMethodCall - 13(org.eclipse.jdt.core.tests.compiler.parser.CompletionParserTest18)  Time elapsed: 0.001 s
04:27:49 testCompletionLocation - 13(org.eclipse.jdt.core.tests.compiler.parser.CompletionParserTest18)  Time elapsed: 0 s
04:27:49 testElidedCompletion - 13(org.eclipse.jdt.core.tests.compiler.parser.CompletionParserTest18)  Time elapsed: 0.001 s
04:27:49 testElidedCompletion2 - 13(org.eclipse.jdt.core.tests.compiler.parser.CompletionParserTest18)  Time elapsed: 0 s
04:27:49 testLocalsPromotion - 13(org.eclipse.jdt.core.tests.compiler.parser.CompletionParserTest18)  Time elapsed: 0.001 s
04:27:49 testUnspecifiedReference - 13(org.eclipse.jdt.core.tests.compiler.parser.CompletionParserTest18)  Time elapsed: 0 s
04:27:49 test424110 - 13(org.eclipse.jdt.core.tests.compiler.parser.SelectionParserTest18)  Time elapsed: 0.001 s
04:27:49 test424110a - 13(org.eclipse.jdt.core.tests.compiler.parser.SelectionParserTest18)  Time elapsed: 0 s
04:27:49 test430572 - 13(org.eclipse.jdt.core.tests.compiler.parser.SelectionParserTest18)  Time elapsed: 0.001 s
04:27:49 test476693 - 13(org.eclipse.jdt.core.tests.compiler.parser.SelectionParserTest18)  Time elapsed: 0 s
04:27:49 test495912 - 13(org.eclipse.jdt.core.tests.compiler.parser.SelectionParserTest18)  Time elapsed: 0.001 s
04:27:49 test495912a - 13(org.eclipse.jdt.core.tests.compiler.parser.SelectionParserTest18)  Time elapsed: 0.001 s
04:27:49 test495912b - 13(org.eclipse.jdt.core.tests.compiler.parser.SelectionParserTest18)  Time elapsed: 0.001 s
04:27:49 test510339_001_since_9 - 13(org.eclipse.jdt.core.tests.compiler.parser.SelectionParserTest9)  Time elapsed: 0.001 s
04:27:49 test510339_002_since_9 - 13(org.eclipse.jdt.core.tests.compiler.parser.SelectionParserTest9)  Time elapsed: 0 s
04:27:49 test510339_003_since_9 - 13(org.eclipse.jdt.core.tests.compiler.parser.SelectionParserTest9)  Time elapsed: 0 s
04:27:49 test510339_004_since_9 - 13(org.eclipse.jdt.core.tests.compiler.parser.SelectionParserTest9)  Time elapsed: 0 s
04:27:49 test510339_005_since_9 - 13(org.eclipse.jdt.core.tests.compiler.parser.SelectionParserTest9)  Time elapsed: 0.001 s
04:27:49 test510339_006_since_9 - 13(org.eclipse.jdt.core.tests.compiler.parser.SelectionParserTest9)  Time elapsed: 0 s
04:27:49 test510339_007_since_9 - 13(org.eclipse.jdt.core.tests.compiler.parser.SelectionParserTest9)  Time elapsed: 0 s
04:27:49 test510339_008_since_9 - 13(org.eclipse.jdt.core.tests.compiler.parser.SelectionParserTest9)  Time elapsed: 0 s
04:27:49 test510339_009_since_9 - 13(org.eclipse.jdt.core.tests.compiler.parser.SelectionParserTest9)  Time elapsed: 0.001 s
04:27:49 test510339_010_since_9 - 13(org.eclipse.jdt.core.tests.compiler.parser.SelectionParserTest9)  Time elapsed: 0 s
04:27:49 test510339_011_since_9 - 13(org.eclipse.jdt.core.tests.compiler.parser.SelectionParserTest9)  Time elapsed: 0 s
04:27:49 test001 - 13(org.eclipse.jdt.core.tests.compiler.parser.SelectionParserTest10)  Time elapsed: 0 s
04:27:49 test002 - 13(org.eclipse.jdt.core.tests.compiler.parser.SelectionParserTest10)  Time elapsed: 0 s
04:27:49 test001 - 13(org.eclipse.jdt.core.tests.compiler.parser.SelectionParserTest12)  Time elapsed: 0 s
04:27:49 test002 - 13(org.eclipse.jdt.core.tests.compiler.parser.SelectionParserTest12)  Time elapsed: 0 s
04:27:49 test003 - 13(org.eclipse.jdt.core.tests.compiler.parser.SelectionParserTest12)  Time elapsed: 0.001 s
04:27:49 test004 - 13(org.eclipse.jdt.core.tests.compiler.parser.SelectionParserTest12)  Time elapsed: 0 s
04:27:49 test005 - 13(org.eclipse.jdt.core.tests.compiler.parser.SelectionParserTest12)  Time elapsed: 0 s
04:27:49 test006 - 13(org.eclipse.jdt.core.tests.compiler.parser.SelectionParserTest12)  Time elapsed: 0.001 s
04:27:49 test007 - 13(org.eclipse.jdt.core.tests.compiler.parser.SelectionParserTest12)  Time elapsed: 0.001 s
04:27:49 test008 - 13(org.eclipse.jdt.core.tests.compiler.parser.SelectionParserTest12)  Time elapsed: 0 s
04:27:49 test009 - 13(org.eclipse.jdt.core.tests.compiler.parser.SelectionParserTest12)  Time elapsed: 0.001 s
04:27:49 test010 - 13(org.eclipse.jdt.core.tests.compiler.parser.SelectionParserTest12)  Time elapsed: 0 s
04:27:49 test011 - 13(org.eclipse.jdt.core.tests.compiler.parser.SelectionParserTest12)  Time elapsed: 0.001 s
04:27:49 test012 - 13(org.eclipse.jdt.core.tests.compiler.parser.SelectionParserTest12)  Time elapsed: 0 s
04:27:49 test013 - 13(org.eclipse.jdt.core.tests.compiler.parser.SelectionParserTest12)  Time elapsed: 0 s
04:27:49 test014 - 13(org.eclipse.jdt.core.tests.compiler.parser.SelectionParserTest12)  Time elapsed: 0.001 s
04:27:49 test015 - 13(org.eclipse.jdt.core.tests.compiler.parser.SelectionParserTest12)  Time elapsed: 0 s
04:27:49 test016 - 13(org.eclipse.jdt.core.tests.compiler.parser.SelectionParserTest12)  Time elapsed: 0.001 s
04:27:49 test017 - 13(org.eclipse.jdt.core.tests.compiler.parser.SelectionParserTest12)  Time elapsed: 0 s
04:27:49 test018 - 13(org.eclipse.jdt.core.tests.compiler.parser.SelectionParserTest12)  Time elapsed: 0.001 s  <<< FAILURE!
04:27:49 junit.framework.ComparisonFailure: 
04:27:49 invalid selection unit-X.java.
04:27:49 ----------- Expected ------------
04:27:49 import org.eclipse.jdt.annotation.*;\n
04:27:49 import java.util.function.*;\n
04:27:49 interface IN0 {\n
04:27:49 }\n
04:27:49 interface IN1 extends IN0 {\n
04:27:49 }\n
04:27:49 interface IN2 extends IN0 {\n
04:27:49 }\n
04:27:49 public class X {\n
04:27:49   public X() {\n
04:27:49   }\n
04:27:49   IN1 n_1() {\n
04:27:49   }\n
04:27:49   IN2 n_2() {\n
04:27:49   }\n
04:27:49   <M>void m(Supplier<M> m2) {\n
04:27:49   }\n
04:27:49   void testSw(int i) {\n
04:27:49     m(switch (i) {\n
04:27:49 case 1 ->\n
04:27:49  <SelectionOnReferenceExpressionName:this::n_1>;\n
04:27:49 default ->\n
04:27:49  this::n_2;\n
04:27:49 });\n
04:27:49   }\n
04:27:49 }\n
04:27:49 
04:27:49 ------------ but was ------------
04:27:49 import org.eclipse.jdt.annotation.*;\n
04:27:49 import java.util.function.*;\n
04:27:49 interface IN0 {\n
04:27:49 }\n
04:27:49 interface IN1 extends IN0 {\n
04:27:49 }\n
04:27:49 interface IN2 extends IN0 {\n
04:27:49 }\n
04:27:49 public class X {\n
04:27:49   public X() {\n
04:27:49   }\n
04:27:49   IN1 n_1() {\n
04:27:49   }\n
04:27:49   IN2 n_2() {\n
04:27:49   }\n
04:27:49   <M>void m(Supplier<M> m2) {\n
04:27:49   }\n
04:27:49   void testSw(int i) {\n
04:27:49     m(switch (i) {\n
04:27:49 case 1 ->\n
04:27:49     yield <SelectionOnReferenceExpressionName:this::n_1>;\n
04:27:49 default ->\n
04:27:49     yield this::n_2;\n
04:27:49 });\n
04:27:49   }\n
04:27:49 }\n
04:27:49 
04:27:49 --------- Difference is ----------
04:27:49  expected:<...i) {\n
04:27:49 case 1 ->\n
04:27:49  [<SelectionOnReferenceExpressionName:this::n_1>;\n
04:27:49 default ->\n
04:27:49 ] this::n_2;\n
04:27:49 });\n
04:27:49 ...> but was:<...i) {\n
04:27:49 case 1 ->\n
04:27:49  [   yield <SelectionOnReferenceExpressionName:this::n_1>;\n
04:27:49 default ->\n
04:27:49     yield] this::n_2;\n
04:27:49 });\n
04:27:49 ...>
04:27:49 	at org.eclipse.jdt.core.tests.compiler.parser.SelectionParserTest12.test018(SelectionParserTest12.java:844)
04:27:49 
04:27:49 test019 - 13(org.eclipse.jdt.core.tests.compiler.parser.SelectionParserTest12)  Time elapsed: 0.001 s  <<< FAILURE!
04:27:49 junit.framework.ComparisonFailure: 
04:27:49 invalid selection unit-X.java.
04:27:49 ----------- Expected ------------
04:27:49 import org.eclipse.jdt.annotation.*;\n
04:27:49 import java.util.function.*;\n
04:27:49 interface IN0 {\n
04:27:49 }\n
04:27:49 interface IN1 extends IN0 {\n
04:27:49 }\n
04:27:49 interface IN2 extends IN0 {\n
04:27:49 }\n
04:27:49 public class X {\n
04:27:49   public X() {\n
04:27:49   }\n
04:27:49   IN1 n_1() {\n
04:27:49   }\n
04:27:49   IN2 n_2() {\n
04:27:49   }\n
04:27:49   <M>void m(Supplier<M> m2) {\n
04:27:49   }\n
04:27:49   void testSw(int i) {\n
04:27:49     m(switch (i) {\n
04:27:49 case 2 ->\n
04:27:49  () -> <SelectOnMessageSend:n_1()>;\n
04:27:49 default ->\n
04:27:49  this::n_2;\n
04:27:49 });\n
04:27:49   }\n
04:27:49 }\n
04:27:49 
04:27:49 ------------ but was ------------
04:27:49 import org.eclipse.jdt.annotation.*;\n
04:27:49 import java.util.function.*;\n
04:27:49 interface IN0 {\n
04:27:49 }\n
04:27:49 interface IN1 extends IN0 {\n
04:27:49 }\n
04:27:49 interface IN2 extends IN0 {\n
04:27:49 }\n
04:27:49 public class X {\n
04:27:49   public X() {\n
04:27:49   }\n
04:27:49   IN1 n_1() {\n
04:27:49   }\n
04:27:49   IN2 n_2() {\n
04:27:49   }\n
04:27:49   <M>void m(Supplier<M> m2) {\n
04:27:49   }\n
04:27:49   void testSw(int i) {\n
04:27:49     m(switch (i) {\n
04:27:49 case 2 ->\n
04:27:49     yield () -> <SelectOnMessageSend:n_1()>;\n
04:27:49 default ->\n
04:27:49     yield this::n_2;\n
04:27:49 });\n
04:27:49   }\n
04:27:49 }\n
04:27:49 
04:27:49 --------- Difference is ----------
04:27:49  expected:<...i) {\n
04:27:49 case 2 ->\n
04:27:49  [() -> <SelectOnMessageSend:n_1()>;\n
04:27:49 default ->\n
04:27:49 ] this::n_2;\n
04:27:49 });\n
04:27:49 ...> but was:<...i) {\n
04:27:49 case 2 ->\n
04:27:49  [   yield () -> <SelectOnMessageSend:n_1()>;\n
04:27:49 default ->\n
04:27:49     yield] this::n_2;\n
04:27:49 });\n
04:27:49 ...>
04:27:49 	at org.eclipse.jdt.core.tests.compiler.parser.SelectionParserTest12.test019(SelectionParserTest12.java:902)
04:27:49 
04:27:49 test020 - 13(org.eclipse.jdt.core.tests.compiler.parser.SelectionParserTest12)  Time elapsed: 0.001 s  <<< FAILURE!
04:27:49 junit.framework.ComparisonFailure: 
04:27:49 invalid selection unit-X.java.
04:27:49 ----------- Expected ------------
04:27:49 import org.eclipse.jdt.annotation.*;\n
04:27:49 import java.util.function.*;\n
04:27:49 interface IN0 {\n
04:27:49 }\n
04:27:49 interface IN1 extends IN0 {\n
04:27:49 }\n
04:27:49 interface IN2 extends IN0 {\n
04:27:49 }\n
04:27:49 public class X {\n
04:27:49   public X() {\n
04:27:49   }\n
04:27:49   IN1 n_1() {\n
04:27:49   }\n
04:27:49   IN2 n_2() {\n
04:27:49   }\n
04:27:49   <M>void m(Supplier<M> m2) {\n
04:27:49   }\n
04:27:49   void testSw(int i) {\n
04:27:49     m(switch (i) {\n
04:27:49 default ->\n
04:27:49  <SelectionOnReferenceExpressionName:this::n_2>;\n
04:27:49 });\n
04:27:49   }\n
04:27:49 }\n
04:27:49 
04:27:49 ------------ but was ------------
04:27:49 import org.eclipse.jdt.annotation.*;\n
04:27:49 import java.util.function.*;\n
04:27:49 interface IN0 {\n
04:27:49 }\n
04:27:49 interface IN1 extends IN0 {\n
04:27:49 }\n
04:27:49 interface IN2 extends IN0 {\n
04:27:49 }\n
04:27:49 public class X {\n
04:27:49   public X() {\n
04:27:49   }\n
04:27:49   IN1 n_1() {\n
04:27:49   }\n
04:27:49   IN2 n_2() {\n
04:27:49   }\n
04:27:49   <M>void m(Supplier<M> m2) {\n
04:27:49   }\n
04:27:49   void testSw(int i) {\n
04:27:49     m(switch (i) {\n
04:27:49 default ->\n
04:27:49     yield <SelectionOnReferenceExpressionName:this::n_2>;\n
04:27:49 });\n
04:27:49   }\n
04:27:49 }\n
04:27:49 
04:27:49 --------- Difference is ----------
04:27:49  expected:<...) {\n
04:27:49 default ->\n
04:27:49  []<SelectionOnReferenc...> but was:<...) {\n
04:27:49 default ->\n
04:27:49  [   yield ]<SelectionOnReferenc...>
04:27:49 	at org.eclipse.jdt.core.tests.compiler.parser.SelectionParserTest12.test020(SelectionParserTest12.java:957)
04:27:49 
04:27:49 test021 - 13(org.eclipse.jdt.core.tests.compiler.parser.SelectionParserTest12)  Time elapsed: 0.001 s  <<< FAILURE!
04:27:49 junit.framework.ComparisonFailure: 
04:27:49 invalid selection unit-X.java.
04:27:49 ----------- Expected ------------
04:27:49 import org.eclipse.jdt.annotation.*;\n
04:27:49 import java.util.function.*;\n
04:27:49 interface IN0 {\n
04:27:49 }\n
04:27:49 interface IN1 extends IN0 {\n
04:27:49 }\n
04:27:49 interface IN2 extends IN0 {\n
04:27:49 }\n
04:27:49 public class X {\n
04:27:49   public X() {\n
04:27:49   }\n
04:27:49   IN1 n_1(int ijk) {\n
04:27:49   }\n
04:27:49   IN2 n_2() {\n
04:27:49   }\n
04:27:49   <M>void m(Supplier<M> m2) {\n
04:27:49   }\n
04:27:49   void testSw(int ijk) {\n
04:27:49     m(switch (ijk) {\n
04:27:49 default ->\n
04:27:49  () -> <SelectOnMessageSend:n_1(ijk)>;\n
04:27:49 });\n
04:27:49   }\n
04:27:49 }\n
04:27:49 
04:27:49 ------------ but was ------------
04:27:49 import org.eclipse.jdt.annotation.*;\n
04:27:49 import java.util.function.*;\n
04:27:49 interface IN0 {\n
04:27:49 }\n
04:27:49 interface IN1 extends IN0 {\n
04:27:49 }\n
04:27:49 interface IN2 extends IN0 {\n
04:27:49 }\n
04:27:49 public class X {\n
04:27:49   public X() {\n
04:27:49   }\n
04:27:49   IN1 n_1(int ijk) {\n
04:27:49   }\n
04:27:49   IN2 n_2() {\n
04:27:49   }\n
04:27:49   <M>void m(Supplier<M> m2) {\n
04:27:49   }\n
04:27:49   void testSw(int ijk) {\n
04:27:49     m(switch (ijk) {\n
04:27:49 default ->\n
04:27:49     yield () -> <SelectOnMessageSend:n_1(ijk)>;\n
04:27:49 });\n
04:27:49   }\n
04:27:49 }\n
04:27:49 
04:27:49 --------- Difference is ----------
04:27:49  expected:<...) {\n
04:27:49 default ->\n
04:27:49  []() -> <SelectOnMessa...> but was:<...) {\n
04:27:49 default ->\n
04:27:49  [   yield ]() -> <SelectOnMessa...>
04:27:49 	at org.eclipse.jdt.core.tests.compiler.parser.SelectionParserTest12.test021(SelectionParserTest12.java:1012)
04:27:49 
04:27:49 test022 - 13(org.eclipse.jdt.core.tests.compiler.parser.SelectionParserTest12)  Time elapsed: 0.002 s  <<< FAILURE!
04:27:49 junit.framework.ComparisonFailure: 
04:27:49 invalid selection unit-X.java.
04:27:49 ----------- Expected ------------
04:27:49 import org.eclipse.jdt.annotation.*;\n
04:27:49 import java.util.function.*;\n
04:27:49 interface IN0 {\n
04:27:49 }\n
04:27:49 interface IN1 extends IN0 {\n
04:27:49 }\n
04:27:49 interface IN2 extends IN0 {\n
04:27:49 }\n
04:27:49 public class X {\n
04:27:49   public X() {\n
04:27:49   }\n
04:27:49   IN1 n_1(int ijk) {\n
04:27:49   }\n
04:27:49   IN2 n_2() {\n
04:27:49   }\n
04:27:49   <M>void m(Supplier<M> m2) {\n
04:27:49   }\n
04:27:49   void testSw(int ijk) {\n
04:27:49     m(switch (ijk) {\n
04:27:49 default ->\n
04:27:49  () -> n_1(<SelectOnName:ijk>);\n
04:27:49 });\n
04:27:49   }\n
04:27:49 }\n
04:27:49 
04:27:49 ------------ but was ------------
04:27:49 import org.eclipse.jdt.annotation.*;\n
04:27:49 import java.util.function.*;\n
04:27:49 interface IN0 {\n
04:27:49 }\n
04:27:49 interface IN1 extends IN0 {\n
04:27:49 }\n
04:27:49 interface IN2 extends IN0 {\n
04:27:49 }\n
04:27:49 public class X {\n
04:27:49   public X() {\n
04:27:49   }\n
04:27:49   IN1 n_1(int ijk) {\n
04:27:49   }\n
04:27:49   IN2 n_2() {\n
04:27:49   }\n
04:27:49   <M>void m(Supplier<M> m2) {\n
04:27:49   }\n
04:27:49   void testSw(int ijk) {\n
04:27:49     m(switch (ijk) {\n
04:27:49 default ->\n
04:27:49     yield () -> n_1(<SelectOnName:ijk>);\n
04:27:49 });\n
04:27:49   }\n
04:27:49 }\n
04:27:49 
04:27:49 --------- Difference is ----------
04:27:49  expected:<...) {\n
04:27:49 default ->\n
04:27:49  []() -> n_1(<SelectOnN...> but was:<...) {\n
04:27:49 default ->\n
04:27:49  [   yield ]() -> n_1(<SelectOnN...>
04:27:49 	at org.eclipse.jdt.core.tests.compiler.parser.SelectionParserTest12.test022(SelectionParserTest12.java:1067)
04:27:49 
04:27:49 test0001 - 13(org.eclipse.jdt.core.tests.compiler.parser.ModuleDeclarationSyntaxTest)  Time elapsed: 0 s
04:27:49 test0002 - 13(org.eclipse.jdt.core.tests.compiler.parser.ModuleDeclarationSyntaxTest)  Time elapsed: 0 s
04:27:49 test0003 - 13(org.eclipse.jdt.core.tests.compiler.parser.ModuleDeclarationSyntaxTest)  Time elapsed: 0 s
04:27:49 test0004 - 13(org.eclipse.jdt.core.tests.compiler.parser.ModuleDeclarationSyntaxTest)  Time elapsed: 0 s
04:27:49 test0005 - 13(org.eclipse.jdt.core.tests.compiler.parser.ModuleDeclarationSyntaxTest)  Time elapsed: 0 s
04:27:49 test0006 - 13(org.eclipse.jdt.core.tests.compiler.parser.ModuleDeclarationSyntaxTest)  Time elapsed: 0 s
04:27:49 test0007 - 13(org.eclipse.jdt.core.tests.compiler.parser.ModuleDeclarationSyntaxTest)  Time elapsed: 0.003 s
04:27:49 test0008 - 13(org.eclipse.jdt.core.tests.compiler.parser.ModuleDeclarationSyntaxTest)  Time elapsed: 0.001 s
04:27:49 test0009 - 13(org.eclipse.jdt.core.tests.compiler.parser.ModuleDeclarationSyntaxTest)  Time elapsed: 0 s
04:27:49 test0010 - 13(org.eclipse.jdt.core.tests.compiler.parser.ModuleDeclarationSyntaxTest)  Time elapsed: 0.001 s
04:27:49 test0011 - 13(org.eclipse.jdt.core.tests.compiler.parser.ModuleDeclarationSyntaxTest)  Time elapsed: 0 s
04:27:49 test0012 - 13(org.eclipse.jdt.core.tests.compiler.parser.ModuleDeclarationSyntaxTest)  Time elapsed: 0.001 s
04:27:49 test0013 - 13(org.eclipse.jdt.core.tests.compiler.parser.ModuleDeclarationSyntaxTest)  Time elapsed: 0 s
04:27:49 test0014 - 13(org.eclipse.jdt.core.tests.compiler.parser.ModuleDeclarationSyntaxTest)  Time elapsed: 0.001 s
04:27:49 test0015 - 13(org.eclipse.jdt.core.tests.compiler.parser.ModuleDeclarationSyntaxTest)  Time elapsed: 0 s
04:27:49 test0016 - 13(org.eclipse.jdt.core.tests.compiler.parser.ModuleDeclarationSyntaxTest)  Time elapsed: 0 s
04:27:49 test0017 - 13(org.eclipse.jdt.core.tests.compiler.parser.ModuleDeclarationSyntaxTest)  Time elapsed: 0 s
04:27:49 test0018 - 13(org.eclipse.jdt.core.tests.compiler.parser.ModuleDeclarationSyntaxTest)  Time elapsed: 0 s
04:27:49 test0019 - 13(org.eclipse.jdt.core.tests.compiler.parser.ModuleDeclarationSyntaxTest)  Time elapsed: 0.001 s
04:27:49 test0020 - 13(org.eclipse.jdt.core.tests.compiler.parser.ModuleDeclarationSyntaxTest)  Time elapsed: 0 s
04:27:49 test0021 - 13(org.eclipse.jdt.core.tests.compiler.parser.ModuleDeclarationSyntaxTest)  Time elapsed: 0 s
04:27:49 test0022 - 13(org.eclipse.jdt.core.tests.compiler.parser.ModuleDeclarationSyntaxTest)  Time elapsed: 0 s
04:27:49 test0023 - 13(org.eclipse.jdt.core.tests.compiler.parser.ModuleDeclarationSyntaxTest)  Time elapsed: 0 s
04:27:49 test0024 - 13(org.eclipse.jdt.core.tests.compiler.parser.ModuleDeclarationSyntaxTest)  Time elapsed: 0.001 s
04:27:49 test0025 - 13(org.eclipse.jdt.core.tests.compiler.parser.ModuleDeclarationSyntaxTest)  Time elapsed: 0 s
04:27:49 test0026 - 13(org.eclipse.jdt.core.tests.compiler.parser.ModuleDeclarationSyntaxTest)  Time elapsed: 0 s
04:27:49 test0027 - 13(org.eclipse.jdt.core.tests.compiler.parser.ModuleDeclarationSyntaxTest)  Time elapsed: 0.001 s
04:27:49 testBug518626 - 13(org.eclipse.jdt.core.tests.compiler.parser.ModuleDeclarationSyntaxTest)  Time elapsed: 0 s
04:27:49 testbug488541 - 13(org.eclipse.jdt.core.tests.compiler.parser.ModuleDeclarationSyntaxTest)  Time elapsed: 0 s
04:27:49 testbug488541a - 13(org.eclipse.jdt.core.tests.compiler.parser.ModuleDeclarationSyntaxTest)  Time elapsed: 0 s
04:27:49 testbug488541b - 13(org.eclipse.jdt.core.tests.compiler.parser.ModuleDeclarationSyntaxTest)  Time elapsed: 0.001 s
04:27:49 test0001_class_var_warning - 13(org.eclipse.jdt.core.tests.compiler.regression.JEP286ReservedWordTest)  Time elapsed: 0.001 s
04:27:49 test0002_interface_var_warning - 13(org.eclipse.jdt.core.tests.compiler.regression.JEP286ReservedWordTest)  Time elapsed: 0.001 s
04:27:49 testBug530920 - 13(org.eclipse.jdt.core.tests.compiler.regression.JEP286ReservedWordTest)  Time elapsed: 0.001 s
04:27:49 testBug530920a - 13(org.eclipse.jdt.core.tests.compiler.regression.JEP286ReservedWordTest)  Time elapsed: 0.001 s
04:27:49 test1 - 13(org.eclipse.jdt.core.tests.compiler.regression.Unicode12_1Test)  Time elapsed: 0.001 s  <<< ERROR!
04:27:49 java.lang.IllegalArgumentException
04:27:49 
04:27:49 test2 - 13(org.eclipse.jdt.core.tests.compiler.regression.Unicode12_1Test)  Time elapsed: 0 s  <<< ERROR!
04:27:49 java.lang.IllegalArgumentException
04:27:49 
04:27:49 Running org.eclipse.jdt.core.tests.eval.TestAll
04:27:50 Listening for transport dt_socket at address: 36329
04:27:50 1.4: connected to VM using port 36329
04:27:50 1.4: connected to target using port 36329
04:27:50 This is an expected exception printed by the target VM:
04:27:50 java.io.IOException
04:27:50 	at CodeSnippet_73.run(Unknown Source)
04:27:50 	at java.base/jdk.internal.reflect.GeneratedMethodAccessor1.invoke(Unknown Source)
04:27:50 	at java.base/jdk.internal.reflect.DelegatingMethodAccessorImpl.invoke(DelegatingMethodAccessorImpl.java:43)
04:27:50 	at java.base/java.lang.reflect.Method.invoke(Method.java:567)
04:27:50 	at org.eclipse.jdt.core.tests.eval.target.CodeSnippetRunner$2.run(CodeSnippetRunner.java:351)
04:27:50 This is an expected error printed by the target VM:
04:27:50 java.lang.Error
04:27:50 	at CodeSnippet_75.run(Unknown Source)
04:27:50 	at java.base/jdk.internal.reflect.GeneratedMethodAccessor1.invoke(Unknown Source)
04:27:50 	at java.base/jdk.internal.reflect.DelegatingMethodAccessorImpl.invoke(DelegatingMethodAccessorImpl.java:43)
04:27:50 	at java.base/java.lang.reflect.Method.invoke(Method.java:567)
04:27:50 	at org.eclipse.jdt.core.tests.eval.target.CodeSnippetRunner$2.run(CodeSnippetRunner.java:351)
04:28:01 java.net.ConnectException: Connection refused (Connection refused)
04:28:01 	at java.base/java.net.PlainSocketImpl.socketConnect(Native Method)
04:28:01 	at java.base/java.net.AbstractPlainSocketImpl.doConnect(AbstractPlainSocketImpl.java:412)
04:28:01 	at java.base/java.net.AbstractPlainSocketImpl.connectToAddress(AbstractPlainSocketImpl.java:255)
04:28:01 	at java.base/java.net.AbstractPlainSocketImpl.connect(AbstractPlainSocketImpl.java:236)
04:28:01 	at java.base/java.net.SocksSocketImpl.connect(SocksSocketImpl.java:339)
04:28:01 	at java.base/java.net.Socket.connect(Socket.java:576)
04:28:01 	at java.base/java.net.Socket.connect(Socket.java:525)
04:28:01 	at java.base/java.net.Socket.<init>(Socket.java:448)
04:28:01 	at java.base/java.net.Socket.<init>(Socket.java:225)
04:28:01 	at org.eclipse.jdi.internal.connect.SocketTransportService$2.run(SocketTransportService.java:147)
04:28:01 	at java.base/java.lang.Thread.run(Thread.java:830)
04:28:01 1.7: could not contact the VM at localhost:43721. Retrying...
04:28:01 java.net.ConnectException: Connection refused (Connection refused)
04:28:01 	at java.base/java.net.PlainSocketImpl.socketConnect(Native Method)
04:28:01 	at java.base/java.net.AbstractPlainSocketImpl.doConnect(AbstractPlainSocketImpl.java:412)
04:28:01 	at java.base/java.net.AbstractPlainSocketImpl.connectToAddress(AbstractPlainSocketImpl.java:255)
04:28:01 	at java.base/java.net.AbstractPlainSocketImpl.connect(AbstractPlainSocketImpl.java:236)
04:28:01 	at java.base/java.net.SocksSocketImpl.connect(SocksSocketImpl.java:339)
04:28:01 	at java.base/java.net.Socket.connect(Socket.java:576)
04:28:01 	at java.base/java.net.Socket.connect(Socket.java:525)
04:28:01 	at java.base/java.net.Socket.<init>(Socket.java:448)
04:28:01 	at java.base/java.net.Socket.<init>(Socket.java:225)
04:28:01 	at org.eclipse.jdi.internal.connect.SocketTransportService$2.run(SocketTransportService.java:147)
04:28:01 	at java.base/java.lang.Thread.run(Thread.java:830)
04:28:01 1.7: could not contact the VM at localhost:43721. Retrying...
04:28:01 java.net.ConnectException: Connection refused (Connection refused)
04:28:01 	at java.base/java.net.PlainSocketImpl.socketConnect(Native Method)
04:28:01 	at java.base/java.net.AbstractPlainSocketImpl.doConnect(AbstractPlainSocketImpl.java:412)
04:28:01 	at java.base/java.net.AbstractPlainSocketImpl.connectToAddress(AbstractPlainSocketImpl.java:255)
04:28:01 	at java.base/java.net.AbstractPlainSocketImpl.connect(AbstractPlainSocketImpl.java:236)
04:28:01 	at java.base/java.net.SocksSocketImpl.connect(SocksSocketImpl.java:339)
04:28:01 	at java.base/java.net.Socket.connect(Socket.java:576)
04:28:01 	at java.base/java.net.Socket.connect(Socket.java:525)
04:28:01 	at java.base/java.net.Socket.<init>(Socket.java:448)
04:28:01 	at java.base/java.net.Socket.<init>(Socket.java:225)
04:28:01 	at org.eclipse.jdi.internal.connect.SocketTransportService$2.run(SocketTransportService.java:147)
04:28:01 	at java.base/java.lang.Thread.run(Thread.java:830)
04:28:01 1.7: could not contact the VM at localhost:43721. Retrying...
04:28:01 java.net.ConnectException: Connection refused (Connection refused)
04:28:01 	at java.base/java.net.PlainSocketImpl.socketConnect(Native Method)
04:28:01 	at java.base/java.net.AbstractPlainSocketImpl.doConnect(AbstractPlainSocketImpl.java:412)
04:28:01 	at java.base/java.net.AbstractPlainSocketImpl.connectToAddress(AbstractPlainSocketImpl.java:255)
04:28:01 	at java.base/java.net.AbstractPlainSocketImpl.connect(AbstractPlainSocketImpl.java:236)
04:28:01 	at java.base/java.net.SocksSocketImpl.connect(SocksSocketImpl.java:339)
04:28:01 	at java.base/java.net.Socket.connect(Socket.java:576)
04:28:01 	at java.base/java.net.Socket.connect(Socket.java:525)
04:28:01 	at java.base/java.net.Socket.<init>(Socket.java:448)
04:28:01 	at java.base/java.net.Socket.<init>(Socket.java:225)
04:28:01 	at org.eclipse.jdi.internal.connect.SocketTransportService$2.run(SocketTransportService.java:147)
04:28:01 	at java.base/java.lang.Thread.run(Thread.java:830)
04:28:01 1.7: could not contact the VM at localhost:43721. Retrying...
04:28:01 java.net.ConnectException: Connection refused (Connection refused)
04:28:01 	at java.base/java.net.PlainSocketImpl.socketConnect(Native Method)
04:28:01 	at java.base/java.net.AbstractPlainSocketImpl.doConnect(AbstractPlainSocketImpl.java:412)
04:28:01 	at java.base/java.net.AbstractPlainSocketImpl.connectToAddress(AbstractPlainSocketImpl.java:255)
04:28:01 	at java.base/java.net.AbstractPlainSocketImpl.connect(AbstractPlainSocketImpl.java:236)
04:28:01 	at java.base/java.net.SocksSocketImpl.connect(SocksSocketImpl.java:339)
04:28:01 	at java.base/java.net.Socket.connect(Socket.java:576)
04:28:01 	at java.base/java.net.Socket.connect(Socket.java:525)
04:28:01 	at java.base/java.net.Socket.<init>(Socket.java:448)
04:28:01 	at java.base/java.net.Socket.<init>(Socket.java:225)
04:28:01 	at org.eclipse.jdi.internal.connect.SocketTransportService$2.run(SocketTransportService.java:147)
04:28:01 	at java.base/java.lang.Thread.run(Thread.java:830)
04:28:01 1.7: could not contact the VM at localhost:43721. Retrying...
04:28:01 java.net.ConnectException: Connection refused (Connection refused)
04:28:01 	at java.base/java.net.PlainSocketImpl.socketConnect(Native Method)
04:28:01 	at java.base/java.net.AbstractPlainSocketImpl.doConnect(AbstractPlainSocketImpl.java:412)
04:28:01 	at java.base/java.net.AbstractPlainSocketImpl.connectToAddress(AbstractPlainSocketImpl.java:255)
04:28:01 	at java.base/java.net.AbstractPlainSocketImpl.connect(AbstractPlainSocketImpl.java:236)
04:28:01 	at java.base/java.net.SocksSocketImpl.connect(SocksSocketImpl.java:339)
04:28:01 	at java.base/java.net.Socket.connect(Socket.java:576)
04:28:01 	at java.base/java.net.Socket.connect(Socket.java:525)
04:28:01 	at java.base/java.net.Socket.<init>(Socket.java:448)
04:28:01 	at java.base/java.net.Socket.<init>(Socket.java:225)
04:28:01 	at org.eclipse.jdi.internal.connect.SocketTransportService$2.run(SocketTransportService.java:147)
04:28:01 	at java.base/java.lang.Thread.run(Thread.java:830)
04:28:01 1.7: could not contact the VM at localhost:43721. Retrying...
04:28:02 java.net.ConnectException: Connection refused (Connection refused)
04:28:02 	at java.base/java.net.PlainSocketImpl.socketConnect(Native Method)
04:28:02 	at java.base/java.net.AbstractPlainSocketImpl.doConnect(AbstractPlainSocketImpl.java:412)
04:28:02 	at java.base/java.net.AbstractPlainSocketImpl.connectToAddress(AbstractPlainSocketImpl.java:255)
04:28:02 	at java.base/java.net.AbstractPlainSocketImpl.connect(AbstractPlainSocketImpl.java:236)
04:28:02 	at java.base/java.net.SocksSocketImpl.connect(SocksSocketImpl.java:339)
04:28:02 	at java.base/java.net.Socket.connect(Socket.java:576)
04:28:02 	at java.base/java.net.Socket.connect(Socket.java:525)
04:28:02 	at java.base/java.net.Socket.<init>(Socket.java:448)
04:28:02 	at java.base/java.net.Socket.<init>(Socket.java:225)
04:28:02 	at org.eclipse.jdi.internal.connect.SocketTransportService$2.run(SocketTransportService.java:147)
04:28:02 	at java.base/java.lang.Thread.run(Thread.java:830)
04:28:02 1.7: could not contact the VM at localhost:43721. Retrying...
04:28:02 java.net.ConnectException: Connection refused (Connection refused)
04:28:02 	at java.base/java.net.PlainSocketImpl.socketConnect(Native Method)
04:28:02 	at java.base/java.net.AbstractPlainSocketImpl.doConnect(AbstractPlainSocketImpl.java:412)
04:28:02 	at java.base/java.net.AbstractPlainSocketImpl.connectToAddress(AbstractPlainSocketImpl.java:255)
04:28:02 	at java.base/java.net.AbstractPlainSocketImpl.connect(AbstractPlainSocketImpl.java:236)
04:28:02 	at java.base/java.net.SocksSocketImpl.connect(SocksSocketImpl.java:339)
04:28:02 	at java.base/java.net.Socket.connect(Socket.java:576)
04:28:02 	at java.base/java.net.Socket.connect(Socket.java:525)
04:28:02 	at java.base/java.net.Socket.<init>(Socket.java:448)
04:28:02 	at java.base/java.net.Socket.<init>(Socket.java:225)
04:28:02 	at org.eclipse.jdi.internal.connect.SocketTransportService$2.run(SocketTransportService.java:147)
04:28:02 	at java.base/java.lang.Thread.run(Thread.java:830)
04:28:02 1.7: could not contact the VM at localhost:43721. Retrying...
04:28:02 Listening for transport dt_socket at address: 43721
04:28:02 1.7: connected to VM using port 43721
04:28:02 1.7: connected to target using port 43721
04:28:03 This is an expected exception printed by the target VM:
04:28:03 java.io.IOException
04:28:03 	at CodeSnippet_395.run(Unknown Source)
04:28:03 	at java.base/jdk.internal.reflect.GeneratedMethodAccessor1.invoke(Unknown Source)
04:28:03 	at java.base/jdk.internal.reflect.DelegatingMethodAccessorImpl.invoke(DelegatingMethodAccessorImpl.java:43)
04:28:03 	at java.base/java.lang.reflect.Method.invoke(Method.java:567)
04:28:03 	at org.eclipse.jdt.core.tests.eval.target.CodeSnippetRunner$2.run(CodeSnippetRunner.java:351)
04:28:03 This is an expected error printed by the target VM:
04:28:03 java.lang.Error
04:28:03 	at CodeSnippet_398.run(Unknown Source)
04:28:03 	at java.base/jdk.internal.reflect.GeneratedMethodAccessor1.invoke(Unknown Source)
04:28:03 	at java.base/jdk.internal.reflect.DelegatingMethodAccessorImpl.invoke(DelegatingMethodAccessorImpl.java:43)
04:28:03 	at java.base/java.lang.reflect.Method.invoke(Method.java:567)
04:28:03 	at org.eclipse.jdt.core.tests.eval.target.CodeSnippetRunner$2.run(CodeSnippetRunner.java:351)
04:28:15 java.net.ConnectException: Connection refused (Connection refused)
04:28:15 	at java.base/java.net.PlainSocketImpl.socketConnect(Native Method)
04:28:15 	at java.base/java.net.AbstractPlainSocketImpl.doConnect(AbstractPlainSocketImpl.java:412)
04:28:15 	at java.base/java.net.AbstractPlainSocketImpl.connectToAddress(AbstractPlainSocketImpl.java:255)
04:28:15 	at java.base/java.net.AbstractPlainSocketImpl.connect(AbstractPlainSocketImpl.java:236)
04:28:15 	at java.base/java.net.SocksSocketImpl.connect(SocksSocketImpl.java:339)
04:28:15 	at java.base/java.net.Socket.connect(Socket.java:576)
04:28:15 	at java.base/java.net.Socket.connect(Socket.java:525)
04:28:15 	at java.base/java.net.Socket.<init>(Socket.java:448)
04:28:15 	at java.base/java.net.Socket.<init>(Socket.java:225)
04:28:15 	at org.eclipse.jdi.internal.connect.SocketTransportService$2.run(SocketTransportService.java:147)
04:28:15 	at java.base/java.lang.Thread.run(Thread.java:830)
04:28:15 1.8: could not contact the VM at localhost:50417. Retrying...
04:28:15 Listening for transport dt_socket at address: 50417
04:28:15 1.8: connected to VM using port 50417
04:28:15 1.8: connected to target using port 50417
04:28:16 This is an expected exception printed by the target VM:
04:28:16 java.io.IOException
04:28:16 	at CodeSnippet_736.run(Unknown Source)
04:28:16 	at java.base/jdk.internal.reflect.GeneratedMethodAccessor1.invoke(Unknown Source)
04:28:16 	at java.base/jdk.internal.reflect.DelegatingMethodAccessorImpl.invoke(DelegatingMethodAccessorImpl.java:43)
04:28:16 	at java.base/java.lang.reflect.Method.invoke(Method.java:567)
04:28:16 	at org.eclipse.jdt.core.tests.eval.target.CodeSnippetRunner$2.run(CodeSnippetRunner.java:351)
04:28:16 This is an expected error printed by the target VM:
04:28:16 java.lang.Error
04:28:16 	at CodeSnippet_739.run(Unknown Source)
04:28:16 	at java.base/jdk.internal.reflect.GeneratedMethodAccessor1.invoke(Unknown Source)
04:28:16 	at java.base/jdk.internal.reflect.DelegatingMethodAccessorImpl.invoke(DelegatingMethodAccessorImpl.java:43)
04:28:16 	at java.base/java.lang.reflect.Method.invoke(Method.java:567)
04:28:16 	at org.eclipse.jdt.core.tests.eval.target.CodeSnippetRunner$2.run(CodeSnippetRunner.java:351)
04:28:27 java.net.ConnectException: Connection refused (Connection refused)
04:28:27 	at java.base/java.net.PlainSocketImpl.socketConnect(Native Method)
04:28:27 	at java.base/java.net.AbstractPlainSocketImpl.doConnect(AbstractPlainSocketImpl.java:412)
04:28:27 	at java.base/java.net.AbstractPlainSocketImpl.connectToAddress(AbstractPlainSocketImpl.java:255)
04:28:27 	at java.base/java.net.AbstractPlainSocketImpl.connect(AbstractPlainSocketImpl.java:236)
04:28:27 	at java.base/java.net.SocksSocketImpl.connect(SocksSocketImpl.java:339)
04:28:27 	at java.base/java.net.Socket.connect(Socket.java:576)
04:28:27 	at java.base/java.net.Socket.connect(Socket.java:525)
04:28:27 	at java.base/java.net.Socket.<init>(Socket.java:448)
04:28:27 	at java.base/java.net.Socket.<init>(Socket.java:225)
04:28:27 	at org.eclipse.jdi.internal.connect.SocketTransportService$2.run(SocketTransportService.java:147)
04:28:27 	at java.base/java.lang.Thread.run(Thread.java:830)
04:28:27 13: could not contact the VM at localhost:40711. Retrying...
04:28:27 Listening for transport dt_socket at address: 40711
04:28:27 13: connected to VM using port 40711
04:28:27 13: connected to target using port 40711
04:28:27 This is an expected exception printed by the target VM:
04:28:27 java.io.IOException
04:28:27 	at CodeSnippet_1077.run(Unknown Source)
04:28:27 	at java.base/jdk.internal.reflect.GeneratedMethodAccessor1.invoke(Unknown Source)
04:28:27 	at java.base/jdk.internal.reflect.DelegatingMethodAccessorImpl.invoke(DelegatingMethodAccessorImpl.java:43)
04:28:27 	at java.base/java.lang.reflect.Method.invoke(Method.java:567)
04:28:27 	at org.eclipse.jdt.core.tests.eval.target.CodeSnippetRunner$2.run(CodeSnippetRunner.java:351)
04:28:27 This is an expected error printed by the target VM:
04:28:27 java.lang.Error
04:28:27 	at CodeSnippet_1080.run(Unknown Source)
04:28:27 	at java.base/jdk.internal.reflect.GeneratedMethodAccessor1.invoke(Unknown Source)
04:28:27 	at java.base/jdk.internal.reflect.DelegatingMethodAccessorImpl.invoke(DelegatingMethodAccessorImpl.java:43)
04:28:27 	at java.base/java.lang.reflect.Method.invoke(Method.java:567)
04:28:27 	at org.eclipse.jdt.core.tests.eval.target.CodeSnippetRunner$2.run(CodeSnippetRunner.java:351)
04:28:39 Tests run: 760, Failures: 0, Errors: 0, Skipped: 0, Time elapsed: 49.803 s - in org.eclipse.jdt.core.tests.eval.TestAll
04:28:39 testAllVariables - 1.4(org.eclipse.jdt.core.tests.eval.SanityTestEvaluationContext)  Time elapsed: 0 s
04:28:39 testEvaluate - 1.4(org.eclipse.jdt.core.tests.eval.SanityTestEvaluationContext)  Time elapsed: 0.034 s
04:28:39 testEvaluateImports - 1.4(org.eclipse.jdt.core.tests.eval.SanityTestEvaluationContext)  Time elapsed: 0.001 s
04:28:39 testEvaluateVariable - 1.4(org.eclipse.jdt.core.tests.eval.SanityTestEvaluationContext)  Time elapsed: 0.011 s
04:28:39 testEvaluateVariables - 1.4(org.eclipse.jdt.core.tests.eval.SanityTestEvaluationContext)  Time elapsed: 0.002 s
04:28:39 testGetSetImports - 1.4(org.eclipse.jdt.core.tests.eval.SanityTestEvaluationContext)  Time elapsed: 0 s
04:28:39 testGetSetPackageName - 1.4(org.eclipse.jdt.core.tests.eval.SanityTestEvaluationContext)  Time elapsed: 0 s
04:28:39 testNewDeleteVariable - 1.4(org.eclipse.jdt.core.tests.eval.SanityTestEvaluationContext)  Time elapsed: 0 s
04:28:39 testGetEvaluationType - 1.4(org.eclipse.jdt.core.tests.eval.SanityTestEvaluationResult)  Time elapsed: 0.006 s
04:28:39 testGetProblems - 1.4(org.eclipse.jdt.core.tests.eval.SanityTestEvaluationResult)  Time elapsed: 0.004 s
04:28:39 testGetValue - 1.4(org.eclipse.jdt.core.tests.eval.SanityTestEvaluationResult)  Time elapsed: 0.003 s
04:28:39 testGetValueDisplayString - 1.4(org.eclipse.jdt.core.tests.eval.SanityTestEvaluationResult)  Time elapsed: 0.005 s
04:28:39 testGetValueTypeName - 1.4(org.eclipse.jdt.core.tests.eval.SanityTestEvaluationResult)  Time elapsed: 0.004 s
04:28:39 testHasErrors - 1.4(org.eclipse.jdt.core.tests.eval.SanityTestEvaluationResult)  Time elapsed: 0.005 s
04:28:39 testHasProblems - 1.4(org.eclipse.jdt.core.tests.eval.SanityTestEvaluationResult)  Time elapsed: 0.004 s
04:28:39 testHasValue - 1.4(org.eclipse.jdt.core.tests.eval.SanityTestEvaluationResult)  Time elapsed: 0.003 s
04:28:39 testHasWarnings - 1.4(org.eclipse.jdt.core.tests.eval.SanityTestEvaluationResult)  Time elapsed: 0.003 s
04:28:39 testAllKindOfValues - 1.4(org.eclipse.jdt.core.tests.eval.VariableTest)  Time elapsed: 0.05 s
04:28:39 testCodeSnippetVarAssign - 1.4(org.eclipse.jdt.core.tests.eval.VariableTest)  Time elapsed: 0.074 s
04:28:39 testCodeSnippetVarRetrieval - 1.4(org.eclipse.jdt.core.tests.eval.VariableTest)  Time elapsed: 0.031 s
04:28:39 testImports - 1.4(org.eclipse.jdt.core.tests.eval.VariableTest)  Time elapsed: 0.025 s
04:28:39 testSeveralVariableInstallations - 1.4(org.eclipse.jdt.core.tests.eval.VariableTest)  Time elapsed: 0.084 s
04:28:39 testBug345334 - 1.4(org.eclipse.jdt.core.tests.eval.CodeSnippetTest)  Time elapsed: 0.004 s
04:28:39 testBug464656 - 1.4(org.eclipse.jdt.core.tests.eval.CodeSnippetTest)  Time elapsed: 0 s
04:28:39 testCheckedException - 1.4(org.eclipse.jdt.core.tests.eval.CodeSnippetTest)  Time elapsed: 0.006 s
04:28:39 testDiamond - 1.4(org.eclipse.jdt.core.tests.eval.CodeSnippetTest)  Time elapsed: 0 s
04:28:39 testEmptyStatement - 1.4(org.eclipse.jdt.core.tests.eval.CodeSnippetTest)  Time elapsed: 0.005 s
04:28:39 testEvaluateEmptyImport - 1.4(org.eclipse.jdt.core.tests.eval.CodeSnippetTest)  Time elapsed: 0.001 s
04:28:39 testEvaluateExistingPackageAndNonExistingTypeImports - 1.4(org.eclipse.jdt.core.tests.eval.CodeSnippetTest)  Time elapsed: 0 s
04:28:39 testEvaluateNonExistingPackageAndExistingTypeImports - 1.4(org.eclipse.jdt.core.tests.eval.CodeSnippetTest)  Time elapsed: 0.001 s
04:28:39 testEvaluateNonExistingPackageImport - 1.4(org.eclipse.jdt.core.tests.eval.CodeSnippetTest)  Time elapsed: 0 s
04:28:39 testEvaluateNonExistingTypeImport - 1.4(org.eclipse.jdt.core.tests.eval.CodeSnippetTest)  Time elapsed: 0.001 s
04:28:39 testEvaluateValidPackageAndTypeImports - 1.4(org.eclipse.jdt.core.tests.eval.CodeSnippetTest)  Time elapsed: 0 s
04:28:39 testEvaluateValidPackageImport - 1.4(org.eclipse.jdt.core.tests.eval.CodeSnippetTest)  Time elapsed: 0.001 s
04:28:39 testEvaluateValidTypeImport - 1.4(org.eclipse.jdt.core.tests.eval.CodeSnippetTest)  Time elapsed: 0 s
04:28:39 testFinallyError - 1.4(org.eclipse.jdt.core.tests.eval.CodeSnippetTest)  Time elapsed: 0.005 s
04:28:39 testFinallyOneBlock - 1.4(org.eclipse.jdt.core.tests.eval.CodeSnippetTest)  Time elapsed: 0.005 s
04:28:39 testFinallyTwoBlock - 1.4(org.eclipse.jdt.core.tests.eval.CodeSnippetTest)  Time elapsed: 0.004 s
04:28:39 testFor89632 - 1.4(org.eclipse.jdt.core.tests.eval.CodeSnippetTest)  Time elapsed: 0 s
04:28:39 testFreeReturnAnonymous - 1.4(org.eclipse.jdt.core.tests.eval.CodeSnippetTest)  Time elapsed: 0.004 s
04:28:39 testFreeReturnClassDeclaration - 1.4(org.eclipse.jdt.core.tests.eval.CodeSnippetTest)  Time elapsed: 0.005 s
04:28:39 testFreeReturnExpression - 1.4(org.eclipse.jdt.core.tests.eval.CodeSnippetTest)  Time elapsed: 0.003 s
04:28:39 testFreeReturnInteger - 1.4(org.eclipse.jdt.core.tests.eval.CodeSnippetTest)  Time elapsed: 0.003 s
04:28:39 testFreeReturnLocalVar - 1.4(org.eclipse.jdt.core.tests.eval.CodeSnippetTest)  Time elapsed: 0.003 s
04:28:39 testFreeReturnStatement - 1.4(org.eclipse.jdt.core.tests.eval.CodeSnippetTest)  Time elapsed: 0.003 s
04:28:39 testImportPackage - 1.4(org.eclipse.jdt.core.tests.eval.CodeSnippetTest)  Time elapsed: 0.005 s
04:28:39 testImportType - 1.4(org.eclipse.jdt.core.tests.eval.CodeSnippetTest)  Time elapsed: 0.007 s
04:28:39 testImportTypeAndPackage - 1.4(org.eclipse.jdt.core.tests.eval.CodeSnippetTest)  Time elapsed: 0.006 s
04:28:39 testInnerClassAnonymous - 1.4(org.eclipse.jdt.core.tests.eval.CodeSnippetTest)  Time elapsed: 0.006 s
04:28:39 testInnerClassNamed - 1.4(org.eclipse.jdt.core.tests.eval.CodeSnippetTest)  Time elapsed: 0.004 s
04:28:39 testReturnDisplayStringBoolean - 1.4(org.eclipse.jdt.core.tests.eval.CodeSnippetTest)  Time elapsed: 0.004 s
04:28:39 testReturnDisplayStringCharacter - 1.4(org.eclipse.jdt.core.tests.eval.CodeSnippetTest)  Time elapsed: 0.004 s
04:28:39 testReturnDisplayStringDouble - 1.4(org.eclipse.jdt.core.tests.eval.CodeSnippetTest)  Time elapsed: 0.003 s
04:28:39 testReturnDisplayStringEmptyCodeSnippet - 1.4(org.eclipse.jdt.core.tests.eval.CodeSnippetTest)  Time elapsed: 0.002 s
04:28:39 testReturnDisplayStringFloat - 1.4(org.eclipse.jdt.core.tests.eval.CodeSnippetTest)  Time elapsed: 0.003 s
04:28:39 testReturnDisplayStringInteger - 1.4(org.eclipse.jdt.core.tests.eval.CodeSnippetTest)  Time elapsed: 0.003 s
04:28:39 testReturnDisplayStringLong - 1.4(org.eclipse.jdt.core.tests.eval.CodeSnippetTest)  Time elapsed: 0.004 s
04:28:39 testReturnDisplayStringNoExplicitReturnedValue - 1.4(org.eclipse.jdt.core.tests.eval.CodeSnippetTest)  Time elapsed: 0.003 s
04:28:39 testReturnDisplayStringObject - 1.4(org.eclipse.jdt.core.tests.eval.CodeSnippetTest)  Time elapsed: 0.005 s
04:28:39 testReturnDisplayStringShort - 1.4(org.eclipse.jdt.core.tests.eval.CodeSnippetTest)  Time elapsed: 0.002 s
04:28:39 testReturnDisplayStringString - 1.4(org.eclipse.jdt.core.tests.eval.CodeSnippetTest)  Time elapsed: 0.004 s
04:28:39 testReturnDisplayStringVoid - 1.4(org.eclipse.jdt.core.tests.eval.CodeSnippetTest)  Time elapsed: 0.003 s
04:28:39 testReturnTypeBoolean - 1.4(org.eclipse.jdt.core.tests.eval.CodeSnippetTest)  Time elapsed: 0.003 s
04:28:39 testReturnTypeBooleanArray - 1.4(org.eclipse.jdt.core.tests.eval.CodeSnippetTest)  Time elapsed: 0.003 s
04:28:39 testReturnTypeBooleanObject - 1.4(org.eclipse.jdt.core.tests.eval.CodeSnippetTest)  Time elapsed: 0.003 s
04:28:39 testReturnTypeChar - 1.4(org.eclipse.jdt.core.tests.eval.CodeSnippetTest)  Time elapsed: 0.003 s
04:28:39 testReturnTypeCharArray - 1.4(org.eclipse.jdt.core.tests.eval.CodeSnippetTest)  Time elapsed: 0.003 s
04:28:39 testReturnTypeCharacterObject - 1.4(org.eclipse.jdt.core.tests.eval.CodeSnippetTest)  Time elapsed: 0.004 s
04:28:39 testReturnTypeDouble - 1.4(org.eclipse.jdt.core.tests.eval.CodeSnippetTest)  Time elapsed: 0.006 s
04:28:39 testReturnTypeDoubleArray - 1.4(org.eclipse.jdt.core.tests.eval.CodeSnippetTest)  Time elapsed: 0.005 s
04:28:39 testReturnTypeDoubleObject - 1.4(org.eclipse.jdt.core.tests.eval.CodeSnippetTest)  Time elapsed: 0.006 s
04:28:39 testReturnTypeEmptyCodeSnippet - 1.4(org.eclipse.jdt.core.tests.eval.CodeSnippetTest)  Time elapsed: 0.003 s
04:28:39 testReturnTypeFloat - 1.4(org.eclipse.jdt.core.tests.eval.CodeSnippetTest)  Time elapsed: 0.004 s
04:28:39 testReturnTypeFloatArray - 1.4(org.eclipse.jdt.core.tests.eval.CodeSnippetTest)  Time elapsed: 0.005 s
04:28:39 testReturnTypeFloatObject - 1.4(org.eclipse.jdt.core.tests.eval.CodeSnippetTest)  Time elapsed: 0.006 s
04:28:39 testReturnTypeInt - 1.4(org.eclipse.jdt.core.tests.eval.CodeSnippetTest)  Time elapsed: 0.005 s
04:28:39 testReturnTypeIntegerObject - 1.4(org.eclipse.jdt.core.tests.eval.CodeSnippetTest)  Time elapsed: 0.006 s
04:28:39 testReturnTypeLong - 1.4(org.eclipse.jdt.core.tests.eval.CodeSnippetTest)  Time elapsed: 0.004 s
04:28:39 testReturnTypeLongArray - 1.4(org.eclipse.jdt.core.tests.eval.CodeSnippetTest)  Time elapsed: 0.004 s
04:28:39 testReturnTypeLongObject - 1.4(org.eclipse.jdt.core.tests.eval.CodeSnippetTest)  Time elapsed: 0.006 s
04:28:39 testReturnTypeNoExplicitReturnedValue - 1.4(org.eclipse.jdt.core.tests.eval.CodeSnippetTest)  Time elapsed: 0.004 s
04:28:39 testReturnTypeObject - 1.4(org.eclipse.jdt.core.tests.eval.CodeSnippetTest)  Time elapsed: 0.003 s
04:28:39 testReturnTypeObjectArray - 1.4(org.eclipse.jdt.core.tests.eval.CodeSnippetTest)  Time elapsed: 0.004 s
04:28:39 testReturnTypeShort - 1.4(org.eclipse.jdt.core.tests.eval.CodeSnippetTest)  Time elapsed: 0.003 s
04:28:39 testReturnTypeShortArray - 1.4(org.eclipse.jdt.core.tests.eval.CodeSnippetTest)  Time elapsed: 0.004 s
04:28:39 testReturnTypeShortObject - 1.4(org.eclipse.jdt.core.tests.eval.CodeSnippetTest)  Time elapsed: 0.003 s
04:28:39 testReturnTypeString - 1.4(org.eclipse.jdt.core.tests.eval.CodeSnippetTest)  Time elapsed: 0.004 s
04:28:39 testReturnTypeStringArray - 1.4(org.eclipse.jdt.core.tests.eval.CodeSnippetTest)  Time elapsed: 0.004 s
04:28:39 testReturnTypeVoid - 1.4(org.eclipse.jdt.core.tests.eval.CodeSnippetTest)  Time elapsed: 0.005 s
04:28:39 testReturnTypesIntArray - 1.4(org.eclipse.jdt.core.tests.eval.CodeSnippetTest)  Time elapsed: 0.004 s
04:28:39 testRunMethodInAnonymous - 1.4(org.eclipse.jdt.core.tests.eval.CodeSnippetTest)  Time elapsed: 0.207 s
04:28:39 testRunMethodInAnonymous2 - 1.4(org.eclipse.jdt.core.tests.eval.CodeSnippetTest)  Time elapsed: 0.207 s
04:28:39 testRunMethodInAnonymous3 - 1.4(org.eclipse.jdt.core.tests.eval.CodeSnippetTest)  Time elapsed: 0.207 s
04:28:39 testRunMethodInAnonymous4 - 1.4(org.eclipse.jdt.core.tests.eval.CodeSnippetTest)  Time elapsed: 0.206 s
04:28:39 testRunMethodInAnonymous5 - 1.4(org.eclipse.jdt.core.tests.eval.CodeSnippetTest)  Time elapsed: 0.207 s
04:28:39 testRunMethodInAnonymous6 - 1.4(org.eclipse.jdt.core.tests.eval.CodeSnippetTest)  Time elapsed: 0.207 s
04:28:39 testRunMethodInAnonymous7 - 1.4(org.eclipse.jdt.core.tests.eval.CodeSnippetTest)  Time elapsed: 0.208 s
04:28:39 testRunMethodInAnonymous8 - 1.4(org.eclipse.jdt.core.tests.eval.CodeSnippetTest)  Time elapsed: 0.206 s
04:28:39 testExpressionInInnerClass - 1.4(org.eclipse.jdt.core.tests.eval.NegativeCodeSnippetTest)  Time elapsed: 0.002 s
04:28:39 testExtraClosingCurlyBracket - 1.4(org.eclipse.jdt.core.tests.eval.NegativeCodeSnippetTest)  Time elapsed: 0.001 s
04:28:39 testExtraOpenRoundBracket - 1.4(org.eclipse.jdt.core.tests.eval.NegativeCodeSnippetTest)  Time elapsed: 0.001 s
04:28:39 testExtraSemiColonInExpression - 1.4(org.eclipse.jdt.core.tests.eval.NegativeCodeSnippetTest)  Time elapsed: 0.001 s
04:28:39 testInvalidField - 1.4(org.eclipse.jdt.core.tests.eval.NegativeCodeSnippetTest)  Time elapsed: 0.006 s
04:28:39 testInvalidImport - 1.4(org.eclipse.jdt.core.tests.eval.NegativeCodeSnippetTest)  Time elapsed: 0.002 s
04:28:39 testInvalidUseOfThisInSnippet - 1.4(org.eclipse.jdt.core.tests.eval.NegativeCodeSnippetTest)  Time elapsed: 0.001 s
04:28:39 testInvalidUseOfThisInSnippet2 - 1.4(org.eclipse.jdt.core.tests.eval.NegativeCodeSnippetTest)  Time elapsed: 0.001 s
04:28:39 testMissingClosingRoundBracket - 1.4(org.eclipse.jdt.core.tests.eval.NegativeCodeSnippetTest)  Time elapsed: 0.001 s
04:28:39 testMissingDoubleQuote - 1.4(org.eclipse.jdt.core.tests.eval.NegativeCodeSnippetTest)  Time elapsed: 0.001 s
04:28:39 testNonLastExpressionStatement - 1.4(org.eclipse.jdt.core.tests.eval.NegativeCodeSnippetTest)  Time elapsed: 0 s
04:28:39 testProblemInExpression - 1.4(org.eclipse.jdt.core.tests.eval.NegativeCodeSnippetTest)  Time elapsed: 0.001 s
04:28:39 testProblemInExpression2 - 1.4(org.eclipse.jdt.core.tests.eval.NegativeCodeSnippetTest)  Time elapsed: 0.001 s
04:28:39 testProblemInInnerClass - 1.4(org.eclipse.jdt.core.tests.eval.NegativeCodeSnippetTest)  Time elapsed: 0.006 s
04:28:39 testProblemInPreviousStatement - 1.4(org.eclipse.jdt.core.tests.eval.NegativeCodeSnippetTest)  Time elapsed: 0.001 s
04:28:39 testProblemInReturnStatement - 1.4(org.eclipse.jdt.core.tests.eval.NegativeCodeSnippetTest)  Time elapsed: 0.001 s
04:28:39 testRemoveImport - 1.4(org.eclipse.jdt.core.tests.eval.NegativeCodeSnippetTest)  Time elapsed: 0.006 s
04:28:39 testRemoveVariable - 1.4(org.eclipse.jdt.core.tests.eval.NegativeCodeSnippetTest)  Time elapsed: 0.007 s
04:28:39 testUnreachableExpression - 1.4(org.eclipse.jdt.core.tests.eval.NegativeCodeSnippetTest)  Time elapsed: 0.001 s
04:28:39 testUnusedImport - 1.4(org.eclipse.jdt.core.tests.eval.NegativeCodeSnippetTest)  Time elapsed: 0.006 s
04:28:39 testWarning - 1.4(org.eclipse.jdt.core.tests.eval.NegativeCodeSnippetTest)  Time elapsed: 0.003 s
04:28:39 testInitializerProblem - 1.4(org.eclipse.jdt.core.tests.eval.NegativeVariableTest)  Time elapsed: 0.004 s
04:28:39 testUnknownType - 1.4(org.eclipse.jdt.core.tests.eval.NegativeVariableTest)  Time elapsed: 0.001 s
04:28:39 test001 - 1.4(org.eclipse.jdt.core.tests.eval.DebugEvaluationTest)  Time elapsed: 0.157 s
04:28:39 test002 - 1.4(org.eclipse.jdt.core.tests.eval.DebugEvaluationTest)  Time elapsed: 0.13 s
04:28:39 test003 - 1.4(org.eclipse.jdt.core.tests.eval.DebugEvaluationTest)  Time elapsed: 0.02 s
04:28:39 test004 - 1.4(org.eclipse.jdt.core.tests.eval.DebugEvaluationTest)  Time elapsed: 0.12 s
04:28:39 test005 - 1.4(org.eclipse.jdt.core.tests.eval.DebugEvaluationTest)  Time elapsed: 0.13 s
04:28:39 test006 - 1.4(org.eclipse.jdt.core.tests.eval.DebugEvaluationTest)  Time elapsed: 0.125 s
04:28:39 test007 - 1.4(org.eclipse.jdt.core.tests.eval.DebugEvaluationTest)  Time elapsed: 0.126 s
04:28:39 test008 - 1.4(org.eclipse.jdt.core.tests.eval.DebugEvaluationTest)  Time elapsed: 0.133 s
04:28:39 test009 - 1.4(org.eclipse.jdt.core.tests.eval.DebugEvaluationTest)  Time elapsed: 0.12 s
04:28:39 test010 - 1.4(org.eclipse.jdt.core.tests.eval.DebugEvaluationTest)  Time elapsed: 0.127 s
04:28:39 test011 - 1.4(org.eclipse.jdt.core.tests.eval.DebugEvaluationTest)  Time elapsed: 0.125 s
04:28:39 test016 - 1.4(org.eclipse.jdt.core.tests.eval.DebugEvaluationTest)  Time elapsed: 0.227 s
04:28:39 test017 - 1.4(org.eclipse.jdt.core.tests.eval.DebugEvaluationTest)  Time elapsed: 0.117 s
04:28:39 test018 - 1.4(org.eclipse.jdt.core.tests.eval.DebugEvaluationTest)  Time elapsed: 0.239 s
04:28:39 test019 - 1.4(org.eclipse.jdt.core.tests.eval.DebugEvaluationTest)  Time elapsed: 0.024 s
04:28:39 test020 - 1.4(org.eclipse.jdt.core.tests.eval.DebugEvaluationTest)  Time elapsed: 0.13 s
04:28:39 test021 - 1.4(org.eclipse.jdt.core.tests.eval.DebugEvaluationTest)  Time elapsed: 0.24 s
04:28:39 test022 - 1.4(org.eclipse.jdt.core.tests.eval.DebugEvaluationTest)  Time elapsed: 0.252 s
04:28:39 test023 - 1.4(org.eclipse.jdt.core.tests.eval.DebugEvaluationTest)  Time elapsed: 0.252 s
04:28:39 test024 - 1.4(org.eclipse.jdt.core.tests.eval.DebugEvaluationTest)  Time elapsed: 0.251 s
04:28:39 test025 - 1.4(org.eclipse.jdt.core.tests.eval.DebugEvaluationTest)  Time elapsed: 0.238 s
04:28:39 test026 - 1.4(org.eclipse.jdt.core.tests.eval.DebugEvaluationTest)  Time elapsed: 0.129 s
04:28:39 test027 - 1.4(org.eclipse.jdt.core.tests.eval.DebugEvaluationTest)  Time elapsed: 0.129 s
04:28:39 test028 - 1.4(org.eclipse.jdt.core.tests.eval.DebugEvaluationTest)  Time elapsed: 0.125 s
04:28:39 test029 - 1.4(org.eclipse.jdt.core.tests.eval.DebugEvaluationTest)  Time elapsed: 0.125 s
04:28:39 test030 - 1.4(org.eclipse.jdt.core.tests.eval.DebugEvaluationTest)  Time elapsed: 0.132 s
04:28:39 test031 - 1.4(org.eclipse.jdt.core.tests.eval.DebugEvaluationTest)  Time elapsed: 0.136 s
04:28:39 test032 - 1.4(org.eclipse.jdt.core.tests.eval.DebugEvaluationTest)  Time elapsed: 0.021 s
04:28:39 test033 - 1.4(org.eclipse.jdt.core.tests.eval.DebugEvaluationTest)  Time elapsed: 0.13 s
04:28:39 test034 - 1.4(org.eclipse.jdt.core.tests.eval.DebugEvaluationTest)  Time elapsed: 0.128 s
04:28:39 test035 - 1.4(org.eclipse.jdt.core.tests.eval.DebugEvaluationTest)  Time elapsed: 0.129 s
04:28:39 test036 - 1.4(org.eclipse.jdt.core.tests.eval.DebugEvaluationTest)  Time elapsed: 0.126 s
04:28:39 test037 - 1.4(org.eclipse.jdt.core.tests.eval.DebugEvaluationTest)  Time elapsed: 0.125 s
04:28:39 test038 - 1.4(org.eclipse.jdt.core.tests.eval.DebugEvaluationTest)  Time elapsed: 0.124 s
04:28:39 test039 - 1.4(org.eclipse.jdt.core.tests.eval.DebugEvaluationTest)  Time elapsed: 0.128 s
04:28:39 test040 - 1.4(org.eclipse.jdt.core.tests.eval.DebugEvaluationTest)  Time elapsed: 0.128 s
04:28:39 test041 - 1.4(org.eclipse.jdt.core.tests.eval.DebugEvaluationTest)  Time elapsed: 0.132 s
04:28:39 test042 - 1.4(org.eclipse.jdt.core.tests.eval.DebugEvaluationTest)  Time elapsed: 0.125 s
04:28:39 test043 - 1.4(org.eclipse.jdt.core.tests.eval.DebugEvaluationTest)  Time elapsed: 0.126 s
04:28:39 test044 - 1.4(org.eclipse.jdt.core.tests.eval.DebugEvaluationTest)  Time elapsed: 0.126 s
04:28:39 test045 - 1.4(org.eclipse.jdt.core.tests.eval.DebugEvaluationTest)  Time elapsed: 0.125 s
04:28:39 test046 - 1.4(org.eclipse.jdt.core.tests.eval.DebugEvaluationTest)  Time elapsed: 0.126 s
04:28:39 test047 - 1.4(org.eclipse.jdt.core.tests.eval.DebugEvaluationTest)  Time elapsed: 0.127 s
04:28:39 test048 - 1.4(org.eclipse.jdt.core.tests.eval.DebugEvaluationTest)  Time elapsed: 0.13 s
04:28:39 test049 - 1.4(org.eclipse.jdt.core.tests.eval.DebugEvaluationTest)  Time elapsed: 0.125 s
04:28:39 test050 - 1.4(org.eclipse.jdt.core.tests.eval.DebugEvaluationTest)  Time elapsed: 0.126 s
04:28:39 test051 - 1.4(org.eclipse.jdt.core.tests.eval.DebugEvaluationTest)  Time elapsed: 0.126 s
04:28:39 test052 - 1.4(org.eclipse.jdt.core.tests.eval.DebugEvaluationTest)  Time elapsed: 0.126 s
04:28:39 test053 - 1.4(org.eclipse.jdt.core.tests.eval.DebugEvaluationTest)  Time elapsed: 0.127 s
04:28:39 test054 - 1.4(org.eclipse.jdt.core.tests.eval.DebugEvaluationTest)  Time elapsed: 0.125 s
04:28:39 test055 - 1.4(org.eclipse.jdt.core.tests.eval.DebugEvaluationTest)  Time elapsed: 0.127 s
04:28:39 test056 - 1.4(org.eclipse.jdt.core.tests.eval.DebugEvaluationTest)  Time elapsed: 0.129 s
04:28:39 test057 - 1.4(org.eclipse.jdt.core.tests.eval.DebugEvaluationTest)  Time elapsed: 0.128 s
04:28:39 test058 - 1.4(org.eclipse.jdt.core.tests.eval.DebugEvaluationTest)  Time elapsed: 0.126 s
04:28:39 test059 - 1.4(org.eclipse.jdt.core.tests.eval.DebugEvaluationTest)  Time elapsed: 0.129 s
04:28:39 test060 - 1.4(org.eclipse.jdt.core.tests.eval.DebugEvaluationTest)  Time elapsed: 0.128 s
04:28:39 test061 - 1.4(org.eclipse.jdt.core.tests.eval.DebugEvaluationTest)  Time elapsed: 0.471 s
04:28:39 test062 - 1.4(org.eclipse.jdt.core.tests.eval.DebugEvaluationTest)  Time elapsed: 0.125 s
04:28:39 test063 - 1.4(org.eclipse.jdt.core.tests.eval.DebugEvaluationTest)  Time elapsed: 0 s
04:28:39 test065 - 1.4(org.eclipse.jdt.core.tests.eval.DebugEvaluationTest)  Time elapsed: 0 s
04:28:39 test066 - 1.4(org.eclipse.jdt.core.tests.eval.DebugEvaluationTest)  Time elapsed: 0 s
04:28:39 test067 - 1.4(org.eclipse.jdt.core.tests.eval.DebugEvaluationTest)  Time elapsed: 0 s
04:28:39 test068 - 1.4(org.eclipse.jdt.core.tests.eval.DebugEvaluationTest)  Time elapsed: 0 s
04:28:39 test069 - 1.4(org.eclipse.jdt.core.tests.eval.DebugEvaluationTest)  Time elapsed: 0 s
04:28:39 testNegative001 - 1.4(org.eclipse.jdt.core.tests.eval.DebugEvaluationTest)  Time elapsed: 0.018 s
04:28:39 testNegative002 - 1.4(org.eclipse.jdt.core.tests.eval.DebugEvaluationTest)  Time elapsed: 0.021 s
04:28:39 testNegative003 - 1.4(org.eclipse.jdt.core.tests.eval.DebugEvaluationTest)  Time elapsed: 0.018 s
04:28:39 testNegative004 - 1.4(org.eclipse.jdt.core.tests.eval.DebugEvaluationTest)  Time elapsed: 0.009 s
04:28:39 testNegative005 - 1.4(org.eclipse.jdt.core.tests.eval.DebugEvaluationTest)  Time elapsed: 0.009 s
04:28:39 testAllVariables - 1.7(org.eclipse.jdt.core.tests.eval.SanityTestEvaluationContext)  Time elapsed: 0 s
04:28:39 testEvaluate - 1.7(org.eclipse.jdt.core.tests.eval.SanityTestEvaluationContext)  Time elapsed: 1.253 s
04:28:39 testEvaluateImports - 1.7(org.eclipse.jdt.core.tests.eval.SanityTestEvaluationContext)  Time elapsed: 0 s
04:28:39 testEvaluateVariable - 1.7(org.eclipse.jdt.core.tests.eval.SanityTestEvaluationContext)  Time elapsed: 0.007 s
04:28:39 testEvaluateVariables - 1.7(org.eclipse.jdt.core.tests.eval.SanityTestEvaluationContext)  Time elapsed: 0.002 s
04:28:39 testGetSetImports - 1.7(org.eclipse.jdt.core.tests.eval.SanityTestEvaluationContext)  Time elapsed: 0 s
04:28:39 testGetSetPackageName - 1.7(org.eclipse.jdt.core.tests.eval.SanityTestEvaluationContext)  Time elapsed: 0 s
04:28:39 testNewDeleteVariable - 1.7(org.eclipse.jdt.core.tests.eval.SanityTestEvaluationContext)  Time elapsed: 0 s
04:28:39 testGetEvaluationType - 1.7(org.eclipse.jdt.core.tests.eval.SanityTestEvaluationResult)  Time elapsed: 0.004 s
04:28:39 testGetProblems - 1.7(org.eclipse.jdt.core.tests.eval.SanityTestEvaluationResult)  Time elapsed: 0.003 s
04:28:39 testGetValue - 1.7(org.eclipse.jdt.core.tests.eval.SanityTestEvaluationResult)  Time elapsed: 0.003 s
04:28:39 testGetValueDisplayString - 1.7(org.eclipse.jdt.core.tests.eval.SanityTestEvaluationResult)  Time elapsed: 0.003 s
04:28:39 testGetValueTypeName - 1.7(org.eclipse.jdt.core.tests.eval.SanityTestEvaluationResult)  Time elapsed: 0.003 s
04:28:39 testHasErrors - 1.7(org.eclipse.jdt.core.tests.eval.SanityTestEvaluationResult)  Time elapsed: 0.003 s
04:28:39 testHasProblems - 1.7(org.eclipse.jdt.core.tests.eval.SanityTestEvaluationResult)  Time elapsed: 0.002 s
04:28:39 testHasValue - 1.7(org.eclipse.jdt.core.tests.eval.SanityTestEvaluationResult)  Time elapsed: 0.003 s
04:28:39 testHasWarnings - 1.7(org.eclipse.jdt.core.tests.eval.SanityTestEvaluationResult)  Time elapsed: 0.003 s
04:28:39 testAllKindOfValues - 1.7(org.eclipse.jdt.core.tests.eval.VariableTest)  Time elapsed: 0.043 s
04:28:39 testCodeSnippetVarAssign - 1.7(org.eclipse.jdt.core.tests.eval.VariableTest)  Time elapsed: 0.055 s
04:28:39 testCodeSnippetVarRetrieval - 1.7(org.eclipse.jdt.core.tests.eval.VariableTest)  Time elapsed: 0.029 s
04:28:39 testImports - 1.7(org.eclipse.jdt.core.tests.eval.VariableTest)  Time elapsed: 0.021 s
04:28:39 testSeveralVariableInstallations - 1.7(org.eclipse.jdt.core.tests.eval.VariableTest)  Time elapsed: 0.076 s
04:28:39 testBug345334 - 1.7(org.eclipse.jdt.core.tests.eval.CodeSnippetTest)  Time elapsed: 0.004 s
04:28:39 testBug464656 - 1.7(org.eclipse.jdt.core.tests.eval.CodeSnippetTest)  Time elapsed: 0 s
04:28:39 testCheckedException - 1.7(org.eclipse.jdt.core.tests.eval.CodeSnippetTest)  Time elapsed: 0.003 s
04:28:39 testDiamond - 1.7(org.eclipse.jdt.core.tests.eval.CodeSnippetTest)  Time elapsed: 0.006 s
04:28:39 testEmptyStatement - 1.7(org.eclipse.jdt.core.tests.eval.CodeSnippetTest)  Time elapsed: 0.004 s
04:28:39 testEvaluateEmptyImport - 1.7(org.eclipse.jdt.core.tests.eval.CodeSnippetTest)  Time elapsed: 0 s
04:28:39 testEvaluateExistingPackageAndNonExistingTypeImports - 1.7(org.eclipse.jdt.core.tests.eval.CodeSnippetTest)  Time elapsed: 0 s
04:28:39 testEvaluateNonExistingPackageAndExistingTypeImports - 1.7(org.eclipse.jdt.core.tests.eval.CodeSnippetTest)  Time elapsed: 0 s
04:28:39 testEvaluateNonExistingPackageImport - 1.7(org.eclipse.jdt.core.tests.eval.CodeSnippetTest)  Time elapsed: 0 s
04:28:39 testEvaluateNonExistingTypeImport - 1.7(org.eclipse.jdt.core.tests.eval.CodeSnippetTest)  Time elapsed: 0 s
04:28:39 testEvaluateValidPackageAndTypeImports - 1.7(org.eclipse.jdt.core.tests.eval.CodeSnippetTest)  Time elapsed: 0 s
04:28:39 testEvaluateValidPackageImport - 1.7(org.eclipse.jdt.core.tests.eval.CodeSnippetTest)  Time elapsed: 0 s
04:28:39 testEvaluateValidTypeImport - 1.7(org.eclipse.jdt.core.tests.eval.CodeSnippetTest)  Time elapsed: 0.001 s
04:28:39 testFinallyError - 1.7(org.eclipse.jdt.core.tests.eval.CodeSnippetTest)  Time elapsed: 0.003 s
04:28:39 testFinallyOneBlock - 1.7(org.eclipse.jdt.core.tests.eval.CodeSnippetTest)  Time elapsed: 0.004 s
04:28:39 testFinallyTwoBlock - 1.7(org.eclipse.jdt.core.tests.eval.CodeSnippetTest)  Time elapsed: 0.002 s
04:28:39 testFor89632 - 1.7(org.eclipse.jdt.core.tests.eval.CodeSnippetTest)  Time elapsed: 0.008 s
04:28:39 testFreeReturnAnonymous - 1.7(org.eclipse.jdt.core.tests.eval.CodeSnippetTest)  Time elapsed: 0.004 s
04:28:39 testFreeReturnClassDeclaration - 1.7(org.eclipse.jdt.core.tests.eval.CodeSnippetTest)  Time elapsed: 0.004 s
04:28:39 testFreeReturnExpression - 1.7(org.eclipse.jdt.core.tests.eval.CodeSnippetTest)  Time elapsed: 0.002 s
04:28:39 testFreeReturnInteger - 1.7(org.eclipse.jdt.core.tests.eval.CodeSnippetTest)  Time elapsed: 0.003 s
04:28:39 testFreeReturnLocalVar - 1.7(org.eclipse.jdt.core.tests.eval.CodeSnippetTest)  Time elapsed: 0.003 s
04:28:39 testFreeReturnStatement - 1.7(org.eclipse.jdt.core.tests.eval.CodeSnippetTest)  Time elapsed: 0.003 s
04:28:39 testImportPackage - 1.7(org.eclipse.jdt.core.tests.eval.CodeSnippetTest)  Time elapsed: 0.005 s
04:28:39 testImportType - 1.7(org.eclipse.jdt.core.tests.eval.CodeSnippetTest)  Time elapsed: 0.006 s
04:28:39 testImportTypeAndPackage - 1.7(org.eclipse.jdt.core.tests.eval.CodeSnippetTest)  Time elapsed: 0.005 s
04:28:39 testInnerClassAnonymous - 1.7(org.eclipse.jdt.core.tests.eval.CodeSnippetTest)  Time elapsed: 0.004 s
04:28:39 testInnerClassNamed - 1.7(org.eclipse.jdt.core.tests.eval.CodeSnippetTest)  Time elapsed: 0.004 s
04:28:39 testReturnDisplayStringBoolean - 1.7(org.eclipse.jdt.core.tests.eval.CodeSnippetTest)  Time elapsed: 0.002 s
04:28:39 testReturnDisplayStringCharacter - 1.7(org.eclipse.jdt.core.tests.eval.CodeSnippetTest)  Time elapsed: 0.003 s
04:28:39 testReturnDisplayStringDouble - 1.7(org.eclipse.jdt.core.tests.eval.CodeSnippetTest)  Time elapsed: 0.002 s
04:28:39 testReturnDisplayStringEmptyCodeSnippet - 1.7(org.eclipse.jdt.core.tests.eval.CodeSnippetTest)  Time elapsed: 0.001 s
04:28:39 testReturnDisplayStringFloat - 1.7(org.eclipse.jdt.core.tests.eval.CodeSnippetTest)  Time elapsed: 0.003 s
04:28:39 testReturnDisplayStringInteger - 1.7(org.eclipse.jdt.core.tests.eval.CodeSnippetTest)  Time elapsed: 0.003 s
04:28:39 testReturnDisplayStringLong - 1.7(org.eclipse.jdt.core.tests.eval.CodeSnippetTest)  Time elapsed: 0.003 s
04:28:39 testReturnDisplayStringNoExplicitReturnedValue - 1.7(org.eclipse.jdt.core.tests.eval.CodeSnippetTest)  Time elapsed: 0.003 s
04:28:39 testReturnDisplayStringObject - 1.7(org.eclipse.jdt.core.tests.eval.CodeSnippetTest)  Time elapsed: 0.003 s
04:28:39 testReturnDisplayStringShort - 1.7(org.eclipse.jdt.core.tests.eval.CodeSnippetTest)  Time elapsed: 0.003 s
04:28:39 testReturnDisplayStringString - 1.7(org.eclipse.jdt.core.tests.eval.CodeSnippetTest)  Time elapsed: 0.003 s
04:28:39 testReturnDisplayStringVoid - 1.7(org.eclipse.jdt.core.tests.eval.CodeSnippetTest)  Time elapsed: 0.003 s
04:28:39 testReturnTypeBoolean - 1.7(org.eclipse.jdt.core.tests.eval.CodeSnippetTest)  Time elapsed: 0.003 s
04:28:39 testReturnTypeBooleanArray - 1.7(org.eclipse.jdt.core.tests.eval.CodeSnippetTest)  Time elapsed: 0.002 s
04:28:39 testReturnTypeBooleanObject - 1.7(org.eclipse.jdt.core.tests.eval.CodeSnippetTest)  Time elapsed: 0.002 s
04:28:39 testReturnTypeChar - 1.7(org.eclipse.jdt.core.tests.eval.CodeSnippetTest)  Time elapsed: 0.003 s
04:28:39 testReturnTypeCharArray - 1.7(org.eclipse.jdt.core.tests.eval.CodeSnippetTest)  Time elapsed: 0.003 s
04:28:39 testReturnTypeCharacterObject - 1.7(org.eclipse.jdt.core.tests.eval.CodeSnippetTest)  Time elapsed: 0.002 s
04:28:39 testReturnTypeDouble - 1.7(org.eclipse.jdt.core.tests.eval.CodeSnippetTest)  Time elapsed: 0.002 s
04:28:39 testReturnTypeDoubleArray - 1.7(org.eclipse.jdt.core.tests.eval.CodeSnippetTest)  Time elapsed: 0.003 s
04:28:39 testReturnTypeDoubleObject - 1.7(org.eclipse.jdt.core.tests.eval.CodeSnippetTest)  Time elapsed: 0.003 s
04:28:39 testReturnTypeEmptyCodeSnippet - 1.7(org.eclipse.jdt.core.tests.eval.CodeSnippetTest)  Time elapsed: 0.002 s
04:28:39 testReturnTypeFloat - 1.7(org.eclipse.jdt.core.tests.eval.CodeSnippetTest)  Time elapsed: 0.003 s
04:28:39 testReturnTypeFloatArray - 1.7(org.eclipse.jdt.core.tests.eval.CodeSnippetTest)  Time elapsed: 0.003 s
04:28:39 testReturnTypeFloatObject - 1.7(org.eclipse.jdt.core.tests.eval.CodeSnippetTest)  Time elapsed: 0.003 s
04:28:39 testReturnTypeInt - 1.7(org.eclipse.jdt.core.tests.eval.CodeSnippetTest)  Time elapsed: 0.002 s
04:28:39 testReturnTypeIntegerObject - 1.7(org.eclipse.jdt.core.tests.eval.CodeSnippetTest)  Time elapsed: 0.003 s
04:28:39 testReturnTypeLong - 1.7(org.eclipse.jdt.core.tests.eval.CodeSnippetTest)  Time elapsed: 0.003 s
04:28:39 testReturnTypeLongArray - 1.7(org.eclipse.jdt.core.tests.eval.CodeSnippetTest)  Time elapsed: 0.002 s
04:28:39 testReturnTypeLongObject - 1.7(org.eclipse.jdt.core.tests.eval.CodeSnippetTest)  Time elapsed: 0.004 s
04:28:39 testReturnTypeNoExplicitReturnedValue - 1.7(org.eclipse.jdt.core.tests.eval.CodeSnippetTest)  Time elapsed: 0.002 s
04:28:39 testReturnTypeObject - 1.7(org.eclipse.jdt.core.tests.eval.CodeSnippetTest)  Time elapsed: 0.003 s
04:28:39 testReturnTypeObjectArray - 1.7(org.eclipse.jdt.core.tests.eval.CodeSnippetTest)  Time elapsed: 0.003 s
04:28:39 testReturnTypeShort - 1.7(org.eclipse.jdt.core.tests.eval.CodeSnippetTest)  Time elapsed: 0.003 s
04:28:39 testReturnTypeShortArray - 1.7(org.eclipse.jdt.core.tests.eval.CodeSnippetTest)  Time elapsed: 0.002 s
04:28:39 testReturnTypeShortObject - 1.7(org.eclipse.jdt.core.tests.eval.CodeSnippetTest)  Time elapsed: 0.004 s
04:28:39 testReturnTypeString - 1.7(org.eclipse.jdt.core.tests.eval.CodeSnippetTest)  Time elapsed: 0.003 s
04:28:39 testReturnTypeStringArray - 1.7(org.eclipse.jdt.core.tests.eval.CodeSnippetTest)  Time elapsed: 0.003 s
04:28:39 testReturnTypeVoid - 1.7(org.eclipse.jdt.core.tests.eval.CodeSnippetTest)  Time elapsed: 0.003 s
04:28:39 testReturnTypesIntArray - 1.7(org.eclipse.jdt.core.tests.eval.CodeSnippetTest)  Time elapsed: 0.003 s
04:28:39 testRunMethodInAnonymous - 1.7(org.eclipse.jdt.core.tests.eval.CodeSnippetTest)  Time elapsed: 0.205 s
04:28:39 testRunMethodInAnonymous2 - 1.7(org.eclipse.jdt.core.tests.eval.CodeSnippetTest)  Time elapsed: 0.209 s
04:28:39 testRunMethodInAnonymous3 - 1.7(org.eclipse.jdt.core.tests.eval.CodeSnippetTest)  Time elapsed: 0.209 s
04:28:39 testRunMethodInAnonymous4 - 1.7(org.eclipse.jdt.core.tests.eval.CodeSnippetTest)  Time elapsed: 0.206 s
04:28:39 testRunMethodInAnonymous5 - 1.7(org.eclipse.jdt.core.tests.eval.CodeSnippetTest)  Time elapsed: 0.206 s
04:28:39 testRunMethodInAnonymous6 - 1.7(org.eclipse.jdt.core.tests.eval.CodeSnippetTest)  Time elapsed: 0.207 s
04:28:39 testRunMethodInAnonymous7 - 1.7(org.eclipse.jdt.core.tests.eval.CodeSnippetTest)  Time elapsed: 0.207 s
04:28:39 testRunMethodInAnonymous8 - 1.7(org.eclipse.jdt.core.tests.eval.CodeSnippetTest)  Time elapsed: 0.21 s
04:28:39 testExpressionInInnerClass - 1.7(org.eclipse.jdt.core.tests.eval.NegativeCodeSnippetTest)  Time elapsed: 0.001 s
04:28:39 testExtraClosingCurlyBracket - 1.7(org.eclipse.jdt.core.tests.eval.NegativeCodeSnippetTest)  Time elapsed: 0.002 s
04:28:39 testExtraOpenRoundBracket - 1.7(org.eclipse.jdt.core.tests.eval.NegativeCodeSnippetTest)  Time elapsed: 0.001 s
04:28:39 testExtraSemiColonInExpression - 1.7(org.eclipse.jdt.core.tests.eval.NegativeCodeSnippetTest)  Time elapsed: 0.001 s
04:28:39 testInvalidField - 1.7(org.eclipse.jdt.core.tests.eval.NegativeCodeSnippetTest)  Time elapsed: 0.003 s
04:28:39 testInvalidImport - 1.7(org.eclipse.jdt.core.tests.eval.NegativeCodeSnippetTest)  Time elapsed: 0.002 s
04:28:39 testInvalidUseOfThisInSnippet - 1.7(org.eclipse.jdt.core.tests.eval.NegativeCodeSnippetTest)  Time elapsed: 0.002 s
04:28:39 testInvalidUseOfThisInSnippet2 - 1.7(org.eclipse.jdt.core.tests.eval.NegativeCodeSnippetTest)  Time elapsed: 0.001 s
04:28:39 testMissingClosingRoundBracket - 1.7(org.eclipse.jdt.core.tests.eval.NegativeCodeSnippetTest)  Time elapsed: 0.001 s
04:28:39 testMissingDoubleQuote - 1.7(org.eclipse.jdt.core.tests.eval.NegativeCodeSnippetTest)  Time elapsed: 0.001 s
04:28:39 testNonLastExpressionStatement - 1.7(org.eclipse.jdt.core.tests.eval.NegativeCodeSnippetTest)  Time elapsed: 0.001 s
04:28:39 testProblemInExpression - 1.7(org.eclipse.jdt.core.tests.eval.NegativeCodeSnippetTest)  Time elapsed: 0.001 s
04:28:39 testProblemInExpression2 - 1.7(org.eclipse.jdt.core.tests.eval.NegativeCodeSnippetTest)  Time elapsed: 0.001 s
04:28:39 testProblemInInnerClass - 1.7(org.eclipse.jdt.core.tests.eval.NegativeCodeSnippetTest)  Time elapsed: 0.006 s
04:28:39 testProblemInPreviousStatement - 1.7(org.eclipse.jdt.core.tests.eval.NegativeCodeSnippetTest)  Time elapsed: 0.002 s
04:28:39 testProblemInReturnStatement - 1.7(org.eclipse.jdt.core.tests.eval.NegativeCodeSnippetTest)  Time elapsed: 0 s
04:28:39 testRemoveImport - 1.7(org.eclipse.jdt.core.tests.eval.NegativeCodeSnippetTest)  Time elapsed: 0.007 s
04:28:39 testRemoveVariable - 1.7(org.eclipse.jdt.core.tests.eval.NegativeCodeSnippetTest)  Time elapsed: 0.006 s
04:28:39 testUnreachableExpression - 1.7(org.eclipse.jdt.core.tests.eval.NegativeCodeSnippetTest)  Time elapsed: 0.001 s
04:28:39 testUnusedImport - 1.7(org.eclipse.jdt.core.tests.eval.NegativeCodeSnippetTest)  Time elapsed: 0.008 s
04:28:39 testWarning - 1.7(org.eclipse.jdt.core.tests.eval.NegativeCodeSnippetTest)  Time elapsed: 0.003 s
04:28:39 testInitializerProblem - 1.7(org.eclipse.jdt.core.tests.eval.NegativeVariableTest)  Time elapsed: 0.003 s
04:28:39 testUnknownType - 1.7(org.eclipse.jdt.core.tests.eval.NegativeVariableTest)  Time elapsed: 0.001 s
04:28:39 test001 - 1.7(org.eclipse.jdt.core.tests.eval.DebugEvaluationTest)  Time elapsed: 0.133 s
04:28:39 test002 - 1.7(org.eclipse.jdt.core.tests.eval.DebugEvaluationTest)  Time elapsed: 0.136 s
04:28:39 test003 - 1.7(org.eclipse.jdt.core.tests.eval.DebugEvaluationTest)  Time elapsed: 0.021 s
04:28:39 test004 - 1.7(org.eclipse.jdt.core.tests.eval.DebugEvaluationTest)  Time elapsed: 0.12 s
04:28:39 test005 - 1.7(org.eclipse.jdt.core.tests.eval.DebugEvaluationTest)  Time elapsed: 0.256 s
04:28:39 test006 - 1.7(org.eclipse.jdt.core.tests.eval.DebugEvaluationTest)  Time elapsed: 0.135 s
04:28:39 test007 - 1.7(org.eclipse.jdt.core.tests.eval.DebugEvaluationTest)  Time elapsed: 0.128 s
04:28:39 test008 - 1.7(org.eclipse.jdt.core.tests.eval.DebugEvaluationTest)  Time elapsed: 0.127 s
04:28:39 test009 - 1.7(org.eclipse.jdt.core.tests.eval.DebugEvaluationTest)  Time elapsed: 0.118 s
04:28:39 test010 - 1.7(org.eclipse.jdt.core.tests.eval.DebugEvaluationTest)  Time elapsed: 0.129 s
04:28:39 test011 - 1.7(org.eclipse.jdt.core.tests.eval.DebugEvaluationTest)  Time elapsed: 0.121 s
04:28:39 test016 - 1.7(org.eclipse.jdt.core.tests.eval.DebugEvaluationTest)  Time elapsed: 0.222 s
04:28:39 test017 - 1.7(org.eclipse.jdt.core.tests.eval.DebugEvaluationTest)  Time elapsed: 0.114 s
04:28:39 test018 - 1.7(org.eclipse.jdt.core.tests.eval.DebugEvaluationTest)  Time elapsed: 1.048 s
04:28:39 test019 - 1.7(org.eclipse.jdt.core.tests.eval.DebugEvaluationTest)  Time elapsed: 0.029 s
04:28:39 test020 - 1.7(org.eclipse.jdt.core.tests.eval.DebugEvaluationTest)  Time elapsed: 0.129 s
04:28:39 test021 - 1.7(org.eclipse.jdt.core.tests.eval.DebugEvaluationTest)  Time elapsed: 0.237 s
04:28:39 test022 - 1.7(org.eclipse.jdt.core.tests.eval.DebugEvaluationTest)  Time elapsed: 0.243 s
04:28:39 test023 - 1.7(org.eclipse.jdt.core.tests.eval.DebugEvaluationTest)  Time elapsed: 0.247 s
04:28:39 test024 - 1.7(org.eclipse.jdt.core.tests.eval.DebugEvaluationTest)  Time elapsed: 0.244 s
04:28:39 test025 - 1.7(org.eclipse.jdt.core.tests.eval.DebugEvaluationTest)  Time elapsed: 0.236 s
04:28:39 test026 - 1.7(org.eclipse.jdt.core.tests.eval.DebugEvaluationTest)  Time elapsed: 0.127 s
04:28:39 test027 - 1.7(org.eclipse.jdt.core.tests.eval.DebugEvaluationTest)  Time elapsed: 0.128 s
04:28:39 test028 - 1.7(org.eclipse.jdt.core.tests.eval.DebugEvaluationTest)  Time elapsed: 0.128 s
04:28:39 test029 - 1.7(org.eclipse.jdt.core.tests.eval.DebugEvaluationTest)  Time elapsed: 0.128 s
04:28:39 test030 - 1.7(org.eclipse.jdt.core.tests.eval.DebugEvaluationTest)  Time elapsed: 0.129 s
04:28:39 test031 - 1.7(org.eclipse.jdt.core.tests.eval.DebugEvaluationTest)  Time elapsed: 0.128 s
04:28:39 test032 - 1.7(org.eclipse.jdt.core.tests.eval.DebugEvaluationTest)  Time elapsed: 0.033 s
04:28:39 test033 - 1.7(org.eclipse.jdt.core.tests.eval.DebugEvaluationTest)  Time elapsed: 0.133 s
04:28:39 test034 - 1.7(org.eclipse.jdt.core.tests.eval.DebugEvaluationTest)  Time elapsed: 0.128 s
04:28:39 test035 - 1.7(org.eclipse.jdt.core.tests.eval.DebugEvaluationTest)  Time elapsed: 0.128 s
04:28:39 test036 - 1.7(org.eclipse.jdt.core.tests.eval.DebugEvaluationTest)  Time elapsed: 0.127 s
04:28:39 test037 - 1.7(org.eclipse.jdt.core.tests.eval.DebugEvaluationTest)  Time elapsed: 0.127 s
04:28:39 test038 - 1.7(org.eclipse.jdt.core.tests.eval.DebugEvaluationTest)  Time elapsed: 0.128 s
04:28:39 test039 - 1.7(org.eclipse.jdt.core.tests.eval.DebugEvaluationTest)  Time elapsed: 0.131 s
04:28:39 test040 - 1.7(org.eclipse.jdt.core.tests.eval.DebugEvaluationTest)  Time elapsed: 0.129 s
04:28:39 test041 - 1.7(org.eclipse.jdt.core.tests.eval.DebugEvaluationTest)  Time elapsed: 0.13 s
04:28:39 test042 - 1.7(org.eclipse.jdt.core.tests.eval.DebugEvaluationTest)  Time elapsed: 0.128 s
04:28:39 test043 - 1.7(org.eclipse.jdt.core.tests.eval.DebugEvaluationTest)  Time elapsed: 0.127 s
04:28:39 test044 - 1.7(org.eclipse.jdt.core.tests.eval.DebugEvaluationTest)  Time elapsed: 0.129 s
04:28:39 test045 - 1.7(org.eclipse.jdt.core.tests.eval.DebugEvaluationTest)  Time elapsed: 0.13 s
04:28:39 test046 - 1.7(org.eclipse.jdt.core.tests.eval.DebugEvaluationTest)  Time elapsed: 0.129 s
04:28:39 test047 - 1.7(org.eclipse.jdt.core.tests.eval.DebugEvaluationTest)  Time elapsed: 0.127 s
04:28:39 test048 - 1.7(org.eclipse.jdt.core.tests.eval.DebugEvaluationTest)  Time elapsed: 0.128 s
04:28:39 test049 - 1.7(org.eclipse.jdt.core.tests.eval.DebugEvaluationTest)  Time elapsed: 0.131 s
04:28:39 test050 - 1.7(org.eclipse.jdt.core.tests.eval.DebugEvaluationTest)  Time elapsed: 0.13 s
04:28:39 test051 - 1.7(org.eclipse.jdt.core.tests.eval.DebugEvaluationTest)  Time elapsed: 0.131 s
04:28:39 test052 - 1.7(org.eclipse.jdt.core.tests.eval.DebugEvaluationTest)  Time elapsed: 0.129 s
04:28:39 test053 - 1.7(org.eclipse.jdt.core.tests.eval.DebugEvaluationTest)  Time elapsed: 0.127 s
04:28:39 test054 - 1.7(org.eclipse.jdt.core.tests.eval.DebugEvaluationTest)  Time elapsed: 0.127 s
04:28:39 test055 - 1.7(org.eclipse.jdt.core.tests.eval.DebugEvaluationTest)  Time elapsed: 0.128 s
04:28:39 test056 - 1.7(org.eclipse.jdt.core.tests.eval.DebugEvaluationTest)  Time elapsed: 0.128 s
04:28:39 test057 - 1.7(org.eclipse.jdt.core.tests.eval.DebugEvaluationTest)  Time elapsed: 0.128 s
04:28:39 test058 - 1.7(org.eclipse.jdt.core.tests.eval.DebugEvaluationTest)  Time elapsed: 0.129 s
04:28:39 test059 - 1.7(org.eclipse.jdt.core.tests.eval.DebugEvaluationTest)  Time elapsed: 0.13 s
04:28:39 test060 - 1.7(org.eclipse.jdt.core.tests.eval.DebugEvaluationTest)  Time elapsed: 0.128 s
04:28:39 test061 - 1.7(org.eclipse.jdt.core.tests.eval.DebugEvaluationTest)  Time elapsed: 0.128 s
04:28:39 test062 - 1.7(org.eclipse.jdt.core.tests.eval.DebugEvaluationTest)  Time elapsed: 0.127 s
04:28:39 test063 - 1.7(org.eclipse.jdt.core.tests.eval.DebugEvaluationTest)  Time elapsed: 0.129 s
04:28:39 test065 - 1.7(org.eclipse.jdt.core.tests.eval.DebugEvaluationTest)  Time elapsed: 0.132 s
04:28:39 test066 - 1.7(org.eclipse.jdt.core.tests.eval.DebugEvaluationTest)  Time elapsed: 0.131 s
04:28:39 test067 - 1.7(org.eclipse.jdt.core.tests.eval.DebugEvaluationTest)  Time elapsed: 0.137 s
04:28:39 test068 - 1.7(org.eclipse.jdt.core.tests.eval.DebugEvaluationTest)  Time elapsed: 0.026 s
04:28:39 test069 - 1.7(org.eclipse.jdt.core.tests.eval.DebugEvaluationTest)  Time elapsed: 0.03 s
04:28:39 testNegative001 - 1.7(org.eclipse.jdt.core.tests.eval.DebugEvaluationTest)  Time elapsed: 0.02 s
04:28:39 testNegative002 - 1.7(org.eclipse.jdt.core.tests.eval.DebugEvaluationTest)  Time elapsed: 0.02 s
04:28:39 testNegative003 - 1.7(org.eclipse.jdt.core.tests.eval.DebugEvaluationTest)  Time elapsed: 0.019 s
04:28:39 testNegative004 - 1.7(org.eclipse.jdt.core.tests.eval.DebugEvaluationTest)  Time elapsed: 0.01 s
04:28:39 testNegative005 - 1.7(org.eclipse.jdt.core.tests.eval.DebugEvaluationTest)  Time elapsed: 0.008 s
04:28:39 testAllVariables - 1.8(org.eclipse.jdt.core.tests.eval.SanityTestEvaluationContext)  Time elapsed: 0.001 s
04:28:39 testEvaluate - 1.8(org.eclipse.jdt.core.tests.eval.SanityTestEvaluationContext)  Time elapsed: 0.008 s
04:28:39 testEvaluateImports - 1.8(org.eclipse.jdt.core.tests.eval.SanityTestEvaluationContext)  Time elapsed: 0.001 s
04:28:39 testEvaluateVariable - 1.8(org.eclipse.jdt.core.tests.eval.SanityTestEvaluationContext)  Time elapsed: 0.007 s
04:28:39 testEvaluateVariables - 1.8(org.eclipse.jdt.core.tests.eval.SanityTestEvaluationContext)  Time elapsed: 0.001 s
04:28:39 testGetSetImports - 1.8(org.eclipse.jdt.core.tests.eval.SanityTestEvaluationContext)  Time elapsed: 0.001 s
04:28:39 testGetSetPackageName - 1.8(org.eclipse.jdt.core.tests.eval.SanityTestEvaluationContext)  Time elapsed: 0 s
04:28:39 testNewDeleteVariable - 1.8(org.eclipse.jdt.core.tests.eval.SanityTestEvaluationContext)  Time elapsed: 0 s
04:28:39 testGetEvaluationType - 1.8(org.eclipse.jdt.core.tests.eval.SanityTestEvaluationResult)  Time elapsed: 0.004 s
04:28:39 testGetProblems - 1.8(org.eclipse.jdt.core.tests.eval.SanityTestEvaluationResult)  Time elapsed: 0.004 s
04:28:39 testGetValue - 1.8(org.eclipse.jdt.core.tests.eval.SanityTestEvaluationResult)  Time elapsed: 0.004 s
04:28:39 testGetValueDisplayString - 1.8(org.eclipse.jdt.core.tests.eval.SanityTestEvaluationResult)  Time elapsed: 0.003 s
04:28:39 testGetValueTypeName - 1.8(org.eclipse.jdt.core.tests.eval.SanityTestEvaluationResult)  Time elapsed: 0.004 s
04:28:39 testHasErrors - 1.8(org.eclipse.jdt.core.tests.eval.SanityTestEvaluationResult)  Time elapsed: 0.003 s
04:28:39 testHasProblems - 1.8(org.eclipse.jdt.core.tests.eval.SanityTestEvaluationResult)  Time elapsed: 0.004 s
04:28:39 testHasValue - 1.8(org.eclipse.jdt.core.tests.eval.SanityTestEvaluationResult)  Time elapsed: 0.003 s
04:28:39 testHasWarnings - 1.8(org.eclipse.jdt.core.tests.eval.SanityTestEvaluationResult)  Time elapsed: 0.004 s
04:28:39 testAllKindOfValues - 1.8(org.eclipse.jdt.core.tests.eval.VariableTest)  Time elapsed: 0.051 s
04:28:39 testCodeSnippetVarAssign - 1.8(org.eclipse.jdt.core.tests.eval.VariableTest)  Time elapsed: 0.069 s
04:28:39 testCodeSnippetVarRetrieval - 1.8(org.eclipse.jdt.core.tests.eval.VariableTest)  Time elapsed: 0.035 s
04:28:39 testImports - 1.8(org.eclipse.jdt.core.tests.eval.VariableTest)  Time elapsed: 0.027 s
04:28:39 testSeveralVariableInstallations - 1.8(org.eclipse.jdt.core.tests.eval.VariableTest)  Time elapsed: 0.096 s
04:28:39 testBug345334 - 1.8(org.eclipse.jdt.core.tests.eval.CodeSnippetTest)  Time elapsed: 0.005 s
04:28:39 testBug464656 - 1.8(org.eclipse.jdt.core.tests.eval.CodeSnippetTest)  Time elapsed: 0.017 s
04:28:39 testCheckedException - 1.8(org.eclipse.jdt.core.tests.eval.CodeSnippetTest)  Time elapsed: 0.005 s
04:28:39 testDiamond - 1.8(org.eclipse.jdt.core.tests.eval.CodeSnippetTest)  Time elapsed: 0.006 s
04:28:39 testEmptyStatement - 1.8(org.eclipse.jdt.core.tests.eval.CodeSnippetTest)  Time elapsed: 0.027 s
04:28:39 testEvaluateEmptyImport - 1.8(org.eclipse.jdt.core.tests.eval.CodeSnippetTest)  Time elapsed: 0 s
04:28:39 testEvaluateExistingPackageAndNonExistingTypeImports - 1.8(org.eclipse.jdt.core.tests.eval.CodeSnippetTest)  Time elapsed: 0 s
04:28:39 testEvaluateNonExistingPackageAndExistingTypeImports - 1.8(org.eclipse.jdt.core.tests.eval.CodeSnippetTest)  Time elapsed: 0 s
04:28:39 testEvaluateNonExistingPackageImport - 1.8(org.eclipse.jdt.core.tests.eval.CodeSnippetTest)  Time elapsed: 0 s
04:28:39 testEvaluateNonExistingTypeImport - 1.8(org.eclipse.jdt.core.tests.eval.CodeSnippetTest)  Time elapsed: 0 s
04:28:39 testEvaluateValidPackageAndTypeImports - 1.8(org.eclipse.jdt.core.tests.eval.CodeSnippetTest)  Time elapsed: 0 s
04:28:39 testEvaluateValidPackageImport - 1.8(org.eclipse.jdt.core.tests.eval.CodeSnippetTest)  Time elapsed: 0 s
04:28:39 testEvaluateValidTypeImport - 1.8(org.eclipse.jdt.core.tests.eval.CodeSnippetTest)  Time elapsed: 0 s
04:28:39 testFinallyError - 1.8(org.eclipse.jdt.core.tests.eval.CodeSnippetTest)  Time elapsed: 0.006 s
04:28:39 testFinallyOneBlock - 1.8(org.eclipse.jdt.core.tests.eval.CodeSnippetTest)  Time elapsed: 0.005 s
04:28:39 testFinallyTwoBlock - 1.8(org.eclipse.jdt.core.tests.eval.CodeSnippetTest)  Time elapsed: 0.003 s
04:28:39 testFor89632 - 1.8(org.eclipse.jdt.core.tests.eval.CodeSnippetTest)  Time elapsed: 0.01 s
04:28:39 testFreeReturnAnonymous - 1.8(org.eclipse.jdt.core.tests.eval.CodeSnippetTest)  Time elapsed: 0.005 s
04:28:39 testFreeReturnClassDeclaration - 1.8(org.eclipse.jdt.core.tests.eval.CodeSnippetTest)  Time elapsed: 0.004 s
04:28:39 testFreeReturnExpression - 1.8(org.eclipse.jdt.core.tests.eval.CodeSnippetTest)  Time elapsed: 0.004 s
04:28:39 testFreeReturnInteger - 1.8(org.eclipse.jdt.core.tests.eval.CodeSnippetTest)  Time elapsed: 0.003 s
04:28:39 testFreeReturnLocalVar - 1.8(org.eclipse.jdt.core.tests.eval.CodeSnippetTest)  Time elapsed: 0.004 s
04:28:39 testFreeReturnStatement - 1.8(org.eclipse.jdt.core.tests.eval.CodeSnippetTest)  Time elapsed: 0.004 s
04:28:39 testImportPackage - 1.8(org.eclipse.jdt.core.tests.eval.CodeSnippetTest)  Time elapsed: 0.006 s
04:28:39 testImportType - 1.8(org.eclipse.jdt.core.tests.eval.CodeSnippetTest)  Time elapsed: 0.009 s
04:28:39 testImportTypeAndPackage - 1.8(org.eclipse.jdt.core.tests.eval.CodeSnippetTest)  Time elapsed: 0.006 s
04:28:39 testInnerClassAnonymous - 1.8(org.eclipse.jdt.core.tests.eval.CodeSnippetTest)  Time elapsed: 0.006 s
04:28:39 testInnerClassNamed - 1.8(org.eclipse.jdt.core.tests.eval.CodeSnippetTest)  Time elapsed: 0.005 s
04:28:39 testReturnDisplayStringBoolean - 1.8(org.eclipse.jdt.core.tests.eval.CodeSnippetTest)  Time elapsed: 0.003 s
04:28:39 testReturnDisplayStringCharacter - 1.8(org.eclipse.jdt.core.tests.eval.CodeSnippetTest)  Time elapsed: 0.004 s
04:28:39 testReturnDisplayStringDouble - 1.8(org.eclipse.jdt.core.tests.eval.CodeSnippetTest)  Time elapsed: 0.003 s
04:28:39 testReturnDisplayStringEmptyCodeSnippet - 1.8(org.eclipse.jdt.core.tests.eval.CodeSnippetTest)  Time elapsed: 0.002 s
04:28:39 testReturnDisplayStringFloat - 1.8(org.eclipse.jdt.core.tests.eval.CodeSnippetTest)  Time elapsed: 0.003 s
04:28:39 testReturnDisplayStringInteger - 1.8(org.eclipse.jdt.core.tests.eval.CodeSnippetTest)  Time elapsed: 0.003 s
04:28:39 testReturnDisplayStringLong - 1.8(org.eclipse.jdt.core.tests.eval.CodeSnippetTest)  Time elapsed: 0.004 s
04:28:39 testReturnDisplayStringNoExplicitReturnedValue - 1.8(org.eclipse.jdt.core.tests.eval.CodeSnippetTest)  Time elapsed: 0.004 s
04:28:39 testReturnDisplayStringObject - 1.8(org.eclipse.jdt.core.tests.eval.CodeSnippetTest)  Time elapsed: 0.005 s
04:28:39 testReturnDisplayStringShort - 1.8(org.eclipse.jdt.core.tests.eval.CodeSnippetTest)  Time elapsed: 0.003 s
04:28:39 testReturnDisplayStringString - 1.8(org.eclipse.jdt.core.tests.eval.CodeSnippetTest)  Time elapsed: 0.004 s
04:28:39 testReturnDisplayStringVoid - 1.8(org.eclipse.jdt.core.tests.eval.CodeSnippetTest)  Time elapsed: 0.004 s
04:28:39 testReturnTypeBoolean - 1.8(org.eclipse.jdt.core.tests.eval.CodeSnippetTest)  Time elapsed: 0.003 s
04:28:39 testReturnTypeBooleanArray - 1.8(org.eclipse.jdt.core.tests.eval.CodeSnippetTest)  Time elapsed: 0.003 s
04:28:39 testReturnTypeBooleanObject - 1.8(org.eclipse.jdt.core.tests.eval.CodeSnippetTest)  Time elapsed: 0.003 s
04:28:39 testReturnTypeChar - 1.8(org.eclipse.jdt.core.tests.eval.CodeSnippetTest)  Time elapsed: 0.003 s
04:28:39 testReturnTypeCharArray - 1.8(org.eclipse.jdt.core.tests.eval.CodeSnippetTest)  Time elapsed: 0.003 s
04:28:39 testReturnTypeCharacterObject - 1.8(org.eclipse.jdt.core.tests.eval.CodeSnippetTest)  Time elapsed: 0.004 s
04:28:39 testReturnTypeDouble - 1.8(org.eclipse.jdt.core.tests.eval.CodeSnippetTest)  Time elapsed: 0.003 s
04:28:39 testReturnTypeDoubleArray - 1.8(org.eclipse.jdt.core.tests.eval.CodeSnippetTest)  Time elapsed: 0.003 s
04:28:39 testReturnTypeDoubleObject - 1.8(org.eclipse.jdt.core.tests.eval.CodeSnippetTest)  Time elapsed: 0.004 s
04:28:39 testReturnTypeEmptyCodeSnippet - 1.8(org.eclipse.jdt.core.tests.eval.CodeSnippetTest)  Time elapsed: 0.002 s
04:28:39 testReturnTypeFloat - 1.8(org.eclipse.jdt.core.tests.eval.CodeSnippetTest)  Time elapsed: 0.003 s
04:28:39 testReturnTypeFloatArray - 1.8(org.eclipse.jdt.core.tests.eval.CodeSnippetTest)  Time elapsed: 0.003 s
04:28:39 testReturnTypeFloatObject - 1.8(org.eclipse.jdt.core.tests.eval.CodeSnippetTest)  Time elapsed: 0.004 s
04:28:39 testReturnTypeInt - 1.8(org.eclipse.jdt.core.tests.eval.CodeSnippetTest)  Time elapsed: 0.003 s
04:28:39 testReturnTypeIntegerObject - 1.8(org.eclipse.jdt.core.tests.eval.CodeSnippetTest)  Time elapsed: 0.004 s
04:28:39 testReturnTypeLong - 1.8(org.eclipse.jdt.core.tests.eval.CodeSnippetTest)  Time elapsed: 0.003 s
04:28:39 testReturnTypeLongArray - 1.8(org.eclipse.jdt.core.tests.eval.CodeSnippetTest)  Time elapsed: 0.003 s
04:28:39 testReturnTypeLongObject - 1.8(org.eclipse.jdt.core.tests.eval.CodeSnippetTest)  Time elapsed: 0.007 s
04:28:39 testReturnTypeNoExplicitReturnedValue - 1.8(org.eclipse.jdt.core.tests.eval.CodeSnippetTest)  Time elapsed: 0.003 s
04:28:39 testReturnTypeObject - 1.8(org.eclipse.jdt.core.tests.eval.CodeSnippetTest)  Time elapsed: 0.003 s
04:28:39 testReturnTypeObjectArray - 1.8(org.eclipse.jdt.core.tests.eval.CodeSnippetTest)  Time elapsed: 0.004 s
04:28:39 testReturnTypeShort - 1.8(org.eclipse.jdt.core.tests.eval.CodeSnippetTest)  Time elapsed: 0.003 s
04:28:39 testReturnTypeShortArray - 1.8(org.eclipse.jdt.core.tests.eval.CodeSnippetTest)  Time elapsed: 0.003 s
04:28:39 testReturnTypeShortObject - 1.8(org.eclipse.jdt.core.tests.eval.CodeSnippetTest)  Time elapsed: 0.004 s
04:28:39 testReturnTypeString - 1.8(org.eclipse.jdt.core.tests.eval.CodeSnippetTest)  Time elapsed: 0.004 s
04:28:39 testReturnTypeStringArray - 1.8(org.eclipse.jdt.core.tests.eval.CodeSnippetTest)  Time elapsed: 0.004 s
04:28:39 testReturnTypeVoid - 1.8(org.eclipse.jdt.core.tests.eval.CodeSnippetTest)  Time elapsed: 0.003 s
04:28:39 testReturnTypesIntArray - 1.8(org.eclipse.jdt.core.tests.eval.CodeSnippetTest)  Time elapsed: 0.003 s
04:28:39 testRunMethodInAnonymous - 1.8(org.eclipse.jdt.core.tests.eval.CodeSnippetTest)  Time elapsed: 0.207 s
04:28:39 testRunMethodInAnonymous2 - 1.8(org.eclipse.jdt.core.tests.eval.CodeSnippetTest)  Time elapsed: 0.209 s
04:28:39 testRunMethodInAnonymous3 - 1.8(org.eclipse.jdt.core.tests.eval.CodeSnippetTest)  Time elapsed: 0.208 s
04:28:39 testRunMethodInAnonymous4 - 1.8(org.eclipse.jdt.core.tests.eval.CodeSnippetTest)  Time elapsed: 0.207 s
04:28:39 testRunMethodInAnonymous5 - 1.8(org.eclipse.jdt.core.tests.eval.CodeSnippetTest)  Time elapsed: 0.207 s
04:28:39 testRunMethodInAnonymous6 - 1.8(org.eclipse.jdt.core.tests.eval.CodeSnippetTest)  Time elapsed: 0.207 s
04:28:39 testRunMethodInAnonymous7 - 1.8(org.eclipse.jdt.core.tests.eval.CodeSnippetTest)  Time elapsed: 0.206 s
04:28:39 testRunMethodInAnonymous8 - 1.8(org.eclipse.jdt.core.tests.eval.CodeSnippetTest)  Time elapsed: 0.206 s
04:28:39 testExpressionInInnerClass - 1.8(org.eclipse.jdt.core.tests.eval.NegativeCodeSnippetTest)  Time elapsed: 0.001 s
04:28:39 testExtraClosingCurlyBracket - 1.8(org.eclipse.jdt.core.tests.eval.NegativeCodeSnippetTest)  Time elapsed: 0.002 s
04:28:39 testExtraOpenRoundBracket - 1.8(org.eclipse.jdt.core.tests.eval.NegativeCodeSnippetTest)  Time elapsed: 0 s
04:28:39 testExtraSemiColonInExpression - 1.8(org.eclipse.jdt.core.tests.eval.NegativeCodeSnippetTest)  Time elapsed: 0.001 s
04:28:39 testInvalidField - 1.8(org.eclipse.jdt.core.tests.eval.NegativeCodeSnippetTest)  Time elapsed: 0.002 s
04:28:39 testInvalidImport - 1.8(org.eclipse.jdt.core.tests.eval.NegativeCodeSnippetTest)  Time elapsed: 0.002 s
04:28:39 testInvalidUseOfThisInSnippet - 1.8(org.eclipse.jdt.core.tests.eval.NegativeCodeSnippetTest)  Time elapsed: 0.001 s
04:28:39 testInvalidUseOfThisInSnippet2 - 1.8(org.eclipse.jdt.core.tests.eval.NegativeCodeSnippetTest)  Time elapsed: 0.001 s
04:28:39 testMissingClosingRoundBracket - 1.8(org.eclipse.jdt.core.tests.eval.NegativeCodeSnippetTest)  Time elapsed: 0.001 s
04:28:39 testMissingDoubleQuote - 1.8(org.eclipse.jdt.core.tests.eval.NegativeCodeSnippetTest)  Time elapsed: 0.001 s
04:28:39 testNonLastExpressionStatement - 1.8(org.eclipse.jdt.core.tests.eval.NegativeCodeSnippetTest)  Time elapsed: 0 s
04:28:39 testProblemInExpression - 1.8(org.eclipse.jdt.core.tests.eval.NegativeCodeSnippetTest)  Time elapsed: 0.001 s
04:28:39 testProblemInExpression2 - 1.8(org.eclipse.jdt.core.tests.eval.NegativeCodeSnippetTest)  Time elapsed: 0.001 s
04:28:39 testProblemInInnerClass - 1.8(org.eclipse.jdt.core.tests.eval.NegativeCodeSnippetTest)  Time elapsed: 0.005 s
04:28:39 testProblemInPreviousStatement - 1.8(org.eclipse.jdt.core.tests.eval.NegativeCodeSnippetTest)  Time elapsed: 0.002 s
04:28:39 testProblemInReturnStatement - 1.8(org.eclipse.jdt.core.tests.eval.NegativeCodeSnippetTest)  Time elapsed: 0 s
04:28:39 testRemoveImport - 1.8(org.eclipse.jdt.core.tests.eval.NegativeCodeSnippetTest)  Time elapsed: 0.007 s
04:28:39 testRemoveVariable - 1.8(org.eclipse.jdt.core.tests.eval.NegativeCodeSnippetTest)  Time elapsed: 0.005 s
04:28:39 testUnreachableExpression - 1.8(org.eclipse.jdt.core.tests.eval.NegativeCodeSnippetTest)  Time elapsed: 0.001 s
04:28:39 testUnusedImport - 1.8(org.eclipse.jdt.core.tests.eval.NegativeCodeSnippetTest)  Time elapsed: 0.006 s
04:28:39 testWarning - 1.8(org.eclipse.jdt.core.tests.eval.NegativeCodeSnippetTest)  Time elapsed: 0.003 s
04:28:39 testInitializerProblem - 1.8(org.eclipse.jdt.core.tests.eval.NegativeVariableTest)  Time elapsed: 0.002 s
04:28:39 testUnknownType - 1.8(org.eclipse.jdt.core.tests.eval.NegativeVariableTest)  Time elapsed: 0.002 s
04:28:39 test001 - 1.8(org.eclipse.jdt.core.tests.eval.DebugEvaluationTest)  Time elapsed: 0.132 s
04:28:39 test002 - 1.8(org.eclipse.jdt.core.tests.eval.DebugEvaluationTest)  Time elapsed: 0.128 s
04:28:39 test003 - 1.8(org.eclipse.jdt.core.tests.eval.DebugEvaluationTest)  Time elapsed: 0.023 s
04:28:39 test004 - 1.8(org.eclipse.jdt.core.tests.eval.DebugEvaluationTest)  Time elapsed: 0.118 s
04:28:39 test005 - 1.8(org.eclipse.jdt.core.tests.eval.DebugEvaluationTest)  Time elapsed: 0.132 s
04:28:39 test006 - 1.8(org.eclipse.jdt.core.tests.eval.DebugEvaluationTest)  Time elapsed: 0.129 s
04:28:39 test007 - 1.8(org.eclipse.jdt.core.tests.eval.DebugEvaluationTest)  Time elapsed: 0.133 s
04:28:39 test008 - 1.8(org.eclipse.jdt.core.tests.eval.DebugEvaluationTest)  Time elapsed: 0.131 s
04:28:39 test009 - 1.8(org.eclipse.jdt.core.tests.eval.DebugEvaluationTest)  Time elapsed: 0.12 s
04:28:39 test010 - 1.8(org.eclipse.jdt.core.tests.eval.DebugEvaluationTest)  Time elapsed: 0.133 s
04:28:39 test011 - 1.8(org.eclipse.jdt.core.tests.eval.DebugEvaluationTest)  Time elapsed: 0.125 s
04:28:39 test016 - 1.8(org.eclipse.jdt.core.tests.eval.DebugEvaluationTest)  Time elapsed: 0.225 s
04:28:39 test017 - 1.8(org.eclipse.jdt.core.tests.eval.DebugEvaluationTest)  Time elapsed: 0.118 s
04:28:39 test018 - 1.8(org.eclipse.jdt.core.tests.eval.DebugEvaluationTest)  Time elapsed: 0.243 s
04:28:39 test019 - 1.8(org.eclipse.jdt.core.tests.eval.DebugEvaluationTest)  Time elapsed: 0.025 s
04:28:39 test020 - 1.8(org.eclipse.jdt.core.tests.eval.DebugEvaluationTest)  Time elapsed: 0.127 s
04:28:39 test021 - 1.8(org.eclipse.jdt.core.tests.eval.DebugEvaluationTest)  Time elapsed: 0.239 s
04:28:39 test022 - 1.8(org.eclipse.jdt.core.tests.eval.DebugEvaluationTest)  Time elapsed: 0.244 s
04:28:39 test023 - 1.8(org.eclipse.jdt.core.tests.eval.DebugEvaluationTest)  Time elapsed: 0.251 s
04:28:39 test024 - 1.8(org.eclipse.jdt.core.tests.eval.DebugEvaluationTest)  Time elapsed: 0.246 s
04:28:39 test025 - 1.8(org.eclipse.jdt.core.tests.eval.DebugEvaluationTest)  Time elapsed: 0.238 s
04:28:39 test026 - 1.8(org.eclipse.jdt.core.tests.eval.DebugEvaluationTest)  Time elapsed: 0.128 s
04:28:39 test027 - 1.8(org.eclipse.jdt.core.tests.eval.DebugEvaluationTest)  Time elapsed: 0.128 s
04:28:39 test028 - 1.8(org.eclipse.jdt.core.tests.eval.DebugEvaluationTest)  Time elapsed: 0.128 s
04:28:39 test029 - 1.8(org.eclipse.jdt.core.tests.eval.DebugEvaluationTest)  Time elapsed: 0.129 s
04:28:39 test030 - 1.8(org.eclipse.jdt.core.tests.eval.DebugEvaluationTest)  Time elapsed: 0.129 s
04:28:39 test031 - 1.8(org.eclipse.jdt.core.tests.eval.DebugEvaluationTest)  Time elapsed: 0.129 s
04:28:39 test032 - 1.8(org.eclipse.jdt.core.tests.eval.DebugEvaluationTest)  Time elapsed: 0.025 s
04:28:39 test033 - 1.8(org.eclipse.jdt.core.tests.eval.DebugEvaluationTest)  Time elapsed: 0.133 s
04:28:39 test034 - 1.8(org.eclipse.jdt.core.tests.eval.DebugEvaluationTest)  Time elapsed: 0.127 s
04:28:39 test035 - 1.8(org.eclipse.jdt.core.tests.eval.DebugEvaluationTest)  Time elapsed: 0.13 s
04:28:39 test036 - 1.8(org.eclipse.jdt.core.tests.eval.DebugEvaluationTest)  Time elapsed: 0.132 s
04:28:39 test037 - 1.8(org.eclipse.jdt.core.tests.eval.DebugEvaluationTest)  Time elapsed: 0.128 s
04:28:39 test038 - 1.8(org.eclipse.jdt.core.tests.eval.DebugEvaluationTest)  Time elapsed: 0.128 s
04:28:39 test039 - 1.8(org.eclipse.jdt.core.tests.eval.DebugEvaluationTest)  Time elapsed: 0.131 s
04:28:39 test040 - 1.8(org.eclipse.jdt.core.tests.eval.DebugEvaluationTest)  Time elapsed: 0.129 s
04:28:39 test041 - 1.8(org.eclipse.jdt.core.tests.eval.DebugEvaluationTest)  Time elapsed: 0.129 s
04:28:39 test042 - 1.8(org.eclipse.jdt.core.tests.eval.DebugEvaluationTest)  Time elapsed: 0.129 s
04:28:39 test043 - 1.8(org.eclipse.jdt.core.tests.eval.DebugEvaluationTest)  Time elapsed: 0.132 s
04:28:39 test044 - 1.8(org.eclipse.jdt.core.tests.eval.DebugEvaluationTest)  Time elapsed: 0.128 s
04:28:39 test045 - 1.8(org.eclipse.jdt.core.tests.eval.DebugEvaluationTest)  Time elapsed: 0.129 s
04:28:39 test046 - 1.8(org.eclipse.jdt.core.tests.eval.DebugEvaluationTest)  Time elapsed: 0.129 s
04:28:39 test047 - 1.8(org.eclipse.jdt.core.tests.eval.DebugEvaluationTest)  Time elapsed: 0.128 s
04:28:39 test048 - 1.8(org.eclipse.jdt.core.tests.eval.DebugEvaluationTest)  Time elapsed: 0.128 s
04:28:39 test049 - 1.8(org.eclipse.jdt.core.tests.eval.DebugEvaluationTest)  Time elapsed: 0.131 s
04:28:39 test050 - 1.8(org.eclipse.jdt.core.tests.eval.DebugEvaluationTest)  Time elapsed: 0.131 s
04:28:39 test051 - 1.8(org.eclipse.jdt.core.tests.eval.DebugEvaluationTest)  Time elapsed: 0.129 s
04:28:39 test052 - 1.8(org.eclipse.jdt.core.tests.eval.DebugEvaluationTest)  Time elapsed: 0.129 s
04:28:39 test053 - 1.8(org.eclipse.jdt.core.tests.eval.DebugEvaluationTest)  Time elapsed: 0.129 s
04:28:39 test054 - 1.8(org.eclipse.jdt.core.tests.eval.DebugEvaluationTest)  Time elapsed: 0.128 s
04:28:39 test055 - 1.8(org.eclipse.jdt.core.tests.eval.DebugEvaluationTest)  Time elapsed: 0.129 s
04:28:39 test056 - 1.8(org.eclipse.jdt.core.tests.eval.DebugEvaluationTest)  Time elapsed: 0.133 s
04:28:39 test057 - 1.8(org.eclipse.jdt.core.tests.eval.DebugEvaluationTest)  Time elapsed: 0.128 s
04:28:39 test058 - 1.8(org.eclipse.jdt.core.tests.eval.DebugEvaluationTest)  Time elapsed: 0.128 s
04:28:39 test059 - 1.8(org.eclipse.jdt.core.tests.eval.DebugEvaluationTest)  Time elapsed: 0.13 s
04:28:39 test060 - 1.8(org.eclipse.jdt.core.tests.eval.DebugEvaluationTest)  Time elapsed: 0.129 s
04:28:39 test061 - 1.8(org.eclipse.jdt.core.tests.eval.DebugEvaluationTest)  Time elapsed: 0.129 s
04:28:39 test062 - 1.8(org.eclipse.jdt.core.tests.eval.DebugEvaluationTest)  Time elapsed: 0.131 s
04:28:39 test063 - 1.8(org.eclipse.jdt.core.tests.eval.DebugEvaluationTest)  Time elapsed: 0.128 s
04:28:39 test065 - 1.8(org.eclipse.jdt.core.tests.eval.DebugEvaluationTest)  Time elapsed: 0.129 s
04:28:39 test066 - 1.8(org.eclipse.jdt.core.tests.eval.DebugEvaluationTest)  Time elapsed: 0.129 s
04:28:39 test067 - 1.8(org.eclipse.jdt.core.tests.eval.DebugEvaluationTest)  Time elapsed: 0.133 s
04:28:39 test068 - 1.8(org.eclipse.jdt.core.tests.eval.DebugEvaluationTest)  Time elapsed: 0.027 s
04:28:39 test069 - 1.8(org.eclipse.jdt.core.tests.eval.DebugEvaluationTest)  Time elapsed: 0.027 s
04:28:39 testNegative001 - 1.8(org.eclipse.jdt.core.tests.eval.DebugEvaluationTest)  Time elapsed: 0.021 s
04:28:39 testNegative002 - 1.8(org.eclipse.jdt.core.tests.eval.DebugEvaluationTest)  Time elapsed: 0.02 s
04:28:39 testNegative003 - 1.8(org.eclipse.jdt.core.tests.eval.DebugEvaluationTest)  Time elapsed: 0.019 s
04:28:39 testNegative004 - 1.8(org.eclipse.jdt.core.tests.eval.DebugEvaluationTest)  Time elapsed: 0.01 s
04:28:39 testNegative005 - 1.8(org.eclipse.jdt.core.tests.eval.DebugEvaluationTest)  Time elapsed: 0.009 s
04:28:39 testAllVariables - 13(org.eclipse.jdt.core.tests.eval.SanityTestEvaluationContext)  Time elapsed: 0 s
04:28:39 testEvaluate - 13(org.eclipse.jdt.core.tests.eval.SanityTestEvaluationContext)  Time elapsed: 0.01 s
04:28:39 testEvaluateImports - 13(org.eclipse.jdt.core.tests.eval.SanityTestEvaluationContext)  Time elapsed: 0 s
04:28:39 testEvaluateVariable - 13(org.eclipse.jdt.core.tests.eval.SanityTestEvaluationContext)  Time elapsed: 0.008 s
04:28:39 testEvaluateVariables - 13(org.eclipse.jdt.core.tests.eval.SanityTestEvaluationContext)  Time elapsed: 0.002 s
04:28:39 testGetSetImports - 13(org.eclipse.jdt.core.tests.eval.SanityTestEvaluationContext)  Time elapsed: 0 s
04:28:39 testGetSetPackageName - 13(org.eclipse.jdt.core.tests.eval.SanityTestEvaluationContext)  Time elapsed: 0 s
04:28:39 testNewDeleteVariable - 13(org.eclipse.jdt.core.tests.eval.SanityTestEvaluationContext)  Time elapsed: 0 s
04:28:39 testGetEvaluationType - 13(org.eclipse.jdt.core.tests.eval.SanityTestEvaluationResult)  Time elapsed: 0.005 s
04:28:39 testGetProblems - 13(org.eclipse.jdt.core.tests.eval.SanityTestEvaluationResult)  Time elapsed: 0.003 s
04:28:39 testGetValue - 13(org.eclipse.jdt.core.tests.eval.SanityTestEvaluationResult)  Time elapsed: 0.004 s
04:28:39 testGetValueDisplayString - 13(org.eclipse.jdt.core.tests.eval.SanityTestEvaluationResult)  Time elapsed: 0.003 s
04:28:39 testGetValueTypeName - 13(org.eclipse.jdt.core.tests.eval.SanityTestEvaluationResult)  Time elapsed: 0.004 s
04:28:39 testHasErrors - 13(org.eclipse.jdt.core.tests.eval.SanityTestEvaluationResult)  Time elapsed: 0.003 s
04:28:39 testHasProblems - 13(org.eclipse.jdt.core.tests.eval.SanityTestEvaluationResult)  Time elapsed: 0.004 s
04:28:39 testHasValue - 13(org.eclipse.jdt.core.tests.eval.SanityTestEvaluationResult)  Time elapsed: 0.003 s
04:28:39 testHasWarnings - 13(org.eclipse.jdt.core.tests.eval.SanityTestEvaluationResult)  Time elapsed: 0.004 s
04:28:39 testAllKindOfValues - 13(org.eclipse.jdt.core.tests.eval.VariableTest)  Time elapsed: 0.056 s
04:28:39 testCodeSnippetVarAssign - 13(org.eclipse.jdt.core.tests.eval.VariableTest)  Time elapsed: 0.078 s
04:28:39 testCodeSnippetVarRetrieval - 13(org.eclipse.jdt.core.tests.eval.VariableTest)  Time elapsed: 0.042 s
04:28:39 testImports - 13(org.eclipse.jdt.core.tests.eval.VariableTest)  Time elapsed: 0.031 s
04:28:39 testSeveralVariableInstallations - 13(org.eclipse.jdt.core.tests.eval.VariableTest)  Time elapsed: 0.096 s
04:28:39 testBug345334 - 13(org.eclipse.jdt.core.tests.eval.CodeSnippetTest)  Time elapsed: 0.005 s
04:28:39 testBug464656 - 13(org.eclipse.jdt.core.tests.eval.CodeSnippetTest)  Time elapsed: 0.017 s
04:28:39 testCheckedException - 13(org.eclipse.jdt.core.tests.eval.CodeSnippetTest)  Time elapsed: 0.005 s
04:28:39 testDiamond - 13(org.eclipse.jdt.core.tests.eval.CodeSnippetTest)  Time elapsed: 0.006 s
04:28:39 testEmptyStatement - 13(org.eclipse.jdt.core.tests.eval.CodeSnippetTest)  Time elapsed: 0.005 s
04:28:39 testEvaluateEmptyImport - 13(org.eclipse.jdt.core.tests.eval.CodeSnippetTest)  Time elapsed: 0.001 s
04:28:39 testEvaluateExistingPackageAndNonExistingTypeImports - 13(org.eclipse.jdt.core.tests.eval.CodeSnippetTest)  Time elapsed: 0 s
04:28:39 testEvaluateNonExistingPackageAndExistingTypeImports - 13(org.eclipse.jdt.core.tests.eval.CodeSnippetTest)  Time elapsed: 0 s
04:28:39 testEvaluateNonExistingPackageImport - 13(org.eclipse.jdt.core.tests.eval.CodeSnippetTest)  Time elapsed: 0 s
04:28:39 testEvaluateNonExistingTypeImport - 13(org.eclipse.jdt.core.tests.eval.CodeSnippetTest)  Time elapsed: 0 s
04:28:39 testEvaluateValidPackageAndTypeImports - 13(org.eclipse.jdt.core.tests.eval.CodeSnippetTest)  Time elapsed: 0 s
04:28:39 testEvaluateValidPackageImport - 13(org.eclipse.jdt.core.tests.eval.CodeSnippetTest)  Time elapsed: 0 s
04:28:39 testEvaluateValidTypeImport - 13(org.eclipse.jdt.core.tests.eval.CodeSnippetTest)  Time elapsed: 0.001 s
04:28:39 testFinallyError - 13(org.eclipse.jdt.core.tests.eval.CodeSnippetTest)  Time elapsed: 0.006 s
04:28:39 testFinallyOneBlock - 13(org.eclipse.jdt.core.tests.eval.CodeSnippetTest)  Time elapsed: 0.006 s
04:28:39 testFinallyTwoBlock - 13(org.eclipse.jdt.core.tests.eval.CodeSnippetTest)  Time elapsed: 0.005 s
04:28:39 testFor89632 - 13(org.eclipse.jdt.core.tests.eval.CodeSnippetTest)  Time elapsed: 0.011 s
04:28:39 testFreeReturnAnonymous - 13(org.eclipse.jdt.core.tests.eval.CodeSnippetTest)  Time elapsed: 0.006 s
04:28:39 testFreeReturnClassDeclaration - 13(org.eclipse.jdt.core.tests.eval.CodeSnippetTest)  Time elapsed: 0.005 s
04:28:39 testFreeReturnExpression - 13(org.eclipse.jdt.core.tests.eval.CodeSnippetTest)  Time elapsed: 0.004 s
04:28:39 testFreeReturnInteger - 13(org.eclipse.jdt.core.tests.eval.CodeSnippetTest)  Time elapsed: 0.005 s
04:28:39 testFreeReturnLocalVar - 13(org.eclipse.jdt.core.tests.eval.CodeSnippetTest)  Time elapsed: 0.003 s
04:28:39 testFreeReturnStatement - 13(org.eclipse.jdt.core.tests.eval.CodeSnippetTest)  Time elapsed: 0.004 s
04:28:39 testImportPackage - 13(org.eclipse.jdt.core.tests.eval.CodeSnippetTest)  Time elapsed: 0.005 s
04:28:39 testImportType - 13(org.eclipse.jdt.core.tests.eval.CodeSnippetTest)  Time elapsed: 0.006 s
04:28:39 testImportTypeAndPackage - 13(org.eclipse.jdt.core.tests.eval.CodeSnippetTest)  Time elapsed: 0.005 s
04:28:39 testInnerClassAnonymous - 13(org.eclipse.jdt.core.tests.eval.CodeSnippetTest)  Time elapsed: 0.006 s
04:28:39 testInnerClassNamed - 13(org.eclipse.jdt.core.tests.eval.CodeSnippetTest)  Time elapsed: 0.004 s
04:28:39 testReturnDisplayStringBoolean - 13(org.eclipse.jdt.core.tests.eval.CodeSnippetTest)  Time elapsed: 0.003 s
04:28:39 testReturnDisplayStringCharacter - 13(org.eclipse.jdt.core.tests.eval.CodeSnippetTest)  Time elapsed: 0.003 s
04:28:39 testReturnDisplayStringDouble - 13(org.eclipse.jdt.core.tests.eval.CodeSnippetTest)  Time elapsed: 0.004 s
04:28:39 testReturnDisplayStringEmptyCodeSnippet - 13(org.eclipse.jdt.core.tests.eval.CodeSnippetTest)  Time elapsed: 0.002 s
04:28:39 testReturnDisplayStringFloat - 13(org.eclipse.jdt.core.tests.eval.CodeSnippetTest)  Time elapsed: 0.003 s
04:28:39 testReturnDisplayStringInteger - 13(org.eclipse.jdt.core.tests.eval.CodeSnippetTest)  Time elapsed: 0.004 s
04:28:39 testReturnDisplayStringLong - 13(org.eclipse.jdt.core.tests.eval.CodeSnippetTest)  Time elapsed: 0.003 s
04:28:39 testReturnDisplayStringNoExplicitReturnedValue - 13(org.eclipse.jdt.core.tests.eval.CodeSnippetTest)  Time elapsed: 0.004 s
04:28:39 testReturnDisplayStringObject - 13(org.eclipse.jdt.core.tests.eval.CodeSnippetTest)  Time elapsed: 0.005 s
04:28:39 testReturnDisplayStringShort - 13(org.eclipse.jdt.core.tests.eval.CodeSnippetTest)  Time elapsed: 0.003 s
04:28:39 testReturnDisplayStringString - 13(org.eclipse.jdt.core.tests.eval.CodeSnippetTest)  Time elapsed: 0.004 s
04:28:39 testReturnDisplayStringVoid - 13(org.eclipse.jdt.core.tests.eval.CodeSnippetTest)  Time elapsed: 0.006 s
04:28:39 testReturnTypeBoolean - 13(org.eclipse.jdt.core.tests.eval.CodeSnippetTest)  Time elapsed: 0.003 s
04:28:39 testReturnTypeBooleanArray - 13(org.eclipse.jdt.core.tests.eval.CodeSnippetTest)  Time elapsed: 0.004 s
04:28:39 testReturnTypeBooleanObject - 13(org.eclipse.jdt.core.tests.eval.CodeSnippetTest)  Time elapsed: 0.003 s
04:28:39 testReturnTypeChar - 13(org.eclipse.jdt.core.tests.eval.CodeSnippetTest)  Time elapsed: 0.003 s
04:28:39 testReturnTypeCharArray - 13(org.eclipse.jdt.core.tests.eval.CodeSnippetTest)  Time elapsed: 0.004 s
04:28:39 testReturnTypeCharacterObject - 13(org.eclipse.jdt.core.tests.eval.CodeSnippetTest)  Time elapsed: 0.005 s
04:28:39 testReturnTypeDouble - 13(org.eclipse.jdt.core.tests.eval.CodeSnippetTest)  Time elapsed: 0.005 s
04:28:39 testReturnTypeDoubleArray - 13(org.eclipse.jdt.core.tests.eval.CodeSnippetTest)  Time elapsed: 0.004 s
04:28:39 testReturnTypeDoubleObject - 13(org.eclipse.jdt.core.tests.eval.CodeSnippetTest)  Time elapsed: 0.004 s
04:28:39 testReturnTypeEmptyCodeSnippet - 13(org.eclipse.jdt.core.tests.eval.CodeSnippetTest)  Time elapsed: 0.002 s
04:28:39 testReturnTypeFloat - 13(org.eclipse.jdt.core.tests.eval.CodeSnippetTest)  Time elapsed: 0.003 s
04:28:39 testReturnTypeFloatArray - 13(org.eclipse.jdt.core.tests.eval.CodeSnippetTest)  Time elapsed: 0.003 s
04:28:39 testReturnTypeFloatObject - 13(org.eclipse.jdt.core.tests.eval.CodeSnippetTest)  Time elapsed: 0.004 s
04:28:39 testReturnTypeInt - 13(org.eclipse.jdt.core.tests.eval.CodeSnippetTest)  Time elapsed: 0.003 s
04:28:39 testReturnTypeIntegerObject - 13(org.eclipse.jdt.core.tests.eval.CodeSnippetTest)  Time elapsed: 0.004 s
04:28:39 testReturnTypeLong - 13(org.eclipse.jdt.core.tests.eval.CodeSnippetTest)  Time elapsed: 0.003 s
04:28:39 testReturnTypeLongArray - 13(org.eclipse.jdt.core.tests.eval.CodeSnippetTest)  Time elapsed: 0.003 s
04:28:39 testReturnTypeLongObject - 13(org.eclipse.jdt.core.tests.eval.CodeSnippetTest)  Time elapsed: 0.004 s
04:28:39 testReturnTypeNoExplicitReturnedValue - 13(org.eclipse.jdt.core.tests.eval.CodeSnippetTest)  Time elapsed: 0.003 s
04:28:39 testReturnTypeObject - 13(org.eclipse.jdt.core.tests.eval.CodeSnippetTest)  Time elapsed: 0.003 s
04:28:39 testReturnTypeObjectArray - 13(org.eclipse.jdt.core.tests.eval.CodeSnippetTest)  Time elapsed: 0.003 s
04:28:39 testReturnTypeShort - 13(org.eclipse.jdt.core.tests.eval.CodeSnippetTest)  Time elapsed: 0.003 s
04:28:39 testReturnTypeShortArray - 13(org.eclipse.jdt.core.tests.eval.CodeSnippetTest)  Time elapsed: 0.003 s
04:28:39 testReturnTypeShortObject - 13(org.eclipse.jdt.core.tests.eval.CodeSnippetTest)  Time elapsed: 0.003 s
04:28:39 testReturnTypeString - 13(org.eclipse.jdt.core.tests.eval.CodeSnippetTest)  Time elapsed: 0.003 s
04:28:39 testReturnTypeStringArray - 13(org.eclipse.jdt.core.tests.eval.CodeSnippetTest)  Time elapsed: 0.005 s
04:28:39 testReturnTypeVoid - 13(org.eclipse.jdt.core.tests.eval.CodeSnippetTest)  Time elapsed: 0.006 s
04:28:39 testReturnTypesIntArray - 13(org.eclipse.jdt.core.tests.eval.CodeSnippetTest)  Time elapsed: 0.005 s
04:28:39 testRunMethodInAnonymous - 13(org.eclipse.jdt.core.tests.eval.CodeSnippetTest)  Time elapsed: 0.209 s
04:28:39 testRunMethodInAnonymous2 - 13(org.eclipse.jdt.core.tests.eval.CodeSnippetTest)  Time elapsed: 0.207 s
04:28:39 testRunMethodInAnonymous3 - 13(org.eclipse.jdt.core.tests.eval.CodeSnippetTest)  Time elapsed: 0.207 s
04:28:39 testRunMethodInAnonymous4 - 13(org.eclipse.jdt.core.tests.eval.CodeSnippetTest)  Time elapsed: 0.208 s
04:28:39 testRunMethodInAnonymous5 - 13(org.eclipse.jdt.core.tests.eval.CodeSnippetTest)  Time elapsed: 0.207 s
04:28:39 testRunMethodInAnonymous6 - 13(org.eclipse.jdt.core.tests.eval.CodeSnippetTest)  Time elapsed: 0.208 s
04:28:39 testRunMethodInAnonymous7 - 13(org.eclipse.jdt.core.tests.eval.CodeSnippetTest)  Time elapsed: 0.207 s
04:28:39 testRunMethodInAnonymous8 - 13(org.eclipse.jdt.core.tests.eval.CodeSnippetTest)  Time elapsed: 0.208 s
04:28:39 testExpressionInInnerClass - 13(org.eclipse.jdt.core.tests.eval.NegativeCodeSnippetTest)  Time elapsed: 0.001 s
04:28:39 testExtraClosingCurlyBracket - 13(org.eclipse.jdt.core.tests.eval.NegativeCodeSnippetTest)  Time elapsed: 0.003 s
04:28:39 testExtraOpenRoundBracket - 13(org.eclipse.jdt.core.tests.eval.NegativeCodeSnippetTest)  Time elapsed: 0.001 s
04:28:39 testExtraSemiColonInExpression - 13(org.eclipse.jdt.core.tests.eval.NegativeCodeSnippetTest)  Time elapsed: 0.001 s
04:28:39 testInvalidField - 13(org.eclipse.jdt.core.tests.eval.NegativeCodeSnippetTest)  Time elapsed: 0.003 s
04:28:39 testInvalidImport - 13(org.eclipse.jdt.core.tests.eval.NegativeCodeSnippetTest)  Time elapsed: 0.002 s
04:28:39 testInvalidUseOfThisInSnippet - 13(org.eclipse.jdt.core.tests.eval.NegativeCodeSnippetTest)  Time elapsed: 0.003 s
04:28:39 testInvalidUseOfThisInSnippet2 - 13(org.eclipse.jdt.core.tests.eval.NegativeCodeSnippetTest)  Time elapsed: 0.001 s
04:28:39 testMissingClosingRoundBracket - 13(org.eclipse.jdt.core.tests.eval.NegativeCodeSnippetTest)  Time elapsed: 0.002 s
04:28:39 testMissingDoubleQuote - 13(org.eclipse.jdt.core.tests.eval.NegativeCodeSnippetTest)  Time elapsed: 0.001 s
04:28:39 testNonLastExpressionStatement - 13(org.eclipse.jdt.core.tests.eval.NegativeCodeSnippetTest)  Time elapsed: 0.001 s
04:28:39 testProblemInExpression - 13(org.eclipse.jdt.core.tests.eval.NegativeCodeSnippetTest)  Time elapsed: 0.001 s
04:28:39 testProblemInExpression2 - 13(org.eclipse.jdt.core.tests.eval.NegativeCodeSnippetTest)  Time elapsed: 0.002 s
04:28:39 testProblemInInnerClass - 13(org.eclipse.jdt.core.tests.eval.NegativeCodeSnippetTest)  Time elapsed: 0.007 s
04:28:39 testProblemInPreviousStatement - 13(org.eclipse.jdt.core.tests.eval.NegativeCodeSnippetTest)  Time elapsed: 0.002 s
04:28:39 testProblemInReturnStatement - 13(org.eclipse.jdt.core.tests.eval.NegativeCodeSnippetTest)  Time elapsed: 0.001 s
04:28:39 testRemoveImport - 13(org.eclipse.jdt.core.tests.eval.NegativeCodeSnippetTest)  Time elapsed: 0.009 s
04:28:39 testRemoveVariable - 13(org.eclipse.jdt.core.tests.eval.NegativeCodeSnippetTest)  Time elapsed: 0.008 s
04:28:39 testUnreachableExpression - 13(org.eclipse.jdt.core.tests.eval.NegativeCodeSnippetTest)  Time elapsed: 0.002 s
04:28:39 testUnusedImport - 13(org.eclipse.jdt.core.tests.eval.NegativeCodeSnippetTest)  Time elapsed: 0.008 s
04:28:39 testWarning - 13(org.eclipse.jdt.core.tests.eval.NegativeCodeSnippetTest)  Time elapsed: 0.004 s
04:28:39 testInitializerProblem - 13(org.eclipse.jdt.core.tests.eval.NegativeVariableTest)  Time elapsed: 0.006 s
04:28:39 testUnknownType - 13(org.eclipse.jdt.core.tests.eval.NegativeVariableTest)  Time elapsed: 0.003 s
04:28:39 test001 - 13(org.eclipse.jdt.core.tests.eval.DebugEvaluationTest)  Time elapsed: 0.133 s
04:28:39 test002 - 13(org.eclipse.jdt.core.tests.eval.DebugEvaluationTest)  Time elapsed: 0.134 s
04:28:39 test003 - 13(org.eclipse.jdt.core.tests.eval.DebugEvaluationTest)  Time elapsed: 0.024 s
04:28:39 test004 - 13(org.eclipse.jdt.core.tests.eval.DebugEvaluationTest)  Time elapsed: 0.119 s
04:28:39 test005 - 13(org.eclipse.jdt.core.tests.eval.DebugEvaluationTest)  Time elapsed: 0.132 s
04:28:39 test006 - 13(org.eclipse.jdt.core.tests.eval.DebugEvaluationTest)  Time elapsed: 0.134 s
04:28:39 test007 - 13(org.eclipse.jdt.core.tests.eval.DebugEvaluationTest)  Time elapsed: 0.131 s
04:28:39 test008 - 13(org.eclipse.jdt.core.tests.eval.DebugEvaluationTest)  Time elapsed: 0.131 s
04:28:39 test009 - 13(org.eclipse.jdt.core.tests.eval.DebugEvaluationTest)  Time elapsed: 0.122 s
04:28:39 test010 - 13(org.eclipse.jdt.core.tests.eval.DebugEvaluationTest)  Time elapsed: 0.134 s
04:28:39 test011 - 13(org.eclipse.jdt.core.tests.eval.DebugEvaluationTest)  Time elapsed: 0.127 s
04:28:39 test016 - 13(org.eclipse.jdt.core.tests.eval.DebugEvaluationTest)  Time elapsed: 0.227 s
04:28:39 test017 - 13(org.eclipse.jdt.core.tests.eval.DebugEvaluationTest)  Time elapsed: 0.13 s
04:28:39 test018 - 13(org.eclipse.jdt.core.tests.eval.DebugEvaluationTest)  Time elapsed: 0.245 s
04:28:39 test019 - 13(org.eclipse.jdt.core.tests.eval.DebugEvaluationTest)  Time elapsed: 0.025 s
04:28:39 test020 - 13(org.eclipse.jdt.core.tests.eval.DebugEvaluationTest)  Time elapsed: 0.132 s
04:28:39 test021 - 13(org.eclipse.jdt.core.tests.eval.DebugEvaluationTest)  Time elapsed: 0.245 s
04:28:39 test022 - 13(org.eclipse.jdt.core.tests.eval.DebugEvaluationTest)  Time elapsed: 0.251 s
04:28:39 test023 - 13(org.eclipse.jdt.core.tests.eval.DebugEvaluationTest)  Time elapsed: 0.257 s
04:28:39 test024 - 13(org.eclipse.jdt.core.tests.eval.DebugEvaluationTest)  Time elapsed: 0.277 s
04:28:39 test025 - 13(org.eclipse.jdt.core.tests.eval.DebugEvaluationTest)  Time elapsed: 0.247 s
04:28:39 test026 - 13(org.eclipse.jdt.core.tests.eval.DebugEvaluationTest)  Time elapsed: 0.133 s
04:28:39 test027 - 13(org.eclipse.jdt.core.tests.eval.DebugEvaluationTest)  Time elapsed: 0.135 s
04:28:39 test028 - 13(org.eclipse.jdt.core.tests.eval.DebugEvaluationTest)  Time elapsed: 0.136 s
04:28:39 test029 - 13(org.eclipse.jdt.core.tests.eval.DebugEvaluationTest)  Time elapsed: 0.134 s
04:28:39 test030 - 13(org.eclipse.jdt.core.tests.eval.DebugEvaluationTest)  Time elapsed: 0.134 s
04:28:39 test031 - 13(org.eclipse.jdt.core.tests.eval.DebugEvaluationTest)  Time elapsed: 0.135 s
04:28:39 test032 - 13(org.eclipse.jdt.core.tests.eval.DebugEvaluationTest)  Time elapsed: 0.031 s
04:28:39 test033 - 13(org.eclipse.jdt.core.tests.eval.DebugEvaluationTest)  Time elapsed: 0.136 s
04:28:39 test034 - 13(org.eclipse.jdt.core.tests.eval.DebugEvaluationTest)  Time elapsed: 0.135 s
04:28:39 test035 - 13(org.eclipse.jdt.core.tests.eval.DebugEvaluationTest)  Time elapsed: 0.135 s
04:28:39 test036 - 13(org.eclipse.jdt.core.tests.eval.DebugEvaluationTest)  Time elapsed: 0.134 s
04:28:39 test037 - 13(org.eclipse.jdt.core.tests.eval.DebugEvaluationTest)  Time elapsed: 0.133 s
04:28:39 test038 - 13(org.eclipse.jdt.core.tests.eval.DebugEvaluationTest)  Time elapsed: 0.133 s
04:28:39 test039 - 13(org.eclipse.jdt.core.tests.eval.DebugEvaluationTest)  Time elapsed: 0.135 s
04:28:39 test040 - 13(org.eclipse.jdt.core.tests.eval.DebugEvaluationTest)  Time elapsed: 0.134 s
04:28:39 test041 - 13(org.eclipse.jdt.core.tests.eval.DebugEvaluationTest)  Time elapsed: 0.133 s
04:28:39 test042 - 13(org.eclipse.jdt.core.tests.eval.DebugEvaluationTest)  Time elapsed: 0.134 s
04:28:39 test043 - 13(org.eclipse.jdt.core.tests.eval.DebugEvaluationTest)  Time elapsed: 0.139 s
04:28:39 test044 - 13(org.eclipse.jdt.core.tests.eval.DebugEvaluationTest)  Time elapsed: 0.135 s
04:28:39 test045 - 13(org.eclipse.jdt.core.tests.eval.DebugEvaluationTest)  Time elapsed: 0.138 s
04:28:39 test046 - 13(org.eclipse.jdt.core.tests.eval.DebugEvaluationTest)  Time elapsed: 0.135 s
04:28:39 test047 - 13(org.eclipse.jdt.core.tests.eval.DebugEvaluationTest)  Time elapsed: 0.133 s
04:28:39 test048 - 13(org.eclipse.jdt.core.tests.eval.DebugEvaluationTest)  Time elapsed: 0.134 s
04:28:39 test049 - 13(org.eclipse.jdt.core.tests.eval.DebugEvaluationTest)  Time elapsed: 0.131 s
04:28:39 test050 - 13(org.eclipse.jdt.core.tests.eval.DebugEvaluationTest)  Time elapsed: 0.132 s
04:28:39 test051 - 13(org.eclipse.jdt.core.tests.eval.DebugEvaluationTest)  Time elapsed: 0.132 s
04:28:39 test052 - 13(org.eclipse.jdt.core.tests.eval.DebugEvaluationTest)  Time elapsed: 0.133 s
04:28:39 test053 - 13(org.eclipse.jdt.core.tests.eval.DebugEvaluationTest)  Time elapsed: 0.133 s
04:28:39 test054 - 13(org.eclipse.jdt.core.tests.eval.DebugEvaluationTest)  Time elapsed: 0.137 s
04:28:39 test055 - 13(org.eclipse.jdt.core.tests.eval.DebugEvaluationTest)  Time elapsed: 0.134 s
04:28:39 test056 - 13(org.eclipse.jdt.core.tests.eval.DebugEvaluationTest)  Time elapsed: 0.135 s
04:28:39 test057 - 13(org.eclipse.jdt.core.tests.eval.DebugEvaluationTest)  Time elapsed: 0.138 s
04:28:39 test058 - 13(org.eclipse.jdt.core.tests.eval.DebugEvaluationTest)  Time elapsed: 0.133 s
04:28:39 test059 - 13(org.eclipse.jdt.core.tests.eval.DebugEvaluationTest)  Time elapsed: 0.139 s
04:28:39 test060 - 13(org.eclipse.jdt.core.tests.eval.DebugEvaluationTest)  Time elapsed: 0.136 s
04:28:39 test061 - 13(org.eclipse.jdt.core.tests.eval.DebugEvaluationTest)  Time elapsed: 0.132 s
04:28:39 test062 - 13(org.eclipse.jdt.core.tests.eval.DebugEvaluationTest)  Time elapsed: 0.134 s
04:28:39 test063 - 13(org.eclipse.jdt.core.tests.eval.DebugEvaluationTest)  Time elapsed: 0.134 s
04:28:39 test065 - 13(org.eclipse.jdt.core.tests.eval.DebugEvaluationTest)  Time elapsed: 0.139 s
04:28:39 test066 - 13(org.eclipse.jdt.core.tests.eval.DebugEvaluationTest)  Time elapsed: 0.134 s
04:28:39 test067 - 13(org.eclipse.jdt.core.tests.eval.DebugEvaluationTest)  Time elapsed: 0.136 s
04:28:39 test068 - 13(org.eclipse.jdt.core.tests.eval.DebugEvaluationTest)  Time elapsed: 0.03 s
04:28:39 test069 - 13(org.eclipse.jdt.core.tests.eval.DebugEvaluationTest)  Time elapsed: 0.029 s
04:28:39 testNegative001 - 13(org.eclipse.jdt.core.tests.eval.DebugEvaluationTest)  Time elapsed: 0.026 s
04:28:39 testNegative002 - 13(org.eclipse.jdt.core.tests.eval.DebugEvaluationTest)  Time elapsed: 0.024 s
04:28:39 testNegative003 - 13(org.eclipse.jdt.core.tests.eval.DebugEvaluationTest)  Time elapsed: 0.023 s
04:28:39 testNegative004 - 13(org.eclipse.jdt.core.tests.eval.DebugEvaluationTest)  Time elapsed: 0.012 s
04:28:39 testNegative005 - 13(org.eclipse.jdt.core.tests.eval.DebugEvaluationTest)  Time elapsed: 0.011 s
04:28:39 
04:28:39 Results:
04:28:39 
04:28:39 Failures: 
04:28:39   SelectionParserTest12>TestCase.runTest:964->test018:844->AbstractSelectionTest.checkMethodParse:256->AbstractSelectionTest.checkMethodParse:194->TestCase.assertEquals:242->TestCase.assertStringEquals:266 invalid selection unit-X.java.
04:28:39 ----------- Expected ------------
04:28:39 import org.eclipse.jdt.annotation.*;\n
04:28:39 import java.util.function.*;\n
04:28:39 interface IN0 {\n
04:28:39 }\n
04:28:39 interface IN1 extends IN0 {\n
04:28:39 }\n
04:28:39 interface IN2 extends IN0 {\n
04:28:39 }\n
04:28:39 public class X {\n
04:28:39   public X() {\n
04:28:39   }\n
04:28:39   IN1 n_1() {\n
04:28:39   }\n
04:28:39   IN2 n_2() {\n
04:28:39   }\n
04:28:39   <M>void m(Supplier<M> m2) {\n
04:28:39   }\n
04:28:39   void testSw(int i) {\n
04:28:39     m(switch (i) {\n
04:28:39 case 1 ->\n
04:28:39  <SelectionOnReferenceExpressionName:this::n_1>;\n
04:28:39 default ->\n
04:28:39  this::n_2;\n
04:28:39 });\n
04:28:39   }\n
04:28:39 }\n
04:28:39 
04:28:39 ------------ but was ------------
04:28:39 import org.eclipse.jdt.annotation.*;\n
04:28:39 import java.util.function.*;\n
04:28:39 interface IN0 {\n
04:28:39 }\n
04:28:39 interface IN1 extends IN0 {\n
04:28:39 }\n
04:28:39 interface IN2 extends IN0 {\n
04:28:39 }\n
04:28:39 public class X {\n
04:28:39   public X() {\n
04:28:39   }\n
04:28:39   IN1 n_1() {\n
04:28:39   }\n
04:28:39   IN2 n_2() {\n
04:28:39   }\n
04:28:39   <M>void m(Supplier<M> m2) {\n
04:28:39   }\n
04:28:39   void testSw(int i) {\n
04:28:39     m(switch (i) {\n
04:28:39 case 1 ->\n
04:28:39     yield <SelectionOnReferenceExpressionName:this::n_1>;\n
04:28:39 default ->\n
04:28:39     yield this::n_2;\n
04:28:39 });\n
04:28:39   }\n
04:28:39 }\n
04:28:39 
04:28:39 --------- Difference is ----------
04:28:39  expected:<...i) {\n
04:28:39 case 1 ->\n
04:28:39  [<SelectionOnReferenceExpressionName:this::n_1>;\n
04:28:39 default ->\n
04:28:39 ] this::n_2;\n
04:28:39 });\n
04:28:39 ...> but was:<...i) {\n
04:28:39 case 1 ->\n
04:28:39  [   yield <SelectionOnReferenceExpressionName:this::n_1>;\n
04:28:39 default ->\n
04:28:39     yield] this::n_2;\n
04:28:39 });\n
04:28:39 ...>
04:28:39   SelectionParserTest12>TestCase.runTest:964->test019:902->AbstractSelectionTest.checkMethodParse:256->AbstractSelectionTest.checkMethodParse:194->TestCase.assertEquals:242->TestCase.assertStringEquals:266 invalid selection unit-X.java.
04:28:39 ----------- Expected ------------
04:28:39 import org.eclipse.jdt.annotation.*;\n
04:28:39 import java.util.function.*;\n
04:28:39 interface IN0 {\n
04:28:39 }\n
04:28:39 interface IN1 extends IN0 {\n
04:28:39 }\n
04:28:39 interface IN2 extends IN0 {\n
04:28:39 }\n
04:28:39 public class X {\n
04:28:39   public X() {\n
04:28:39   }\n
04:28:39   IN1 n_1() {\n
04:28:39   }\n
04:28:39   IN2 n_2() {\n
04:28:39   }\n
04:28:39   <M>void m(Supplier<M> m2) {\n
04:28:39   }\n
04:28:39   void testSw(int i) {\n
04:28:39     m(switch (i) {\n
04:28:39 case 2 ->\n
04:28:39  () -> <SelectOnMessageSend:n_1()>;\n
04:28:39 default ->\n
04:28:39  this::n_2;\n
04:28:39 });\n
04:28:39   }\n
04:28:39 }\n
04:28:39 
04:28:39 ------------ but was ------------
04:28:39 import org.eclipse.jdt.annotation.*;\n
04:28:39 import java.util.function.*;\n
04:28:39 interface IN0 {\n
04:28:39 }\n
04:28:39 interface IN1 extends IN0 {\n
04:28:39 }\n
04:28:39 interface IN2 extends IN0 {\n
04:28:39 }\n
04:28:39 public class X {\n
04:28:39   public X() {\n
04:28:39   }\n
04:28:39   IN1 n_1() {\n
04:28:39   }\n
04:28:39   IN2 n_2() {\n
04:28:39   }\n
04:28:39   <M>void m(Supplier<M> m2) {\n
04:28:39   }\n
04:28:39   void testSw(int i) {\n
04:28:39     m(switch (i) {\n
04:28:39 case 2 ->\n
04:28:39     yield () -> <SelectOnMessageSend:n_1()>;\n
04:28:39 default ->\n
04:28:39     yield this::n_2;\n
04:28:39 });\n
04:28:39   }\n
04:28:39 }\n
04:28:39 
04:28:39 --------- Difference is ----------
04:28:39  expected:<...i) {\n
04:28:39 case 2 ->\n
04:28:39  [() -> <SelectOnMessageSend:n_1()>;\n
04:28:39 default ->\n
04:28:39 ] this::n_2;\n
04:28:39 });\n
04:28:39 ...> but was:<...i) {\n
04:28:39 case 2 ->\n
04:28:39  [   yield () -> <SelectOnMessageSend:n_1()>;\n
04:28:39 default ->\n
04:28:39     yield] this::n_2;\n
04:28:39 });\n
04:28:39 ...>
04:28:39   SelectionParserTest12>TestCase.runTest:964->test020:957->AbstractSelectionTest.checkMethodParse:256->AbstractSelectionTest.checkMethodParse:194->TestCase.assertEquals:242->TestCase.assertStringEquals:266 invalid selection unit-X.java.
04:28:39 ----------- Expected ------------
04:28:39 import org.eclipse.jdt.annotation.*;\n
04:28:39 import java.util.function.*;\n
04:28:39 interface IN0 {\n
04:28:39 }\n
04:28:39 interface IN1 extends IN0 {\n
04:28:39 }\n
04:28:39 interface IN2 extends IN0 {\n
04:28:39 }\n
04:28:39 public class X {\n
04:28:39   public X() {\n
04:28:39   }\n
04:28:39   IN1 n_1() {\n
04:28:39   }\n
04:28:39   IN2 n_2() {\n
04:28:39   }\n
04:28:39   <M>void m(Supplier<M> m2) {\n
04:28:39   }\n
04:28:39   void testSw(int i) {\n
04:28:39     m(switch (i) {\n
04:28:39 default ->\n
04:28:39  <SelectionOnReferenceExpressionName:this::n_2>;\n
04:28:39 });\n
04:28:39   }\n
04:28:39 }\n
04:28:39 
04:28:39 ------------ but was ------------
04:28:39 import org.eclipse.jdt.annotation.*;\n
04:28:39 import java.util.function.*;\n
04:28:39 interface IN0 {\n
04:28:39 }\n
04:28:39 interface IN1 extends IN0 {\n
04:28:39 }\n
04:28:39 interface IN2 extends IN0 {\n
04:28:39 }\n
04:28:39 public class X {\n
04:28:39   public X() {\n
04:28:39   }\n
04:28:39   IN1 n_1() {\n
04:28:39   }\n
04:28:39   IN2 n_2() {\n
04:28:39   }\n
04:28:39   <M>void m(Supplier<M> m2) {\n
04:28:39   }\n
04:28:39   void testSw(int i) {\n
04:28:39     m(switch (i) {\n
04:28:39 default ->\n
04:28:39     yield <SelectionOnReferenceExpressionName:this::n_2>;\n
04:28:39 });\n
04:28:39   }\n
04:28:39 }\n
04:28:39 
04:28:39 --------- Difference is ----------
04:28:39  expected:<...) {\n
04:28:39 default ->\n
04:28:39  []<SelectionOnReferenc...> but was:<...) {\n
04:28:39 default ->\n
04:28:39  [   yield ]<SelectionOnReferenc...>
04:28:39   SelectionParserTest12>TestCase.runTest:964->test021:1012->AbstractSelectionTest.checkMethodParse:256->AbstractSelectionTest.checkMethodParse:194->TestCase.assertEquals:242->TestCase.assertStringEquals:266 invalid selection unit-X.java.
04:28:39 ----------- Expected ------------
04:28:39 import org.eclipse.jdt.annotation.*;\n
04:28:39 import java.util.function.*;\n
04:28:39 interface IN0 {\n
04:28:39 }\n
04:28:39 interface IN1 extends IN0 {\n
04:28:39 }\n
04:28:39 interface IN2 extends IN0 {\n
04:28:39 }\n
04:28:39 public class X {\n
04:28:39   public X() {\n
04:28:39   }\n
04:28:39   IN1 n_1(int ijk) {\n
04:28:39   }\n
04:28:39   IN2 n_2() {\n
04:28:39   }\n
04:28:39   <M>void m(Supplier<M> m2) {\n
04:28:39   }\n
04:28:39   void testSw(int ijk) {\n
04:28:39     m(switch (ijk) {\n
04:28:39 default ->\n
04:28:39  () -> <SelectOnMessageSend:n_1(ijk)>;\n
04:28:39 });\n
04:28:39   }\n
04:28:39 }\n
04:28:39 
04:28:39 ------------ but was ------------
04:28:39 import org.eclipse.jdt.annotation.*;\n
04:28:39 import java.util.function.*;\n
04:28:39 interface IN0 {\n
04:28:39 }\n
04:28:39 interface IN1 extends IN0 {\n
04:28:39 }\n
04:28:39 interface IN2 extends IN0 {\n
04:28:39 }\n
04:28:39 public class X {\n
04:28:39   public X() {\n
04:28:39   }\n
04:28:39   IN1 n_1(int ijk) {\n
04:28:39   }\n
04:28:39   IN2 n_2() {\n
04:28:39   }\n
04:28:39   <M>void m(Supplier<M> m2) {\n
04:28:39   }\n
04:28:39   void testSw(int ijk) {\n
04:28:39     m(switch (ijk) {\n
04:28:39 default ->\n
04:28:39     yield () -> <SelectOnMessageSend:n_1(ijk)>;\n
04:28:39 });\n
04:28:39   }\n
04:28:39 }\n
04:28:39 
04:28:39 --------- Difference is ----------
04:28:39  expected:<...) {\n
04:28:39 default ->\n
04:28:39  []() -> <SelectOnMessa...> but was:<...) {\n
04:28:39 default ->\n
04:28:39  [   yield ]() -> <SelectOnMessa...>
04:28:39   SelectionParserTest12>TestCase.runTest:964->test022:1067->AbstractSelectionTest.checkMethodParse:256->AbstractSelectionTest.checkMethodParse:194->TestCase.assertEquals:242->TestCase.assertStringEquals:266 invalid selection unit-X.java.
04:28:39 ----------- Expected ------------
04:28:39 import org.eclipse.jdt.annotation.*;\n
04:28:39 import java.util.function.*;\n
04:28:39 interface IN0 {\n
04:28:39 }\n
04:28:39 interface IN1 extends IN0 {\n
04:28:39 }\n
04:28:39 interface IN2 extends IN0 {\n
04:28:39 }\n
04:28:39 public class X {\n
04:28:39   public X() {\n
04:28:39   }\n
04:28:39   IN1 n_1(int ijk) {\n
04:28:39   }\n
04:28:39   IN2 n_2() {\n
04:28:39   }\n
04:28:39   <M>void m(Supplier<M> m2) {\n
04:28:39   }\n
04:28:39   void testSw(int ijk) {\n
04:28:39     m(switch (ijk) {\n
04:28:39 default ->\n
04:28:39  () -> n_1(<SelectOnName:ijk>);\n
04:28:39 });\n
04:28:39   }\n
04:28:39 }\n
04:28:39 
04:28:39 ------------ but was ------------
04:28:39 import org.eclipse.jdt.annotation.*;\n
04:28:39 import java.util.function.*;\n
04:28:39 interface IN0 {\n
04:28:39 }\n
04:28:39 interface IN1 extends IN0 {\n
04:28:39 }\n
04:28:39 interface IN2 extends IN0 {\n
04:28:39 }\n
04:28:39 public class X {\n
04:28:39   public X() {\n
04:28:39   }\n
04:28:39   IN1 n_1(int ijk) {\n
04:28:39   }\n
04:28:39   IN2 n_2() {\n
04:28:39   }\n
04:28:39   <M>void m(Supplier<M> m2) {\n
04:28:39   }\n
04:28:39   void testSw(int ijk) {\n
04:28:39     m(switch (ijk) {\n
04:28:39 default ->\n
04:28:39     yield () -> n_1(<SelectOnName:ijk>);\n
04:28:39 });\n
04:28:39   }\n
04:28:39 }\n
04:28:39 
04:28:39 --------- Difference is ----------
04:28:39  expected:<...) {\n
04:28:39 default ->\n
04:28:39  []() -> n_1(<SelectOnN...> but was:<...) {\n
04:28:39 default ->\n
04:28:39  [   yield ]() -> n_1(<SelectOnN...>
04:28:39   NullAnnotationTest>TestCase.runTest:964->testBug542707_001:10372->AbstractNullAnnotationTest.runNegativeTestWithLibs:175->AbstractNullAnnotationTest.runNegativeTestWithLibs:153->AbstractNullAnnotationTest.runNegativeTestWithLibs:164->AbstractRegressionTest.runNegativeTest:3520->AbstractRegressionTest.runTest:2933->AbstractRegressionTest.runTest:3140->AbstractRegressionTest.checkCompilerLog:1290->TestCase.assertEquals:242->TestCase.assertStringEquals:266 Invalid problem log .
04:28:39 ----------- Expected ------------
04:28:39 ----------\n
04:28:39 1. ERROR in X.java (at line 12)\n
04:28:39 	x = null;\n
04:28:39 	    ^^^^\n
04:28:39 Null type mismatch: required '@NonNull X' but the provided value is null\n
04:28:39 ----------\n
04:28:39 2. ERROR in X.java (at line 15)\n
04:28:39 	default -> null;\n
04:28:39 	           ^^^^\n
04:28:39 Null type mismatch: required '@NonNull X' but the provided value is null\n
04:28:39 ----------\n
04:28:39 
04:28:39 ------------ but was ------------
04:28:39 ----------\n
04:28:39 1. ERROR in X.java (at line 0)\n
04:28:39 	import java.io.IOException;\n
04:28:39 	^\n
04:28:39 Preview features enabled at an invalid source release level 12, preview can be enabled only at source level 13\n
04:28:39 ----------\n
04:28:39 
04:28:39 --------- Difference is ----------
04:28:39  expected:<... in X.java (at line [12)\n
04:28:39 	x = null;\n
04:28:39 	    ^^^^\n
04:28:39 Null type mismatch: required '@NonNull X' but the provided value is null\n
04:28:39 ----------\n
04:28:39 2. ERROR in X.java (at line 15)\n
04:28:39 	default -> null;\n
04:28:39 	           ^^^^\n
04:28:39 Null type mismatch: required '@NonNull X' but the provided value is null]\n
04:28:39 ----------\n
04:28:39 > but was:<... in X.java (at line [0)\n
04:28:39 	import java.io.IOException;\n
04:28:39 	^\n
04:28:39 Preview features enabled at an invalid source release level 12, preview can be enabled only at source level 13]\n
04:28:39 ----------\n
04:28:39 >
04:28:39   SwitchExpressionsYieldTest>TestCase.runTest:964->testBug547891_02:2664->AbstractRegressionTest.runNegativeTest:2614->AbstractRegressionTest.runTest:2933->AbstractRegressionTest.runTest:3192->TestCase.assertEquals:242->TestCase.assertStringEquals:266 Unexpected error running resulting class file for X.java:
04:28:39 --[START]--
04:28:39 Error: Could not find or load main class 
04:28:39 Caused by: java.lang.ClassNotFoundException: 
04:28:39 ---[END]---
04:28:39 .
04:28:39 ----------- Expected ------------
04:28:39 
04:28:39 ------------ but was ------------
04:28:39 Error: Could not find or load main class \n
04:28:39 Caused by: java.lang.ClassNotFoundException: \n
04:28:39 
04:28:39 --------- Difference is ----------
04:28:39  expected:<[]> but was:<[Error: Could not find or load main class \n
04:28:39 Caused by: java.lang.ClassNotFoundException: \n
04:28:39 ]>
04:28:39   SwitchExpressionsYieldTest>TestCase.runTest:964->testBug547891_06:2783->AbstractRegressionTest.runNegativeTest:2614->AbstractRegressionTest.runTest:2933->AbstractRegressionTest.runTest:3192->TestCase.assertEquals:242->TestCase.assertStringEquals:266 Unexpected error running resulting class file for X.java:
04:28:39 --[START]--
04:28:39 Error: Could not find or load main class 
04:28:39 Caused by: java.lang.ClassNotFoundException: 
04:28:39 ---[END]---
04:28:39 .
04:28:39 ----------- Expected ------------
04:28:39 
04:28:39 ------------ but was ------------
04:28:39 Error: Could not find or load main class \n
04:28:39 Caused by: java.lang.ClassNotFoundException: \n
04:28:39 
04:28:39 --------- Difference is ----------
04:28:39  expected:<[]> but was:<[Error: Could not find or load main class \n
04:28:39 Caused by: java.lang.ClassNotFoundException: \n
04:28:39 ]>
04:28:39   SwitchExpressionsYieldTest>TestCase.runTest:964->testBug547891_08:2845->AbstractRegressionTest.runNegativeTest:2614->AbstractRegressionTest.runTest:2933->AbstractRegressionTest.runTest:3192->TestCase.assertEquals:242->TestCase.assertStringEquals:266 Unexpected error running resulting class file for X.java:
04:28:39 --[START]--
04:28:39 Error: Could not find or load main class 
04:28:39 Caused by: java.lang.ClassNotFoundException: 
04:28:39 ---[END]---
04:28:39 .
04:28:39 ----------- Expected ------------
04:28:39 
04:28:39 ------------ but was ------------
04:28:39 Error: Could not find or load main class \n
04:28:39 Caused by: java.lang.ClassNotFoundException: \n
04:28:39 
04:28:39 --------- Difference is ----------
04:28:39  expected:<[]> but was:<[Error: Could not find or load main class \n
04:28:39 Caused by: java.lang.ClassNotFoundException: \n
04:28:39 ]>
04:28:39   SwitchExpressionsYieldTest>TestCase.runTest:964->testBug547891_10:2889->AbstractRegressionTest.runNegativeTest:2614->AbstractRegressionTest.runTest:2933->AbstractRegressionTest.runTest:3192->TestCase.assertEquals:242->TestCase.assertStringEquals:266 Unexpected error running resulting class file for X.java:
04:28:39 --[START]--
04:28:39 Error: Could not find or load main class 
04:28:39 Caused by: java.lang.ClassNotFoundException: 
04:28:39 ---[END]---
04:28:39 .
04:28:39 ----------- Expected ------------
04:28:39 
04:28:39 ------------ but was ------------
04:28:39 Error: Could not find or load main class \n
04:28:39 Caused by: java.lang.ClassNotFoundException: \n
04:28:39 
04:28:39 --------- Difference is ----------
04:28:39  expected:<[]> but was:<[Error: Could not find or load main class \n
04:28:39 Caused by: java.lang.ClassNotFoundException: \n
04:28:39 ]>
04:28:39   SwitchExpressionsYieldTest>TestCase.runTest:964->testBug547891_12:2946->AbstractRegressionTest.runNegativeTest:2614->AbstractRegressionTest.runTest:2933->AbstractRegressionTest.runTest:3192->TestCase.assertEquals:242->TestCase.assertStringEquals:266 Unexpected error running resulting class file for X.java:
04:28:39 --[START]--
04:28:39 Error: Could not find or load main class 
04:28:39 Caused by: java.lang.ClassNotFoundException: 
04:28:39 ---[END]---
04:28:39 .
04:28:39 ----------- Expected ------------
04:28:39 
04:28:39 ------------ but was ------------
04:28:39 Error: Could not find or load main class \n
04:28:39 Caused by: java.lang.ClassNotFoundException: \n
04:28:39 
04:28:39 --------- Difference is ----------
04:28:39  expected:<[]> but was:<[Error: Could not find or load main class \n
04:28:39 Caused by: java.lang.ClassNotFoundException: \n
04:28:39 ]>
04:28:39   SwitchExpressionsYieldTest>TestCase.runTest:964->testBug547891_14:3003->AbstractRegressionTest.runNegativeTest:2614->AbstractRegressionTest.runTest:2933->AbstractRegressionTest.runTest:3192->TestCase.assertEquals:242->TestCase.assertStringEquals:266 Unexpected error running resulting class file for X.java:
04:28:39 --[START]--
04:28:39 Error: Could not find or load main class 
04:28:39 Caused by: java.lang.ClassNotFoundException: 
04:28:39 ---[END]---
04:28:39 .
04:28:39 ----------- Expected ------------
04:28:39 
04:28:39 ------------ but was ------------
04:28:39 Error: Could not find or load main class \n
04:28:39 Caused by: java.lang.ClassNotFoundException: \n
04:28:39 
04:28:39 --------- Difference is ----------
04:28:39  expected:<[]> but was:<[Error: Could not find or load main class \n
04:28:39 Caused by: java.lang.ClassNotFoundException: \n
04:28:39 ]>
04:28:39 Errors: 
04:28:39 org.eclipse.jdt.core.tests.compiler.regression.Unicode12_1Test.test1 - 13(org.eclipse.jdt.core.tests.compiler.regression.Unicode12_1Test)
04:28:39   Run 1: PASS
04:28:39   Run 2: Unicode12_1Test>AbstractRegressionTest.setUp:3614->TestCase.setUp:827->PerformanceTestCase.setUp:66 » IllegalArgument
04:28:39 
04:28:39 org.eclipse.jdt.core.tests.compiler.regression.Unicode12_1Test.test2 - 13(org.eclipse.jdt.core.tests.compiler.regression.Unicode12_1Test)
04:28:39   Run 1: PASS
04:28:39   Run 2: Unicode12_1Test>AbstractRegressionTest.setUp:3614->TestCase.setUp:827->PerformanceTestCase.setUp:66 » IllegalArgument
04:28:39 
04:28:39 
04:28:39 Tests run: 40822, Failures: 12, Errors: 2, Skipped: 0
04:28:39 
04:28:46 [INFO] ------------------------------------------------------------------------
04:28:46 [INFO] Reactor Summary:
04:28:46 [INFO] 
04:28:46 [INFO] eclipse.jdt.core 4.13.0-SNAPSHOT ................... SUCCESS [ 45.329 s]
04:28:46 [INFO] org.eclipse.jdt.annotation 2.2.300-SNAPSHOT ........ SUCCESS [ 32.262 s]
04:28:46 [INFO] org.eclipse.jdt.annotation 1.1.400-SNAPSHOT ........ SUCCESS [  7.918 s]
04:28:46 [INFO] org.eclipse.jdt.core 3.18.50-SNAPSHOT .............. SUCCESS [ 29.619 s]
04:28:46 [INFO] org.eclipse.jdt.compiler.tool 1.2.600-SNAPSHOT ..... SUCCESS [ 22.303 s]
04:28:46 [INFO] org.eclipse.jdt.compiler.apt 1.3.600-SNAPSHOT ...... SUCCESS [ 14.644 s]
04:28:46 [INFO] org.eclipse.jdt.core.tests.compiler 3.12.900-SNAPSHOT FAILURE [28:45 min]
04:28:46 [INFO] org.eclipse.jdt.compiler.tool.tests 1.2.500-SNAPSHOT SKIPPED
04:28:46 [INFO] org.eclipse.jdt.core.tests.builder 3.10.600-SNAPSHOT SKIPPED
04:28:46 [INFO] org.eclipse.jdt.compiler.apt.tests 1.1.800-SNAPSHOT  SKIPPED
04:28:46 [INFO] org.eclipse.jdt.core.tests.model 3.10.900-SNAPSHOT . SKIPPED
04:28:46 [INFO] org.eclipse.jdt.core.tests.performance 3.10.600-SNAPSHOT SKIPPED
04:28:46 [INFO] org.eclipse.jdt.apt.core 3.6.400-SNAPSHOT .......... SKIPPED
04:28:46 [INFO] org.eclipse.jdt.apt.pluggable.core 1.2.300-SNAPSHOT  SKIPPED
04:28:46 [INFO] org.eclipse.jdt.apt.ui 3.6.200-SNAPSHOT ............ SKIPPED
04:28:46 [INFO] org.eclipse.jdt.apt.pluggable.tests 3.4.600-SNAPSHOT SKIPPED
04:28:46 [INFO] org.eclipse.jdt.apt.tests 3.4.500-SNAPSHOT ......... SKIPPED
04:28:46 [INFO] ------------------------------------------------------------------------
04:28:46 [INFO] BUILD FAILURE
04:28:46 [INFO] ------------------------------------------------------------------------
04:28:46 [INFO] Total time:  34:52 min
04:28:46 [INFO] Finished at: 2019-07-10T04:28:46-04:00
04:28:46 [INFO] ------------------------------------------------------------------------
04:28:46 [ERROR] Failed to execute goal org.eclipse.tycho:tycho-surefire-plugin:1.5.0-SNAPSHOT:test (default-test) on project org.eclipse.jdt.core.tests.compiler: There are test failures.
04:28:46 [ERROR] 
04:28:46 [ERROR] Please refer to /jobs/genie.jdt/eclipse.jdt.core-Gerrit-BETA/workspace/org.eclipse.jdt.core.tests.compiler/target/surefire-reports for the individual test results.
04:28:46 [ERROR] -> [Help 1]
04:28:46 [ERROR] 
04:28:46 [ERROR] To see the full stack trace of the errors, re-run Maven with the -e switch.
04:28:46 [ERROR] Re-run Maven using the -X switch to enable full debug logging.
04:28:46 [ERROR] 
04:28:46 [ERROR] For more information about the errors and possible solutions, please read the following articles:
04:28:46 [ERROR] [Help 1] http://cwiki.apache.org/confluence/display/MAVEN/MojoFailureException
04:28:46 [ERROR] 
04:28:46 [ERROR] After correcting the problems, you can resume the build with the command
04:28:46 [ERROR]   mvn <goals> -rf :org.eclipse.jdt.core.tests.compiler
04:28:48 Build step 'Invoke top-level Maven targets' marked build as failure
04:28:48 Recording test results
04:28:51 Archiving artifacts
04:28:52 Started calculate disk usage of build
04:28:52 Finished Calculation of disk usage of build in 0 seconds
04:28:56 Started calculate disk usage of workspace
04:28:57 Finished Calculation of disk usage of workspace in 0 seconds
04:28:59 Finished: FAILURE