FailedConsole Output

Skipping 5,492 KB.. Full Log
sed: 0.009 s
14:25:46 testEvaluateImports - 1.8(org.eclipse.jdt.core.tests.eval.SanityTestEvaluationContext)  Time elapsed: 0 s
14:25:46 testEvaluateVariable - 1.8(org.eclipse.jdt.core.tests.eval.SanityTestEvaluationContext)  Time elapsed: 0.008 s
14:25:46 testEvaluateVariables - 1.8(org.eclipse.jdt.core.tests.eval.SanityTestEvaluationContext)  Time elapsed: 0.001 s
14:25:46 testGetSetImports - 1.8(org.eclipse.jdt.core.tests.eval.SanityTestEvaluationContext)  Time elapsed: 0 s
14:25:46 testGetSetPackageName - 1.8(org.eclipse.jdt.core.tests.eval.SanityTestEvaluationContext)  Time elapsed: 0 s
14:25:46 testNewDeleteVariable - 1.8(org.eclipse.jdt.core.tests.eval.SanityTestEvaluationContext)  Time elapsed: 0 s
14:25:46 testGetEvaluationType - 1.8(org.eclipse.jdt.core.tests.eval.SanityTestEvaluationResult)  Time elapsed: 0.01 s
14:25:46 testGetProblems - 1.8(org.eclipse.jdt.core.tests.eval.SanityTestEvaluationResult)  Time elapsed: 0.004 s
14:25:46 testGetValue - 1.8(org.eclipse.jdt.core.tests.eval.SanityTestEvaluationResult)  Time elapsed: 0.004 s
14:25:46 testGetValueDisplayString - 1.8(org.eclipse.jdt.core.tests.eval.SanityTestEvaluationResult)  Time elapsed: 0.003 s
14:25:46 testGetValueTypeName - 1.8(org.eclipse.jdt.core.tests.eval.SanityTestEvaluationResult)  Time elapsed: 0.004 s
14:25:46 testHasErrors - 1.8(org.eclipse.jdt.core.tests.eval.SanityTestEvaluationResult)  Time elapsed: 0.003 s
14:25:46 testHasProblems - 1.8(org.eclipse.jdt.core.tests.eval.SanityTestEvaluationResult)  Time elapsed: 0.003 s
14:25:46 testHasValue - 1.8(org.eclipse.jdt.core.tests.eval.SanityTestEvaluationResult)  Time elapsed: 0.004 s
14:25:46 testHasWarnings - 1.8(org.eclipse.jdt.core.tests.eval.SanityTestEvaluationResult)  Time elapsed: 0.003 s
14:25:46 testAllKindOfValues - 1.8(org.eclipse.jdt.core.tests.eval.VariableTest)  Time elapsed: 0.051 s
14:25:46 testCodeSnippetVarAssign - 1.8(org.eclipse.jdt.core.tests.eval.VariableTest)  Time elapsed: 0.072 s
14:25:46 testCodeSnippetVarRetrieval - 1.8(org.eclipse.jdt.core.tests.eval.VariableTest)  Time elapsed: 0.035 s
14:25:46 testImports - 1.8(org.eclipse.jdt.core.tests.eval.VariableTest)  Time elapsed: 0.027 s
14:25:46 testSeveralVariableInstallations - 1.8(org.eclipse.jdt.core.tests.eval.VariableTest)  Time elapsed: 0.096 s
14:25:46 testBug345334 - 1.8(org.eclipse.jdt.core.tests.eval.CodeSnippetTest)  Time elapsed: 0.004 s
14:25:46 testBug464656 - 1.8(org.eclipse.jdt.core.tests.eval.CodeSnippetTest)  Time elapsed: 0.02 s
14:25:46 testCheckedException - 1.8(org.eclipse.jdt.core.tests.eval.CodeSnippetTest)  Time elapsed: 0.006 s
14:25:46 testDiamond - 1.8(org.eclipse.jdt.core.tests.eval.CodeSnippetTest)  Time elapsed: 0.006 s
14:25:46 testEmptyStatement - 1.8(org.eclipse.jdt.core.tests.eval.CodeSnippetTest)  Time elapsed: 0.006 s
14:25:46 testEvaluateEmptyImport - 1.8(org.eclipse.jdt.core.tests.eval.CodeSnippetTest)  Time elapsed: 0 s
14:25:46 testEvaluateExistingPackageAndNonExistingTypeImports - 1.8(org.eclipse.jdt.core.tests.eval.CodeSnippetTest)  Time elapsed: 0 s
14:25:46 testEvaluateNonExistingPackageAndExistingTypeImports - 1.8(org.eclipse.jdt.core.tests.eval.CodeSnippetTest)  Time elapsed: 0 s
14:25:46 testEvaluateNonExistingPackageImport - 1.8(org.eclipse.jdt.core.tests.eval.CodeSnippetTest)  Time elapsed: 0 s
14:25:46 testEvaluateNonExistingTypeImport - 1.8(org.eclipse.jdt.core.tests.eval.CodeSnippetTest)  Time elapsed: 0 s
14:25:46 testEvaluateValidPackageAndTypeImports - 1.8(org.eclipse.jdt.core.tests.eval.CodeSnippetTest)  Time elapsed: 0 s
14:25:46 testEvaluateValidPackageImport - 1.8(org.eclipse.jdt.core.tests.eval.CodeSnippetTest)  Time elapsed: 0 s
14:25:46 testEvaluateValidTypeImport - 1.8(org.eclipse.jdt.core.tests.eval.CodeSnippetTest)  Time elapsed: 0.001 s
14:25:46 testFinallyError - 1.8(org.eclipse.jdt.core.tests.eval.CodeSnippetTest)  Time elapsed: 0.005 s
14:25:46 testFinallyOneBlock - 1.8(org.eclipse.jdt.core.tests.eval.CodeSnippetTest)  Time elapsed: 0.004 s
14:25:46 testFinallyTwoBlock - 1.8(org.eclipse.jdt.core.tests.eval.CodeSnippetTest)  Time elapsed: 0.004 s
14:25:46 testFor89632 - 1.8(org.eclipse.jdt.core.tests.eval.CodeSnippetTest)  Time elapsed: 0.011 s
14:25:46 testFreeReturnAnonymous - 1.8(org.eclipse.jdt.core.tests.eval.CodeSnippetTest)  Time elapsed: 0.005 s
14:25:46 testFreeReturnClassDeclaration - 1.8(org.eclipse.jdt.core.tests.eval.CodeSnippetTest)  Time elapsed: 0.005 s
14:25:46 testFreeReturnExpression - 1.8(org.eclipse.jdt.core.tests.eval.CodeSnippetTest)  Time elapsed: 0.003 s
14:25:46 testFreeReturnInteger - 1.8(org.eclipse.jdt.core.tests.eval.CodeSnippetTest)  Time elapsed: 0.004 s
14:25:46 testFreeReturnLocalVar - 1.8(org.eclipse.jdt.core.tests.eval.CodeSnippetTest)  Time elapsed: 0.003 s
14:25:46 testFreeReturnStatement - 1.8(org.eclipse.jdt.core.tests.eval.CodeSnippetTest)  Time elapsed: 0.004 s
14:25:46 testImportPackage - 1.8(org.eclipse.jdt.core.tests.eval.CodeSnippetTest)  Time elapsed: 0.006 s
14:25:46 testImportType - 1.8(org.eclipse.jdt.core.tests.eval.CodeSnippetTest)  Time elapsed: 0.009 s
14:25:46 testImportTypeAndPackage - 1.8(org.eclipse.jdt.core.tests.eval.CodeSnippetTest)  Time elapsed: 0.006 s
14:25:46 testInnerClassAnonymous - 1.8(org.eclipse.jdt.core.tests.eval.CodeSnippetTest)  Time elapsed: 0.006 s
14:25:46 testInnerClassNamed - 1.8(org.eclipse.jdt.core.tests.eval.CodeSnippetTest)  Time elapsed: 0.004 s
14:25:46 testReturnDisplayStringBoolean - 1.8(org.eclipse.jdt.core.tests.eval.CodeSnippetTest)  Time elapsed: 0.003 s
14:25:46 testReturnDisplayStringCharacter - 1.8(org.eclipse.jdt.core.tests.eval.CodeSnippetTest)  Time elapsed: 0.004 s
14:25:46 testReturnDisplayStringDouble - 1.8(org.eclipse.jdt.core.tests.eval.CodeSnippetTest)  Time elapsed: 0.003 s
14:25:46 testReturnDisplayStringEmptyCodeSnippet - 1.8(org.eclipse.jdt.core.tests.eval.CodeSnippetTest)  Time elapsed: 0.002 s
14:25:46 testReturnDisplayStringFloat - 1.8(org.eclipse.jdt.core.tests.eval.CodeSnippetTest)  Time elapsed: 0.003 s
14:25:46 testReturnDisplayStringInteger - 1.8(org.eclipse.jdt.core.tests.eval.CodeSnippetTest)  Time elapsed: 0.004 s
14:25:46 testReturnDisplayStringLong - 1.8(org.eclipse.jdt.core.tests.eval.CodeSnippetTest)  Time elapsed: 0.003 s
14:25:46 testReturnDisplayStringNoExplicitReturnedValue - 1.8(org.eclipse.jdt.core.tests.eval.CodeSnippetTest)  Time elapsed: 0.004 s
14:25:46 testReturnDisplayStringObject - 1.8(org.eclipse.jdt.core.tests.eval.CodeSnippetTest)  Time elapsed: 0.006 s
14:25:46 testReturnDisplayStringShort - 1.8(org.eclipse.jdt.core.tests.eval.CodeSnippetTest)  Time elapsed: 0.004 s
14:25:46 testReturnDisplayStringString - 1.8(org.eclipse.jdt.core.tests.eval.CodeSnippetTest)  Time elapsed: 0.004 s
14:25:46 testReturnDisplayStringVoid - 1.8(org.eclipse.jdt.core.tests.eval.CodeSnippetTest)  Time elapsed: 0.005 s
14:25:46 testReturnTypeBoolean - 1.8(org.eclipse.jdt.core.tests.eval.CodeSnippetTest)  Time elapsed: 0.003 s
14:25:46 testReturnTypeBooleanArray - 1.8(org.eclipse.jdt.core.tests.eval.CodeSnippetTest)  Time elapsed: 0.003 s
14:25:46 testReturnTypeBooleanObject - 1.8(org.eclipse.jdt.core.tests.eval.CodeSnippetTest)  Time elapsed: 0.004 s
14:25:46 testReturnTypeChar - 1.8(org.eclipse.jdt.core.tests.eval.CodeSnippetTest)  Time elapsed: 0.003 s
14:25:46 testReturnTypeCharArray - 1.8(org.eclipse.jdt.core.tests.eval.CodeSnippetTest)  Time elapsed: 0.003 s
14:25:46 testReturnTypeCharacterObject - 1.8(org.eclipse.jdt.core.tests.eval.CodeSnippetTest)  Time elapsed: 0.004 s
14:25:46 testReturnTypeDouble - 1.8(org.eclipse.jdt.core.tests.eval.CodeSnippetTest)  Time elapsed: 0.004 s
14:25:46 testReturnTypeDoubleArray - 1.8(org.eclipse.jdt.core.tests.eval.CodeSnippetTest)  Time elapsed: 0.003 s
14:25:46 testReturnTypeDoubleObject - 1.8(org.eclipse.jdt.core.tests.eval.CodeSnippetTest)  Time elapsed: 0.004 s
14:25:46 testReturnTypeEmptyCodeSnippet - 1.8(org.eclipse.jdt.core.tests.eval.CodeSnippetTest)  Time elapsed: 0.002 s
14:25:46 testReturnTypeFloat - 1.8(org.eclipse.jdt.core.tests.eval.CodeSnippetTest)  Time elapsed: 0.003 s
14:25:46 testReturnTypeFloatArray - 1.8(org.eclipse.jdt.core.tests.eval.CodeSnippetTest)  Time elapsed: 0.003 s
14:25:46 testReturnTypeFloatObject - 1.8(org.eclipse.jdt.core.tests.eval.CodeSnippetTest)  Time elapsed: 0.004 s
14:25:46 testReturnTypeInt - 1.8(org.eclipse.jdt.core.tests.eval.CodeSnippetTest)  Time elapsed: 0.003 s
14:25:46 testReturnTypeIntegerObject - 1.8(org.eclipse.jdt.core.tests.eval.CodeSnippetTest)  Time elapsed: 0.005 s
14:25:46 testReturnTypeLong - 1.8(org.eclipse.jdt.core.tests.eval.CodeSnippetTest)  Time elapsed: 0.003 s
14:25:46 testReturnTypeLongArray - 1.8(org.eclipse.jdt.core.tests.eval.CodeSnippetTest)  Time elapsed: 0.003 s
14:25:46 testReturnTypeLongObject - 1.8(org.eclipse.jdt.core.tests.eval.CodeSnippetTest)  Time elapsed: 0.005 s
14:25:46 testReturnTypeNoExplicitReturnedValue - 1.8(org.eclipse.jdt.core.tests.eval.CodeSnippetTest)  Time elapsed: 0.003 s
14:25:46 testReturnTypeObject - 1.8(org.eclipse.jdt.core.tests.eval.CodeSnippetTest)  Time elapsed: 0.003 s
14:25:46 testReturnTypeObjectArray - 1.8(org.eclipse.jdt.core.tests.eval.CodeSnippetTest)  Time elapsed: 0.003 s
14:25:46 testReturnTypeShort - 1.8(org.eclipse.jdt.core.tests.eval.CodeSnippetTest)  Time elapsed: 0.003 s
14:25:46 testReturnTypeShortArray - 1.8(org.eclipse.jdt.core.tests.eval.CodeSnippetTest)  Time elapsed: 0.003 s
14:25:46 testReturnTypeShortObject - 1.8(org.eclipse.jdt.core.tests.eval.CodeSnippetTest)  Time elapsed: 0.005 s
14:25:46 testReturnTypeString - 1.8(org.eclipse.jdt.core.tests.eval.CodeSnippetTest)  Time elapsed: 0.005 s
14:25:46 testReturnTypeStringArray - 1.8(org.eclipse.jdt.core.tests.eval.CodeSnippetTest)  Time elapsed: 0.004 s
14:25:46 testReturnTypeVoid - 1.8(org.eclipse.jdt.core.tests.eval.CodeSnippetTest)  Time elapsed: 0.004 s
14:25:46 testReturnTypesIntArray - 1.8(org.eclipse.jdt.core.tests.eval.CodeSnippetTest)  Time elapsed: 0.003 s
14:25:46 testRunMethodInAnonymous - 1.8(org.eclipse.jdt.core.tests.eval.CodeSnippetTest)  Time elapsed: 0.206 s
14:25:46 testRunMethodInAnonymous2 - 1.8(org.eclipse.jdt.core.tests.eval.CodeSnippetTest)  Time elapsed: 0.206 s
14:25:46 testRunMethodInAnonymous3 - 1.8(org.eclipse.jdt.core.tests.eval.CodeSnippetTest)  Time elapsed: 0.206 s
14:25:46 testRunMethodInAnonymous4 - 1.8(org.eclipse.jdt.core.tests.eval.CodeSnippetTest)  Time elapsed: 0.206 s
14:25:46 testRunMethodInAnonymous5 - 1.8(org.eclipse.jdt.core.tests.eval.CodeSnippetTest)  Time elapsed: 0.206 s
14:25:46 testRunMethodInAnonymous6 - 1.8(org.eclipse.jdt.core.tests.eval.CodeSnippetTest)  Time elapsed: 0.213 s
14:25:46 testRunMethodInAnonymous7 - 1.8(org.eclipse.jdt.core.tests.eval.CodeSnippetTest)  Time elapsed: 0.207 s
14:25:46 testRunMethodInAnonymous8 - 1.8(org.eclipse.jdt.core.tests.eval.CodeSnippetTest)  Time elapsed: 0.207 s
14:25:46 testExpressionInInnerClass - 1.8(org.eclipse.jdt.core.tests.eval.NegativeCodeSnippetTest)  Time elapsed: 0.001 s
14:25:46 testExtraClosingCurlyBracket - 1.8(org.eclipse.jdt.core.tests.eval.NegativeCodeSnippetTest)  Time elapsed: 0.001 s
14:25:46 testExtraOpenRoundBracket - 1.8(org.eclipse.jdt.core.tests.eval.NegativeCodeSnippetTest)  Time elapsed: 0.001 s
14:25:46 testExtraSemiColonInExpression - 1.8(org.eclipse.jdt.core.tests.eval.NegativeCodeSnippetTest)  Time elapsed: 0 s
14:25:46 testInvalidField - 1.8(org.eclipse.jdt.core.tests.eval.NegativeCodeSnippetTest)  Time elapsed: 0.002 s
14:25:46 testInvalidImport - 1.8(org.eclipse.jdt.core.tests.eval.NegativeCodeSnippetTest)  Time elapsed: 0.002 s
14:25:46 testInvalidUseOfThisInSnippet - 1.8(org.eclipse.jdt.core.tests.eval.NegativeCodeSnippetTest)  Time elapsed: 0.001 s
14:25:46 testInvalidUseOfThisInSnippet2 - 1.8(org.eclipse.jdt.core.tests.eval.NegativeCodeSnippetTest)  Time elapsed: 0.001 s
14:25:46 testMissingClosingRoundBracket - 1.8(org.eclipse.jdt.core.tests.eval.NegativeCodeSnippetTest)  Time elapsed: 0 s
14:25:46 testMissingDoubleQuote - 1.8(org.eclipse.jdt.core.tests.eval.NegativeCodeSnippetTest)  Time elapsed: 0.001 s
14:25:46 testNonLastExpressionStatement - 1.8(org.eclipse.jdt.core.tests.eval.NegativeCodeSnippetTest)  Time elapsed: 0.001 s
14:25:46 testProblemInExpression - 1.8(org.eclipse.jdt.core.tests.eval.NegativeCodeSnippetTest)  Time elapsed: 0 s
14:25:46 testProblemInExpression2 - 1.8(org.eclipse.jdt.core.tests.eval.NegativeCodeSnippetTest)  Time elapsed: 0.001 s
14:25:46 testProblemInInnerClass - 1.8(org.eclipse.jdt.core.tests.eval.NegativeCodeSnippetTest)  Time elapsed: 0.006 s
14:25:46 testProblemInPreviousStatement - 1.8(org.eclipse.jdt.core.tests.eval.NegativeCodeSnippetTest)  Time elapsed: 0.001 s
14:25:46 testProblemInReturnStatement - 1.8(org.eclipse.jdt.core.tests.eval.NegativeCodeSnippetTest)  Time elapsed: 0.001 s
14:25:46 testRemoveImport - 1.8(org.eclipse.jdt.core.tests.eval.NegativeCodeSnippetTest)  Time elapsed: 0.007 s
14:25:46 testRemoveVariable - 1.8(org.eclipse.jdt.core.tests.eval.NegativeCodeSnippetTest)  Time elapsed: 0.005 s
14:25:46 testUnreachableExpression - 1.8(org.eclipse.jdt.core.tests.eval.NegativeCodeSnippetTest)  Time elapsed: 0.002 s
14:25:46 testUnusedImport - 1.8(org.eclipse.jdt.core.tests.eval.NegativeCodeSnippetTest)  Time elapsed: 0.006 s
14:25:46 testWarning - 1.8(org.eclipse.jdt.core.tests.eval.NegativeCodeSnippetTest)  Time elapsed: 0.003 s
14:25:46 testInitializerProblem - 1.8(org.eclipse.jdt.core.tests.eval.NegativeVariableTest)  Time elapsed: 0.003 s
14:25:46 testUnknownType - 1.8(org.eclipse.jdt.core.tests.eval.NegativeVariableTest)  Time elapsed: 0.002 s
14:25:46 test001 - 1.8(org.eclipse.jdt.core.tests.eval.DebugEvaluationTest)  Time elapsed: 0.127 s
14:25:46 test002 - 1.8(org.eclipse.jdt.core.tests.eval.DebugEvaluationTest)  Time elapsed: 0.128 s
14:25:46 test003 - 1.8(org.eclipse.jdt.core.tests.eval.DebugEvaluationTest)  Time elapsed: 0.02 s
14:25:46 test004 - 1.8(org.eclipse.jdt.core.tests.eval.DebugEvaluationTest)  Time elapsed: 0.118 s
14:25:46 test005 - 1.8(org.eclipse.jdt.core.tests.eval.DebugEvaluationTest)  Time elapsed: 0.127 s
14:25:46 test006 - 1.8(org.eclipse.jdt.core.tests.eval.DebugEvaluationTest)  Time elapsed: 0.127 s
14:25:46 test007 - 1.8(org.eclipse.jdt.core.tests.eval.DebugEvaluationTest)  Time elapsed: 0.126 s
14:25:46 test008 - 1.8(org.eclipse.jdt.core.tests.eval.DebugEvaluationTest)  Time elapsed: 0.128 s
14:25:46 test009 - 1.8(org.eclipse.jdt.core.tests.eval.DebugEvaluationTest)  Time elapsed: 0.194 s
14:25:46 test010 - 1.8(org.eclipse.jdt.core.tests.eval.DebugEvaluationTest)  Time elapsed: 0.128 s
14:25:46 test011 - 1.8(org.eclipse.jdt.core.tests.eval.DebugEvaluationTest)  Time elapsed: 0.123 s
14:25:46 test016 - 1.8(org.eclipse.jdt.core.tests.eval.DebugEvaluationTest)  Time elapsed: 0.222 s
14:25:46 test017 - 1.8(org.eclipse.jdt.core.tests.eval.DebugEvaluationTest)  Time elapsed: 0.116 s
14:25:46 test018 - 1.8(org.eclipse.jdt.core.tests.eval.DebugEvaluationTest)  Time elapsed: 0.241 s
14:25:46 test019 - 1.8(org.eclipse.jdt.core.tests.eval.DebugEvaluationTest)  Time elapsed: 0.022 s
14:25:46 test020 - 1.8(org.eclipse.jdt.core.tests.eval.DebugEvaluationTest)  Time elapsed: 0.127 s
14:25:46 test021 - 1.8(org.eclipse.jdt.core.tests.eval.DebugEvaluationTest)  Time elapsed: 0.239 s
14:25:46 test022 - 1.8(org.eclipse.jdt.core.tests.eval.DebugEvaluationTest)  Time elapsed: 0.247 s
14:25:46 test023 - 1.8(org.eclipse.jdt.core.tests.eval.DebugEvaluationTest)  Time elapsed: 0.252 s
14:25:46 test024 - 1.8(org.eclipse.jdt.core.tests.eval.DebugEvaluationTest)  Time elapsed: 0.249 s
14:25:46 test025 - 1.8(org.eclipse.jdt.core.tests.eval.DebugEvaluationTest)  Time elapsed: 0.24 s
14:25:46 test026 - 1.8(org.eclipse.jdt.core.tests.eval.DebugEvaluationTest)  Time elapsed: 0.13 s
14:25:46 test027 - 1.8(org.eclipse.jdt.core.tests.eval.DebugEvaluationTest)  Time elapsed: 0.129 s
14:25:46 test028 - 1.8(org.eclipse.jdt.core.tests.eval.DebugEvaluationTest)  Time elapsed: 0.136 s
14:25:46 test029 - 1.8(org.eclipse.jdt.core.tests.eval.DebugEvaluationTest)  Time elapsed: 0.129 s
14:25:46 test030 - 1.8(org.eclipse.jdt.core.tests.eval.DebugEvaluationTest)  Time elapsed: 0.13 s
14:25:46 test031 - 1.8(org.eclipse.jdt.core.tests.eval.DebugEvaluationTest)  Time elapsed: 0.13 s
14:25:46 test032 - 1.8(org.eclipse.jdt.core.tests.eval.DebugEvaluationTest)  Time elapsed: 0.026 s
14:25:46 test033 - 1.8(org.eclipse.jdt.core.tests.eval.DebugEvaluationTest)  Time elapsed: 0.134 s
14:25:46 test034 - 1.8(org.eclipse.jdt.core.tests.eval.DebugEvaluationTest)  Time elapsed: 0.131 s
14:25:46 test035 - 1.8(org.eclipse.jdt.core.tests.eval.DebugEvaluationTest)  Time elapsed: 0.128 s
14:25:46 test036 - 1.8(org.eclipse.jdt.core.tests.eval.DebugEvaluationTest)  Time elapsed: 0.13 s
14:25:46 test037 - 1.8(org.eclipse.jdt.core.tests.eval.DebugEvaluationTest)  Time elapsed: 0.128 s
14:25:46 test038 - 1.8(org.eclipse.jdt.core.tests.eval.DebugEvaluationTest)  Time elapsed: 0.129 s
14:25:46 test039 - 1.8(org.eclipse.jdt.core.tests.eval.DebugEvaluationTest)  Time elapsed: 0.129 s
14:25:46 test040 - 1.8(org.eclipse.jdt.core.tests.eval.DebugEvaluationTest)  Time elapsed: 0.132 s
14:25:46 test041 - 1.8(org.eclipse.jdt.core.tests.eval.DebugEvaluationTest)  Time elapsed: 0.132 s
14:25:46 test042 - 1.8(org.eclipse.jdt.core.tests.eval.DebugEvaluationTest)  Time elapsed: 0.129 s
14:25:46 test043 - 1.8(org.eclipse.jdt.core.tests.eval.DebugEvaluationTest)  Time elapsed: 0.128 s
14:25:46 test044 - 1.8(org.eclipse.jdt.core.tests.eval.DebugEvaluationTest)  Time elapsed: 0.13 s
14:25:46 test045 - 1.8(org.eclipse.jdt.core.tests.eval.DebugEvaluationTest)  Time elapsed: 0.129 s
14:25:46 test046 - 1.8(org.eclipse.jdt.core.tests.eval.DebugEvaluationTest)  Time elapsed: 0.134 s
14:25:46 test047 - 1.8(org.eclipse.jdt.core.tests.eval.DebugEvaluationTest)  Time elapsed: 0.131 s
14:25:46 test048 - 1.8(org.eclipse.jdt.core.tests.eval.DebugEvaluationTest)  Time elapsed: 0.13 s
14:25:46 test049 - 1.8(org.eclipse.jdt.core.tests.eval.DebugEvaluationTest)  Time elapsed: 0.13 s
14:25:46 test050 - 1.8(org.eclipse.jdt.core.tests.eval.DebugEvaluationTest)  Time elapsed: 0.131 s
14:25:46 test051 - 1.8(org.eclipse.jdt.core.tests.eval.DebugEvaluationTest)  Time elapsed: 0.13 s
14:25:46 test052 - 1.8(org.eclipse.jdt.core.tests.eval.DebugEvaluationTest)  Time elapsed: 0.13 s
14:25:46 test053 - 1.8(org.eclipse.jdt.core.tests.eval.DebugEvaluationTest)  Time elapsed: 0.129 s
14:25:46 test054 - 1.8(org.eclipse.jdt.core.tests.eval.DebugEvaluationTest)  Time elapsed: 0.388 s
14:25:46 test055 - 1.8(org.eclipse.jdt.core.tests.eval.DebugEvaluationTest)  Time elapsed: 0.134 s
14:25:46 test056 - 1.8(org.eclipse.jdt.core.tests.eval.DebugEvaluationTest)  Time elapsed: 0.13 s
14:25:46 test057 - 1.8(org.eclipse.jdt.core.tests.eval.DebugEvaluationTest)  Time elapsed: 0.132 s
14:25:46 test058 - 1.8(org.eclipse.jdt.core.tests.eval.DebugEvaluationTest)  Time elapsed: 0.131 s
14:25:46 test059 - 1.8(org.eclipse.jdt.core.tests.eval.DebugEvaluationTest)  Time elapsed: 0.131 s
14:25:46 test060 - 1.8(org.eclipse.jdt.core.tests.eval.DebugEvaluationTest)  Time elapsed: 0.132 s
14:25:46 test061 - 1.8(org.eclipse.jdt.core.tests.eval.DebugEvaluationTest)  Time elapsed: 0.129 s
14:25:46 test062 - 1.8(org.eclipse.jdt.core.tests.eval.DebugEvaluationTest)  Time elapsed: 0.127 s
14:25:46 test063 - 1.8(org.eclipse.jdt.core.tests.eval.DebugEvaluationTest)  Time elapsed: 0.128 s
14:25:46 test065 - 1.8(org.eclipse.jdt.core.tests.eval.DebugEvaluationTest)  Time elapsed: 0.13 s
14:25:46 test066 - 1.8(org.eclipse.jdt.core.tests.eval.DebugEvaluationTest)  Time elapsed: 0.129 s
14:25:46 test067 - 1.8(org.eclipse.jdt.core.tests.eval.DebugEvaluationTest)  Time elapsed: 0.137 s
14:25:46 test068 - 1.8(org.eclipse.jdt.core.tests.eval.DebugEvaluationTest)  Time elapsed: 0.027 s
14:25:46 test069 - 1.8(org.eclipse.jdt.core.tests.eval.DebugEvaluationTest)  Time elapsed: 0.029 s
14:25:46 testNegative001 - 1.8(org.eclipse.jdt.core.tests.eval.DebugEvaluationTest)  Time elapsed: 0.02 s
14:25:46 testNegative002 - 1.8(org.eclipse.jdt.core.tests.eval.DebugEvaluationTest)  Time elapsed: 0.021 s
14:25:46 testNegative003 - 1.8(org.eclipse.jdt.core.tests.eval.DebugEvaluationTest)  Time elapsed: 0.019 s
14:25:46 testNegative004 - 1.8(org.eclipse.jdt.core.tests.eval.DebugEvaluationTest)  Time elapsed: 0.01 s
14:25:46 testNegative005 - 1.8(org.eclipse.jdt.core.tests.eval.DebugEvaluationTest)  Time elapsed: 0.009 s
14:25:46 testAllVariables - 13(org.eclipse.jdt.core.tests.eval.SanityTestEvaluationContext)  Time elapsed: 0 s
14:25:46 testEvaluate - 13(org.eclipse.jdt.core.tests.eval.SanityTestEvaluationContext)  Time elapsed: 0.011 s
14:25:46 testEvaluateImports - 13(org.eclipse.jdt.core.tests.eval.SanityTestEvaluationContext)  Time elapsed: 0 s
14:25:46 testEvaluateVariable - 13(org.eclipse.jdt.core.tests.eval.SanityTestEvaluationContext)  Time elapsed: 0.008 s
14:25:46 testEvaluateVariables - 13(org.eclipse.jdt.core.tests.eval.SanityTestEvaluationContext)  Time elapsed: 0.002 s
14:25:46 testGetSetImports - 13(org.eclipse.jdt.core.tests.eval.SanityTestEvaluationContext)  Time elapsed: 0 s
14:25:46 testGetSetPackageName - 13(org.eclipse.jdt.core.tests.eval.SanityTestEvaluationContext)  Time elapsed: 0 s
14:25:46 testNewDeleteVariable - 13(org.eclipse.jdt.core.tests.eval.SanityTestEvaluationContext)  Time elapsed: 0 s
14:25:46 testGetEvaluationType - 13(org.eclipse.jdt.core.tests.eval.SanityTestEvaluationResult)  Time elapsed: 0.005 s
14:25:46 testGetProblems - 13(org.eclipse.jdt.core.tests.eval.SanityTestEvaluationResult)  Time elapsed: 0.004 s
14:25:46 testGetValue - 13(org.eclipse.jdt.core.tests.eval.SanityTestEvaluationResult)  Time elapsed: 0.004 s
14:25:46 testGetValueDisplayString - 13(org.eclipse.jdt.core.tests.eval.SanityTestEvaluationResult)  Time elapsed: 0.004 s
14:25:46 testGetValueTypeName - 13(org.eclipse.jdt.core.tests.eval.SanityTestEvaluationResult)  Time elapsed: 0.004 s
14:25:46 testHasErrors - 13(org.eclipse.jdt.core.tests.eval.SanityTestEvaluationResult)  Time elapsed: 0.004 s
14:25:46 testHasProblems - 13(org.eclipse.jdt.core.tests.eval.SanityTestEvaluationResult)  Time elapsed: 0.004 s
14:25:46 testHasValue - 13(org.eclipse.jdt.core.tests.eval.SanityTestEvaluationResult)  Time elapsed: 0.004 s
14:25:46 testHasWarnings - 13(org.eclipse.jdt.core.tests.eval.SanityTestEvaluationResult)  Time elapsed: 0.003 s
14:25:46 testAllKindOfValues - 13(org.eclipse.jdt.core.tests.eval.VariableTest)  Time elapsed: 0.075 s
14:25:46 testCodeSnippetVarAssign - 13(org.eclipse.jdt.core.tests.eval.VariableTest)  Time elapsed: 0.076 s
14:25:46 testCodeSnippetVarRetrieval - 13(org.eclipse.jdt.core.tests.eval.VariableTest)  Time elapsed: 0.037 s
14:25:46 testImports - 13(org.eclipse.jdt.core.tests.eval.VariableTest)  Time elapsed: 0.028 s
14:25:46 testSeveralVariableInstallations - 13(org.eclipse.jdt.core.tests.eval.VariableTest)  Time elapsed: 0.099 s
14:25:46 testBug345334 - 13(org.eclipse.jdt.core.tests.eval.CodeSnippetTest)  Time elapsed: 0.005 s
14:25:46 testBug464656 - 13(org.eclipse.jdt.core.tests.eval.CodeSnippetTest)  Time elapsed: 0.019 s
14:25:46 testCheckedException - 13(org.eclipse.jdt.core.tests.eval.CodeSnippetTest)  Time elapsed: 0.005 s
14:25:46 testDiamond - 13(org.eclipse.jdt.core.tests.eval.CodeSnippetTest)  Time elapsed: 0.006 s
14:25:46 testEmptyStatement - 13(org.eclipse.jdt.core.tests.eval.CodeSnippetTest)  Time elapsed: 0.004 s
14:25:46 testEvaluateEmptyImport - 13(org.eclipse.jdt.core.tests.eval.CodeSnippetTest)  Time elapsed: 0 s
14:25:46 testEvaluateExistingPackageAndNonExistingTypeImports - 13(org.eclipse.jdt.core.tests.eval.CodeSnippetTest)  Time elapsed: 0 s
14:25:46 testEvaluateNonExistingPackageAndExistingTypeImports - 13(org.eclipse.jdt.core.tests.eval.CodeSnippetTest)  Time elapsed: 0 s
14:25:46 testEvaluateNonExistingPackageImport - 13(org.eclipse.jdt.core.tests.eval.CodeSnippetTest)  Time elapsed: 0 s
14:25:46 testEvaluateNonExistingTypeImport - 13(org.eclipse.jdt.core.tests.eval.CodeSnippetTest)  Time elapsed: 0 s
14:25:46 testEvaluateValidPackageAndTypeImports - 13(org.eclipse.jdt.core.tests.eval.CodeSnippetTest)  Time elapsed: 0 s
14:25:46 testEvaluateValidPackageImport - 13(org.eclipse.jdt.core.tests.eval.CodeSnippetTest)  Time elapsed: 0.001 s
14:25:46 testEvaluateValidTypeImport - 13(org.eclipse.jdt.core.tests.eval.CodeSnippetTest)  Time elapsed: 0 s
14:25:46 testFinallyError - 13(org.eclipse.jdt.core.tests.eval.CodeSnippetTest)  Time elapsed: 0.005 s
14:25:46 testFinallyOneBlock - 13(org.eclipse.jdt.core.tests.eval.CodeSnippetTest)  Time elapsed: 0.004 s
14:25:46 testFinallyTwoBlock - 13(org.eclipse.jdt.core.tests.eval.CodeSnippetTest)  Time elapsed: 0.003 s
14:25:46 testFor89632 - 13(org.eclipse.jdt.core.tests.eval.CodeSnippetTest)  Time elapsed: 0.009 s
14:25:46 testFreeReturnAnonymous - 13(org.eclipse.jdt.core.tests.eval.CodeSnippetTest)  Time elapsed: 0.007 s
14:25:46 testFreeReturnClassDeclaration - 13(org.eclipse.jdt.core.tests.eval.CodeSnippetTest)  Time elapsed: 0.004 s
14:25:46 testFreeReturnExpression - 13(org.eclipse.jdt.core.tests.eval.CodeSnippetTest)  Time elapsed: 0.004 s
14:25:46 testFreeReturnInteger - 13(org.eclipse.jdt.core.tests.eval.CodeSnippetTest)  Time elapsed: 0.003 s
14:25:46 testFreeReturnLocalVar - 13(org.eclipse.jdt.core.tests.eval.CodeSnippetTest)  Time elapsed: 0.003 s
14:25:46 testFreeReturnStatement - 13(org.eclipse.jdt.core.tests.eval.CodeSnippetTest)  Time elapsed: 0.004 s
14:25:46 testImportPackage - 13(org.eclipse.jdt.core.tests.eval.CodeSnippetTest)  Time elapsed: 0.006 s
14:25:46 testImportType - 13(org.eclipse.jdt.core.tests.eval.CodeSnippetTest)  Time elapsed: 0.006 s
14:25:46 testImportTypeAndPackage - 13(org.eclipse.jdt.core.tests.eval.CodeSnippetTest)  Time elapsed: 0.007 s
14:25:46 testInnerClassAnonymous - 13(org.eclipse.jdt.core.tests.eval.CodeSnippetTest)  Time elapsed: 0.005 s
14:25:46 testInnerClassNamed - 13(org.eclipse.jdt.core.tests.eval.CodeSnippetTest)  Time elapsed: 0.004 s
14:25:46 testReturnDisplayStringBoolean - 13(org.eclipse.jdt.core.tests.eval.CodeSnippetTest)  Time elapsed: 0.003 s
14:25:46 testReturnDisplayStringCharacter - 13(org.eclipse.jdt.core.tests.eval.CodeSnippetTest)  Time elapsed: 0.004 s
14:25:46 testReturnDisplayStringDouble - 13(org.eclipse.jdt.core.tests.eval.CodeSnippetTest)  Time elapsed: 0.003 s
14:25:46 testReturnDisplayStringEmptyCodeSnippet - 13(org.eclipse.jdt.core.tests.eval.CodeSnippetTest)  Time elapsed: 0.002 s
14:25:46 testReturnDisplayStringFloat - 13(org.eclipse.jdt.core.tests.eval.CodeSnippetTest)  Time elapsed: 0.004 s
14:25:46 testReturnDisplayStringInteger - 13(org.eclipse.jdt.core.tests.eval.CodeSnippetTest)  Time elapsed: 0.004 s
14:25:46 testReturnDisplayStringLong - 13(org.eclipse.jdt.core.tests.eval.CodeSnippetTest)  Time elapsed: 0.005 s
14:25:46 testReturnDisplayStringNoExplicitReturnedValue - 13(org.eclipse.jdt.core.tests.eval.CodeSnippetTest)  Time elapsed: 0.005 s
14:25:46 testReturnDisplayStringObject - 13(org.eclipse.jdt.core.tests.eval.CodeSnippetTest)  Time elapsed: 0.006 s
14:25:46 testReturnDisplayStringShort - 13(org.eclipse.jdt.core.tests.eval.CodeSnippetTest)  Time elapsed: 0.003 s
14:25:46 testReturnDisplayStringString - 13(org.eclipse.jdt.core.tests.eval.CodeSnippetTest)  Time elapsed: 0.005 s
14:25:46 testReturnDisplayStringVoid - 13(org.eclipse.jdt.core.tests.eval.CodeSnippetTest)  Time elapsed: 0.005 s
14:25:46 testReturnTypeBoolean - 13(org.eclipse.jdt.core.tests.eval.CodeSnippetTest)  Time elapsed: 0.004 s
14:25:46 testReturnTypeBooleanArray - 13(org.eclipse.jdt.core.tests.eval.CodeSnippetTest)  Time elapsed: 0.004 s
14:25:46 testReturnTypeBooleanObject - 13(org.eclipse.jdt.core.tests.eval.CodeSnippetTest)  Time elapsed: 0.003 s
14:25:46 testReturnTypeChar - 13(org.eclipse.jdt.core.tests.eval.CodeSnippetTest)  Time elapsed: 0.003 s
14:25:46 testReturnTypeCharArray - 13(org.eclipse.jdt.core.tests.eval.CodeSnippetTest)  Time elapsed: 0.003 s
14:25:46 testReturnTypeCharacterObject - 13(org.eclipse.jdt.core.tests.eval.CodeSnippetTest)  Time elapsed: 0.004 s
14:25:46 testReturnTypeDouble - 13(org.eclipse.jdt.core.tests.eval.CodeSnippetTest)  Time elapsed: 0.004 s
14:25:46 testReturnTypeDoubleArray - 13(org.eclipse.jdt.core.tests.eval.CodeSnippetTest)  Time elapsed: 0.003 s
14:25:46 testReturnTypeDoubleObject - 13(org.eclipse.jdt.core.tests.eval.CodeSnippetTest)  Time elapsed: 0.004 s
14:25:46 testReturnTypeEmptyCodeSnippet - 13(org.eclipse.jdt.core.tests.eval.CodeSnippetTest)  Time elapsed: 0.002 s
14:25:46 testReturnTypeFloat - 13(org.eclipse.jdt.core.tests.eval.CodeSnippetTest)  Time elapsed: 0.004 s
14:25:46 testReturnTypeFloatArray - 13(org.eclipse.jdt.core.tests.eval.CodeSnippetTest)  Time elapsed: 0.004 s
14:25:46 testReturnTypeFloatObject - 13(org.eclipse.jdt.core.tests.eval.CodeSnippetTest)  Time elapsed: 0.003 s
14:25:46 testReturnTypeInt - 13(org.eclipse.jdt.core.tests.eval.CodeSnippetTest)  Time elapsed: 0.004 s
14:25:46 testReturnTypeIntegerObject - 13(org.eclipse.jdt.core.tests.eval.CodeSnippetTest)  Time elapsed: 0.003 s
14:25:46 testReturnTypeLong - 13(org.eclipse.jdt.core.tests.eval.CodeSnippetTest)  Time elapsed: 0.004 s
14:25:46 testReturnTypeLongArray - 13(org.eclipse.jdt.core.tests.eval.CodeSnippetTest)  Time elapsed: 0.004 s
14:25:46 testReturnTypeLongObject - 13(org.eclipse.jdt.core.tests.eval.CodeSnippetTest)  Time elapsed: 0.004 s
14:25:46 testReturnTypeNoExplicitReturnedValue - 13(org.eclipse.jdt.core.tests.eval.CodeSnippetTest)  Time elapsed: 0.004 s
14:25:46 testReturnTypeObject - 13(org.eclipse.jdt.core.tests.eval.CodeSnippetTest)  Time elapsed: 0.003 s
14:25:46 testReturnTypeObjectArray - 13(org.eclipse.jdt.core.tests.eval.CodeSnippetTest)  Time elapsed: 0.003 s
14:25:46 testReturnTypeShort - 13(org.eclipse.jdt.core.tests.eval.CodeSnippetTest)  Time elapsed: 0.003 s
14:25:46 testReturnTypeShortArray - 13(org.eclipse.jdt.core.tests.eval.CodeSnippetTest)  Time elapsed: 0.004 s
14:25:46 testReturnTypeShortObject - 13(org.eclipse.jdt.core.tests.eval.CodeSnippetTest)  Time elapsed: 0.004 s
14:25:46 testReturnTypeString - 13(org.eclipse.jdt.core.tests.eval.CodeSnippetTest)  Time elapsed: 0.003 s
14:25:46 testReturnTypeStringArray - 13(org.eclipse.jdt.core.tests.eval.CodeSnippetTest)  Time elapsed: 0.004 s
14:25:46 testReturnTypeVoid - 13(org.eclipse.jdt.core.tests.eval.CodeSnippetTest)  Time elapsed: 0.004 s
14:25:46 testReturnTypesIntArray - 13(org.eclipse.jdt.core.tests.eval.CodeSnippetTest)  Time elapsed: 0.003 s
14:25:46 testRunMethodInAnonymous - 13(org.eclipse.jdt.core.tests.eval.CodeSnippetTest)  Time elapsed: 0.206 s
14:25:46 testRunMethodInAnonymous2 - 13(org.eclipse.jdt.core.tests.eval.CodeSnippetTest)  Time elapsed: 0.206 s
14:25:46 testRunMethodInAnonymous3 - 13(org.eclipse.jdt.core.tests.eval.CodeSnippetTest)  Time elapsed: 0.208 s
14:25:46 testRunMethodInAnonymous4 - 13(org.eclipse.jdt.core.tests.eval.CodeSnippetTest)  Time elapsed: 0.206 s
14:25:46 testRunMethodInAnonymous5 - 13(org.eclipse.jdt.core.tests.eval.CodeSnippetTest)  Time elapsed: 0.208 s
14:25:46 testRunMethodInAnonymous6 - 13(org.eclipse.jdt.core.tests.eval.CodeSnippetTest)  Time elapsed: 0.208 s
14:25:46 testRunMethodInAnonymous7 - 13(org.eclipse.jdt.core.tests.eval.CodeSnippetTest)  Time elapsed: 0.206 s
14:25:46 testRunMethodInAnonymous8 - 13(org.eclipse.jdt.core.tests.eval.CodeSnippetTest)  Time elapsed: 0.208 s
14:25:46 testExpressionInInnerClass - 13(org.eclipse.jdt.core.tests.eval.NegativeCodeSnippetTest)  Time elapsed: 0.002 s
14:25:46 testExtraClosingCurlyBracket - 13(org.eclipse.jdt.core.tests.eval.NegativeCodeSnippetTest)  Time elapsed: 0.003 s
14:25:46 testExtraOpenRoundBracket - 13(org.eclipse.jdt.core.tests.eval.NegativeCodeSnippetTest)  Time elapsed: 0.001 s
14:25:46 testExtraSemiColonInExpression - 13(org.eclipse.jdt.core.tests.eval.NegativeCodeSnippetTest)  Time elapsed: 0.002 s
14:25:46 testInvalidField - 13(org.eclipse.jdt.core.tests.eval.NegativeCodeSnippetTest)  Time elapsed: 0.002 s
14:25:46 testInvalidImport - 13(org.eclipse.jdt.core.tests.eval.NegativeCodeSnippetTest)  Time elapsed: 0.003 s
14:25:46 testInvalidUseOfThisInSnippet - 13(org.eclipse.jdt.core.tests.eval.NegativeCodeSnippetTest)  Time elapsed: 0.004 s
14:25:46 testInvalidUseOfThisInSnippet2 - 13(org.eclipse.jdt.core.tests.eval.NegativeCodeSnippetTest)  Time elapsed: 0.001 s
14:25:46 testMissingClosingRoundBracket - 13(org.eclipse.jdt.core.tests.eval.NegativeCodeSnippetTest)  Time elapsed: 0.001 s
14:25:46 testMissingDoubleQuote - 13(org.eclipse.jdt.core.tests.eval.NegativeCodeSnippetTest)  Time elapsed: 0.002 s
14:25:46 testNonLastExpressionStatement - 13(org.eclipse.jdt.core.tests.eval.NegativeCodeSnippetTest)  Time elapsed: 0.001 s
14:25:46 testProblemInExpression - 13(org.eclipse.jdt.core.tests.eval.NegativeCodeSnippetTest)  Time elapsed: 0.001 s
14:25:46 testProblemInExpression2 - 13(org.eclipse.jdt.core.tests.eval.NegativeCodeSnippetTest)  Time elapsed: 0.002 s
14:25:46 testProblemInInnerClass - 13(org.eclipse.jdt.core.tests.eval.NegativeCodeSnippetTest)  Time elapsed: 0.007 s
14:25:46 testProblemInPreviousStatement - 13(org.eclipse.jdt.core.tests.eval.NegativeCodeSnippetTest)  Time elapsed: 0.006 s
14:25:46 testProblemInReturnStatement - 13(org.eclipse.jdt.core.tests.eval.NegativeCodeSnippetTest)  Time elapsed: 0.002 s
14:25:46 testRemoveImport - 13(org.eclipse.jdt.core.tests.eval.NegativeCodeSnippetTest)  Time elapsed: 0.012 s
14:25:46 testRemoveVariable - 13(org.eclipse.jdt.core.tests.eval.NegativeCodeSnippetTest)  Time elapsed: 0.01 s
14:25:46 testUnreachableExpression - 13(org.eclipse.jdt.core.tests.eval.NegativeCodeSnippetTest)  Time elapsed: 0.003 s
14:25:46 testUnusedImport - 13(org.eclipse.jdt.core.tests.eval.NegativeCodeSnippetTest)  Time elapsed: 0.009 s
14:25:46 testWarning - 13(org.eclipse.jdt.core.tests.eval.NegativeCodeSnippetTest)  Time elapsed: 0.004 s
14:25:46 testInitializerProblem - 13(org.eclipse.jdt.core.tests.eval.NegativeVariableTest)  Time elapsed: 0.004 s
14:25:46 testUnknownType - 13(org.eclipse.jdt.core.tests.eval.NegativeVariableTest)  Time elapsed: 0.002 s
14:25:46 test001 - 13(org.eclipse.jdt.core.tests.eval.DebugEvaluationTest)  Time elapsed: 0.136 s
14:25:46 test002 - 13(org.eclipse.jdt.core.tests.eval.DebugEvaluationTest)  Time elapsed: 0.133 s
14:25:46 test003 - 13(org.eclipse.jdt.core.tests.eval.DebugEvaluationTest)  Time elapsed: 0.027 s
14:25:46 test004 - 13(org.eclipse.jdt.core.tests.eval.DebugEvaluationTest)  Time elapsed: 0.123 s
14:25:46 test005 - 13(org.eclipse.jdt.core.tests.eval.DebugEvaluationTest)  Time elapsed: 0.135 s
14:25:46 test006 - 13(org.eclipse.jdt.core.tests.eval.DebugEvaluationTest)  Time elapsed: 0.132 s
14:25:46 test007 - 13(org.eclipse.jdt.core.tests.eval.DebugEvaluationTest)  Time elapsed: 0.133 s
14:25:46 test008 - 13(org.eclipse.jdt.core.tests.eval.DebugEvaluationTest)  Time elapsed: 0.132 s
14:25:46 test009 - 13(org.eclipse.jdt.core.tests.eval.DebugEvaluationTest)  Time elapsed: 0.124 s
14:25:46 test010 - 13(org.eclipse.jdt.core.tests.eval.DebugEvaluationTest)  Time elapsed: 0.132 s
14:25:46 test011 - 13(org.eclipse.jdt.core.tests.eval.DebugEvaluationTest)  Time elapsed: 0.124 s
14:25:46 test016 - 13(org.eclipse.jdt.core.tests.eval.DebugEvaluationTest)  Time elapsed: 0.226 s
14:25:46 test017 - 13(org.eclipse.jdt.core.tests.eval.DebugEvaluationTest)  Time elapsed: 0.119 s
14:25:46 test018 - 13(org.eclipse.jdt.core.tests.eval.DebugEvaluationTest)  Time elapsed: 0.242 s
14:25:46 test019 - 13(org.eclipse.jdt.core.tests.eval.DebugEvaluationTest)  Time elapsed: 0.025 s
14:25:46 test020 - 13(org.eclipse.jdt.core.tests.eval.DebugEvaluationTest)  Time elapsed: 0.134 s
14:25:46 test021 - 13(org.eclipse.jdt.core.tests.eval.DebugEvaluationTest)  Time elapsed: 0.245 s
14:25:46 test022 - 13(org.eclipse.jdt.core.tests.eval.DebugEvaluationTest)  Time elapsed: 0.25 s
14:25:46 test023 - 13(org.eclipse.jdt.core.tests.eval.DebugEvaluationTest)  Time elapsed: 0.252 s
14:25:46 test024 - 13(org.eclipse.jdt.core.tests.eval.DebugEvaluationTest)  Time elapsed: 0.257 s
14:25:46 test025 - 13(org.eclipse.jdt.core.tests.eval.DebugEvaluationTest)  Time elapsed: 0.244 s
14:25:46 test026 - 13(org.eclipse.jdt.core.tests.eval.DebugEvaluationTest)  Time elapsed: 0.134 s
14:25:46 test027 - 13(org.eclipse.jdt.core.tests.eval.DebugEvaluationTest)  Time elapsed: 0.135 s
14:25:46 test028 - 13(org.eclipse.jdt.core.tests.eval.DebugEvaluationTest)  Time elapsed: 0.139 s
14:25:46 test029 - 13(org.eclipse.jdt.core.tests.eval.DebugEvaluationTest)  Time elapsed: 0.136 s
14:25:46 test030 - 13(org.eclipse.jdt.core.tests.eval.DebugEvaluationTest)  Time elapsed: 0.134 s
14:25:46 test031 - 13(org.eclipse.jdt.core.tests.eval.DebugEvaluationTest)  Time elapsed: 0.134 s
14:25:46 test032 - 13(org.eclipse.jdt.core.tests.eval.DebugEvaluationTest)  Time elapsed: 0.032 s
14:25:46 test033 - 13(org.eclipse.jdt.core.tests.eval.DebugEvaluationTest)  Time elapsed: 0.14 s
14:25:46 test034 - 13(org.eclipse.jdt.core.tests.eval.DebugEvaluationTest)  Time elapsed: 0.133 s
14:25:46 test035 - 13(org.eclipse.jdt.core.tests.eval.DebugEvaluationTest)  Time elapsed: 0.134 s
14:25:46 test036 - 13(org.eclipse.jdt.core.tests.eval.DebugEvaluationTest)  Time elapsed: 0.131 s
14:25:46 test037 - 13(org.eclipse.jdt.core.tests.eval.DebugEvaluationTest)  Time elapsed: 0.132 s
14:25:46 test038 - 13(org.eclipse.jdt.core.tests.eval.DebugEvaluationTest)  Time elapsed: 0.135 s
14:25:46 test039 - 13(org.eclipse.jdt.core.tests.eval.DebugEvaluationTest)  Time elapsed: 0.133 s
14:25:46 test040 - 13(org.eclipse.jdt.core.tests.eval.DebugEvaluationTest)  Time elapsed: 0.133 s
14:25:46 test041 - 13(org.eclipse.jdt.core.tests.eval.DebugEvaluationTest)  Time elapsed: 0.132 s
14:25:46 test042 - 13(org.eclipse.jdt.core.tests.eval.DebugEvaluationTest)  Time elapsed: 0.133 s
14:25:46 test043 - 13(org.eclipse.jdt.core.tests.eval.DebugEvaluationTest)  Time elapsed: 0.135 s
14:25:46 test044 - 13(org.eclipse.jdt.core.tests.eval.DebugEvaluationTest)  Time elapsed: 0.132 s
14:25:46 test045 - 13(org.eclipse.jdt.core.tests.eval.DebugEvaluationTest)  Time elapsed: 0.132 s
14:25:46 test046 - 13(org.eclipse.jdt.core.tests.eval.DebugEvaluationTest)  Time elapsed: 0.131 s
14:25:46 test047 - 13(org.eclipse.jdt.core.tests.eval.DebugEvaluationTest)  Time elapsed: 0.133 s
14:25:46 test048 - 13(org.eclipse.jdt.core.tests.eval.DebugEvaluationTest)  Time elapsed: 0.137 s
14:25:46 test049 - 13(org.eclipse.jdt.core.tests.eval.DebugEvaluationTest)  Time elapsed: 0.132 s
14:25:46 test050 - 13(org.eclipse.jdt.core.tests.eval.DebugEvaluationTest)  Time elapsed: 0.132 s
14:25:46 test051 - 13(org.eclipse.jdt.core.tests.eval.DebugEvaluationTest)  Time elapsed: 0.133 s
14:25:46 test052 - 13(org.eclipse.jdt.core.tests.eval.DebugEvaluationTest)  Time elapsed: 0.132 s
14:25:46 test053 - 13(org.eclipse.jdt.core.tests.eval.DebugEvaluationTest)  Time elapsed: 0.133 s
14:25:46 test054 - 13(org.eclipse.jdt.core.tests.eval.DebugEvaluationTest)  Time elapsed: 0.135 s
14:25:46 test055 - 13(org.eclipse.jdt.core.tests.eval.DebugEvaluationTest)  Time elapsed: 0.133 s
14:25:46 test056 - 13(org.eclipse.jdt.core.tests.eval.DebugEvaluationTest)  Time elapsed: 0.135 s
14:25:46 test057 - 13(org.eclipse.jdt.core.tests.eval.DebugEvaluationTest)  Time elapsed: 0.134 s
14:25:46 test058 - 13(org.eclipse.jdt.core.tests.eval.DebugEvaluationTest)  Time elapsed: 0.137 s
14:25:46 test059 - 13(org.eclipse.jdt.core.tests.eval.DebugEvaluationTest)  Time elapsed: 0.135 s
14:25:46 test060 - 13(org.eclipse.jdt.core.tests.eval.DebugEvaluationTest)  Time elapsed: 0.135 s
14:25:46 test061 - 13(org.eclipse.jdt.core.tests.eval.DebugEvaluationTest)  Time elapsed: 0.134 s
14:25:46 test062 - 13(org.eclipse.jdt.core.tests.eval.DebugEvaluationTest)  Time elapsed: 0.132 s
14:25:46 test063 - 13(org.eclipse.jdt.core.tests.eval.DebugEvaluationTest)  Time elapsed: 0.137 s
14:25:46 test065 - 13(org.eclipse.jdt.core.tests.eval.DebugEvaluationTest)  Time elapsed: 0.135 s
14:25:46 test066 - 13(org.eclipse.jdt.core.tests.eval.DebugEvaluationTest)  Time elapsed: 0.134 s
14:25:46 test067 - 13(org.eclipse.jdt.core.tests.eval.DebugEvaluationTest)  Time elapsed: 0.138 s
14:25:46 test068 - 13(org.eclipse.jdt.core.tests.eval.DebugEvaluationTest)  Time elapsed: 0.033 s
14:25:46 test069 - 13(org.eclipse.jdt.core.tests.eval.DebugEvaluationTest)  Time elapsed: 0.031 s
14:25:46 testNegative001 - 13(org.eclipse.jdt.core.tests.eval.DebugEvaluationTest)  Time elapsed: 0.026 s
14:25:46 testNegative002 - 13(org.eclipse.jdt.core.tests.eval.DebugEvaluationTest)  Time elapsed: 0.025 s
14:25:46 testNegative003 - 13(org.eclipse.jdt.core.tests.eval.DebugEvaluationTest)  Time elapsed: 0.029 s
14:25:46 testNegative004 - 13(org.eclipse.jdt.core.tests.eval.DebugEvaluationTest)  Time elapsed: 0.013 s
14:25:46 testNegative005 - 13(org.eclipse.jdt.core.tests.eval.DebugEvaluationTest)  Time elapsed: 0.01 s
14:25:46 
14:25:46 Results:
14:25:46 
14:25:46 Failures: 
14:25:46   ComplianceDiagnoseTest>TestCase.runTest:964->testBug531714_001:3570->runComplianceParserTest:79->AbstractRegressionTest.runNegativeTest:2487->AbstractRegressionTest.runNegativeTest:2498->AbstractRegressionTest.runTest:2933->AbstractRegressionTest.runTest:3140->AbstractRegressionTest.checkCompilerLog:1290->TestCase.assertEquals:242->TestCase.assertStringEquals:266 Invalid problem log .
14:25:46 ----------- Expected ------------
14:25:46 ----------\n
14:25:46 1. ERROR in X.java (at line 3)\n
14:25:46 	int tw = switch (i) {\n
14:25:46 			case 0 -> i * 0;\n
14:25:46 			case 1 -> 2;\n
14:25:46 			default -> 3;\n
14:25:46 		};\n
14:25:46 	         ^^^^^^^^^^^^^^^^^^^^^^^^^^^^^^^^^^^^^^^^^^^^^^^^^^^^^^^^^^^^^^^^^^^^^\n
14:25:46 The preview feature Switch Expressions is only available with source level 12 and above\n
14:25:46 ----------\n
14:25:46 2. ERROR in X.java (at line 4)\n
14:25:46 	case 0 -> i * 0;\n
14:25:46 	^^^^^^\n
14:25:46 The preview feature Case Labels with '->' is only available with source level 12 and above\n
14:25:46 ----------\n
14:25:46 3. ERROR in X.java (at line 5)\n
14:25:46 	case 1 -> 2;\n
14:25:46 	^^^^^^\n
14:25:46 The preview feature Case Labels with '->' is only available with source level 12 and above\n
14:25:46 ----------\n
14:25:46 4. ERROR in X.java (at line 6)\n
14:25:46 	default -> 3;\n
14:25:46 	^^^^^^^\n
14:25:46 The preview feature Case Labels with '->' is only available with source level 12 and above\n
14:25:46 ----------\n
14:25:46 
14:25:46 ------------ but was ------------
14:25:46 ----------\n
14:25:46 1. ERROR in X.java (at line 3)\n
14:25:46 	int tw = switch (i) {\n
14:25:46 			case 0 -> i * 0;\n
14:25:46 			case 1 -> 2;\n
14:25:46 			default -> 3;\n
14:25:46 		};\n
14:25:46 	         ^^^^^^^^^^^^^^^^^^^^^^^^^^^^^^^^^^^^^^^^^^^^^^^^^^^^^^^^^^^^^^^^^^^^^\n
14:25:46 The preview feature Switch Expressions is only available with source level 12 and above\n
14:25:46 ----------\n
14:25:46 2. ERROR in X.java (at line 4)\n
14:25:46 	case 0 -> i * 0;\n
14:25:46 	^^^^^^\n
14:25:46 The preview feature Case Labels with '->' is only available with source level 12 and above\n
14:25:46 ----------\n
14:25:46 3. ERROR in X.java (at line 5)\n
14:25:46 	case 1 -> 2;\n
14:25:46 	^^^^^^\n
14:25:46 The preview feature Case Labels with '->' is only available with source level 12 and above\n
14:25:46 ----------\n
14:25:46 4. ERROR in X.java (at line 6)\n
14:25:46 	default -> 3;\n
14:25:46 	^^^^^^^\n
14:25:46 The preview feature Case Labels with '->' is only available with source level 13 and above\n
14:25:46 ----------\n
14:25:46 
14:25:46 --------- Difference is ----------
14:25:46  expected:<... with source level 1[2] and above\n
14:25:46 -------...> but was:<... with source level 1[3] and above\n
14:25:46 -------...>
14:25:46   ComplianceDiagnoseTest>TestCase.runTest:964->testBug531714_001:3570->runComplianceParserTest:85->AbstractRegressionTest.runNegativeTest:2487->AbstractRegressionTest.runNegativeTest:2498->AbstractRegressionTest.runTest:2933->AbstractRegressionTest.runTest:3140->AbstractRegressionTest.checkCompilerLog:1290->TestCase.assertEquals:242->TestCase.assertStringEquals:266 Invalid problem log .
14:25:46 ----------- Expected ------------
14:25:46 ----------\n
14:25:46 1. ERROR in X.java (at line 3)\n
14:25:46 	int tw = switch (i) {\n
14:25:46 			case 0 -> i * 0;\n
14:25:46 			case 1 -> 2;\n
14:25:46 			default -> 3;\n
14:25:46 		};\n
14:25:46 	         ^^^^^^^^^^^^^^^^^^^^^^^^^^^^^^^^^^^^^^^^^^^^^^^^^^^^^^^^^^^^^^^^^^^^^\n
14:25:46 The preview feature Switch Expressions is only available with source level 12 and above\n
14:25:46 ----------\n
14:25:46 2. ERROR in X.java (at line 4)\n
14:25:46 	case 0 -> i * 0;\n
14:25:46 	^^^^^^\n
14:25:46 The preview feature Case Labels with '->' is only available with source level 12 and above\n
14:25:46 ----------\n
14:25:46 3. ERROR in X.java (at line 5)\n
14:25:46 	case 1 -> 2;\n
14:25:46 	^^^^^^\n
14:25:46 The preview feature Case Labels with '->' is only available with source level 12 and above\n
14:25:46 ----------\n
14:25:46 4. ERROR in X.java (at line 6)\n
14:25:46 	default -> 3;\n
14:25:46 	^^^^^^^\n
14:25:46 The preview feature Case Labels with '->' is only available with source level 12 and above\n
14:25:46 ----------\n
14:25:46 
14:25:46 ------------ but was ------------
14:25:46 ----------\n
14:25:46 1. ERROR in X.java (at line 3)\n
14:25:46 	int tw = switch (i) {\n
14:25:46 			case 0 -> i * 0;\n
14:25:46 			case 1 -> 2;\n
14:25:46 			default -> 3;\n
14:25:46 		};\n
14:25:46 	         ^^^^^^^^^^^^^^^^^^^^^^^^^^^^^^^^^^^^^^^^^^^^^^^^^^^^^^^^^^^^^^^^^^^^^\n
14:25:46 The preview feature Switch Expressions is only available with source level 12 and above\n
14:25:46 ----------\n
14:25:46 2. ERROR in X.java (at line 4)\n
14:25:46 	case 0 -> i * 0;\n
14:25:46 	^^^^^^\n
14:25:46 The preview feature Case Labels with '->' is only available with source level 12 and above\n
14:25:46 ----------\n
14:25:46 3. ERROR in X.java (at line 5)\n
14:25:46 	case 1 -> 2;\n
14:25:46 	^^^^^^\n
14:25:46 The preview feature Case Labels with '->' is only available with source level 12 and above\n
14:25:46 ----------\n
14:25:46 4. ERROR in X.java (at line 6)\n
14:25:46 	default -> 3;\n
14:25:46 	^^^^^^^\n
14:25:46 The preview feature Case Labels with '->' is only available with source level 13 and above\n
14:25:46 ----------\n
14:25:46 
14:25:46 --------- Difference is ----------
14:25:46  expected:<... with source level 1[2] and above\n
14:25:46 -------...> but was:<... with source level 1[3] and above\n
14:25:46 -------...>
14:25:46   ComplianceDiagnoseTest>TestCase.runTest:964->testBug531714_002:3617->runComplianceParserTest:79->AbstractRegressionTest.runNegativeTest:2487->AbstractRegressionTest.runNegativeTest:2498->AbstractRegressionTest.runTest:2933->AbstractRegressionTest.runTest:3140->AbstractRegressionTest.checkCompilerLog:1290->TestCase.assertEquals:242->TestCase.assertStringEquals:266 Invalid problem log .
14:25:46 ----------- Expected ------------
14:25:46 ----------\n
14:25:46 1. ERROR in X.java (at line 4)\n
14:25:46 	case 0 -> i * 0;\n
14:25:46 	^^^^^^\n
14:25:46 The preview feature Case Labels with '->' is only available with source level 12 and above\n
14:25:46 ----------\n
14:25:46 2. ERROR in X.java (at line 5)\n
14:25:46 	case 1 -> 2;\n
14:25:46 	^^^^^^\n
14:25:46 The preview feature Case Labels with '->' is only available with source level 12 and above\n
14:25:46 ----------\n
14:25:46 3. ERROR in X.java (at line 6)\n
14:25:46 	default -> 3;\n
14:25:46 	^^^^^^^\n
14:25:46 The preview feature Case Labels with '->' is only available with source level 12 and above\n
14:25:46 ----------\n
14:25:46 
14:25:46 ------------ but was ------------
14:25:46 ----------\n
14:25:46 1. ERROR in X.java (at line 4)\n
14:25:46 	case 0 -> i * 0;\n
14:25:46 	^^^^^^\n
14:25:46 The preview feature Case Labels with '->' is only available with source level 12 and above\n
14:25:46 ----------\n
14:25:46 2. ERROR in X.java (at line 5)\n
14:25:46 	case 1 -> 2;\n
14:25:46 	^^^^^^\n
14:25:46 The preview feature Case Labels with '->' is only available with source level 12 and above\n
14:25:46 ----------\n
14:25:46 3. ERROR in X.java (at line 6)\n
14:25:46 	default -> 3;\n
14:25:46 	^^^^^^^\n
14:25:46 The preview feature Case Labels with '->' is only available with source level 13 and above\n
14:25:46 ----------\n
14:25:46 
14:25:46 --------- Difference is ----------
14:25:46  expected:<... with source level 1[2] and above\n
14:25:46 -------...> but was:<... with source level 1[3] and above\n
14:25:46 -------...>
14:25:46   ComplianceDiagnoseTest>TestCase.runTest:964->testBug531714_002:3617->runComplianceParserTest:85->AbstractRegressionTest.runNegativeTest:2487->AbstractRegressionTest.runNegativeTest:2498->AbstractRegressionTest.runTest:2933->AbstractRegressionTest.runTest:3140->AbstractRegressionTest.checkCompilerLog:1290->TestCase.assertEquals:242->TestCase.assertStringEquals:266 Invalid problem log .
14:25:46 ----------- Expected ------------
14:25:46 ----------\n
14:25:46 1. ERROR in X.java (at line 4)\n
14:25:46 	case 0 -> i * 0;\n
14:25:46 	^^^^^^\n
14:25:46 The preview feature Case Labels with '->' is only available with source level 12 and above\n
14:25:46 ----------\n
14:25:46 2. ERROR in X.java (at line 5)\n
14:25:46 	case 1 -> 2;\n
14:25:46 	^^^^^^\n
14:25:46 The preview feature Case Labels with '->' is only available with source level 12 and above\n
14:25:46 ----------\n
14:25:46 3. ERROR in X.java (at line 6)\n
14:25:46 	default -> 3;\n
14:25:46 	^^^^^^^\n
14:25:46 The preview feature Case Labels with '->' is only available with source level 12 and above\n
14:25:46 ----------\n
14:25:46 
14:25:46 ------------ but was ------------
14:25:46 ----------\n
14:25:46 1. ERROR in X.java (at line 4)\n
14:25:46 	case 0 -> i * 0;\n
14:25:46 	^^^^^^\n
14:25:46 The preview feature Case Labels with '->' is only available with source level 12 and above\n
14:25:46 ----------\n
14:25:46 2. ERROR in X.java (at line 5)\n
14:25:46 	case 1 -> 2;\n
14:25:46 	^^^^^^\n
14:25:46 The preview feature Case Labels with '->' is only available with source level 12 and above\n
14:25:46 ----------\n
14:25:46 3. ERROR in X.java (at line 6)\n
14:25:46 	default -> 3;\n
14:25:46 	^^^^^^^\n
14:25:46 The preview feature Case Labels with '->' is only available with source level 13 and above\n
14:25:46 ----------\n
14:25:46 
14:25:46 --------- Difference is ----------
14:25:46  expected:<... with source level 1[2] and above\n
14:25:46 -------...> but was:<... with source level 1[3] and above\n
14:25:46 -------...>
14:25:46   SelectionParserTest12>TestCase.runTest:964->test018:844->AbstractSelectionTest.checkMethodParse:256->AbstractSelectionTest.checkMethodParse:194->TestCase.assertEquals:242->TestCase.assertStringEquals:266 invalid selection unit-X.java.
14:25:46 ----------- Expected ------------
14:25:46 import org.eclipse.jdt.annotation.*;\n
14:25:46 import java.util.function.*;\n
14:25:46 interface IN0 {\n
14:25:46 }\n
14:25:46 interface IN1 extends IN0 {\n
14:25:46 }\n
14:25:46 interface IN2 extends IN0 {\n
14:25:46 }\n
14:25:46 public class X {\n
14:25:46   public X() {\n
14:25:46   }\n
14:25:46   IN1 n_1() {\n
14:25:46   }\n
14:25:46   IN2 n_2() {\n
14:25:46   }\n
14:25:46   <M>void m(Supplier<M> m2) {\n
14:25:46   }\n
14:25:46   void testSw(int i) {\n
14:25:46     m(switch (i) {\n
14:25:46 case 1 ->\n
14:25:46  <SelectionOnReferenceExpressionName:this::n_1>;\n
14:25:46 default ->\n
14:25:46  this::n_2;\n
14:25:46 });\n
14:25:46   }\n
14:25:46 }\n
14:25:46 
14:25:46 ------------ but was ------------
14:25:46 import org.eclipse.jdt.annotation.*;\n
14:25:46 import java.util.function.*;\n
14:25:46 interface IN0 {\n
14:25:46 }\n
14:25:46 interface IN1 extends IN0 {\n
14:25:46 }\n
14:25:46 interface IN2 extends IN0 {\n
14:25:46 }\n
14:25:46 public class X {\n
14:25:46   public X() {\n
14:25:46   }\n
14:25:46   IN1 n_1() {\n
14:25:46   }\n
14:25:46   IN2 n_2() {\n
14:25:46   }\n
14:25:46   <M>void m(Supplier<M> m2) {\n
14:25:46   }\n
14:25:46   void testSw(int i) {\n
14:25:46     m(switch (i) {\n
14:25:46 case 1 ->\n
14:25:46     yield <SelectionOnReferenceExpressionName:this::n_1>;\n
14:25:46 default ->\n
14:25:46     yield this::n_2;\n
14:25:46 });\n
14:25:46   }\n
14:25:46 }\n
14:25:46 
14:25:46 --------- Difference is ----------
14:25:46  expected:<...i) {\n
14:25:46 case 1 ->\n
14:25:46  [<SelectionOnReferenceExpressionName:this::n_1>;\n
14:25:46 default ->\n
14:25:46 ] this::n_2;\n
14:25:46 });\n
14:25:46 ...> but was:<...i) {\n
14:25:46 case 1 ->\n
14:25:46  [   yield <SelectionOnReferenceExpressionName:this::n_1>;\n
14:25:46 default ->\n
14:25:46     yield] this::n_2;\n
14:25:46 });\n
14:25:46 ...>
14:25:46   SelectionParserTest12>TestCase.runTest:964->test019:902->AbstractSelectionTest.checkMethodParse:256->AbstractSelectionTest.checkMethodParse:194->TestCase.assertEquals:242->TestCase.assertStringEquals:266 invalid selection unit-X.java.
14:25:46 ----------- Expected ------------
14:25:46 import org.eclipse.jdt.annotation.*;\n
14:25:46 import java.util.function.*;\n
14:25:46 interface IN0 {\n
14:25:46 }\n
14:25:46 interface IN1 extends IN0 {\n
14:25:46 }\n
14:25:46 interface IN2 extends IN0 {\n
14:25:46 }\n
14:25:46 public class X {\n
14:25:46   public X() {\n
14:25:46   }\n
14:25:46   IN1 n_1() {\n
14:25:46   }\n
14:25:46   IN2 n_2() {\n
14:25:46   }\n
14:25:46   <M>void m(Supplier<M> m2) {\n
14:25:46   }\n
14:25:46   void testSw(int i) {\n
14:25:46     m(switch (i) {\n
14:25:46 case 2 ->\n
14:25:46  () -> <SelectOnMessageSend:n_1()>;\n
14:25:46 default ->\n
14:25:46  this::n_2;\n
14:25:46 });\n
14:25:46   }\n
14:25:46 }\n
14:25:46 
14:25:46 ------------ but was ------------
14:25:46 import org.eclipse.jdt.annotation.*;\n
14:25:46 import java.util.function.*;\n
14:25:46 interface IN0 {\n
14:25:46 }\n
14:25:46 interface IN1 extends IN0 {\n
14:25:46 }\n
14:25:46 interface IN2 extends IN0 {\n
14:25:46 }\n
14:25:46 public class X {\n
14:25:46   public X() {\n
14:25:46   }\n
14:25:46   IN1 n_1() {\n
14:25:46   }\n
14:25:46   IN2 n_2() {\n
14:25:46   }\n
14:25:46   <M>void m(Supplier<M> m2) {\n
14:25:46   }\n
14:25:46   void testSw(int i) {\n
14:25:46     m(switch (i) {\n
14:25:46 case 2 ->\n
14:25:46     yield () -> <SelectOnMessageSend:n_1()>;\n
14:25:46 default ->\n
14:25:46     yield this::n_2;\n
14:25:46 });\n
14:25:46   }\n
14:25:46 }\n
14:25:46 
14:25:46 --------- Difference is ----------
14:25:46  expected:<...i) {\n
14:25:46 case 2 ->\n
14:25:46  [() -> <SelectOnMessageSend:n_1()>;\n
14:25:46 default ->\n
14:25:46 ] this::n_2;\n
14:25:46 });\n
14:25:46 ...> but was:<...i) {\n
14:25:46 case 2 ->\n
14:25:46  [   yield () -> <SelectOnMessageSend:n_1()>;\n
14:25:46 default ->\n
14:25:46     yield] this::n_2;\n
14:25:46 });\n
14:25:46 ...>
14:25:46   SelectionParserTest12>TestCase.runTest:964->test020:957->AbstractSelectionTest.checkMethodParse:256->AbstractSelectionTest.checkMethodParse:194->TestCase.assertEquals:242->TestCase.assertStringEquals:266 invalid selection unit-X.java.
14:25:46 ----------- Expected ------------
14:25:46 import org.eclipse.jdt.annotation.*;\n
14:25:46 import java.util.function.*;\n
14:25:46 interface IN0 {\n
14:25:46 }\n
14:25:46 interface IN1 extends IN0 {\n
14:25:46 }\n
14:25:46 interface IN2 extends IN0 {\n
14:25:46 }\n
14:25:46 public class X {\n
14:25:46   public X() {\n
14:25:46   }\n
14:25:46   IN1 n_1() {\n
14:25:46   }\n
14:25:46   IN2 n_2() {\n
14:25:46   }\n
14:25:46   <M>void m(Supplier<M> m2) {\n
14:25:46   }\n
14:25:46   void testSw(int i) {\n
14:25:46     m(switch (i) {\n
14:25:46 default ->\n
14:25:46  <SelectionOnReferenceExpressionName:this::n_2>;\n
14:25:46 });\n
14:25:46   }\n
14:25:46 }\n
14:25:46 
14:25:46 ------------ but was ------------
14:25:46 import org.eclipse.jdt.annotation.*;\n
14:25:46 import java.util.function.*;\n
14:25:46 interface IN0 {\n
14:25:46 }\n
14:25:46 interface IN1 extends IN0 {\n
14:25:46 }\n
14:25:46 interface IN2 extends IN0 {\n
14:25:46 }\n
14:25:46 public class X {\n
14:25:46   public X() {\n
14:25:46   }\n
14:25:46   IN1 n_1() {\n
14:25:46   }\n
14:25:46   IN2 n_2() {\n
14:25:46   }\n
14:25:46   <M>void m(Supplier<M> m2) {\n
14:25:46   }\n
14:25:46   void testSw(int i) {\n
14:25:46     m(switch (i) {\n
14:25:46 default ->\n
14:25:46     yield <SelectionOnReferenceExpressionName:this::n_2>;\n
14:25:46 });\n
14:25:46   }\n
14:25:46 }\n
14:25:46 
14:25:46 --------- Difference is ----------
14:25:46  expected:<...) {\n
14:25:46 default ->\n
14:25:46  []<SelectionOnReferenc...> but was:<...) {\n
14:25:46 default ->\n
14:25:46  [   yield ]<SelectionOnReferenc...>
14:25:46   SelectionParserTest12>TestCase.runTest:964->test021:1012->AbstractSelectionTest.checkMethodParse:256->AbstractSelectionTest.checkMethodParse:194->TestCase.assertEquals:242->TestCase.assertStringEquals:266 invalid selection unit-X.java.
14:25:46 ----------- Expected ------------
14:25:46 import org.eclipse.jdt.annotation.*;\n
14:25:46 import java.util.function.*;\n
14:25:46 interface IN0 {\n
14:25:46 }\n
14:25:46 interface IN1 extends IN0 {\n
14:25:46 }\n
14:25:46 interface IN2 extends IN0 {\n
14:25:46 }\n
14:25:46 public class X {\n
14:25:46   public X() {\n
14:25:46   }\n
14:25:46   IN1 n_1(int ijk) {\n
14:25:46   }\n
14:25:46   IN2 n_2() {\n
14:25:46   }\n
14:25:46   <M>void m(Supplier<M> m2) {\n
14:25:46   }\n
14:25:46   void testSw(int ijk) {\n
14:25:46     m(switch (ijk) {\n
14:25:46 default ->\n
14:25:46  () -> <SelectOnMessageSend:n_1(ijk)>;\n
14:25:46 });\n
14:25:46   }\n
14:25:46 }\n
14:25:46 
14:25:46 ------------ but was ------------
14:25:46 import org.eclipse.jdt.annotation.*;\n
14:25:46 import java.util.function.*;\n
14:25:46 interface IN0 {\n
14:25:46 }\n
14:25:46 interface IN1 extends IN0 {\n
14:25:46 }\n
14:25:46 interface IN2 extends IN0 {\n
14:25:46 }\n
14:25:46 public class X {\n
14:25:46   public X() {\n
14:25:46   }\n
14:25:46   IN1 n_1(int ijk) {\n
14:25:46   }\n
14:25:46   IN2 n_2() {\n
14:25:46   }\n
14:25:46   <M>void m(Supplier<M> m2) {\n
14:25:46   }\n
14:25:46   void testSw(int ijk) {\n
14:25:46     m(switch (ijk) {\n
14:25:46 default ->\n
14:25:46     yield () -> <SelectOnMessageSend:n_1(ijk)>;\n
14:25:46 });\n
14:25:46   }\n
14:25:46 }\n
14:25:46 
14:25:46 --------- Difference is ----------
14:25:46  expected:<...) {\n
14:25:46 default ->\n
14:25:46  []() -> <SelectOnMessa...> but was:<...) {\n
14:25:46 default ->\n
14:25:46  [   yield ]() -> <SelectOnMessa...>
14:25:46   SelectionParserTest12>TestCase.runTest:964->test022:1067->AbstractSelectionTest.checkMethodParse:256->AbstractSelectionTest.checkMethodParse:194->TestCase.assertEquals:242->TestCase.assertStringEquals:266 invalid selection unit-X.java.
14:25:46 ----------- Expected ------------
14:25:46 import org.eclipse.jdt.annotation.*;\n
14:25:46 import java.util.function.*;\n
14:25:46 interface IN0 {\n
14:25:46 }\n
14:25:46 interface IN1 extends IN0 {\n
14:25:46 }\n
14:25:46 interface IN2 extends IN0 {\n
14:25:46 }\n
14:25:46 public class X {\n
14:25:46   public X() {\n
14:25:46   }\n
14:25:46   IN1 n_1(int ijk) {\n
14:25:46   }\n
14:25:46   IN2 n_2() {\n
14:25:46   }\n
14:25:46   <M>void m(Supplier<M> m2) {\n
14:25:46   }\n
14:25:46   void testSw(int ijk) {\n
14:25:46     m(switch (ijk) {\n
14:25:46 default ->\n
14:25:46  () -> n_1(<SelectOnName:ijk>);\n
14:25:46 });\n
14:25:46   }\n
14:25:46 }\n
14:25:46 
14:25:46 ------------ but was ------------
14:25:46 import org.eclipse.jdt.annotation.*;\n
14:25:46 import java.util.function.*;\n
14:25:46 interface IN0 {\n
14:25:46 }\n
14:25:46 interface IN1 extends IN0 {\n
14:25:46 }\n
14:25:46 interface IN2 extends IN0 {\n
14:25:46 }\n
14:25:46 public class X {\n
14:25:46   public X() {\n
14:25:46   }\n
14:25:46   IN1 n_1(int ijk) {\n
14:25:46   }\n
14:25:46   IN2 n_2() {\n
14:25:46   }\n
14:25:46   <M>void m(Supplier<M> m2) {\n
14:25:46   }\n
14:25:46   void testSw(int ijk) {\n
14:25:46     m(switch (ijk) {\n
14:25:46 default ->\n
14:25:46     yield () -> n_1(<SelectOnName:ijk>);\n
14:25:46 });\n
14:25:46   }\n
14:25:46 }\n
14:25:46 
14:25:46 --------- Difference is ----------
14:25:46  expected:<...) {\n
14:25:46 default ->\n
14:25:46  []() -> n_1(<SelectOnN...> but was:<...) {\n
14:25:46 default ->\n
14:25:46  [   yield ]() -> n_1(<SelectOnN...>
14:25:46   GenericTypeTest>TestCase.runTest:964->test0470:14418->AbstractRegressionTest.runNegativeTest:2487->AbstractRegressionTest.runNegativeTest:2498->AbstractRegressionTest.runTest:2933->AbstractRegressionTest.runTest:3140->AbstractRegressionTest.checkCompilerLog:1290->TestCase.assertEquals:242->TestCase.assertStringEquals:266 Invalid problem log .
14:25:46 ----------- Expected ------------
14:25:46 ----------\n
14:25:46 1. WARNING in X.java (at line 9)\n
14:25:46 	Comparable s1 = choose(true, "string", Integer.valueOf(1));\n
14:25:46 	^^^^^^^^^^\n
14:25:46 Comparable is a raw type. References to generic type Comparable<T> should be parameterized\n
14:25:46 ----------\n
14:25:46 2. WARNING in X.java (at line 11)\n
14:25:46 	Comparable s3 = choose(true, Integer.valueOf(1), Float.valueOf(2));\n
14:25:46 	^^^^^^^^^^\n
14:25:46 Comparable is a raw type. References to generic type Comparable<T> should be parameterized\n
14:25:46 ----------\n
14:25:46 3. ERROR in X.java (at line 12)\n
14:25:46 	Cloneable s4 = choose(true, Integer.valueOf(1), Float.valueOf(2));\n
14:25:46 	               ^^^^^^^^^^^^^^^^^^^^^^^^^^^^^^^^^^^^^^^^^^^^^^^^^^\n
14:25:46 Type mismatch: cannot convert from Number&Comparable<?> to Cloneable\n
14:25:46 ----------\n
14:25:46 4. ERROR in X.java (at line 13)\n
14:25:46 	Cloneable s5 = choose(true, "string", Integer.valueOf(1));\n
14:25:46 	               ^^^^^^^^^^^^^^^^^^^^^^^^^^^^^^^^^^^^^^^^^^\n
14:25:46 Type mismatch: cannot convert from Object&Serializable&Comparable<?> to Cloneable\n
14:25:46 ----------\n
14:25:46 
14:25:46 ------------ but was ------------
14:25:46 ----------\n
14:25:46 1. WARNING in X.java (at line 9)\n
14:25:46 	Comparable s1 = choose(true, "string", Integer.valueOf(1));\n
14:25:46 	^^^^^^^^^^\n
14:25:46 Comparable is a raw type. References to generic type Comparable<T> should be parameterized\n
14:25:46 ----------\n
14:25:46 2. WARNING in X.java (at line 11)\n
14:25:46 	Comparable s3 = choose(true, Integer.valueOf(1), Float.valueOf(2));\n
14:25:46 	^^^^^^^^^^\n
14:25:46 Comparable is a raw type. References to generic type Comparable<T> should be parameterized\n
14:25:46 ----------\n
14:25:46 3. ERROR in X.java (at line 12)\n
14:25:46 	Cloneable s4 = choose(true, Integer.valueOf(1), Float.valueOf(2));\n
14:25:46 	               ^^^^^^^^^^^^^^^^^^^^^^^^^^^^^^^^^^^^^^^^^^^^^^^^^^\n
14:25:46 Type mismatch: cannot convert from Number&Comparable<?>&Constable&ConstantDesc to Cloneable\n
14:25:46 ----------\n
14:25:46 4. ERROR in X.java (at line 13)\n
14:25:46 	Cloneable s5 = choose(true, "string", Integer.valueOf(1));\n
14:25:46 	               ^^^^^^^^^^^^^^^^^^^^^^^^^^^^^^^^^^^^^^^^^^\n
14:25:46 Type mismatch: cannot convert from Object&Serializable&Comparable<?>&Constable&ConstantDesc to Cloneable\n
14:25:46 ----------\n
14:25:46 
14:25:46 --------- Difference is ----------
14:25:46  expected:<...Number&Comparable<?>[ to Cloneable\n
14:25:46 ----------\n
14:25:46 4. ERROR in X.java (at line 13)\n
14:25:46 	Cloneable s5 = choose(true, "string", Integer.valueOf(1));\n
14:25:46 	               ^^^^^^^^^^^^^^^^^^^^^^^^^^^^^^^^^^^^^^^^^^\n
14:25:46 Type mismatch: cannot convert from Object&Serializable&Comparable<?>] to Cloneable\n
14:25:46 ----...> but was:<...Number&Comparable<?>[&Constable&ConstantDesc to Cloneable\n
14:25:46 ----------\n
14:25:46 4. ERROR in X.java (at line 13)\n
14:25:46 	Cloneable s5 = choose(true, "string", Integer.valueOf(1));\n
14:25:46 	               ^^^^^^^^^^^^^^^^^^^^^^^^^^^^^^^^^^^^^^^^^^\n
14:25:46 Type mismatch: cannot convert from Object&Serializable&Comparable<?>&Constable&ConstantDesc] to Cloneable\n
14:25:46 ----...>
14:25:46   GenericTypeTest>TestCase.runTest:964->test0470:14418->AbstractRegressionTest.runNegativeTest:2487->AbstractRegressionTest.runNegativeTest:2498->AbstractRegressionTest.runTest:2933->AbstractRegressionTest.runTest:3140->AbstractRegressionTest.checkCompilerLog:1290->TestCase.assertEquals:242->TestCase.assertStringEquals:266 Invalid problem log .
14:25:46 ----------- Expected ------------
14:25:46 ----------\n
14:25:46 1. WARNING in X.java (at line 9)\n
14:25:46 	Comparable s1 = choose(true, "string", Integer.valueOf(1));\n
14:25:46 	^^^^^^^^^^\n
14:25:46 Comparable is a raw type. References to generic type Comparable<T> should be parameterized\n
14:25:46 ----------\n
14:25:46 2. WARNING in X.java (at line 11)\n
14:25:46 	Comparable s3 = choose(true, Integer.valueOf(1), Float.valueOf(2));\n
14:25:46 	^^^^^^^^^^\n
14:25:46 Comparable is a raw type. References to generic type Comparable<T> should be parameterized\n
14:25:46 ----------\n
14:25:46 3. ERROR in X.java (at line 12)\n
14:25:46 	Cloneable s4 = choose(true, Integer.valueOf(1), Float.valueOf(2));\n
14:25:46 	               ^^^^^^^^^^^^^^^^^^^^^^^^^^^^^^^^^^^^^^^^^^^^^^^^^^\n
14:25:46 Type mismatch: cannot convert from Number & Comparable<?> to Cloneable\n
14:25:46 ----------\n
14:25:46 4. ERROR in X.java (at line 13)\n
14:25:46 	Cloneable s5 = choose(true, "string", Integer.valueOf(1));\n
14:25:46 	               ^^^^^^^^^^^^^^^^^^^^^^^^^^^^^^^^^^^^^^^^^^\n
14:25:46 Type mismatch: cannot convert from Object & Serializable & Comparable<?> to Cloneable\n
14:25:46 ----------\n
14:25:46 
14:25:46 ------------ but was ------------
14:25:46 ----------\n
14:25:46 1. WARNING in X.java (at line 9)\n
14:25:46 	Comparable s1 = choose(true, "string", Integer.valueOf(1));\n
14:25:46 	^^^^^^^^^^\n
14:25:46 Comparable is a raw type. References to generic type Comparable<T> should be parameterized\n
14:25:46 ----------\n
14:25:46 2. WARNING in X.java (at line 11)\n
14:25:46 	Comparable s3 = choose(true, Integer.valueOf(1), Float.valueOf(2));\n
14:25:46 	^^^^^^^^^^\n
14:25:46 Comparable is a raw type. References to generic type Comparable<T> should be parameterized\n
14:25:46 ----------\n
14:25:46 3. ERROR in X.java (at line 12)\n
14:25:46 	Cloneable s4 = choose(true, Integer.valueOf(1), Float.valueOf(2));\n
14:25:46 	               ^^^^^^^^^^^^^^^^^^^^^^^^^^^^^^^^^^^^^^^^^^^^^^^^^^\n
14:25:46 Type mismatch: cannot convert from Number & Comparable<?> & Constable & ConstantDesc to Cloneable\n
14:25:46 ----------\n
14:25:46 4. ERROR in X.java (at line 13)\n
14:25:46 	Cloneable s5 = choose(true, "string", Integer.valueOf(1));\n
14:25:46 	               ^^^^^^^^^^^^^^^^^^^^^^^^^^^^^^^^^^^^^^^^^^\n
14:25:46 Type mismatch: cannot convert from Object & Serializable & Comparable<?> & Constable & ConstantDesc to Cloneable\n
14:25:46 ----------\n
14:25:46 
14:25:46 --------- Difference is ----------
14:25:46  expected:<...ber & Comparable<?> [to Cloneable\n
14:25:46 ----------\n
14:25:46 4. ERROR in X.java (at line 13)\n
14:25:46 	Cloneable s5 = choose(true, "string", Integer.valueOf(1));\n
14:25:46 	               ^^^^^^^^^^^^^^^^^^^^^^^^^^^^^^^^^^^^^^^^^^\n
14:25:46 Type mismatch: cannot convert from Object & Serializable & Comparable<?>] to Cloneable\n
14:25:46 ----...> but was:<...ber & Comparable<?> [& Constable & ConstantDesc to Cloneable\n
14:25:46 ----------\n
14:25:46 4. ERROR in X.java (at line 13)\n
14:25:46 	Cloneable s5 = choose(true, "string", Integer.valueOf(1));\n
14:25:46 	               ^^^^^^^^^^^^^^^^^^^^^^^^^^^^^^^^^^^^^^^^^^\n
14:25:46 Type mismatch: cannot convert from Object & Serializable & Comparable<?> & Constable & ConstantDesc] to Cloneable\n
14:25:46 ----...>
14:25:46   GenericTypeTest>TestCase.runTest:964->test0470:14418->AbstractRegressionTest.runNegativeTest:2487->AbstractRegressionTest.runNegativeTest:2498->AbstractRegressionTest.runTest:2933->AbstractRegressionTest.runTest:3140->AbstractRegressionTest.checkCompilerLog:1290->TestCase.assertEquals:242->TestCase.assertStringEquals:266 Invalid problem log .
14:25:46 ----------- Expected ------------
14:25:46 ----------\n
14:25:46 1. WARNING in X.java (at line 9)\n
14:25:46 	Comparable s1 = choose(true, "string", Integer.valueOf(1));\n
14:25:46 	^^^^^^^^^^\n
14:25:46 Comparable is a raw type. References to generic type Comparable<T> should be parameterized\n
14:25:46 ----------\n
14:25:46 2. WARNING in X.java (at line 11)\n
14:25:46 	Comparable s3 = choose(true, Integer.valueOf(1), Float.valueOf(2));\n
14:25:46 	^^^^^^^^^^\n
14:25:46 Comparable is a raw type. References to generic type Comparable<T> should be parameterized\n
14:25:46 ----------\n
14:25:46 3. ERROR in X.java (at line 12)\n
14:25:46 	Cloneable s4 = choose(true, Integer.valueOf(1), Float.valueOf(2));\n
14:25:46 	               ^^^^^^^^^^^^^^^^^^^^^^^^^^^^^^^^^^^^^^^^^^^^^^^^^^\n
14:25:46 Type mismatch: cannot convert from Number & Comparable<?> to Cloneable\n
14:25:46 ----------\n
14:25:46 4. ERROR in X.java (at line 13)\n
14:25:46 	Cloneable s5 = choose(true, "string", Integer.valueOf(1));\n
14:25:46 	               ^^^^^^^^^^^^^^^^^^^^^^^^^^^^^^^^^^^^^^^^^^\n
14:25:46 Type mismatch: cannot convert from Object & Serializable & Comparable<?> to Cloneable\n
14:25:46 ----------\n
14:25:46 
14:25:46 ------------ but was ------------
14:25:46 ----------\n
14:25:46 1. WARNING in X.java (at line 9)\n
14:25:46 	Comparable s1 = choose(true, "string", Integer.valueOf(1));\n
14:25:46 	^^^^^^^^^^\n
14:25:46 Comparable is a raw type. References to generic type Comparable<T> should be parameterized\n
14:25:46 ----------\n
14:25:46 2. WARNING in X.java (at line 11)\n
14:25:46 	Comparable s3 = choose(true, Integer.valueOf(1), Float.valueOf(2));\n
14:25:46 	^^^^^^^^^^\n
14:25:46 Comparable is a raw type. References to generic type Comparable<T> should be parameterized\n
14:25:46 ----------\n
14:25:46 3. ERROR in X.java (at line 12)\n
14:25:46 	Cloneable s4 = choose(true, Integer.valueOf(1), Float.valueOf(2));\n
14:25:46 	               ^^^^^^^^^^^^^^^^^^^^^^^^^^^^^^^^^^^^^^^^^^^^^^^^^^\n
14:25:46 Type mismatch: cannot convert from Number & Comparable<?> & Constable & ConstantDesc to Cloneable\n
14:25:46 ----------\n
14:25:46 4. ERROR in X.java (at line 13)\n
14:25:46 	Cloneable s5 = choose(true, "string", Integer.valueOf(1));\n
14:25:46 	               ^^^^^^^^^^^^^^^^^^^^^^^^^^^^^^^^^^^^^^^^^^\n
14:25:46 Type mismatch: cannot convert from Object & Serializable & Comparable<?> & Constable & ConstantDesc to Cloneable\n
14:25:46 ----------\n
14:25:46 
14:25:46 --------- Difference is ----------
14:25:46  expected:<...ber & Comparable<?> [to Cloneable\n
14:25:46 ----------\n
14:25:46 4. ERROR in X.java (at line 13)\n
14:25:46 	Cloneable s5 = choose(true, "string", Integer.valueOf(1));\n
14:25:46 	               ^^^^^^^^^^^^^^^^^^^^^^^^^^^^^^^^^^^^^^^^^^\n
14:25:46 Type mismatch: cannot convert from Object & Serializable & Comparable<?>] to Cloneable\n
14:25:46 ----...> but was:<...ber & Comparable<?> [& Constable & ConstantDesc to Cloneable\n
14:25:46 ----------\n
14:25:46 4. ERROR in X.java (at line 13)\n
14:25:46 	Cloneable s5 = choose(true, "string", Integer.valueOf(1));\n
14:25:46 	               ^^^^^^^^^^^^^^^^^^^^^^^^^^^^^^^^^^^^^^^^^^\n
14:25:46 Type mismatch: cannot convert from Object & Serializable & Comparable<?> & Constable & ConstantDesc] to Cloneable\n
14:25:46 ----...>
14:25:46   GenericTypeTest>TestCase.runTest:964->test0499:15322->AbstractRegressionTest.runNegativeTest:2487->AbstractRegressionTest.runNegativeTest:2498->AbstractRegressionTest.runTest:2933->AbstractRegressionTest.runTest:3140->AbstractRegressionTest.checkCompilerLog:1290->TestCase.assertEquals:242->TestCase.assertStringEquals:266 Invalid problem log .
14:25:46 ----------- Expected ------------
14:25:46 ----------\n
14:25:46 1. ERROR in X.java (at line 6)\n
14:25:46 	Integer[] var = cond ? tab1 : tab2;\n
14:25:46 	                ^^^^^^^^^^^^^^^^^^\n
14:25:46 Type mismatch: cannot convert from Object&Serializable&Comparable<? extends Object&Serializable&Comparable<?>>[] to Integer[]\n
14:25:46 ----------\n
14:25:46 
14:25:46 ------------ but was ------------
14:25:46 ----------\n
14:25:46 1. ERROR in X.java (at line 6)\n
14:25:46 	Integer[] var = cond ? tab1 : tab2;\n
14:25:46 	                ^^^^^^^^^^^^^^^^^^\n
14:25:46 Type mismatch: cannot convert from Object&Serializable&Comparable<? extends Object&Serializable&Comparable<?>&Constable&ConstantDesc>&Constable&ConstantDesc[] to Integer[]\n
14:25:46 ----------\n
14:25:46 
14:25:46 --------- Difference is ----------
14:25:46  expected:<...izable&Comparable<?>[>][] to Integer[]\n
14:25:46 --...> but was:<...izable&Comparable<?>[&Constable&ConstantDesc>&Constable&ConstantDesc][] to Integer[]\n
14:25:46 --...>
14:25:46   GenericTypeTest>TestCase.runTest:964->test0627:19769->AbstractRegressionTest.runNegativeTest:2487->AbstractRegressionTest.runNegativeTest:2498->AbstractRegressionTest.runTest:2933->AbstractRegressionTest.runTest:3140->AbstractRegressionTest.checkCompilerLog:1290->TestCase.assertEquals:242->TestCase.assertStringEquals:266 Invalid problem log .
14:25:46 ----------- Expected ------------
14:25:46 ----------\n
14:25:46 1. ERROR in X.java (at line 9)\n
14:25:46 	String s = foo(l1, l2);\n
14:25:46 	           ^^^^^^^^^^^\n
14:25:46 Type mismatch: cannot convert from List<capture#2-of ? extends Object&Serializable&Comparable<?>> to String\n
14:25:46 ----------\n
14:25:46 
14:25:46 ------------ but was ------------
14:25:46 ----------\n
14:25:46 1. ERROR in X.java (at line 9)\n
14:25:46 	String s = foo(l1, l2);\n
14:25:46 	           ^^^^^^^^^^^\n
14:25:46 Type mismatch: cannot convert from List<capture#2-of ? extends Object&Serializable&Comparable<?>&Constable&ConstantDesc> to String\n
14:25:46 ----------\n
14:25:46 
14:25:46 --------- Difference is ----------
14:25:46  expected:<...izable&Comparable<?>[]> to String\n
14:25:46 ------...> but was:<...izable&Comparable<?>[&Constable&ConstantDesc]> to String\n
14:25:46 ------...>
14:25:46   GenericTypeTest>TestCase.runTest:964->test0627:19769->AbstractRegressionTest.runNegativeTest:2487->AbstractRegressionTest.runNegativeTest:2498->AbstractRegressionTest.runTest:2933->AbstractRegressionTest.runTest:3140->AbstractRegressionTest.checkCompilerLog:1290->TestCase.assertEquals:242->TestCase.assertStringEquals:266 Invalid problem log .
14:25:46 ----------- Expected ------------
14:25:46 ----------\n
14:25:46 1. ERROR in X.java (at line 9)\n
14:25:46 	String s = foo(l1, l2);\n
14:25:46 	           ^^^^^^^^^^^\n
14:25:46 Type mismatch: cannot convert from List<capture#2-of ? extends Object & Serializable & Comparable<?>> to String\n
14:25:46 ----------\n
14:25:46 
14:25:46 ------------ but was ------------
14:25:46 ----------\n
14:25:46 1. ERROR in X.java (at line 9)\n
14:25:46 	String s = foo(l1, l2);\n
14:25:46 	           ^^^^^^^^^^^\n
14:25:46 Type mismatch: cannot convert from List<capture#2-of ? extends Object & Serializable & Comparable<?> & Constable & ConstantDesc> to String\n
14:25:46 ----------\n
14:25:46 
14:25:46 --------- Difference is ----------
14:25:46  expected:<...able & Comparable<?>[]> to String\n
14:25:46 ------...> but was:<...able & Comparable<?>[ & Constable & ConstantDesc]> to String\n
14:25:46 ------...>
14:25:46   GenericTypeTest>TestCase.runTest:964->test0627:19769->AbstractRegressionTest.runNegativeTest:2487->AbstractRegressionTest.runNegativeTest:2498->AbstractRegressionTest.runTest:2933->AbstractRegressionTest.runTest:3140->AbstractRegressionTest.checkCompilerLog:1290->TestCase.assertEquals:242->TestCase.assertStringEquals:266 Invalid problem log .
14:25:46 ----------- Expected ------------
14:25:46 ----------\n
14:25:46 1. ERROR in X.java (at line 9)\n
14:25:46 	String s = foo(l1, l2);\n
14:25:46 	           ^^^^^^^^^^^\n
14:25:46 Type mismatch: cannot convert from List<capture#2-of ? extends Object & Serializable & Comparable<?>> to String\n
14:25:46 ----------\n
14:25:46 
14:25:46 ------------ but was ------------
14:25:46 ----------\n
14:25:46 1. ERROR in X.java (at line 9)\n
14:25:46 	String s = foo(l1, l2);\n
14:25:46 	           ^^^^^^^^^^^\n
14:25:46 Type mismatch: cannot convert from List<capture#2-of ? extends Object & Serializable & Comparable<?> & Constable & ConstantDesc> to String\n
14:25:46 ----------\n
14:25:46 
14:25:46 --------- Difference is ----------
14:25:46  expected:<...able & Comparable<?>[]> to String\n
14:25:46 ------...> but was:<...able & Comparable<?>[ & Constable & ConstantDesc]> to String\n
14:25:46 ------...>
14:25:46   GenericTypeTest>TestCase.runTest:964->test0628:19793->AbstractRegressionTest.runNegativeTest:2487->AbstractRegressionTest.runNegativeTest:2498->AbstractRegressionTest.runTest:2933->AbstractRegressionTest.runTest:3140->AbstractRegressionTest.checkCompilerLog:1290->TestCase.assertEquals:242->TestCase.assertStringEquals:266 Invalid problem log .
14:25:46 ----------- Expected ------------
14:25:46 ----------\n
14:25:46 1. ERROR in X.java (at line 10)\n
14:25:46 	String s = l1 != null ? foo(l1, l2) : l3;\n
14:25:46 	                        ^^^^^^^^^^^\n
14:25:46 Type mismatch: cannot convert from List<capture#2-of ? extends Number & Comparable<?>> to String\n
14:25:46 ----------\n
14:25:46 
14:25:46 ------------ but was ------------
14:25:46 ----------\n
14:25:46 1. ERROR in X.java (at line 10)\n
14:25:46 	String s = l1 != null ? foo(l1, l2) : l3;\n
14:25:46 	                        ^^^^^^^^^^^\n
14:25:46 Type mismatch: cannot convert from List<capture#2-of ? extends Number & Comparable<?> & Constable & ConstantDesc> to String\n
14:25:46 ----------\n
14:25:46 
14:25:46 --------- Difference is ----------
14:25:46  expected:<...mber & Comparable<?>[]> to String\n
14:25:46 ------...> but was:<...mber & Comparable<?>[ & Constable & ConstantDesc]> to String\n
14:25:46 ------...>
14:25:46   GenericTypeTest>TestCase.runTest:964->test0628:19793->AbstractRegressionTest.runNegativeTest:2487->AbstractRegressionTest.runNegativeTest:2498->AbstractRegressionTest.runTest:2933->AbstractRegressionTest.runTest:3140->AbstractRegressionTest.checkCompilerLog:1290->TestCase.assertEquals:242->TestCase.assertStringEquals:266 Invalid problem log .
14:25:46 ----------- Expected ------------
14:25:46 ----------\n
14:25:46 1. ERROR in X.java (at line 10)\n
14:25:46 	String s = l1 != null ? foo(l1, l2) : l3;\n
14:25:46 	                        ^^^^^^^^^^^\n
14:25:46 Type mismatch: cannot convert from List<capture#2-of ? extends Number & Comparable<?>> to String\n
14:25:46 ----------\n
14:25:46 
14:25:46 ------------ but was ------------
14:25:46 ----------\n
14:25:46 1. ERROR in X.java (at line 10)\n
14:25:46 	String s = l1 != null ? foo(l1, l2) : l3;\n
14:25:46 	                        ^^^^^^^^^^^\n
14:25:46 Type mismatch: cannot convert from List<capture#2-of ? extends Number & Comparable<?> & Constable & ConstantDesc> to String\n
14:25:46 ----------\n
14:25:46 
14:25:46 --------- Difference is ----------
14:25:46  expected:<...mber & Comparable<?>[]> to String\n
14:25:46 ------...> but was:<...mber & Comparable<?>[ & Constable & ConstantDesc]> to String\n
14:25:46 ------...>
14:25:46   GenericTypeTest>TestCase.runTest:964->test0746:24039->AbstractRegressionTest.runNegativeTest:2605->AbstractRegressionTest.runNegativeTest:2614->AbstractRegressionTest.runTest:2933->AbstractRegressionTest.runTest:3140->AbstractRegressionTest.checkCompilerLog:1290->TestCase.assertEquals:242->TestCase.assertStringEquals:266 Invalid problem log .
14:25:46 ----------- Expected ------------
14:25:46 ----------\n
14:25:46 1. ERROR in X.java (at line 3)\n
14:25:46 	String s = java.util.Arrays.asList(3, 3.1);\n
14:25:46 	           ^^^^^^^^^^^^^^^^^^^^^^^^^^^^^^^\n
14:25:46 Type mismatch: cannot convert from List<Number&Comparable<?>> to String\n
14:25:46 ----------\n
14:25:46 
14:25:46 ------------ but was ------------
14:25:46 ----------\n
14:25:46 1. ERROR in X.java (at line 3)\n
14:25:46 	String s = java.util.Arrays.asList(3, 3.1);\n
14:25:46 	           ^^^^^^^^^^^^^^^^^^^^^^^^^^^^^^^\n
14:25:46 Type mismatch: cannot convert from List<Number&Comparable<?>&Constable&ConstantDesc> to String\n
14:25:46 ----------\n
14:25:46 
14:25:46 --------- Difference is ----------
14:25:46  expected:<...Number&Comparable<?>[]> to String\n
14:25:46 ------...> but was:<...Number&Comparable<?>[&Constable&ConstantDesc]> to String\n
14:25:46 ------...>
14:25:46   GenericTypeTest>TestCase.runTest:964->test0746:24039->AbstractRegressionTest.runNegativeTest:2605->AbstractRegressionTest.runNegativeTest:2614->AbstractRegressionTest.runTest:2933->AbstractRegressionTest.runTest:3140->AbstractRegressionTest.checkCompilerLog:1290->TestCase.assertEquals:242->TestCase.assertStringEquals:266 Invalid problem log .
14:25:46 ----------- Expected ------------
14:25:46 ----------\n
14:25:46 1. ERROR in X.java (at line 3)\n
14:25:46 	String s = java.util.Arrays.asList(3, 3.1);\n
14:25:46 	           ^^^^^^^^^^^^^^^^^^^^^^^^^^^^^^^\n
14:25:46 Type mismatch: cannot convert from List<Number & Comparable<?>> to String\n
14:25:46 ----------\n
14:25:46 
14:25:46 ------------ but was ------------
14:25:46 ----------\n
14:25:46 1. ERROR in X.java (at line 3)\n
14:25:46 	String s = java.util.Arrays.asList(3, 3.1);\n
14:25:46 	           ^^^^^^^^^^^^^^^^^^^^^^^^^^^^^^^\n
14:25:46 Type mismatch: cannot convert from List<Number & Comparable<?> & Constable & ConstantDesc> to String\n
14:25:46 ----------\n
14:25:46 
14:25:46 --------- Difference is ----------
14:25:46  expected:<...mber & Comparable<?>[]> to String\n
14:25:46 ------...> but was:<...mber & Comparable<?>[ & Constable & ConstantDesc]> to String\n
14:25:46 ------...>
14:25:46   GenericTypeTest>TestCase.runTest:964->test0746:24039->AbstractRegressionTest.runNegativeTest:2605->AbstractRegressionTest.runNegativeTest:2614->AbstractRegressionTest.runTest:2933->AbstractRegressionTest.runTest:3140->AbstractRegressionTest.checkCompilerLog:1290->TestCase.assertEquals:242->TestCase.assertStringEquals:266 Invalid problem log .
14:25:46 ----------- Expected ------------
14:25:46 ----------\n
14:25:46 1. ERROR in X.java (at line 3)\n
14:25:46 	String s = java.util.Arrays.asList(3, 3.1);\n
14:25:46 	           ^^^^^^^^^^^^^^^^^^^^^^^^^^^^^^^\n
14:25:46 Type mismatch: cannot convert from List<Number & Comparable<?>> to String\n
14:25:46 ----------\n
14:25:46 
14:25:46 ------------ but was ------------
14:25:46 ----------\n
14:25:46 1. ERROR in X.java (at line 3)\n
14:25:46 	String s = java.util.Arrays.asList(3, 3.1);\n
14:25:46 	           ^^^^^^^^^^^^^^^^^^^^^^^^^^^^^^^\n
14:25:46 Type mismatch: cannot convert from List<Number & Comparable<?> & Constable & ConstantDesc> to String\n
14:25:46 ----------\n
14:25:46 
14:25:46 --------- Difference is ----------
14:25:46  expected:<...mber & Comparable<?>[]> to String\n
14:25:46 ------...> but was:<...mber & Comparable<?>[ & Constable & ConstantDesc]> to String\n
14:25:46 ------...>
14:25:46   GenericTypeTest>TestCase.runTest:964->test0790:25406->AbstractRegressionTest.runNegativeTest:2487->AbstractRegressionTest.runNegativeTest:2498->AbstractRegressionTest.runTest:2933->AbstractRegressionTest.runTest:3140->AbstractRegressionTest.checkCompilerLog:1290->TestCase.assertEquals:242->TestCase.assertStringEquals:266 Invalid problem log .
14:25:46 ----------- Expected ------------
14:25:46 ----------\n
14:25:46 1. ERROR in X.java (at line 7)\n
14:25:46 	if (isGreater(i, d)) \n
14:25:46 	    ^^^^^^^^^\n
14:25:46 Bound mismatch: The generic method isGreater(T, T) of type X is not applicable for the arguments (Integer, Double). The inferred type Number&Comparable<?> is not a valid substitute for the bounded parameter <T extends Comparable<T>>\n
14:25:46 ----------\n
14:25:46 2. ERROR in X.java (at line 15)\n
14:25:46 	isGreater(c1, c2);\n
14:25:46 	^^^^^^^^^\n
14:25:46 Bound mismatch: The generic method isGreater(T, T) of type X is not applicable for the arguments (Comparable<capture#1-of ? extends Number>, Comparable<capture#2-of ? extends Number>). The inferred type Comparable<? extends Number> is not a valid substitute for the bounded parameter <T extends Comparable<T>>\n
14:25:46 ----------\n
14:25:46 3. WARNING in X.java (at line 18)\n
14:25:46 	Comparable c1= i;\n
14:25:46 	^^^^^^^^^^\n
14:25:46 Comparable is a raw type. References to generic type Comparable<T> should be parameterized\n
14:25:46 ----------\n
14:25:46 4. WARNING in X.java (at line 19)\n
14:25:46 	Comparable c2= d;\n
14:25:46 	^^^^^^^^^^\n
14:25:46 Comparable is a raw type. References to generic type Comparable<T> should be parameterized\n
14:25:46 ----------\n
14:25:46 5. WARNING in X.java (at line 20)\n
14:25:46 	isGreater(c1, c2);\n
14:25:46 	^^^^^^^^^^^^^^^^^\n
14:25:46 Type safety: Unchecked invocation isGreater(Comparable, Comparable) of the generic method isGreater(T, T) of type X\n
14:25:46 ----------\n
14:25:46 
14:25:46 ------------ but was ------------
14:25:46 ----------\n
14:25:46 1. ERROR in X.java (at line 7)\n
14:25:46 	if (isGreater(i, d)) \n
14:25:46 	    ^^^^^^^^^\n
14:25:46 Bound mismatch: The generic method isGreater(T, T) of type X is not applicable for the arguments (Integer, Double). The inferred type Number&Comparable<?>&Constable&ConstantDesc is not a valid substitute for the bounded parameter <T extends Comparable<T>>\n
14:25:46 ----------\n
14:25:46 2. ERROR in X.java (at line 15)\n
14:25:46 	isGreater(c1, c2);\n
14:25:46 	^^^^^^^^^\n
14:25:46 Bound mismatch: The generic method isGreater(T, T) of type X is not applicable for the arguments (Comparable<capture#1-of ? extends Number>, Comparable<capture#2-of ? extends Number>). The inferred type Comparable<? extends Number> is not a valid substitute for the bounded parameter <T extends Comparable<T>>\n
14:25:46 ----------\n
14:25:46 3. WARNING in X.java (at line 18)\n
14:25:46 	Comparable c1= i;\n
14:25:46 	^^^^^^^^^^\n
14:25:46 Comparable is a raw type. References to generic type Comparable<T> should be parameterized\n
14:25:46 ----------\n
14:25:46 4. WARNING in X.java (at line 19)\n
14:25:46 	Comparable c2= d;\n
14:25:46 	^^^^^^^^^^\n
14:25:46 Comparable is a raw type. References to generic type Comparable<T> should be parameterized\n
14:25:46 ----------\n
14:25:46 5. WARNING in X.java (at line 20)\n
14:25:46 	isGreater(c1, c2);\n
14:25:46 	^^^^^^^^^^^^^^^^^\n
14:25:46 Type safety: Unchecked invocation isGreater(Comparable, Comparable) of the generic method isGreater(T, T) of type X\n
14:25:46 ----------\n
14:25:46 
14:25:46 --------- Difference is ----------
14:25:46  expected:<...Number&Comparable<?>[] is not a valid subs...> but was:<...Number&Comparable<?>[&Constable&ConstantDesc] is not a valid subs...>
14:25:46   GenericTypeTest>TestCase.runTest:964->test0805:26040->AbstractRegressionTest.runNegativeTest:2487->AbstractRegressionTest.runNegativeTest:2498->AbstractRegressionTest.runTest:2933->AbstractRegressionTest.runTest:3140->AbstractRegressionTest.checkCompilerLog:1290->TestCase.assertEquals:242->TestCase.assertStringEquals:266 Invalid problem log .
14:25:46 ----------- Expected ------------
14:25:46 ----------\n
14:25:46 1. ERROR in X.java (at line 10)\n
14:25:46 	String s = foo(numbers, floats); 		\n
14:25:46 	           ^^^^^^^^^^^^^^^^^^^^\n
14:25:46 Type mismatch: cannot convert from Number[] to String\n
14:25:46 ----------\n
14:25:46 2. ERROR in X.java (at line 14)\n
14:25:46 	String s2 = foo(integers, floats);\n
14:25:46 	            ^^^^^^^^^^^^^^^^^^^^^\n
14:25:46 Type mismatch: cannot convert from Number&Comparable<? extends Number&Comparable<?>>[] to String\n
14:25:46 ----------\n
14:25:46 
14:25:46 ------------ but was ------------
14:25:46 ----------\n
14:25:46 1. ERROR in X.java (at line 10)\n
14:25:46 	String s = foo(numbers, floats); 		\n
14:25:46 	           ^^^^^^^^^^^^^^^^^^^^\n
14:25:46 Type mismatch: cannot convert from Number[] to String\n
14:25:46 ----------\n
14:25:46 2. ERROR in X.java (at line 14)\n
14:25:46 	String s2 = foo(integers, floats);\n
14:25:46 	            ^^^^^^^^^^^^^^^^^^^^^\n
14:25:46 Type mismatch: cannot convert from Number&Comparable<? extends Number&Comparable<?>&Constable&ConstantDesc>&Constable&ConstantDesc[] to String\n
14:25:46 ----------\n
14:25:46 
14:25:46 --------- Difference is ----------
14:25:46  expected:<...Number&Comparable<?>[>][] to String\n
14:25:46 -----...> but was:<...Number&Comparable<?>[&Constable&ConstantDesc>&Constable&ConstantDesc][] to String\n
14:25:46 -----...>
14:25:46   GenericTypeTest>TestCase.runTest:964->test0805:26040->AbstractRegressionTest.runNegativeTest:2487->AbstractRegressionTest.runNegativeTest:2498->AbstractRegressionTest.runTest:2933->AbstractRegressionTest.runTest:3140->AbstractRegressionTest.checkCompilerLog:1290->TestCase.assertEquals:242->TestCase.assertStringEquals:266 Invalid problem log .
14:25:46 ----------- Expected ------------
14:25:46 ----------\n
14:25:46 1. ERROR in X.java (at line 10)\n
14:25:46 	String s = foo(numbers, floats); 		\n
14:25:46 	           ^^^^^^^^^^^^^^^^^^^^\n
14:25:46 Type mismatch: cannot convert from Number[] to String\n
14:25:46 ----------\n
14:25:46 2. ERROR in X.java (at line 14)\n
14:25:46 	String s2 = foo(integers, floats);\n
14:25:46 	            ^^^^^^^^^^^^^^^^^^^^^\n
14:25:46 Type mismatch: cannot convert from Number & Comparable<? extends Number & Comparable<?>>[] to String\n
14:25:46 ----------\n
14:25:46 
14:25:46 ------------ but was ------------
14:25:46 ----------\n
14:25:46 1. ERROR in X.java (at line 10)\n
14:25:46 	String s = foo(numbers, floats); 		\n
14:25:46 	           ^^^^^^^^^^^^^^^^^^^^\n
14:25:46 Type mismatch: cannot convert from Number[] to String\n
14:25:46 ----------\n
14:25:46 2. ERROR in X.java (at line 14)\n
14:25:46 	String s2 = foo(integers, floats);\n
14:25:46 	            ^^^^^^^^^^^^^^^^^^^^^\n
14:25:46 Type mismatch: cannot convert from Number & Comparable<? extends Number & Comparable<?> & Constable & ConstantDesc> & Constable & ConstantDesc[] to String\n
14:25:46 ----------\n
14:25:46 
14:25:46 --------- Difference is ----------
14:25:46  expected:<...mber & Comparable<?>[>][] to String\n
14:25:46 -----...> but was:<...mber & Comparable<?>[ & Constable & ConstantDesc> & Constable & ConstantDesc][] to String\n
14:25:46 -----...>
14:25:46   GenericTypeTest>TestCase.runTest:964->test0805:26040->AbstractRegressionTest.runNegativeTest:2487->AbstractRegressionTest.runNegativeTest:2498->AbstractRegressionTest.runTest:2933->AbstractRegressionTest.runTest:3140->AbstractRegressionTest.checkCompilerLog:1290->TestCase.assertEquals:242->TestCase.assertStringEquals:266 Invalid problem log .
14:25:46 ----------- Expected ------------
14:25:46 ----------\n
14:25:46 1. ERROR in X.java (at line 10)\n
14:25:46 	String s = foo(numbers, floats); 		\n
14:25:46 	           ^^^^^^^^^^^^^^^^^^^^\n
14:25:46 Type mismatch: cannot convert from Number[] to String\n
14:25:46 ----------\n
14:25:46 2. ERROR in X.java (at line 14)\n
14:25:46 	String s2 = foo(integers, floats);\n
14:25:46 	            ^^^^^^^^^^^^^^^^^^^^^\n
14:25:46 Type mismatch: cannot convert from Number & Comparable<? extends Number & Comparable<?>>[] to String\n
14:25:46 ----------\n
14:25:46 
14:25:46 ------------ but was ------------
14:25:46 ----------\n
14:25:46 1. ERROR in X.java (at line 10)\n
14:25:46 	String s = foo(numbers, floats); 		\n
14:25:46 	           ^^^^^^^^^^^^^^^^^^^^\n
14:25:46 Type mismatch: cannot convert from Number[] to String\n
14:25:46 ----------\n
14:25:46 2. ERROR in X.java (at line 14)\n
14:25:46 	String s2 = foo(integers, floats);\n
14:25:46 	            ^^^^^^^^^^^^^^^^^^^^^\n
14:25:46 Type mismatch: cannot convert from Number & Comparable<? extends Number & Comparable<?> & Constable & ConstantDesc> & Constable & ConstantDesc[] to String\n
14:25:46 ----------\n
14:25:46 
14:25:46 --------- Difference is ----------
14:25:46  expected:<...mber & Comparable<?>[>][] to String\n
14:25:46 -----...> but was:<...mber & Comparable<?>[ & Constable & ConstantDesc> & Constable & ConstantDesc][] to String\n
14:25:46 -----...>
14:25:46   GenericTypeTest>TestCase.runTest:964->test0985:32918->AbstractRegressionTest.runNegativeTest:2605->AbstractRegressionTest.runNegativeTest:2614->AbstractRegressionTest.runTest:2933->AbstractRegressionTest.runTest:3140->AbstractRegressionTest.checkCompilerLog:1290->TestCase.assertEquals:242->TestCase.assertStringEquals:266 Invalid problem log .
14:25:46 ----------- Expected ------------
14:25:46 ----------\n
14:25:46 1. ERROR in X.java (at line 4)\n
14:25:46 	List<Class<Object>>  lco = Arrays.asList(String.class, Integer.class, Long.class);\n
14:25:46 	                           ^^^^^^^^^^^^^^^^^^^^^^^^^^^^^^^^^^^^^^^^^^^^^^^^^^^^^^\n
14:25:46 Type mismatch: cannot convert from List<Class<? extends Object&Serializable&Comparable<?>>> to List<Class<Object>>\n
14:25:46 ----------\n
14:25:46 
14:25:46 ------------ but was ------------
14:25:46 ----------\n
14:25:46 1. ERROR in X.java (at line 4)\n
14:25:46 	List<Class<Object>>  lco = Arrays.asList(String.class, Integer.class, Long.class);\n
14:25:46 	                           ^^^^^^^^^^^^^^^^^^^^^^^^^^^^^^^^^^^^^^^^^^^^^^^^^^^^^^\n
14:25:46 Type mismatch: cannot convert from List<Class<? extends Object&Serializable&Comparable<?>&Constable&ConstantDesc>> to List<Class<Object>>\n
14:25:46 ----------\n
14:25:46 
14:25:46 --------- Difference is ----------
14:25:46  expected:<...izable&Comparable<?>[]>> to List<Class<Obj...> but was:<...izable&Comparable<?>[&Constable&ConstantDesc]>> to List<Class<Obj...>
14:25:46   GenericTypeTest>TestCase.runTest:964->test0985:32918->AbstractRegressionTest.runNegativeTest:2605->AbstractRegressionTest.runNegativeTest:2614->AbstractRegressionTest.runTest:2933->AbstractRegressionTest.runTest:3140->AbstractRegressionTest.checkCompilerLog:1290->TestCase.assertEquals:242->TestCase.assertStringEquals:266 Invalid problem log .
14:25:46 ----------- Expected ------------
14:25:46 ----------\n
14:25:46 1. ERROR in X.java (at line 4)\n
14:25:46 	List<Class<Object>>  lco = Arrays.asList(String.class, Integer.class, Long.class);\n
14:25:46 	                           ^^^^^^^^^^^^^^^^^^^^^^^^^^^^^^^^^^^^^^^^^^^^^^^^^^^^^^\n
14:25:46 Type mismatch: cannot convert from List<Class<? extends Object & Serializable & Comparable<?>>> to List<Class<Object>>\n
14:25:46 ----------\n
14:25:46 
14:25:46 ------------ but was ------------
14:25:46 ----------\n
14:25:46 1. ERROR in X.java (at line 4)\n
14:25:46 	List<Class<Object>>  lco = Arrays.asList(String.class, Integer.class, Long.class);\n
14:25:46 	                           ^^^^^^^^^^^^^^^^^^^^^^^^^^^^^^^^^^^^^^^^^^^^^^^^^^^^^^\n
14:25:46 Type mismatch: cannot convert from List<Class<? extends Object & Serializable & Comparable<?> & Constable & ConstantDesc>> to List<Class<Object>>\n
14:25:46 ----------\n
14:25:46 
14:25:46 --------- Difference is ----------
14:25:46  expected:<...able & Comparable<?>[]>> to List<Class<Obj...> but was:<...able & Comparable<?>[ & Constable & ConstantDesc]>> to List<Class<Obj...>
14:25:46   GenericTypeTest>TestCase.runTest:964->test0985:32918->AbstractRegressionTest.runNegativeTest:2605->AbstractRegressionTest.runNegativeTest:2614->AbstractRegressionTest.runTest:2933->AbstractRegressionTest.runTest:3140->AbstractRegressionTest.checkCompilerLog:1290->TestCase.assertEquals:242->TestCase.assertStringEquals:266 Invalid problem log .
14:25:46 ----------- Expected ------------
14:25:46 ----------\n
14:25:46 1. ERROR in X.java (at line 4)\n
14:25:46 	List<Class<Object>>  lco = Arrays.asList(String.class, Integer.class, Long.class);\n
14:25:46 	                           ^^^^^^^^^^^^^^^^^^^^^^^^^^^^^^^^^^^^^^^^^^^^^^^^^^^^^^\n
14:25:46 Type mismatch: cannot convert from List<Class<? extends Object & Serializable & Comparable<?>>> to List<Class<Object>>\n
14:25:46 ----------\n
14:25:46 
14:25:46 ------------ but was ------------
14:25:46 ----------\n
14:25:46 1. ERROR in X.java (at line 4)\n
14:25:46 	List<Class<Object>>  lco = Arrays.asList(String.class, Integer.class, Long.class);\n
14:25:46 	                           ^^^^^^^^^^^^^^^^^^^^^^^^^^^^^^^^^^^^^^^^^^^^^^^^^^^^^^\n
14:25:46 Type mismatch: cannot convert from List<Class<? extends Object & Serializable & Comparable<?> & Constable & ConstantDesc>> to List<Class<Object>>\n
14:25:46 ----------\n
14:25:46 
14:25:46 --------- Difference is ----------
14:25:46  expected:<...able & Comparable<?>[]>> to List<Class<Obj...> but was:<...able & Comparable<?>[ & Constable & ConstantDesc]>> to List<Class<Obj...>
14:25:46   GenericTypeTest>TestCase.runTest:964->test1000:33527->AbstractRegressionTest.runNegativeTest:2487->AbstractRegressionTest.runNegativeTest:2498->AbstractRegressionTest.runTest:2933->AbstractRegressionTest.runTest:3140->AbstractRegressionTest.checkCompilerLog:1290->TestCase.assertEquals:242->TestCase.assertStringEquals:266 Invalid problem log .
14:25:46 ----------- Expected ------------
14:25:46 ----------\n
14:25:46 1. WARNING in X.java (at line 3)\n
14:25:46 	public static final <T> Iterator<T> chain(Iterator<? extends T>... it) {\n
14:25:46 	                                                                   ^^\n
14:25:46 Type safety: Potential heap pollution via varargs parameter it\n
14:25:46 ----------\n
14:25:46 2. WARNING in X.java (at line 9)\n
14:25:46 	Iterator<Number> it1 = X.chain(new Iterator[] { l1.iterator(), l2.iterator() });\n
14:25:46 	                       ^^^^^^^^^^^^^^^^^^^^^^^^^^^^^^^^^^^^^^^^^^^^^^^^^^^^^^^^\n
14:25:46 Type safety: Unchecked invocation chain(Iterator[]) of the generic method chain(Iterator<? extends T>...) of type X\n
14:25:46 ----------\n
14:25:46 3. WARNING in X.java (at line 9)\n
14:25:46 	Iterator<Number> it1 = X.chain(new Iterator[] { l1.iterator(), l2.iterator() });\n
14:25:46 	                       ^^^^^^^^^^^^^^^^^^^^^^^^^^^^^^^^^^^^^^^^^^^^^^^^^^^^^^^^\n
14:25:46 Type safety: The expression of type Iterator needs unchecked conversion to conform to Iterator<Number>\n
14:25:46 ----------\n
14:25:46 4. WARNING in X.java (at line 9)\n
14:25:46 	Iterator<Number> it1 = X.chain(new Iterator[] { l1.iterator(), l2.iterator() });\n
14:25:46 	                               ^^^^^^^^^^^^^^^^^^^^^^^^^^^^^^^^^^^^^^^^^^^^^^^\n
14:25:46 Type safety: The expression of type Iterator[] needs unchecked conversion to conform to Iterator<? extends Number>[]\n
14:25:46 ----------\n
14:25:46 5. WARNING in X.java (at line 14)\n
14:25:46 	Iterator<Number> it2 = X.chain(l1.iterator(), l2.iterator());\n
14:25:46 	                       ^^^^^^^^^^^^^^^^^^^^^^^^^^^^^^^^^^^^^\n
14:25:46 Type safety: A generic array of Iterator<? extends Number&Comparable<?>> is created for a varargs parameter\n
14:25:46 ----------\n
14:25:46 6. ERROR in X.java (at line 14)\n
14:25:46 	Iterator<Number> it2 = X.chain(l1.iterator(), l2.iterator());\n
14:25:46 	                       ^^^^^^^^^^^^^^^^^^^^^^^^^^^^^^^^^^^^^\n
14:25:46 Type mismatch: cannot convert from Iterator<Number&Comparable<?>> to Iterator<Number>\n
14:25:46 ----------\n
14:25:46 7. WARNING in X.java (at line 18)\n
14:25:46 	Iterator<Number> it2 = X.chain(l1.iterator(), l1.iterator());\n
14:25:46 	                       ^^^^^^^^^^^^^^^^^^^^^^^^^^^^^^^^^^^^^\n
14:25:46 Type safety: A generic array of Iterator<? extends Integer> is created for a varargs parameter\n
14:25:46 ----------\n
14:25:46 8. ERROR in X.java (at line 18)\n
14:25:46 	Iterator<Number> it2 = X.chain(l1.iterator(), l1.iterator());\n
14:25:46 	                       ^^^^^^^^^^^^^^^^^^^^^^^^^^^^^^^^^^^^^\n
14:25:46 Type mismatch: cannot convert from Iterator<Integer> to Iterator<Number>\n
14:25:46 ----------\n
14:25:46 
14:25:46 ------------ but was ------------
14:25:46 ----------\n
14:25:46 1. WARNING in X.java (at line 3)\n
14:25:46 	public static final <T> Iterator<T> chain(Iterator<? extends T>... it) {\n
14:25:46 	                                                                   ^^\n
14:25:46 Type safety: Potential heap pollution via varargs parameter it\n
14:25:46 ----------\n
14:25:46 2. WARNING in X.java (at line 9)\n
14:25:46 	Iterator<Number> it1 = X.chain(new Iterator[] { l1.iterator(), l2.iterator() });\n
14:25:46 	                       ^^^^^^^^^^^^^^^^^^^^^^^^^^^^^^^^^^^^^^^^^^^^^^^^^^^^^^^^\n
14:25:46 Type safety: Unchecked invocation chain(Iterator[]) of the generic method chain(Iterator<? extends T>...) of type X\n
14:25:46 ----------\n
14:25:46 3. WARNING in X.java (at line 9)\n
14:25:46 	Iterator<Number> it1 = X.chain(new Iterator[] { l1.iterator(), l2.iterator() });\n
14:25:46 	                       ^^^^^^^^^^^^^^^^^^^^^^^^^^^^^^^^^^^^^^^^^^^^^^^^^^^^^^^^\n
14:25:46 Type safety: The expression of type Iterator needs unchecked conversion to conform to Iterator<Number>\n
14:25:46 ----------\n
14:25:46 4. WARNING in X.java (at line 9)\n
14:25:46 	Iterator<Number> it1 = X.chain(new Iterator[] { l1.iterator(), l2.iterator() });\n
14:25:46 	                               ^^^^^^^^^^^^^^^^^^^^^^^^^^^^^^^^^^^^^^^^^^^^^^^\n
14:25:46 Type safety: The expression of type Iterator[] needs unchecked conversion to conform to Iterator<? extends Number>[]\n
14:25:46 ----------\n
14:25:46 5. WARNING in X.java (at line 14)\n
14:25:46 	Iterator<Number> it2 = X.chain(l1.iterator(), l2.iterator());\n
14:25:46 	                       ^^^^^^^^^^^^^^^^^^^^^^^^^^^^^^^^^^^^^\n
14:25:46 Type safety: A generic array of Iterator<? extends Number&Comparable<?>&Constable&ConstantDesc> is created for a varargs parameter\n
14:25:46 ----------\n
14:25:46 6. ERROR in X.java (at line 14)\n
14:25:46 	Iterator<Number> it2 = X.chain(l1.iterator(), l2.iterator());\n
14:25:46 	                       ^^^^^^^^^^^^^^^^^^^^^^^^^^^^^^^^^^^^^\n
14:25:46 Type mismatch: cannot convert from Iterator<Number&Comparable<?>&Constable&ConstantDesc> to Iterator<Number>\n
14:25:46 ----------\n
14:25:46 7. WARNING in X.java (at line 18)\n
14:25:46 	Iterator<Number> it2 = X.chain(l1.iterator(), l1.iterator());\n
14:25:46 	                       ^^^^^^^^^^^^^^^^^^^^^^^^^^^^^^^^^^^^^\n
14:25:46 Type safety: A generic array of Iterator<? extends Integer> is created for a varargs parameter\n
14:25:46 ----------\n
14:25:46 8. ERROR in X.java (at line 18)\n
14:25:46 	Iterator<Number> it2 = X.chain(l1.iterator(), l1.iterator());\n
14:25:46 	                       ^^^^^^^^^^^^^^^^^^^^^^^^^^^^^^^^^^^^^\n
14:25:46 Type mismatch: cannot convert from Iterator<Integer> to Iterator<Number>\n
14:25:46 ----------\n
14:25:46 
14:25:46 --------- Difference is ----------
14:25:46  expected:<...Number&Comparable<?>[> is created for a varargs parameter\n
14:25:46 ----------\n
14:25:46 6. ERROR in X.java (at line 14)\n
14:25:46 	Iterator<Number> it2 = X.chain(l1.iterator(), l2.iterator());\n
14:25:46 	                       ^^^^^^^^^^^^^^^^^^^^^^^^^^^^^^^^^^^^^\n
14:25:46 Type mismatch: cannot convert from Iterator<Number&Comparable<?>]> to Iterator<Number...> but was:<...Number&Comparable<?>[&Constable&ConstantDesc> is created for a varargs parameter\n
14:25:46 ----------\n
14:25:46 6. ERROR in X.java (at line 14)\n
14:25:46 	Iterator<Number> it2 = X.chain(l1.iterator(), l2.iterator());\n
14:25:46 	                       ^^^^^^^^^^^^^^^^^^^^^^^^^^^^^^^^^^^^^\n
14:25:46 Type mismatch: cannot convert from Iterator<Number&Comparable<?>&Constable&ConstantDesc]> to Iterator<Number...>
14:25:46   GenericTypeTest>TestCase.runTest:964->test1029:34744->AbstractRegressionTest.runNegativeTest:2605->AbstractRegressionTest.runNegativeTest:2614->AbstractRegressionTest.runTest:2933->AbstractRegressionTest.runTest:3140->AbstractRegressionTest.checkCompilerLog:1290->TestCase.assertEquals:242->TestCase.assertStringEquals:266 Invalid problem log .
14:25:46 ----------- Expected ------------
14:25:46 ----------\n
14:25:46 1. ERROR in X.java (at line 10)\n
14:25:46 	List<Number> name = makeNumberList(5, 5D);\n
14:25:46 	                    ^^^^^^^^^^^^^^^^^^^^^\n
14:25:46 Type mismatch: cannot convert from List<Number&Comparable<?>> to List<Number>\n
14:25:46 ----------\n
14:25:46 
14:25:46 ------------ but was ------------
14:25:46 ----------\n
14:25:46 1. ERROR in X.java (at line 10)\n
14:25:46 	List<Number> name = makeNumberList(5, 5D);\n
14:25:46 	                    ^^^^^^^^^^^^^^^^^^^^^\n
14:25:46 Type mismatch: cannot convert from List<Number&Comparable<?>&Constable&ConstantDesc> to List<Number>\n
14:25:46 ----------\n
14:25:46 
14:25:46 --------- Difference is ----------
14:25:46  expected:<...Number&Comparable<?>[]> to List<Number>\n
14:25:46 ...> but was:<...Number&Comparable<?>[&Constable&ConstantDesc]> to List<Number>\n
14:25:46 ...>
14:25:46   GenericTypeTest>TestCase.runTest:964->test1136:39656->AbstractRegressionTest.runNegativeTest:2605->AbstractRegressionTest.runNegativeTest:2614->AbstractRegressionTest.runTest:2933->AbstractRegressionTest.runTest:3140->AbstractRegressionTest.checkCompilerLog:1290->TestCase.assertEquals:242->TestCase.assertStringEquals:266 Invalid problem log .
14:25:46 ----------- Expected ------------
14:25:46 ----------\n
14:25:46 1. ERROR in X.java (at line 4)\n
14:25:46 	List<Object>  l1 = Arrays.asList(1, "X");\n
14:25:46 	                   ^^^^^^^^^^^^^^^^^^^^^\n
14:25:46 Type mismatch: cannot convert from List<Object&Comparable<?>&Serializable> to List<Object>\n
14:25:46 ----------\n
14:25:46 2. ERROR in X.java (at line 8)\n
14:25:46 	List<Object>  l2 = Arrays.asList(b, c);\n
14:25:46 	                   ^^^^^^^^^^^^^^^^^^^\n
14:25:46 Type mismatch: cannot convert from List<A<String>&I> to List<Object>\n
14:25:46 ----------\n
14:25:46 
14:25:46 ------------ but was ------------
14:25:46 ----------\n
14:25:46 1. ERROR in X.java (at line 4)\n
14:25:46 	List<Object>  l1 = Arrays.asList(1, "X");\n
14:25:46 	                   ^^^^^^^^^^^^^^^^^^^^^\n
14:25:46 Type mismatch: cannot convert from List<Object&Comparable<?>&Constable&ConstantDesc&Serializable> to List<Object>\n
14:25:46 ----------\n
14:25:46 2. ERROR in X.java (at line 8)\n
14:25:46 	List<Object>  l2 = Arrays.asList(b, c);\n
14:25:46 	                   ^^^^^^^^^^^^^^^^^^^\n
14:25:46 Type mismatch: cannot convert from List<A<String>&I> to List<Object>\n
14:25:46 ----------\n
14:25:46 
14:25:46 --------- Difference is ----------
14:25:46  expected:<...bject&Comparable<?>&[]Serializable> to Lis...> but was:<...bject&Comparable<?>&[Constable&ConstantDesc&]Serializable> to Lis...>
14:25:46   GenericTypeTest>TestCase.runTest:964->test1173:41112->AbstractRegressionTest.runNegativeTest:2487->AbstractRegressionTest.runNegativeTest:2498->AbstractRegressionTest.runTest:2933->AbstractRegressionTest.runTest:3140->AbstractRegressionTest.checkCompilerLog:1290->TestCase.assertEquals:242->TestCase.assertStringEquals:266 Invalid problem log .
14:25:46 ----------- Expected ------------
14:25:46 ----------\n
14:25:46 1. ERROR in X.java (at line 4)\n
14:25:46 	(b ? x1 : x2).field = x1.field;\n
14:25:46 	                      ^^^^^^^^\n
14:25:46 Type mismatch: cannot convert from Integer to capture#1-of ? extends Number&Comparable<?>\n
14:25:46 ----------\n
14:25:46 
14:25:46 ------------ but was ------------
14:25:46 ----------\n
14:25:46 1. ERROR in X.java (at line 4)\n
14:25:46 	(b ? x1 : x2).field = x1.field;\n
14:25:46 	                      ^^^^^^^^\n
14:25:46 Type mismatch: cannot convert from Integer to capture#1-of ? extends Number&Comparable<?>&Constable&ConstantDesc\n
14:25:46 ----------\n
14:25:46 
14:25:46 --------- Difference is ----------
14:25:46  expected:<...Number&Comparable<?>[]\n
14:25:46 ----------\n
14:25:46 > but was:<...Number&Comparable<?>[&Constable&ConstantDesc]\n
14:25:46 ----------\n
14:25:46 >
14:25:46   GenericTypeTest>TestCase.runTest:964->test1173:41112->AbstractRegressionTest.runNegativeTest:2487->AbstractRegressionTest.runNegativeTest:2498->AbstractRegressionTest.runTest:2933->AbstractRegressionTest.runTest:3140->AbstractRegressionTest.checkCompilerLog:1290->TestCase.assertEquals:242->TestCase.assertStringEquals:266 Invalid problem log .
14:25:46 ----------- Expected ------------
14:25:46 ----------\n
14:25:46 1. ERROR in X.java (at line 4)\n
14:25:46 	(b ? x1 : x2).field = x1.field;\n
14:25:46 	                      ^^^^^^^^\n
14:25:46 Type mismatch: cannot convert from Integer to capture#1-of ? extends Number & Comparable<?>\n
14:25:46 ----------\n
14:25:46 
14:25:46 ------------ but was ------------
14:25:46 ----------\n
14:25:46 1. ERROR in X.java (at line 4)\n
14:25:46 	(b ? x1 : x2).field = x1.field;\n
14:25:46 	                      ^^^^^^^^\n
14:25:46 Type mismatch: cannot convert from Integer to capture#1-of ? extends Number & Comparable<?> & Constable & ConstantDesc\n
14:25:46 ----------\n
14:25:46 
14:25:46 --------- Difference is ----------
14:25:46  expected:<...mber & Comparable<?>[]\n
14:25:46 ----------\n
14:25:46 > but was:<...mber & Comparable<?>[ & Constable & ConstantDesc]\n
14:25:46 ----------\n
14:25:46 >
14:25:46   GenericTypeTest>TestCase.runTest:964->test1173:41112->AbstractRegressionTest.runNegativeTest:2487->AbstractRegressionTest.runNegativeTest:2498->AbstractRegressionTest.runTest:2933->AbstractRegressionTest.runTest:3140->AbstractRegressionTest.checkCompilerLog:1290->TestCase.assertEquals:242->TestCase.assertStringEquals:266 Invalid problem log .
14:25:46 ----------- Expected ------------
14:25:46 ----------\n
14:25:46 1. ERROR in X.java (at line 4)\n
14:25:46 	(b ? x1 : x2).field = x1.field;\n
14:25:46 	                      ^^^^^^^^\n
14:25:46 Type mismatch: cannot convert from Integer to capture#1-of ? extends Number & Comparable<?>\n
14:25:46 ----------\n
14:25:46 
14:25:46 ------------ but was ------------
14:25:46 ----------\n
14:25:46 1. ERROR in X.java (at line 4)\n
14:25:46 	(b ? x1 : x2).field = x1.field;\n
14:25:46 	                      ^^^^^^^^\n
14:25:46 Type mismatch: cannot convert from Integer to capture#1-of ? extends Number & Comparable<?> & Constable & ConstantDesc\n
14:25:46 ----------\n
14:25:46 
14:25:46 --------- Difference is ----------
14:25:46  expected:<...mber & Comparable<?>[]\n
14:25:46 ----------\n
14:25:46 > but was:<...mber & Comparable<?>[ & Constable & ConstantDesc]\n
14:25:46 ----------\n
14:25:46 >
14:25:46   GenericTypeTest>TestCase.runTest:964->test1174:41130->AbstractRegressionTest.runNegativeTest:2487->AbstractRegressionTest.runNegativeTest:2498->AbstractRegressionTest.runTest:2933->AbstractRegressionTest.runTest:3140->AbstractRegressionTest.checkCompilerLog:1290->TestCase.assertEquals:242->TestCase.assertStringEquals:266 Invalid problem log .
14:25:46 ----------- Expected ------------
14:25:46 ----------\n
14:25:46 1. ERROR in X.java (at line 4)\n
14:25:46 	(b ? x1 : x2).field = (b ? x1 : x2).field;\n
14:25:46 	                      ^^^^^^^^^^^^^^^^^^^\n
14:25:46 Type mismatch: cannot convert from capture#2-of ? extends Number&Comparable<?> to capture#1-of ? extends Number&Comparable<?>\n
14:25:46 ----------\n
14:25:46 
14:25:46 ------------ but was ------------
14:25:46 ----------\n
14:25:46 1. ERROR in X.java (at line 4)\n
14:25:46 	(b ? x1 : x2).field = (b ? x1 : x2).field;\n
14:25:46 	                      ^^^^^^^^^^^^^^^^^^^\n
14:25:46 Type mismatch: cannot convert from capture#2-of ? extends Number&Comparable<?>&Constable&ConstantDesc to capture#1-of ? extends Number&Comparable<?>&Constable&ConstantDesc\n
14:25:46 ----------\n
14:25:46 
14:25:46 --------- Difference is ----------
14:25:46  expected:<...Number&Comparable<?>[ to capture#1-of ? extends Number&Comparable<?>]\n
14:25:46 ----------\n
14:25:46 > but was:<...Number&Comparable<?>[&Constable&ConstantDesc to capture#1-of ? extends Number&Comparable<?>&Constable&ConstantDesc]\n
14:25:46 ----------\n
14:25:46 >
14:25:46   GenericTypeTest>TestCase.runTest:964->test1174:41130->AbstractRegressionTest.runNegativeTest:2487->AbstractRegressionTest.runNegativeTest:2498->AbstractRegressionTest.runTest:2933->AbstractRegressionTest.runTest:3140->AbstractRegressionTest.checkCompilerLog:1290->TestCase.assertEquals:242->TestCase.assertStringEquals:266 Invalid problem log .
14:25:46 ----------- Expected ------------
14:25:46 ----------\n
14:25:46 1. ERROR in X.java (at line 4)\n
14:25:46 	(b ? x1 : x2).field = (b ? x1 : x2).field;\n
14:25:46 	                      ^^^^^^^^^^^^^^^^^^^\n
14:25:46 Type mismatch: cannot convert from capture#2-of ? extends Number & Comparable<?> to capture#1-of ? extends Number & Comparable<?>\n
14:25:46 ----------\n
14:25:46 
14:25:46 ------------ but was ------------
14:25:46 ----------\n
14:25:46 1. ERROR in X.java (at line 4)\n
14:25:46 	(b ? x1 : x2).field = (b ? x1 : x2).field;\n
14:25:46 	                      ^^^^^^^^^^^^^^^^^^^\n
14:25:46 Type mismatch: cannot convert from capture#2-of ? extends Number & Comparable<?> & Constable & ConstantDesc to capture#1-of ? extends Number & Comparable<?> & Constable & ConstantDesc\n
14:25:46 ----------\n
14:25:46 
14:25:46 --------- Difference is ----------
14:25:46  expected:<...ber & Comparable<?> [to capture#1-of ? extends Number & Comparable<?>]\n
14:25:46 ----------\n
14:25:46 > but was:<...ber & Comparable<?> [& Constable & ConstantDesc to capture#1-of ? extends Number & Comparable<?> & Constable & ConstantDesc]\n
14:25:46 ----------\n
14:25:46 >
14:25:46   GenericTypeTest>TestCase.runTest:964->test1174:41130->AbstractRegressionTest.runNegativeTest:2487->AbstractRegressionTest.runNegativeTest:2498->AbstractRegressionTest.runTest:2933->AbstractRegressionTest.runTest:3140->AbstractRegressionTest.checkCompilerLog:1290->TestCase.assertEquals:242->TestCase.assertStringEquals:266 Invalid problem log .
14:25:46 ----------- Expected ------------
14:25:46 ----------\n
14:25:46 1. ERROR in X.java (at line 4)\n
14:25:46 	(b ? x1 : x2).field = (b ? x1 : x2).field;\n
14:25:46 	                      ^^^^^^^^^^^^^^^^^^^\n
14:25:46 Type mismatch: cannot convert from capture#2-of ? extends Number & Comparable<?> to capture#1-of ? extends Number & Comparable<?>\n
14:25:46 ----------\n
14:25:46 
14:25:46 ------------ but was ------------
14:25:46 ----------\n
14:25:46 1. ERROR in X.java (at line 4)\n
14:25:46 	(b ? x1 : x2).field = (b ? x1 : x2).field;\n
14:25:46 	                      ^^^^^^^^^^^^^^^^^^^\n
14:25:46 Type mismatch: cannot convert from capture#2-of ? extends Number & Comparable<?> & Constable & ConstantDesc to capture#1-of ? extends Number & Comparable<?> & Constable & ConstantDesc\n
14:25:46 ----------\n
14:25:46 
14:25:46 --------- Difference is ----------
14:25:46  expected:<...ber & Comparable<?> [to capture#1-of ? extends Number & Comparable<?>]\n
14:25:46 ----------\n
14:25:46 > but was:<...ber & Comparable<?> [& Constable & ConstantDesc to capture#1-of ? extends Number & Comparable<?> & Constable & ConstantDesc]\n
14:25:46 ----------\n
14:25:46 >
14:25:46   GenericTypeTest>TestCase.runTest:964->test1341:47081->AbstractRegressionTest.runNegativeTest:2605->AbstractRegressionTest.runNegativeTest:2614->AbstractRegressionTest.runTest:2933->AbstractRegressionTest.runTest:3140->AbstractRegressionTest.checkCompilerLog:1290->TestCase.assertEquals:242->TestCase.assertStringEquals:266 Invalid problem log .
14:25:46 ----------- Expected ------------
14:25:46 ----------\n
14:25:46 1. ERROR in X.java (at line 6)\n
14:25:46 	foo((Collection<Number>) Arrays.asList(i, d));\n
14:25:46 	    ^^^^^^^^^^^^^^^^^^^^^^^^^^^^^^^^^^^^^^^^\n
14:25:46 Cannot cast from List<Number&Comparable<?>> to Collection<Number>\n
14:25:46 ----------\n
14:25:46 
14:25:46 ------------ but was ------------
14:25:46 ----------\n
14:25:46 1. ERROR in X.java (at line 6)\n
14:25:46 	foo((Collection<Number>) Arrays.asList(i, d));\n
14:25:46 	    ^^^^^^^^^^^^^^^^^^^^^^^^^^^^^^^^^^^^^^^^\n
14:25:46 Cannot cast from List<Number&Comparable<?>&Constable&ConstantDesc> to Collection<Number>\n
14:25:46 ----------\n
14:25:46 
14:25:46 --------- Difference is ----------
14:25:46  expected:<...Number&Comparable<?>[]> to Collection<Numb...> but was:<...Number&Comparable<?>[&Constable&ConstantDesc]> to Collection<Numb...>
14:25:46   GenericTypeTest>TestCase.runTest:964->test1341:47081->AbstractRegressionTest.runNegativeTest:2605->AbstractRegressionTest.runNegativeTest:2614->AbstractRegressionTest.runTest:2933->AbstractRegressionTest.runTest:3140->AbstractRegressionTest.checkCompilerLog:1290->TestCase.assertEquals:242->TestCase.assertStringEquals:266 Invalid problem log .
14:25:46 ----------- Expected ------------
14:25:46 ----------\n
14:25:46 1. ERROR in X.java (at line 6)\n
14:25:46 	foo((Collection<Number>) Arrays.asList(i, d));\n
14:25:46 	    ^^^^^^^^^^^^^^^^^^^^^^^^^^^^^^^^^^^^^^^^\n
14:25:46 Cannot cast from List<Number & Comparable<?>> to Collection<Number>\n
14:25:46 ----------\n
14:25:46 
14:25:46 ------------ but was ------------
14:25:46 ----------\n
14:25:46 1. ERROR in X.java (at line 6)\n
14:25:46 	foo((Collection<Number>) Arrays.asList(i, d));\n
14:25:46 	    ^^^^^^^^^^^^^^^^^^^^^^^^^^^^^^^^^^^^^^^^\n
14:25:46 Cannot cast from List<Number & Comparable<?> & Constable & ConstantDesc> to Collection<Number>\n
14:25:46 ----------\n
14:25:46 
14:25:46 --------- Difference is ----------
14:25:46  expected:<...mber & Comparable<?>[]> to Collection<Numb...> but was:<...mber & Comparable<?>[ & Constable & ConstantDesc]> to Collection<Numb...>
14:25:46   GenericTypeTest>TestCase.runTest:964->test1341:47081->AbstractRegressionTest.runNegativeTest:2605->AbstractRegressionTest.runNegativeTest:2614->AbstractRegressionTest.runTest:2933->AbstractRegressionTest.runTest:3140->AbstractRegressionTest.checkCompilerLog:1290->TestCase.assertEquals:242->TestCase.assertStringEquals:266 Invalid problem log .
14:25:46 ----------- Expected ------------
14:25:46 ----------\n
14:25:46 1. ERROR in X.java (at line 6)\n
14:25:46 	foo((Collection<Number>) Arrays.asList(i, d));\n
14:25:46 	    ^^^^^^^^^^^^^^^^^^^^^^^^^^^^^^^^^^^^^^^^\n
14:25:46 Cannot cast from List<Number & Comparable<?>> to Collection<Number>\n
14:25:46 ----------\n
14:25:46 
14:25:46 ------------ but was ------------
14:25:46 ----------\n
14:25:46 1. ERROR in X.java (at line 6)\n
14:25:46 	foo((Collection<Number>) Arrays.asList(i, d));\n
14:25:46 	    ^^^^^^^^^^^^^^^^^^^^^^^^^^^^^^^^^^^^^^^^\n
14:25:46 Cannot cast from List<Number & Comparable<?> & Constable & ConstantDesc> to Collection<Number>\n
14:25:46 ----------\n
14:25:46 
14:25:46 --------- Difference is ----------
14:25:46  expected:<...mber & Comparable<?>[]> to Collection<Numb...> but was:<...mber & Comparable<?>[ & Constable & ConstantDesc]> to Collection<Numb...>
14:25:46   GenericTypeTest>TestCase.runTest:964->test1363:47842->AbstractRegressionTest.runNegativeTest:2487->AbstractRegressionTest.runNegativeTest:2498->AbstractRegressionTest.runTest:2933->AbstractRegressionTest.runTest:3140->AbstractRegressionTest.checkCompilerLog:1290->TestCase.assertEquals:242->TestCase.assertStringEquals:266 Invalid problem log .
14:25:46 ----------- Expected ------------
14:25:46 ----------\n
14:25:46 1. ERROR in X.java (at line 7)\n
14:25:46 	int i = getValue(0, s);\n
14:25:46 	        ^^^^^^^^^^^^^^\n
14:25:46 Type mismatch: cannot convert from Comparable<capture#1-of ? extends Object&Comparable<?>&Serializable> to int\n
14:25:46 ----------\n
14:25:46 
14:25:46 ------------ but was ------------
14:25:46 ----------\n
14:25:46 1. ERROR in X.java (at line 7)\n
14:25:46 	int i = getValue(0, s);\n
14:25:46 	        ^^^^^^^^^^^^^^\n
14:25:46 Type mismatch: cannot convert from Comparable<capture#1-of ? extends Object&Comparable<?>&Constable&ConstantDesc&Serializable> to int\n
14:25:46 ----------\n
14:25:46 
14:25:46 --------- Difference is ----------
14:25:46  expected:<...bject&Comparable<?>&[]Serializable> to int...> but was:<...bject&Comparable<?>&[Constable&ConstantDesc&]Serializable> to int...>
14:25:46   GenericTypeTest>TestCase.runTest:964->test1363:47842->AbstractRegressionTest.runNegativeTest:2487->AbstractRegressionTest.runNegativeTest:2498->AbstractRegressionTest.runTest:2933->AbstractRegressionTest.runTest:3140->AbstractRegressionTest.checkCompilerLog:1290->TestCase.assertEquals:242->TestCase.assertStringEquals:266 Invalid problem log .
14:25:46 ----------- Expected ------------
14:25:46 ----------\n
14:25:46 1. ERROR in X.java (at line 7)\n
14:25:46 	int i = getValue(0, s);\n
14:25:46 	        ^^^^^^^^^^^^^^\n
14:25:46 Type mismatch: cannot convert from Comparable<capture#1-of ? extends Object & Comparable<?> & Serializable> to int\n
14:25:46 ----------\n
14:25:46 
14:25:46 ------------ but was ------------
14:25:46 ----------\n
14:25:46 1. ERROR in X.java (at line 7)\n
14:25:46 	int i = getValue(0, s);\n
14:25:46 	        ^^^^^^^^^^^^^^\n
14:25:46 Type mismatch: cannot convert from Comparable<capture#1-of ? extends Object & Comparable<?> & Constable & ConstantDesc & Serializable> to int\n
14:25:46 ----------\n
14:25:46 
14:25:46 --------- Difference is ----------
14:25:46  expected:<...t & Comparable<?> & []Serializable> to int...> but was:<...t & Comparable<?> & [Constable & ConstantDesc & ]Serializable> to int...>
14:25:46   GenericTypeTest>TestCase.runTest:964->test1363:47842->AbstractRegressionTest.runNegativeTest:2487->AbstractRegressionTest.runNegativeTest:2498->AbstractRegressionTest.runTest:2933->AbstractRegressionTest.runTest:3140->AbstractRegressionTest.checkCompilerLog:1290->TestCase.assertEquals:242->TestCase.assertStringEquals:266 Invalid problem log .
14:25:46 ----------- Expected ------------
14:25:46 ----------\n
14:25:46 1. ERROR in X.java (at line 7)\n
14:25:46 	int i = getValue(0, s);\n
14:25:46 	        ^^^^^^^^^^^^^^\n
14:25:46 Type mismatch: cannot convert from Comparable<capture#1-of ? extends Object & Comparable<?> & Serializable> to int\n
14:25:46 ----------\n
14:25:46 
14:25:46 ------------ but was ------------
14:25:46 ----------\n
14:25:46 1. ERROR in X.java (at line 7)\n
14:25:46 	int i = getValue(0, s);\n
14:25:46 	        ^^^^^^^^^^^^^^\n
14:25:46 Type mismatch: cannot convert from Comparable<capture#1-of ? extends Object & Comparable<?> & Constable & ConstantDesc & Serializable> to int\n
14:25:46 ----------\n
14:25:46 
14:25:46 --------- Difference is ----------
14:25:46  expected:<...t & Comparable<?> & []Serializable> to int...> but was:<...t & Comparable<?> & [Constable & ConstantDesc & ]Serializable> to int...>
14:25:46   GenericTypeTest>TestCase.runTest:964->test1441:50699->AbstractRegressionTest.runNegativeTest:2487->AbstractRegressionTest.runNegativeTest:2498->AbstractRegressionTest.runTest:2933->AbstractRegressionTest.runTest:3140->AbstractRegressionTest.checkCompilerLog:1290->TestCase.assertEquals:242->TestCase.assertStringEquals:266 Invalid problem log .
14:25:46 ----------- Expected ------------
14:25:46 ----------\n
14:25:46 1. ERROR in X.java (at line 4)\n
14:25:46 	(x1 != null ? x1 : x2).bar(new Object());\n
14:25:46 	                       ^^^\n
14:25:46 The method bar(capture#4-of ? extends Object&Serializable&Comparable<? extends Object&Serializable&Comparable<?>>) in the type X<capture#4-of ? extends Object&Serializable&Comparable<? extends Object&Serializable&Comparable<?>>> is not applicable for the arguments (Object)\n
14:25:46 ----------\n
14:25:46 
14:25:46 ------------ but was ------------
14:25:46 ----------\n
14:25:46 1. ERROR in X.java (at line 4)\n
14:25:46 	(x1 != null ? x1 : x2).bar(new Object());\n
14:25:46 	                       ^^^\n
14:25:46 The method bar(capture#4-of ? extends Object&Serializable&Comparable<? extends Object&Serializable&Comparable<?>&Constable&ConstantDesc>&Constable&ConstantDesc) in the type X<capture#4-of ? extends Object&Serializable&Comparable<? extends Object&Serializable&Comparable<?>&Constable&ConstantDesc>&Constable&ConstantDesc> is not applicable for the arguments (Object)\n
14:25:46 ----------\n
14:25:46 
14:25:46 --------- Difference is ----------
14:25:46  expected:<...izable&Comparable<?>[>) in the type X<capture#4-of ? extends Object&Serializable&Comparable<? extends Object&Serializable&Comparable<?>>]> is not applicable ...> but was:<...izable&Comparable<?>[&Constable&ConstantDesc>&Constable&ConstantDesc) in the type X<capture#4-of ? extends Object&Serializable&Comparable<? extends Object&Serializable&Comparable<?>&Constable&ConstantDesc>&Constable&ConstantDesc]> is not applicable ...>
14:25:46   GenericTypeTest>TestCase.runTest:964->test1441:50699->AbstractRegressionTest.runNegativeTest:2487->AbstractRegressionTest.runNegativeTest:2498->AbstractRegressionTest.runTest:2933->AbstractRegressionTest.runTest:3140->AbstractRegressionTest.checkCompilerLog:1290->TestCase.assertEquals:242->TestCase.assertStringEquals:266 Invalid problem log .
14:25:46 ----------- Expected ------------
14:25:46 ----------\n
14:25:46 1. ERROR in X.java (at line 4)\n
14:25:46 	(x1 != null ? x1 : x2).bar(new Object());\n
14:25:46 	                       ^^^\n
14:25:46 The method bar(capture#4-of ? extends Object & Serializable & Comparable<? extends Object & Serializable & Comparable<?>>) in the type X<capture#4-of ? extends Object & Serializable & Comparable<? extends Object & Serializable & Comparable<?>>> is not applicable for the arguments (Object)\n
14:25:46 ----------\n
14:25:46 
14:25:46 ------------ but was ------------
14:25:46 ----------\n
14:25:46 1. ERROR in X.java (at line 4)\n
14:25:46 	(x1 != null ? x1 : x2).bar(new Object());\n
14:25:46 	                       ^^^\n
14:25:46 The method bar(capture#4-of ? extends Object & Serializable & Comparable<? extends Object & Serializable & Comparable<?> & Constable & ConstantDesc> & Constable & ConstantDesc) in the type X<capture#4-of ? extends Object & Serializable & Comparable<? extends Object & Serializable & Comparable<?> & Constable & ConstantDesc> & Constable & ConstantDesc> is not applicable for the arguments (Object)\n
14:25:46 ----------\n
14:25:46 
14:25:46 --------- Difference is ----------
14:25:46  expected:<...able & Comparable<?>[>) in the type X<capture#4-of ? extends Object & Serializable & Comparable<? extends Object & Serializable & Comparable<?>>]> is not applicable ...> but was:<...able & Comparable<?>[ & Constable & ConstantDesc> & Constable & ConstantDesc) in the type X<capture#4-of ? extends Object & Serializable & Comparable<? extends Object & Serializable & Comparable<?> & Constable & ConstantDesc> & Constable & ConstantDesc]> is not applicable ...>
14:25:46   GenericTypeTest>TestCase.runTest:964->test1441:50699->AbstractRegressionTest.runNegativeTest:2487->AbstractRegressionTest.runNegativeTest:2498->AbstractRegressionTest.runTest:2933->AbstractRegressionTest.runTest:3140->AbstractRegressionTest.checkCompilerLog:1290->TestCase.assertEquals:242->TestCase.assertStringEquals:266 Invalid problem log .
14:25:46 ----------- Expected ------------
14:25:46 ----------\n
14:25:46 1. ERROR in X.java (at line 4)\n
14:25:46 	(x1 != null ? x1 : x2).bar(new Object());\n
14:25:46 	                       ^^^\n
14:25:46 The method bar(capture#4-of ? extends Object & Serializable & Comparable<? extends Object & Serializable & Comparable<?>>) in the type X<capture#4-of ? extends Object & Serializable & Comparable<? extends Object & Serializable & Comparable<?>>> is not applicable for the arguments (Object)\n
14:25:46 ----------\n
14:25:46 
14:25:46 ------------ but was ------------
14:25:46 ----------\n
14:25:46 1. ERROR in X.java (at line 4)\n
14:25:46 	(x1 != null ? x1 : x2).bar(new Object());\n
14:25:46 	                       ^^^\n
14:25:46 The method bar(capture#4-of ? extends Object & Serializable & Comparable<? extends Object & Serializable & Comparable<?> & Constable & ConstantDesc> & Constable & ConstantDesc) in the type X<capture#4-of ? extends Object & Serializable & Comparable<? extends Object & Serializable & Comparable<?> & Constable & ConstantDesc> & Constable & ConstantDesc> is not applicable for the arguments (Object)\n
14:25:46 ----------\n
14:25:46 
14:25:46 --------- Difference is ----------
14:25:46  expected:<...able & Comparable<?>[>) in the type X<capture#4-of ? extends Object & Serializable & Comparable<? extends Object & Serializable & Comparable<?>>]> is not applicable ...> but was:<...able & Comparable<?>[ & Constable & ConstantDesc> & Constable & ConstantDesc) in the type X<capture#4-of ? extends Object & Serializable & Comparable<? extends Object & Serializable & Comparable<?> & Constable & ConstantDesc> & Constable & ConstantDesc]> is not applicable ...>
14:25:46   JEP286Test>TestCase.runTest:964->test0018_project_variable_types:553->AbstractRegressionTest.runConformTest:1674->AbstractRegressionTest.runTest:3122->assertInferredType:91 Type of variable c_IntLongFloat expected:<...mber & Comparable<?>[]> but was:<...mber & Comparable<?>[ & java.lang.constant.Constable & java.lang.constant.ConstantDesc]>
14:25:46   ModuleCompilationTests>TestCase.runTest:964->testReleaseOption10:4098->AbstractBatchCompilerTest.runNegativeTest:500->AbstractBatchCompilerTest.runTest:654->TestCase.assertEquals:242->TestCase.assertStringEquals:266 Unexpected error output for invocation with arguments ["/tmp/genie.jdt/comptest/run.1562349476555/regression/X.java" --release 6 -d "/tmp/genie.jdt/comptest/run.1562349476555/regression"].
14:25:46 ----------- Expected ------------
14:25:46 ----------\n
14:25:46 1. ERROR in ---OUTPUT_DIR_PLACEHOLDER---/X.java (at line 9)\n
14:25:46 	} catch(IOException | FileNotFoundException e) {\n
14:25:46 	        ^^^^^^^^^^^^^^^^^^^^^^^^^^^^^^^^^^^\n
14:25:46 Multi-catch parameters are not allowed for source level below 1.7\n
14:25:46 ----------\n
14:25:46 2. ERROR in ---OUTPUT_DIR_PLACEHOLDER---/X.java (at line 9)\n
14:25:46 	} catch(IOException | FileNotFoundException e) {\n
14:25:46 	                      ^^^^^^^^^^^^^^^^^^^^^\n
14:25:46 The exception FileNotFoundException is already caught by the alternative IOException\n
14:25:46 ----------\n
14:25:46 2 problems (2 errors)\n
14:25:46 
14:25:46 ------------ but was ------------
14:25:46 release 6 is not found in the system\n
14:25:46 
14:25:46 --------- Difference is ----------
14:25:46  expected:<[----------\n
14:25:46 1. ERROR in ---OUTPUT_DIR_PLACEHOLDER---/X.java (at line 9)\n
14:25:46 	} catch(IOException | FileNotFoundException e) {\n
14:25:46 	        ^^^^^^^^^^^^^^^^^^^^^^^^^^^^^^^^^^^\n
14:25:46 Multi-catch parameters are not allowed for source level below 1.7\n
14:25:46 ----------\n
14:25:46 2. ERROR in ---OUTPUT_DIR_PLACEHOLDER---/X.java (at line 9)\n
14:25:46 	} catch(IOException | FileNotFoundException e) {\n
14:25:46 	                      ^^^^^^^^^^^^^^^^^^^^^\n
14:25:46 The exception FileNotFoundException is already caught by the alternative IOException\n
14:25:46 ----------\n
14:25:46 2 problems (2 errors)]\n
14:25:46 > but was:<[release 6 is not found in the system]\n
14:25:46 >
14:25:46   NullAnnotationTest>TestCase.runTest:964->testBug542707_001:10372->AbstractNullAnnotationTest.runNegativeTestWithLibs:175->AbstractNullAnnotationTest.runNegativeTestWithLibs:153->AbstractNullAnnotationTest.runNegativeTestWithLibs:164->AbstractRegressionTest.runNegativeTest:3520->AbstractRegressionTest.runTest:2933->AbstractRegressionTest.runTest:3140->AbstractRegressionTest.checkCompilerLog:1290->TestCase.assertEquals:242->TestCase.assertStringEquals:266 Invalid problem log .
14:25:46 ----------- Expected ------------
14:25:46 ----------\n
14:25:46 1. ERROR in X.java (at line 12)\n
14:25:46 	x = null;\n
14:25:46 	    ^^^^\n
14:25:46 Null type mismatch: required '@NonNull X' but the provided value is null\n
14:25:46 ----------\n
14:25:46 2. ERROR in X.java (at line 15)\n
14:25:46 	default -> null;\n
14:25:46 	           ^^^^\n
14:25:46 Null type mismatch: required '@NonNull X' but the provided value is null\n
14:25:46 ----------\n
14:25:46 
14:25:46 ------------ but was ------------
14:25:46 ----------\n
14:25:46 1. ERROR in X.java (at line 15)\n
14:25:46 	default -> null;\n
14:25:46 	^^^^^^^\n
14:25:46 The preview feature Case Labels with '->' is only available with source level 13 and above\n
14:25:46 ----------\n
14:25:46 
14:25:46 --------- Difference is ----------
14:25:46  expected:<...in X.java (at line 1[2)\n
14:25:46 	x = null;\n
14:25:46 	    ^^^^\n
14:25:46 Null type mismatch: required '@NonNull X' but the provided value is null\n
14:25:46 ----------\n
14:25:46 2. ERROR in X.java (at line 15)\n
14:25:46 	default -> null;\n
14:25:46 	           ^^^^\n
14:25:46 Null type mismatch: required '@NonNull X' but the provided value is null]\n
14:25:46 ----------\n
14:25:46 > but was:<...in X.java (at line 1[5)\n
14:25:46 	default -> null;\n
14:25:46 	^^^^^^^\n
14:25:46 The preview feature Case Labels with '->' is only available with source level 13 and above]\n
14:25:46 ----------\n
14:25:46 >
14:25:46   ResourceLeakTests>TestCase.runTest:964->testBug542707_001:5506->runLeakTest:75->AbstractRegressionTest.runNegativeTest:2695->AbstractRegressionTest.runTest:2933->AbstractRegressionTest.runTest:3140->AbstractRegressionTest.checkCompilerLog:1290->TestCase.assertEquals:242->TestCase.assertStringEquals:266 Invalid problem log .
14:25:46 ----------- Expected ------------
14:25:46 ----------\n
14:25:46 1. ERROR in X.java (at line 31)\n
14:25:46 	Zork();\n
14:25:46 	^^^^\n
14:25:46 The method Zork() is undefined for the type X\n
14:25:46 ----------\n
14:25:46 
14:25:46 ------------ but was ------------
14:25:46 ----------\n
14:25:46 1. ERROR in X.java (at line 12)\n
14:25:46 	break x;\n
14:25:46 	^^^^^^^^\n
14:25:46 The label x is missing\n
14:25:46 ----------\n
14:25:46 2. ERROR in X.java (at line 31)\n
14:25:46 	Zork();\n
14:25:46 	^^^^\n
14:25:46 The method Zork() is undefined for the type X\n
14:25:46 ----------\n
14:25:46 
14:25:46 --------- Difference is ----------
14:25:46  expected:<... in X.java (at line []31)\n
14:25:46 	Zork();\n
14:25:46 	^^...> but was:<... in X.java (at line [12)\n
14:25:46 	break x;\n
14:25:46 	^^^^^^^^\n
14:25:46 The label x is missing\n
14:25:46 ----------\n
14:25:46 2. ERROR in X.java (at line ]31)\n
14:25:46 	Zork();\n
14:25:46 	^^...>
14:25:46   ResourceLeakTests>TestCase.runTest:964->testBug542707_002:5558->runLeakTest:75->AbstractRegressionTest.runNegativeTest:2695->AbstractRegressionTest.runTest:2933->AbstractRegressionTest.runTest:3140->AbstractRegressionTest.checkCompilerLog:1290->TestCase.assertEquals:242->TestCase.assertStringEquals:266 Invalid problem log .
14:25:46 ----------- Expected ------------
14:25:46 ----------\n
14:25:46 1. ERROR in X.java (at line 12)\n
14:25:46 	x = new X();\n
14:25:46 	^^^^^^^^^^^\n
14:25:46 Resource leak: 'x' is not closed at this location\n
14:25:46 ----------\n
14:25:46 2. ERROR in X.java (at line 32)\n
14:25:46 	Zork();\n
14:25:46 	^^^^\n
14:25:46 The method Zork() is undefined for the type X\n
14:25:46 ----------\n
14:25:46 
14:25:46 ------------ but was ------------
14:25:46 ----------\n
14:25:46 1. ERROR in X.java (at line 12)\n
14:25:46 	x = new X();\n
14:25:46 	^^^^^^^^^^^\n
14:25:46 Resource leak: 'x' is not closed at this location\n
14:25:46 ----------\n
14:25:46 2. ERROR in X.java (at line 13)\n
14:25:46 	break x;\n
14:25:46 	^^^^^^^^\n
14:25:46 The label x is missing\n
14:25:46 ----------\n
14:25:46 3. ERROR in X.java (at line 32)\n
14:25:46 	Zork();\n
14:25:46 	^^^^\n
14:25:46 The method Zork() is undefined for the type X\n
14:25:46 ----------\n
14:25:46 
14:25:46 --------- Difference is ----------
14:25:46  expected:<... in X.java (at line []32)\n
14:25:46 	Zork();\n
14:25:46 	^^...> but was:<... in X.java (at line [13)\n
14:25:46 	break x;\n
14:25:46 	^^^^^^^^\n
14:25:46 The label x is missing\n
14:25:46 ----------\n
14:25:46 3. ERROR in X.java (at line ]32)\n
14:25:46 	Zork();\n
14:25:46 	^^...>
14:25:46   ResourceLeakTests>TestCase.runTest:964->testBug542707_003:5616->runLeakTest:75->AbstractRegressionTest.runNegativeTest:2695->AbstractRegressionTest.runTest:2933->AbstractRegressionTest.runTest:3140->AbstractRegressionTest.checkCompilerLog:1290->TestCase.assertEquals:242->TestCase.assertStringEquals:266 Invalid problem log .
14:25:46 ----------- Expected ------------
14:25:46 ----------\n
14:25:46 1. ERROR in X.java (at line 10)\n
14:25:46 	x  = switch (i) { \n
14:25:46 			  case 1  ->   {\n
14:25:46 				 break new X();\n
14:25:46 			  }\n
14:25:46 			  default -> x;\n
14:25:46 			};\n
14:25:46 	^^^^^^^^^^^^^^^^^^^^^^^^^^^^^^^^^^^^^^^^^^^^^^^^^^^^^^^^^^^^^^^^^^^^^^^^^^^^^^^^^^^^^^^^^\n
14:25:46 Resource leak: 'x' is not closed at this location\n
14:25:46 ----------\n
14:25:46 2. ERROR in X.java (at line 31)\n
14:25:46 	Zork();\n
14:25:46 	^^^^\n
14:25:46 The method Zork() is undefined for the type X\n
14:25:46 ----------\n
14:25:46 
14:25:46 ------------ but was ------------
14:25:46 ----------\n
14:25:46 1. ERROR in X.java (at line 12)\n
14:25:46 	break new X();\n
14:25:46 	^^^^^\n
14:25:46 Syntax error on token "break", ; expected after this token\n
14:25:46 ----------\n
14:25:46 2. ERROR in X.java (at line 31)\n
14:25:46 	Zork();\n
14:25:46 	^^^^\n
14:25:46 The method Zork() is undefined for the type X\n
14:25:46 ----------\n
14:25:46 
14:25:46 --------- Difference is ----------
14:25:46  expected:<...in X.java (at line 1[0)\n
14:25:46 	x  = switch (i) { \n
14:25:46 			  case 1  ->   {\n
14:25:46 				 break new X();\n
14:25:46 			  }\n
14:25:46 			  default -> x;\n
14:25:46 			};\n
14:25:46 	^^^^^^^^^^^^^^^^^^^^^^^^^^^^^^^^^^^^^^^^^^^^^^^^^^^^^^^^^^^^^^^^^^^^^^^^^^^^^^^^^^^^^^^^^\n
14:25:46 Resource leak: 'x' is not closed at this locatio]n\n
14:25:46 ----------\n
14:25:46 2. ...> but was:<...in X.java (at line 1[2)\n
14:25:46 	break new X();\n
14:25:46 	^^^^^\n
14:25:46 Syntax error on token "break", ; expected after this toke]n\n
14:25:46 ----------\n
14:25:46 2. ...>
14:25:46   ScannerTest>TestCase.runTest:964->testBug531716_001_since_13_1:1539
14:25:46   ScannerTest>TestCase.runTest:964->testBug531716_001_since_13_1:1539
14:25:46   ScannerTest>TestCase.runTest:964->testBug531716_001_since_13_1:1539
14:25:46   ScannerTest>TestCase.runTest:964->testBug531716_001_since_13_1:1539
14:25:46   SwitchExpressionTest>TestCase.runTest:964->testBug543240_1:652->AbstractRegressionTest.runConformTest:1753->AbstractRegressionTest.runTest:2933->AbstractRegressionTest.runTest:3192->TestCase.assertEquals:242->TestCase.assertStringEquals:266 Unexpected error running resulting class file for X.java:
14:25:46 --[START]--
14:25:46 Error: LinkageError occurred while loading main class X
14:25:46 	java.lang.UnsupportedClassVersionError: X (class file version 56.65535) was compiled with preview features that are unsupported. This version of the Java Runtime only recognizes preview features for class file version 57.65535
14:25:46 ---[END]---
14:25:46 .
14:25:46 ----------- Expected ------------
14:25:46 
14:25:46 ------------ but was ------------
14:25:46 Error: LinkageError occurred while loading main class X\n
14:25:46 	java.lang.UnsupportedClassVersionError: X (class file version 56.65535) was compiled with preview features that are unsupported. This version of the Java Runtime only recognizes preview features for class file version 57.65535\n
14:25:46 
14:25:46 --------- Difference is ----------
14:25:46  expected:<[]> but was:<[Error: LinkageError occurred while loading main class X\n
14:25:46 	java.lang.UnsupportedClassVersionError: X (class file version 56.65535) was compiled with preview features that are unsupported. This version of the Java Runtime only recognizes preview features for class file version 57.65535\n
14:25:46 ]>
14:25:46   SwitchExpressionTest>TestCase.runTest:964->testBug543240_10:1110->AbstractRegressionTest.runNegativeTest:2614->AbstractRegressionTest.runTest:2933->AbstractRegressionTest.runTest:3192->TestCase.assertEquals:242->TestCase.assertStringEquals:266 Unexpected error running resulting class file for X.java:
14:25:46 --[START]--
14:25:46 Error: LinkageError occurred while loading main class X
14:25:46 	java.lang.UnsupportedClassVersionError: X (class file version 56.65535) was compiled with preview features that are unsupported. This version of the Java Runtime only recognizes preview features for class file version 57.65535
14:25:46 ---[END]---
14:25:46 .
14:25:46 ----------- Expected ------------
14:25:46 
14:25:46 ------------ but was ------------
14:25:46 Error: LinkageError occurred while loading main class X\n
14:25:46 	java.lang.UnsupportedClassVersionError: X (class file version 56.65535) was compiled with preview features that are unsupported. This version of the Java Runtime only recognizes preview features for class file version 57.65535\n
14:25:46 
14:25:46 --------- Difference is ----------
14:25:46  expected:<[]> but was:<[Error: LinkageError occurred while loading main class X\n
14:25:46 	java.lang.UnsupportedClassVersionError: X (class file version 56.65535) was compiled with preview features that are unsupported. This version of the Java Runtime only recognizes preview features for class file version 57.65535\n
14:25:46 ]>
14:25:46   SwitchExpressionTest>TestCase.runTest:964->testBug543240_11:1148->AbstractRegressionTest.runNegativeTest:2614->AbstractRegressionTest.runTest:2933->AbstractRegressionTest.runTest:3192->TestCase.assertEquals:242->TestCase.assertStringEquals:266 Unexpected error running resulting class file for X.java:
14:25:46 --[START]--
14:25:46 Error: LinkageError occurred while loading main class X
14:25:46 	java.lang.UnsupportedClassVersionError: X (class file version 56.65535) was compiled with preview features that are unsupported. This version of the Java Runtime only recognizes preview features for class file version 57.65535
14:25:46 ---[END]---
14:25:46 .
14:25:46 ----------- Expected ------------
14:25:46 
14:25:46 ------------ but was ------------
14:25:46 Error: LinkageError occurred while loading main class X\n
14:25:46 	java.lang.UnsupportedClassVersionError: X (class file version 56.65535) was compiled with preview features that are unsupported. This version of the Java Runtime only recognizes preview features for class file version 57.65535\n
14:25:46 
14:25:46 --------- Difference is ----------
14:25:46  expected:<[]> but was:<[Error: LinkageError occurred while loading main class X\n
14:25:46 	java.lang.UnsupportedClassVersionError: X (class file version 56.65535) was compiled with preview features that are unsupported. This version of the Java Runtime only recognizes preview features for class file version 57.65535\n
14:25:46 ]>
14:25:46   SwitchExpressionTest>TestCase.runTest:964->testBug543240_15:1295->AbstractRegressionTest.runNegativeTest:2605->AbstractRegressionTest.runNegativeTest:2614->AbstractRegressionTest.runTest:2933->AbstractRegressionTest.runTest:3140->AbstractRegressionTest.checkCompilerLog:1290->TestCase.assertEquals:242->TestCase.assertStringEquals:266 Invalid problem log .
14:25:46 ----------- Expected ------------
14:25:46 ----------\n
14:25:46 1. ERROR in X.java (at line 5)\n
14:25:46 	default -> j;\n
14:25:46 	           ^\n
14:25:46 The local variable j may not have been initialized\n
14:25:46 ----------\n
14:25:46 
14:25:46 ------------ but was ------------
14:25:46 ----------\n
14:25:46 1. ERROR in X.java (at line 5)\n
14:25:46 	default -> j;\n
14:25:46 	^^^^^^^\n
14:25:46 The preview feature Case Labels with '->' is only available with source level 13 and above\n
14:25:46 ----------\n
14:25:46 
14:25:46 --------- Difference is ----------
14:25:46  expected:<...n
14:25:46 	default -> j;\n
14:25:46 	[           ^\n
14:25:46 The local variable j may not have been initialized]\n
14:25:46 ----------\n
14:25:46 > but was:<...n
14:25:46 	default -> j;\n
14:25:46 	[^^^^^^^\n
14:25:46 The preview feature Case Labels with '->' is only available with source level 13 and above]\n
14:25:46 ----------\n
14:25:46 >
14:25:46   SwitchExpressionTest>TestCase.runTest:964->testBug543240_16:1320->AbstractRegressionTest.runNegativeTest:2614->AbstractRegressionTest.runTest:2933->AbstractRegressionTest.runTest:3140->AbstractRegressionTest.checkCompilerLog:1290->TestCase.assertEquals:242->TestCase.assertStringEquals:266 Invalid problem log .
14:25:46 ----------- Expected ------------
14:25:46 
14:25:46 ------------ but was ------------
14:25:46 ----------\n
14:25:46 1. ERROR in X.java (at line 7)\n
14:25:46 	default -> j;\n
14:25:46 	^^^^^^^\n
14:25:46 The preview feature Case Labels with '->' is only available with source level 13 and above\n
14:25:46 ----------\n
14:25:46 
14:25:46 --------- Difference is ----------
14:25:46  expected:<[]> but was:<[----------\n
14:25:46 1. ERROR in X.java (at line 7)\n
14:25:46 	default -> j;\n
14:25:46 	^^^^^^^\n
14:25:46 The preview feature Case Labels with '->' is only available with source level 13 and above\n
14:25:46 ----------\n
14:25:46 ]>
14:25:46   SwitchExpressionTest>TestCase.runTest:964->testBug543240_1a:690->AbstractRegressionTest.runNegativeTest:2614->AbstractRegressionTest.runTest:2933->AbstractRegressionTest.runTest:3192->TestCase.assertEquals:242->TestCase.assertStringEquals:266 Unexpected error running resulting class file for X.java:
14:25:46 --[START]--
14:25:46 Error: LinkageError occurred while loading main class X
14:25:46 	java.lang.UnsupportedClassVersionError: X (class file version 56.65535) was compiled with preview features that are unsupported. This version of the Java Runtime only recognizes preview features for class file version 57.65535
14:25:46 ---[END]---
14:25:46 .
14:25:46 ----------- Expected ------------
14:25:46 
14:25:46 ------------ but was ------------
14:25:46 Error: LinkageError occurred while loading main class X\n
14:25:46 	java.lang.UnsupportedClassVersionError: X (class file version 56.65535) was compiled with preview features that are unsupported. This version of the Java Runtime only recognizes preview features for class file version 57.65535\n
14:25:46 
14:25:46 --------- Difference is ----------
14:25:46  expected:<[]> but was:<[Error: LinkageError occurred while loading main class X\n
14:25:46 	java.lang.UnsupportedClassVersionError: X (class file version 56.65535) was compiled with preview features that are unsupported. This version of the Java Runtime only recognizes preview features for class file version 57.65535\n
14:25:46 ]>
14:25:46   SwitchExpressionTest>TestCase.runTest:964->testBug543240_3:829->AbstractRegressionTest.runNegativeTest:2614->AbstractRegressionTest.runTest:2933->AbstractRegressionTest.runTest:3192->TestCase.assertEquals:242->TestCase.assertStringEquals:266 Unexpected error running resulting class file for X.java:
14:25:46 --[START]--
14:25:46 Error: LinkageError occurred while loading main class X
14:25:46 	java.lang.UnsupportedClassVersionError: X (class file version 56.65535) was compiled with preview features that are unsupported. This version of the Java Runtime only recognizes preview features for class file version 57.65535
14:25:46 ---[END]---
14:25:46 .
14:25:46 ----------- Expected ------------
14:25:46 
14:25:46 ------------ but was ------------
14:25:46 Error: LinkageError occurred while loading main class X\n
14:25:46 	java.lang.UnsupportedClassVersionError: X (class file version 56.65535) was compiled with preview features that are unsupported. This version of the Java Runtime only recognizes preview features for class file version 57.65535\n
14:25:46 
14:25:46 --------- Difference is ----------
14:25:46  expected:<[]> but was:<[Error: LinkageError occurred while loading main class X\n
14:25:46 	java.lang.UnsupportedClassVersionError: X (class file version 56.65535) was compiled with preview features that are unsupported. This version of the Java Runtime only recognizes preview features for class file version 57.65535\n
14:25:46 ]>
14:25:46   SwitchExpressionTest>TestCase.runTest:964->testBug543240_4:866->AbstractRegressionTest.runConformTest:1753->AbstractRegressionTest.runTest:2933->AbstractRegressionTest.runTest:3192->TestCase.assertEquals:242->TestCase.assertStringEquals:266 Unexpected error running resulting class file for X.java:
14:25:46 --[START]--
14:25:46 Error: LinkageError occurred while loading main class X
14:25:46 	java.lang.UnsupportedClassVersionError: X (class file version 56.65535) was compiled with preview features that are unsupported. This version of the Java Runtime only recognizes preview features for class file version 57.65535
14:25:46 ---[END]---
14:25:46 .
14:25:46 ----------- Expected ------------
14:25:46 
14:25:46 ------------ but was ------------
14:25:46 Error: LinkageError occurred while loading main class X\n
14:25:46 	java.lang.UnsupportedClassVersionError: X (class file version 56.65535) was compiled with preview features that are unsupported. This version of the Java Runtime only recognizes preview features for class file version 57.65535\n
14:25:46 
14:25:46 --------- Difference is ----------
14:25:46  expected:<[]> but was:<[Error: LinkageError occurred while loading main class X\n
14:25:46 	java.lang.UnsupportedClassVersionError: X (class file version 56.65535) was compiled with preview features that are unsupported. This version of the Java Runtime only recognizes preview features for class file version 57.65535\n
14:25:46 ]>
14:25:46   SwitchExpressionTest>TestCase.runTest:964->testBug543240_5:908->AbstractRegressionTest.runConformTest:1753->AbstractRegressionTest.runTest:2933->AbstractRegressionTest.runTest:3192->TestCase.assertEquals:242->TestCase.assertStringEquals:266 Unexpected error running resulting class file for X.java:
14:25:46 --[START]--
14:25:46 Error: LinkageError occurred while loading main class X
14:25:46 	java.lang.UnsupportedClassVersionError: X (class file version 56.65535) was compiled with preview features that are unsupported. This version of the Java Runtime only recognizes preview features for class file version 57.65535
14:25:46 ---[END]---
14:25:46 .
14:25:46 ----------- Expected ------------
14:25:46 
14:25:46 ------------ but was ------------
14:25:46 Error: LinkageError occurred while loading main class X\n
14:25:46 	java.lang.UnsupportedClassVersionError: X (class file version 56.65535) was compiled with preview features that are unsupported. This version of the Java Runtime only recognizes preview features for class file version 57.65535\n
14:25:46 
14:25:46 --------- Difference is ----------
14:25:46  expected:<[]> but was:<[Error: LinkageError occurred while loading main class X\n
14:25:46 	java.lang.UnsupportedClassVersionError: X (class file version 56.65535) was compiled with preview features that are unsupported. This version of the Java Runtime only recognizes preview features for class file version 57.65535\n
14:25:46 ]>
14:25:46   SwitchExpressionTest>TestCase.runTest:964->testBug543240_6:946->AbstractRegressionTest.runConformTest:1753->AbstractRegressionTest.runTest:2933->AbstractRegressionTest.runTest:3192->TestCase.assertEquals:242->TestCase.assertStringEquals:266 Unexpected error running resulting class file for X.java:
14:25:46 --[START]--
14:25:46 Error: LinkageError occurred while loading main class X
14:25:46 	java.lang.UnsupportedClassVersionError: X (class file version 56.65535) was compiled with preview features that are unsupported. This version of the Java Runtime only recognizes preview features for class file version 57.65535
14:25:46 ---[END]---
14:25:46 .
14:25:46 ----------- Expected ------------
14:25:46 
14:25:46 ------------ but was ------------
14:25:46 Error: LinkageError occurred while loading main class X\n
14:25:46 	java.lang.UnsupportedClassVersionError: X (class file version 56.65535) was compiled with preview features that are unsupported. This version of the Java Runtime only recognizes preview features for class file version 57.65535\n
14:25:46 
14:25:46 --------- Difference is ----------
14:25:46  expected:<[]> but was:<[Error: LinkageError occurred while loading main class X\n
14:25:46 	java.lang.UnsupportedClassVersionError: X (class file version 56.65535) was compiled with preview features that are unsupported. This version of the Java Runtime only recognizes preview features for class file version 57.65535\n
14:25:46 ]>
14:25:46   SwitchExpressionTest>TestCase.runTest:964->testBug543240_7:988->AbstractRegressionTest.runConformTest:1753->AbstractRegressionTest.runTest:2933->AbstractRegressionTest.runTest:3192->TestCase.assertEquals:242->TestCase.assertStringEquals:266 Unexpected error running resulting class file for X.java:
14:25:46 --[START]--
14:25:46 Error: LinkageError occurred while loading main class X
14:25:46 	java.lang.UnsupportedClassVersionError: X (class file version 56.65535) was compiled with preview features that are unsupported. This version of the Java Runtime only recognizes preview features for class file version 57.65535
14:25:46 ---[END]---
14:25:46 .
14:25:46 ----------- Expected ------------
14:25:46 
14:25:46 ------------ but was ------------
14:25:46 Error: LinkageError occurred while loading main class X\n
14:25:46 	java.lang.UnsupportedClassVersionError: X (class file version 56.65535) was compiled with preview features that are unsupported. This version of the Java Runtime only recognizes preview features for class file version 57.65535\n
14:25:46 
14:25:46 --------- Difference is ----------
14:25:46  expected:<[]> but was:<[Error: LinkageError occurred while loading main class X\n
14:25:46 	java.lang.UnsupportedClassVersionError: X (class file version 56.65535) was compiled with preview features that are unsupported. This version of the Java Runtime only recognizes preview features for class file version 57.65535\n
14:25:46 ]>
14:25:46   SwitchExpressionTest>TestCase.runTest:964->testBug543240_8:1031->AbstractRegressionTest.runConformTest:1753->AbstractRegressionTest.runTest:2933->AbstractRegressionTest.runTest:3192->TestCase.assertEquals:242->TestCase.assertStringEquals:266 Unexpected error running resulting class file for X.java:
14:25:46 --[START]--
14:25:46 Error: LinkageError occurred while loading main class X
14:25:46 	java.lang.UnsupportedClassVersionError: X (class file version 56.65535) was compiled with preview features that are unsupported. This version of the Java Runtime only recognizes preview features for class file version 57.65535
14:25:46 ---[END]---
14:25:46 .
14:25:46 ----------- Expected ------------
14:25:46 
14:25:46 ------------ but was ------------
14:25:46 Error: LinkageError occurred while loading main class X\n
14:25:46 	java.lang.UnsupportedClassVersionError: X (class file version 56.65535) was compiled with preview features that are unsupported. This version of the Java Runtime only recognizes preview features for class file version 57.65535\n
14:25:46 
14:25:46 --------- Difference is ----------
14:25:46  expected:<[]> but was:<[Error: LinkageError occurred while loading main class X\n
14:25:46 	java.lang.UnsupportedClassVersionError: X (class file version 56.65535) was compiled with preview features that are unsupported. This version of the Java Runtime only recognizes preview features for class file version 57.65535\n
14:25:46 ]>
14:25:46   SwitchExpressionTest>TestCase.runTest:964->testBug544258_01:1756->AbstractRegressionTest.runNegativeTest:2487->AbstractRegressionTest.runNegativeTest:2498->AbstractRegressionTest.runTest:2933->AbstractRegressionTest.runTest:3140->AbstractRegressionTest.checkCompilerLog:1290->TestCase.assertEquals:242->TestCase.assertStringEquals:266 Invalid problem log .
14:25:46 ----------- Expected ------------
14:25:46 ----------\n
14:25:46 1. ERROR in X.java (at line 4)\n
14:25:46 	today =  switch (day) {\n
14:25:46 	                 ^^^\n
14:25:46 A Switch expression should cover all possible values\n
14:25:46 ----------\n
14:25:46 
14:25:46 ------------ but was ------------
14:25:46 ----------\n
14:25:46 1. ERROR in X.java (at line 4)\n
14:25:46 	today =  switch (day) {\n
14:25:46     		      case SATURDAY,SUNDAY :\n
14:25:46     		         today=1;\n
14:25:46     		         break today;\n
14:25:46     		      case MONDAY,TUESDAY,WEDNESDAY,THURSDAY :\n
14:25:46     			 today=2;\n
14:25:46     			 break today;\n
14:25:46     		};\n
14:25:46 	         ^^^^^^^^^^^^^^^^^^^^^^^^^^^^^^^^^^^^^^^^^^^^^^^^^^^^^^^^^^^^^^^^^^^^^^^^^^^^^^^^^^^^^^^^^^^^^^^^^^^^^^^^^^^^^^^^^^^^^^^^^^^^^^^^^^^^^^^^^^^^^^^^^^^^^^^^^^^^^^^^^^^^^^^^^^^^^^^^^^^^^^^^^^^^^^^^^^^^^^^^\n
14:25:46 A switch expression should have at least one result expression\n
14:25:46 ----------\n
14:25:46 2. ERROR in X.java (at line 4)\n
14:25:46 	today =  switch (day) {\n
14:25:46 	                 ^^^\n
14:25:46 A Switch expression should cover all possible values\n
14:25:46 ----------\n
14:25:46 
14:25:46 --------- Difference is ----------
14:25:46  expected:<...=  switch (day) {\n
14:25:46 []	                 ^^...> but was:<...=  switch (day) {\n
14:25:46 [    		      case SATURDAY,SUNDAY :\n
14:25:46     		         today=1;\n
14:25:46     		         break today;\n
14:25:46     		      case MONDAY,TUESDAY,WEDNESDAY,THURSDAY :\n
14:25:46     			 today=2;\n
14:25:46     			 break today;\n
14:25:46     		};\n
14:25:46 	         ^^^^^^^^^^^^^^^^^^^^^^^^^^^^^^^^^^^^^^^^^^^^^^^^^^^^^^^^^^^^^^^^^^^^^^^^^^^^^^^^^^^^^^^^^^^^^^^^^^^^^^^^^^^^^^^^^^^^^^^^^^^^^^^^^^^^^^^^^^^^^^^^^^^^^^^^^^^^^^^^^^^^^^^^^^^^^^^^^^^^^^^^^^^^^^^^^^^^^^^^\n
14:25:46 A switch expression should have at least one result expression\n
14:25:46 ----------\n
14:25:46 2. ERROR in X.java (at line 4)\n
14:25:46 	today =  switch (day) {\n
14:25:46 ]	                 ^^...>
14:25:46   SwitchExpressionTest>TestCase.runTest:964->testBug544298:1929->AbstractRegressionTest.runNegativeTest:2487->AbstractRegressionTest.runNegativeTest:2498->AbstractRegressionTest.runTest:2933->AbstractRegressionTest.runTest:3140->AbstractRegressionTest.checkCompilerLog:1290->TestCase.assertEquals:242->TestCase.assertStringEquals:266 Invalid problem log .
14:25:46 ----------- Expected ------------
14:25:46 ----------\n
14:25:46 1. ERROR in X.java (at line 7)\n
14:25:46 ----------\n
14:25:46 
14:25:46 ------------ but was ------------
14:25:46 
14:25:46 --------- Difference is ----------
14:25:46  expected:<[----------\n
14:25:46 1. ERROR in X.java (at line 7)\n
14:25:46 ----------\n
14:25:46 ]> but was:<[]>
14:25:46   SwitchExpressionTest>TestCase.runTest:964->testBug545333:2453->AbstractRegressionTest.runNegativeTest:2487->AbstractRegressionTest.runNegativeTest:2498->AbstractRegressionTest.runTest:2933->AbstractRegressionTest.runTest:3140->AbstractRegressionTest.checkCompilerLog:1290->TestCase.assertEquals:242->TestCase.assertStringEquals:266 Invalid problem log .
14:25:46 ----------- Expected ------------
14:25:46 ----------\n
14:25:46 1. ERROR in X.java (at line 4)\n
14:25:46 	int v = switch (i) {\n
14:25:46     		default -> throw new MyException();\n
14:25:46     	};\n
14:25:46 	        ^^^^^^^^^^^^^^^^^^^^^^^^^^^^^^^^^^^^^^^^^^^^^^^^^^^^^^^^^^^^^\n
14:25:46 A switch expression should have at least one result expression\n
14:25:46 ----------\n
14:25:46 
14:25:46 ------------ but was ------------
14:25:46 ----------\n
14:25:46 1. ERROR in X.java (at line 4)\n
14:25:46 	int v = switch (i) {\n
14:25:46     		default -> throw new MyException();\n
14:25:46     	};\n
14:25:46 	        ^^^^^^^^^^^^^^^^^^^^^^^^^^^^^^^^^^^^^^^^^^^^^^^^^^^^^^^^^^^^^\n
14:25:46 A switch expression should have at least one result expression\n
14:25:46 ----------\n
14:25:46 2. ERROR in X.java (at line 5)\n
14:25:46 	default -> throw new MyException();\n
14:25:46 	^^^^^^^\n
14:25:46 The preview feature Case Labels with '->' is only available with source level 13 and above\n
14:25:46 ----------\n
14:25:46 
14:25:46 --------- Difference is ----------
14:25:46  expected:<...sion\n
14:25:46 ----------\n
14:25:46 []> but was:<...sion\n
14:25:46 ----------\n
14:25:46 [2. ERROR in X.java (at line 5)\n
14:25:46 	default -> throw new MyException();\n
14:25:46 	^^^^^^^\n
14:25:46 The preview feature Case Labels with '->' is only available with source level 13 and above\n
14:25:46 ----------\n
14:25:46 ]>
14:25:46   SwitchExpressionTest>TestCase.runTest:964->testBug545518:2504->AbstractRegressionTest.runNegativeTest:2614->AbstractRegressionTest.runTest:2933->AbstractRegressionTest.runTest:3192->TestCase.assertEquals:242->TestCase.assertStringEquals:266 Unexpected error running resulting class file for X.java:
14:25:46 --[START]--
14:25:46 Error: LinkageError occurred while loading main class X
14:25:46 	java.lang.UnsupportedClassVersionError: X (class file version 56.65535) was compiled with preview features that are unsupported. This version of the Java Runtime only recognizes preview features for class file version 57.65535
14:25:46 ---[END]---
14:25:46 .
14:25:46 ----------- Expected ------------
14:25:46 
14:25:46 ------------ but was ------------
14:25:46 Error: LinkageError occurred while loading main class X\n
14:25:46 	java.lang.UnsupportedClassVersionError: X (class file version 56.65535) was compiled with preview features that are unsupported. This version of the Java Runtime only recognizes preview features for class file version 57.65535\n
14:25:46 
14:25:46 --------- Difference is ----------
14:25:46  expected:<[]> but was:<[Error: LinkageError occurred while loading main class X\n
14:25:46 	java.lang.UnsupportedClassVersionError: X (class file version 56.65535) was compiled with preview features that are unsupported. This version of the Java Runtime only recognizes preview features for class file version 57.65535\n
14:25:46 ]>
14:25:46   SwitchExpressionTest>TestCase.runTest:964->testBug545518a:2535->AbstractRegressionTest.runNegativeTest:2614->AbstractRegressionTest.runTest:2933->AbstractRegressionTest.runTest:3192->TestCase.assertEquals:242->TestCase.assertStringEquals:266 Unexpected error running resulting class file for X.java:
14:25:46 --[START]--
14:25:46 Error: LinkageError occurred while loading main class X
14:25:46 	java.lang.UnsupportedClassVersionError: X (class file version 56.65535) was compiled with preview features that are unsupported. This version of the Java Runtime only recognizes preview features for class file version 57.65535
14:25:46 ---[END]---
14:25:46 .
14:25:46 ----------- Expected ------------
14:25:46 
14:25:46 ------------ but was ------------
14:25:46 Error: LinkageError occurred while loading main class X\n
14:25:46 	java.lang.UnsupportedClassVersionError: X (class file version 56.65535) was compiled with preview features that are unsupported. This version of the Java Runtime only recognizes preview features for class file version 57.65535\n
14:25:46 
14:25:46 --------- Difference is ----------
14:25:46  expected:<[]> but was:<[Error: LinkageError occurred while loading main class X\n
14:25:46 	java.lang.UnsupportedClassVersionError: X (class file version 56.65535) was compiled with preview features that are unsupported. This version of the Java Runtime only recognizes preview features for class file version 57.65535\n
14:25:46 ]>
14:25:46   SwitchExpressionTest>TestCase.runTest:964->testBug545916_01:2610->AbstractRegressionTest.runConformTest:1753->AbstractRegressionTest.runTest:2933->AbstractRegressionTest.runTest:3192->TestCase.assertEquals:242->TestCase.assertStringEquals:266 Unexpected error running resulting class file for X.java:
14:25:46 --[START]--
14:25:46 Error: LinkageError occurred while loading main class X
14:25:46 	java.lang.UnsupportedClassVersionError: X (class file version 56.65535) was compiled with preview features that are unsupported. This version of the Java Runtime only recognizes preview features for class file version 57.65535
14:25:46 ---[END]---
14:25:46 .
14:25:46 ----------- Expected ------------
14:25:46 
14:25:46 ------------ but was ------------
14:25:46 Error: LinkageError occurred while loading main class X\n
14:25:46 	java.lang.UnsupportedClassVersionError: X (class file version 56.65535) was compiled with preview features that are unsupported. This version of the Java Runtime only recognizes preview features for class file version 57.65535\n
14:25:46 
14:25:46 --------- Difference is ----------
14:25:46  expected:<[]> but was:<[Error: LinkageError occurred while loading main class X\n
14:25:46 	java.lang.UnsupportedClassVersionError: X (class file version 56.65535) was compiled with preview features that are unsupported. This version of the Java Runtime only recognizes preview features for class file version 57.65535\n
14:25:46 ]>
14:25:46   SwitchExpressionTest>TestCase.runTest:964->testSwitchStatementWithEnumValues:1611->AbstractRegressionTest.runConformTest:1753->AbstractRegressionTest.runTest:2933->AbstractRegressionTest.runTest:3192->TestCase.assertEquals:242->TestCase.assertStringEquals:266 Unexpected error running resulting class file for X.java:
14:25:46 --[START]--
14:25:46 Error: LinkageError occurred while loading main class X
14:25:46 	java.lang.UnsupportedClassVersionError: X (class file version 56.65535) was compiled with preview features that are unsupported. This version of the Java Runtime only recognizes preview features for class file version 57.65535
14:25:46 ---[END]---
14:25:46 .
14:25:46 ----------- Expected ------------
14:25:46 
14:25:46 ------------ but was ------------
14:25:46 Error: LinkageError occurred while loading main class X\n
14:25:46 	java.lang.UnsupportedClassVersionError: X (class file version 56.65535) was compiled with preview features that are unsupported. This version of the Java Runtime only recognizes preview features for class file version 57.65535\n
14:25:46 
14:25:46 --------- Difference is ----------
14:25:46  expected:<[]> but was:<[Error: LinkageError occurred while loading main class X\n
14:25:46 	java.lang.UnsupportedClassVersionError: X (class file version 56.65535) was compiled with preview features that are unsupported. This version of the Java Runtime only recognizes preview features for class file version 57.65535\n
14:25:46 ]>
14:25:46   SwitchExpressionsYieldTest>TestCase.runTest:964->testBug547891_02:2664->AbstractRegressionTest.runNegativeTest:2614->AbstractRegressionTest.runTest:2933->AbstractRegressionTest.runTest:3192->TestCase.assertEquals:242->TestCase.assertStringEquals:266 Unexpected error running resulting class file for X.java:
14:25:46 --[START]--
14:25:46 Error: Could not find or load main class 
14:25:46 Caused by: java.lang.ClassNotFoundException: 
14:25:46 ---[END]---
14:25:46 .
14:25:46 ----------- Expected ------------
14:25:46 
14:25:46 ------------ but was ------------
14:25:46 Error: Could not find or load main class \n
14:25:46 Caused by: java.lang.ClassNotFoundException: \n
14:25:46 
14:25:46 --------- Difference is ----------
14:25:46  expected:<[]> but was:<[Error: Could not find or load main class \n
14:25:46 Caused by: java.lang.ClassNotFoundException: \n
14:25:46 ]>
14:25:46   SwitchExpressionsYieldTest>TestCase.runTest:964->testBug547891_06:2783->AbstractRegressionTest.runNegativeTest:2614->AbstractRegressionTest.runTest:2933->AbstractRegressionTest.runTest:3192->TestCase.assertEquals:242->TestCase.assertStringEquals:266 Unexpected error running resulting class file for X.java:
14:25:46 --[START]--
14:25:46 Error: Could not find or load main class 
14:25:46 Caused by: java.lang.ClassNotFoundException: 
14:25:46 ---[END]---
14:25:46 .
14:25:46 ----------- Expected ------------
14:25:46 
14:25:46 ------------ but was ------------
14:25:46 Error: Could not find or load main class \n
14:25:46 Caused by: java.lang.ClassNotFoundException: \n
14:25:46 
14:25:46 --------- Difference is ----------
14:25:46  expected:<[]> but was:<[Error: Could not find or load main class \n
14:25:46 Caused by: java.lang.ClassNotFoundException: \n
14:25:46 ]>
14:25:46   SwitchExpressionsYieldTest>TestCase.runTest:964->testBug547891_08:2845->AbstractRegressionTest.runNegativeTest:2614->AbstractRegressionTest.runTest:2933->AbstractRegressionTest.runTest:3192->TestCase.assertEquals:242->TestCase.assertStringEquals:266 Unexpected error running resulting class file for X.java:
14:25:46 --[START]--
14:25:46 Error: Could not find or load main class 
14:25:46 Caused by: java.lang.ClassNotFoundException: 
14:25:46 ---[END]---
14:25:46 .
14:25:46 ----------- Expected ------------
14:25:46 
14:25:46 ------------ but was ------------
14:25:46 Error: Could not find or load main class \n
14:25:46 Caused by: java.lang.ClassNotFoundException: \n
14:25:46 
14:25:46 --------- Difference is ----------
14:25:46  expected:<[]> but was:<[Error: Could not find or load main class \n
14:25:46 Caused by: java.lang.ClassNotFoundException: \n
14:25:46 ]>
14:25:46   SwitchExpressionsYieldTest>TestCase.runTest:964->testBug547891_10:2889->AbstractRegressionTest.runNegativeTest:2614->AbstractRegressionTest.runTest:2933->AbstractRegressionTest.runTest:3192->TestCase.assertEquals:242->TestCase.assertStringEquals:266 Unexpected error running resulting class file for X.java:
14:25:46 --[START]--
14:25:46 Error: Could not find or load main class 
14:25:46 Caused by: java.lang.ClassNotFoundException: 
14:25:46 ---[END]---
14:25:46 .
14:25:46 ----------- Expected ------------
14:25:46 
14:25:46 ------------ but was ------------
14:25:46 Error: Could not find or load main class \n
14:25:46 Caused by: java.lang.ClassNotFoundException: \n
14:25:46 
14:25:46 --------- Difference is ----------
14:25:46  expected:<[]> but was:<[Error: Could not find or load main class \n
14:25:46 Caused by: java.lang.ClassNotFoundException: \n
14:25:46 ]>
14:25:46   SwitchExpressionsYieldTest>TestCase.runTest:964->testBug547891_12:2946->AbstractRegressionTest.runNegativeTest:2614->AbstractRegressionTest.runTest:2933->AbstractRegressionTest.runTest:3192->TestCase.assertEquals:242->TestCase.assertStringEquals:266 Unexpected error running resulting class file for X.java:
14:25:46 --[START]--
14:25:46 Error: Could not find or load main class 
14:25:46 Caused by: java.lang.ClassNotFoundException: 
14:25:46 ---[END]---
14:25:46 .
14:25:46 ----------- Expected ------------
14:25:46 
14:25:46 ------------ but was ------------
14:25:46 Error: Could not find or load main class \n
14:25:46 Caused by: java.lang.ClassNotFoundException: \n
14:25:46 
14:25:46 --------- Difference is ----------
14:25:46  expected:<[]> but was:<[Error: Could not find or load main class \n
14:25:46 Caused by: java.lang.ClassNotFoundException: \n
14:25:46 ]>
14:25:46   SwitchExpressionsYieldTest>TestCase.runTest:964->testBug547891_14:3003->AbstractRegressionTest.runNegativeTest:2614->AbstractRegressionTest.runTest:2933->AbstractRegressionTest.runTest:3192->TestCase.assertEquals:242->TestCase.assertStringEquals:266 Unexpected error running resulting class file for X.java:
14:25:46 --[START]--
14:25:46 Error: Could not find or load main class 
14:25:46 Caused by: java.lang.ClassNotFoundException: 
14:25:46 ---[END]---
14:25:46 .
14:25:46 ----------- Expected ------------
14:25:46 
14:25:46 ------------ but was ------------
14:25:46 Error: Could not find or load main class \n
14:25:46 Caused by: java.lang.ClassNotFoundException: \n
14:25:46 
14:25:46 --------- Difference is ----------
14:25:46  expected:<[]> but was:<[Error: Could not find or load main class \n
14:25:46 Caused by: java.lang.ClassNotFoundException: \n
14:25:46 ]>
14:25:46 Errors: 
14:25:46 org.eclipse.jdt.core.tests.compiler.regression.Unicode12_1Test.test1 - 13(org.eclipse.jdt.core.tests.compiler.regression.Unicode12_1Test)
14:25:46   Run 1: PASS
14:25:46   Run 2: Unicode12_1Test>AbstractRegressionTest.setUp:3614->TestCase.setUp:827->PerformanceTestCase.setUp:66 » IllegalArgument
14:25:46 
14:25:46 org.eclipse.jdt.core.tests.compiler.regression.Unicode12_1Test.test2 - 13(org.eclipse.jdt.core.tests.compiler.regression.Unicode12_1Test)
14:25:46   Run 1: PASS
14:25:46   Run 2: Unicode12_1Test>AbstractRegressionTest.setUp:3614->TestCase.setUp:827->PerformanceTestCase.setUp:66 » IllegalArgument
14:25:46 
14:25:46   StandAloneASTParserTest>TestCase.runTest:964->testBug545383_01:1792 » IndexOutOfBounds
14:25:46 
14:25:46 Tests run: 40896, Failures: 81, Errors: 3, Skipped: 0
14:25:46 
14:25:48 [INFO] ------------------------------------------------------------------------
14:25:48 [INFO] Reactor Summary:
14:25:48 [INFO] 
14:25:48 [INFO] eclipse.jdt.core 4.13.0-SNAPSHOT ................... SUCCESS [ 10.314 s]
14:25:48 [INFO] org.eclipse.jdt.annotation 2.2.300-SNAPSHOT ........ SUCCESS [ 22.556 s]
14:25:48 [INFO] org.eclipse.jdt.annotation 1.1.400-SNAPSHOT ........ SUCCESS [  6.328 s]
14:25:48 [INFO] org.eclipse.jdt.core 3.18.50-SNAPSHOT .............. SUCCESS [ 26.097 s]
14:25:48 [INFO] org.eclipse.jdt.compiler.tool 1.2.600-SNAPSHOT ..... SUCCESS [  7.360 s]
14:25:48 [INFO] org.eclipse.jdt.compiler.apt 1.3.600-SNAPSHOT ...... SUCCESS [  7.505 s]
14:25:48 [INFO] org.eclipse.jdt.core.tests.compiler 3.12.900-SNAPSHOT FAILURE [28:04 min]
14:25:48 [INFO] org.eclipse.jdt.compiler.tool.tests 1.2.500-SNAPSHOT SKIPPED
14:25:48 [INFO] org.eclipse.jdt.core.tests.builder 3.10.600-SNAPSHOT SKIPPED
14:25:48 [INFO] org.eclipse.jdt.compiler.apt.tests 1.1.800-SNAPSHOT  SKIPPED
14:25:48 [INFO] org.eclipse.jdt.core.tests.model 3.10.900-SNAPSHOT . SKIPPED
14:25:48 [INFO] org.eclipse.jdt.core.tests.performance 3.10.600-SNAPSHOT SKIPPED
14:25:48 [INFO] org.eclipse.jdt.apt.core 3.6.400-SNAPSHOT .......... SKIPPED
14:25:48 [INFO] org.eclipse.jdt.apt.pluggable.core 1.2.300-SNAPSHOT  SKIPPED
14:25:48 [INFO] org.eclipse.jdt.apt.ui 3.6.200-SNAPSHOT ............ SKIPPED
14:25:48 [INFO] org.eclipse.jdt.apt.pluggable.tests 3.4.600-SNAPSHOT SKIPPED
14:25:48 [INFO] org.eclipse.jdt.apt.tests 3.4.500-SNAPSHOT ......... SKIPPED
14:25:48 [INFO] ------------------------------------------------------------------------
14:25:48 [INFO] BUILD FAILURE
14:25:48 [INFO] ------------------------------------------------------------------------
14:25:48 [INFO] Total time:  31:41 min
14:25:48 [INFO] Finished at: 2019-07-05T14:25:48-04:00
14:25:48 [INFO] ------------------------------------------------------------------------
14:25:48 [ERROR] Failed to execute goal org.eclipse.tycho:tycho-surefire-plugin:1.5.0-SNAPSHOT:test (default-test) on project org.eclipse.jdt.core.tests.compiler: There are test failures.
14:25:48 [ERROR] 
14:25:48 [ERROR] Please refer to /jobs/genie.jdt/eclipse.jdt.core-Gerrit-BETA/workspace/org.eclipse.jdt.core.tests.compiler/target/surefire-reports for the individual test results.
14:25:48 [ERROR] -> [Help 1]
14:25:48 [ERROR] 
14:25:48 [ERROR] To see the full stack trace of the errors, re-run Maven with the -e switch.
14:25:48 [ERROR] Re-run Maven using the -X switch to enable full debug logging.
14:25:48 [ERROR] 
14:25:48 [ERROR] For more information about the errors and possible solutions, please read the following articles:
14:25:48 [ERROR] [Help 1] http://cwiki.apache.org/confluence/display/MAVEN/MojoFailureException
14:25:48 [ERROR] 
14:25:48 [ERROR] After correcting the problems, you can resume the build with the command
14:25:48 [ERROR]   mvn <goals> -rf :org.eclipse.jdt.core.tests.compiler
14:25:49 Build step 'Invoke top-level Maven targets' marked build as failure
14:25:49 Recording test results
14:25:51 Archiving artifacts
14:25:51 Started calculate disk usage of build
14:25:51 Finished Calculation of disk usage of build in 0 seconds
14:25:56 Started calculate disk usage of workspace
14:25:57 Finished Calculation of disk usage of workspace in 0 seconds
14:25:59 Finished: FAILURE