FailedConsole Output

Started by user Alwin Joseph
Rebuilds build #90
Running as Alwin Joseph
Agent basic-hd751 is provisioned from template basic
---
apiVersion: "v1"
kind: "Pod"
metadata:
  annotations: {}
  labels:
    jenkins: "slave"
    jenkins/label: ""
  name: "basic-hd751"
spec:
  containers:
  - env:
    - name: "JENKINS_SECRET"
      value: "********"
    - name: "JENKINS_TUNNEL"
      value: "jenkins-discovery.jakartaee-tck.svc.cluster.local:50000"
    - name: "JENKINS_AGENT_NAME"
      value: "basic-hd751"
    - name: "JENKINS_REMOTING_JAVA_OPTS"
      value: "-showversion -XshowSettings:vm -Xmx256m -Dsun.zip.disableMemoryMapping=true\
        \ -Dorg.jenkinsci.remoting.engine.JnlpProtocol3.disabled=true -Dorg.jenkinsci.plugins.gitclient.CliGitAPIImpl.useSETSID=true"
    - name: "JAVA_TOOL_OPTIONS"
      value: ""
    - name: "_JAVA_OPTIONS"
      value: ""
    - name: "OPENJ9_JAVA_OPTIONS"
      value: "-XX:+IgnoreUnrecognizedVMOptions -XX:+IdleTuningCompactOnIdle -XX:+IdleTuningGcOnIdle"
    - name: "JENKINS_NAME"
      value: "basic-hd751"
    - name: "JENKINS_AGENT_WORKDIR"
      value: "/home/jenkins/agent"
    - name: "JENKINS_URL"
      value: "http://jenkins-ui.jakartaee-tck.svc.cluster.local/jakartaee-tck/"
    image: "docker.io/eclipsecbi/jiro-agent-basic:remoting-4.2.1"
    imagePullPolicy: "Always"
    name: "jnlp"
    resources:
      limits:
        memory: "16384Mi"
        cpu: "4380m"
      requests:
        memory: "16384Mi"
        cpu: "4080m"
    securityContext:
      privileged: false
    tty: true
    volumeMounts:
    - mountPath: "/home/jenkins/.m2/toolchains.xml"
      name: "m2-dir"
      readOnly: true
      subPath: "toolchains.xml"
    - mountPath: "/home/jenkins/.mavenrc"
      name: "m2-dir"
      readOnly: true
      subPath: ".mavenrc"
    - mountPath: "/opt/tools"
      name: "volume-0"
      readOnly: false
    - mountPath: "/home/jenkins"
      name: "volume-2"
      readOnly: false
    - mountPath: "/home/jenkins/.m2/repository"
      name: "volume-3"
      readOnly: false
    - mountPath: "/home/jenkins/.m2/settings-security.xml"
      name: "m2-secret-dir"
      readOnly: true
      subPath: "settings-security.xml"
    - mountPath: "/home/jenkins/.m2/wrapper"
      name: "volume-4"
      readOnly: false
    - mountPath: "/home/jenkins/.m2/settings.xml"
      name: "m2-secret-dir"
      readOnly: true
      subPath: "settings.xml"
    - mountPath: "/home/jenkins/.ssh"
      name: "volume-1"
      readOnly: false
    - mountPath: "/home/jenkins/agent"
      name: "workspace-volume"
      readOnly: false
    workingDir: "/home/jenkins/agent"
  nodeSelector:
    beta.kubernetes.io/os: "linux"
  restartPolicy: "Never"
  securityContext: {}
  volumes:
  - name: "volume-0"
    persistentVolumeClaim:
      claimName: "tools-claim-jiro-jakartaee-tck"
      readOnly: true
  - name: "m2-secret-dir"
    secret:
      secretName: "m2-secret-dir"
  - emptyDir:
      medium: ""
    name: "volume-2"
  - configMap:
      name: "m2-dir"
    name: "m2-dir"
  - configMap:
      name: "known-hosts"
    name: "volume-1"
  - emptyDir:
      medium: ""
    name: "workspace-volume"
  - emptyDir:
      medium: ""
    name: "volume-4"
  - emptyDir:
      medium: ""
    name: "volume-3"

[EnvInject] - Loading node environment variables.
Building remotely on basic-hd751 in workspace /home/jenkins/agent/workspace/jakartaeetck-certification
[ssh-agent] Looking for ssh-agent implementation...
[ssh-agent]   Exec ssh-agent (binary ssh-agent on a remote machine)
$ ssh-agent
SSH_AUTH_SOCK=/tmp/ssh-WG0KDHycLDfg/agent.60
SSH_AGENT_PID=62
[ssh-agent] Started.
Running ssh-add (command line suppressed)
Identity added: /home/jenkins/agent/workspace/jakartaeetck-certification@tmp/private_key_3672224210463464068.key (/home/jenkins/agent/workspace/jakartaeetck-certification@tmp/private_key_3672224210463464068.key)
[ssh-agent] Using credentials genie.jakartaee-tck (ssh://genie.jakartaee-tck@projects-storage.eclipse.org)
[jakartaeetck-certification] $ /bin/bash -x /tmp/jenkins2321334595701039020.sh
+ '[' JAKARTAEE8_LATEST == JAKARTAEE9_NIGHTLY_LATEST ']'
+ '[' JAKARTAEE8_LATEST == MASTER_NIGHTLY_LATEST ']'
+ '[' JAKARTAEE8_LATEST == JAKARTAEE_BUILD_LATEST ']'
+ '[' JAKARTAEE8_LATEST == JAKARTAEE8_LATEST ']'
+ export BUNDLE_URL=https://download.eclipse.org/jakartaee/platform/8
+ BUNDLE_URL=https://download.eclipse.org/jakartaee/platform/8
+ export BUNDLE_FILE=jakarta-jakartaeetck-8.0.2.zip
+ BUNDLE_FILE=jakarta-jakartaeetck-8.0.2.zip
+ rm -f jakartaeetck-full.properties
+ touch jakartaeetck-full.properties
+ echo 'GF_BUNDLE_URL=https://www.eclipse.org/downloads/download.php?file=/ee4j/glassfish/glassfish-5.1.1-SNAPSHOT-RC1.zip'
+ echo OLD_GF_BUNDLE_URL=http://download.oracle.com/glassfish/5.0.1/nightly/latest-glassfish.zip
+ echo PROFILE=FULL
+ echo BUILD_TYPE=CTS
+ echo 'test_suites=assembly appclient compat12 compat13 concurrency connector ejb ejb30/bb ejb30/lite/appexception ejb30/lite/async ejb30/lite/basic ejb30/lite/ejbcontext ejb30/lite/enventry ejb30/lite/interceptor ejb30/lite/lookup ejb30/lite/naming ejb30/lite/nointerface ejb30/lite/packaging ejb30/lite/singleton ejb30/lite/stateful ejb30/lite/tx ejb30/lite/view ejb30/lite/xmloverride ejb30/assembly ejb30/timer ejb30/webservice ejb30/zombie ejb30/misc ejb30/sec ejb32 el integration interop j2eetools jacc jaspic javaee javamail jaxr jaxrpc jaxrs jbatch jdbc_appclient jdbc_ejb jdbc_jsp jdbc_servlet jms jpa_appmanaged jpa_appmanagedNoTx jpa_pmservlet jpa_puservlet jpa_stateful3 jpa_stateless3 jsf jsonb jsonp jsp jstl jta rmiiiop samples securityapi servlet signaturetest/javaee webservices webservices12 webservices13 websocket xa'
+ echo TCK_BUNDLE_BASE_URL=https://download.eclipse.org/jakartaee/platform/8
+ echo TCK_BUNDLE_FILE_NAME=jakarta-jakartaeetck-8.0.2.zip
+ '[' '!' -z ']'
Waiting for the completion of jakartaee-tck » 8.0.2
jakartaee-tck » 8.0.2 #3 started.
jakartaee-tck » 8.0.2 #3 completed. Result was FAILURE
Build step 'Trigger/call builds on other projects' changed build result to UNSTABLE
Copied 126 artifacts from "jakartaee-tck » 8.0.2" build number 3
[jakartaeetck-certification] $ /bin/bash -xe /tmp/jenkins1052724732041132844.sh
+ '[' '!' -z ']'
+ echo 'Version Info:Eclipse GF version used : https://www.eclipse.org/downloads/download.php?file=/ee4j/glassfish/glassfish-5.1.1-SNAPSHOT-RC1.zip'
Version Info:Eclipse GF version used : https://www.eclipse.org/downloads/download.php?file=/ee4j/glassfish/glassfish-5.1.1-SNAPSHOT-RC1.zip
+ for f in *junitreports.tar.gz
+ tar zxf appclient-junitreports.tar.gz -C /home/jenkins/agent/workspace/jakartaeetck-certification --strip-components=5
+ for f in *junitreports.tar.gz
+ tar zxf compat12-junitreports.tar.gz -C /home/jenkins/agent/workspace/jakartaeetck-certification --strip-components=5
+ for f in *junitreports.tar.gz
+ tar zxf compat13-junitreports.tar.gz -C /home/jenkins/agent/workspace/jakartaeetck-certification --strip-components=5
+ for f in *junitreports.tar.gz
+ tar zxf concurrency-junitreports.tar.gz -C /home/jenkins/agent/workspace/jakartaeetck-certification --strip-components=5
+ for f in *junitreports.tar.gz
+ tar zxf connector-junitreports.tar.gz -C /home/jenkins/agent/workspace/jakartaeetck-certification --strip-components=5
+ for f in *junitreports.tar.gz
+ tar zxf ejb30_assembly-junitreports.tar.gz -C /home/jenkins/agent/workspace/jakartaeetck-certification --strip-components=5
+ for f in *junitreports.tar.gz
+ tar zxf ejb30_bb-junitreports.tar.gz -C /home/jenkins/agent/workspace/jakartaeetck-certification --strip-components=5
+ for f in *junitreports.tar.gz
+ tar zxf ejb30_lite_appexception-junitreports.tar.gz -C /home/jenkins/agent/workspace/jakartaeetck-certification --strip-components=5
+ for f in *junitreports.tar.gz
+ tar zxf ejb30_lite_async-junitreports.tar.gz -C /home/jenkins/agent/workspace/jakartaeetck-certification --strip-components=5
+ for f in *junitreports.tar.gz
+ tar zxf ejb30_lite_basic-junitreports.tar.gz -C /home/jenkins/agent/workspace/jakartaeetck-certification --strip-components=5
+ for f in *junitreports.tar.gz
+ tar zxf ejb30_lite_ejbcontext-junitreports.tar.gz -C /home/jenkins/agent/workspace/jakartaeetck-certification --strip-components=5
+ for f in *junitreports.tar.gz
+ tar zxf ejb30_lite_enventry-junitreports.tar.gz -C /home/jenkins/agent/workspace/jakartaeetck-certification --strip-components=5
+ for f in *junitreports.tar.gz
+ tar zxf ejb30_lite_interceptor-junitreports.tar.gz -C /home/jenkins/agent/workspace/jakartaeetck-certification --strip-components=5
+ for f in *junitreports.tar.gz
+ tar zxf ejb30_lite_lookup-junitreports.tar.gz -C /home/jenkins/agent/workspace/jakartaeetck-certification --strip-components=5
+ for f in *junitreports.tar.gz
+ tar zxf ejb30_lite_naming-junitreports.tar.gz -C /home/jenkins/agent/workspace/jakartaeetck-certification --strip-components=5
+ for f in *junitreports.tar.gz
+ tar zxf ejb30_lite_nointerface-junitreports.tar.gz -C /home/jenkins/agent/workspace/jakartaeetck-certification --strip-components=5
+ for f in *junitreports.tar.gz
+ tar zxf ejb30_lite_packaging-junitreports.tar.gz -C /home/jenkins/agent/workspace/jakartaeetck-certification --strip-components=5
+ for f in *junitreports.tar.gz
+ tar zxf ejb30_lite_singleton-junitreports.tar.gz -C /home/jenkins/agent/workspace/jakartaeetck-certification --strip-components=5
+ for f in *junitreports.tar.gz
+ tar zxf ejb30_lite_stateful-junitreports.tar.gz -C /home/jenkins/agent/workspace/jakartaeetck-certification --strip-components=5
+ for f in *junitreports.tar.gz
+ tar zxf ejb30_lite_view-junitreports.tar.gz -C /home/jenkins/agent/workspace/jakartaeetck-certification --strip-components=5
+ for f in *junitreports.tar.gz
+ tar zxf ejb30_lite_xmloverride-junitreports.tar.gz -C /home/jenkins/agent/workspace/jakartaeetck-certification --strip-components=5
+ for f in *junitreports.tar.gz
+ tar zxf ejb30_sec-junitreports.tar.gz -C /home/jenkins/agent/workspace/jakartaeetck-certification --strip-components=5
+ for f in *junitreports.tar.gz
+ tar zxf ejb30_timer-junitreports.tar.gz -C /home/jenkins/agent/workspace/jakartaeetck-certification --strip-components=5
+ for f in *junitreports.tar.gz
+ tar zxf ejb30_zombie-junitreports.tar.gz -C /home/jenkins/agent/workspace/jakartaeetck-certification --strip-components=5
+ for f in *junitreports.tar.gz
+ tar zxf ejb32-junitreports.tar.gz -C /home/jenkins/agent/workspace/jakartaeetck-certification --strip-components=5
+ for f in *junitreports.tar.gz
+ tar zxf integration-junitreports.tar.gz -C /home/jenkins/agent/workspace/jakartaeetck-certification --strip-components=5
+ for f in *junitreports.tar.gz
+ tar zxf interop-junitreports.tar.gz -C /home/jenkins/agent/workspace/jakartaeetck-certification --strip-components=5
+ for f in *junitreports.tar.gz
+ tar zxf j2eetools-junitreports.tar.gz -C /home/jenkins/agent/workspace/jakartaeetck-certification --strip-components=5
+ for f in *junitreports.tar.gz
+ tar zxf jacc-junitreports.tar.gz -C /home/jenkins/agent/workspace/jakartaeetck-certification --strip-components=5
+ for f in *junitreports.tar.gz
+ tar zxf jaspic-junitreports.tar.gz -C /home/jenkins/agent/workspace/jakartaeetck-certification --strip-components=5
+ for f in *junitreports.tar.gz
+ tar zxf javaee-junitreports.tar.gz -C /home/jenkins/agent/workspace/jakartaeetck-certification --strip-components=5
+ for f in *junitreports.tar.gz
+ tar zxf javamail-junitreports.tar.gz -C /home/jenkins/agent/workspace/jakartaeetck-certification --strip-components=5
+ for f in *junitreports.tar.gz
+ tar zxf jaxr-junitreports.tar.gz -C /home/jenkins/agent/workspace/jakartaeetck-certification --strip-components=5
+ for f in *junitreports.tar.gz
+ tar zxf jaxrpc-junitreports.tar.gz -C /home/jenkins/agent/workspace/jakartaeetck-certification --strip-components=5
+ for f in *junitreports.tar.gz
+ tar zxf jaxrs-junitreports.tar.gz -C /home/jenkins/agent/workspace/jakartaeetck-certification --strip-components=5
+ for f in *junitreports.tar.gz
+ tar zxf jbatch-junitreports.tar.gz -C /home/jenkins/agent/workspace/jakartaeetck-certification --strip-components=5
+ for f in *junitreports.tar.gz
+ tar zxf jdbc_appclient-junitreports.tar.gz -C /home/jenkins/agent/workspace/jakartaeetck-certification --strip-components=5
+ for f in *junitreports.tar.gz
+ tar zxf jdbc_ejb-junitreports.tar.gz -C /home/jenkins/agent/workspace/jakartaeetck-certification --strip-components=5
+ for f in *junitreports.tar.gz
+ tar zxf jdbc_jsp-junitreports.tar.gz -C /home/jenkins/agent/workspace/jakartaeetck-certification --strip-components=5
+ for f in *junitreports.tar.gz
+ tar zxf jdbc_servlet-junitreports.tar.gz -C /home/jenkins/agent/workspace/jakartaeetck-certification --strip-components=5
+ for f in *junitreports.tar.gz
+ tar zxf jms-junitreports.tar.gz -C /home/jenkins/agent/workspace/jakartaeetck-certification --strip-components=5
+ for f in *junitreports.tar.gz
+ tar zxf jpa_appmanaged-junitreports.tar.gz -C /home/jenkins/agent/workspace/jakartaeetck-certification --strip-components=5
+ for f in *junitreports.tar.gz
+ tar zxf jpa_appmanagedNoTx-junitreports.tar.gz -C /home/jenkins/agent/workspace/jakartaeetck-certification --strip-components=5
+ for f in *junitreports.tar.gz
+ tar zxf jpa_pmservlet-junitreports.tar.gz -C /home/jenkins/agent/workspace/jakartaeetck-certification --strip-components=5
+ for f in *junitreports.tar.gz
+ tar zxf jpa_puservlet-junitreports.tar.gz -C /home/jenkins/agent/workspace/jakartaeetck-certification --strip-components=5
+ for f in *junitreports.tar.gz
+ tar zxf jpa_stateful3-junitreports.tar.gz -C /home/jenkins/agent/workspace/jakartaeetck-certification --strip-components=5
+ for f in *junitreports.tar.gz
+ tar zxf jpa_stateless3-junitreports.tar.gz -C /home/jenkins/agent/workspace/jakartaeetck-certification --strip-components=5
+ for f in *junitreports.tar.gz
+ tar zxf jsf-junitreports.tar.gz -C /home/jenkins/agent/workspace/jakartaeetck-certification --strip-components=5
+ for f in *junitreports.tar.gz
+ tar zxf jsonb-junitreports.tar.gz -C /home/jenkins/agent/workspace/jakartaeetck-certification --strip-components=5
+ for f in *junitreports.tar.gz
+ tar zxf jsonp-junitreports.tar.gz -C /home/jenkins/agent/workspace/jakartaeetck-certification --strip-components=5
+ for f in *junitreports.tar.gz
+ tar zxf jsp-junitreports.tar.gz -C /home/jenkins/agent/workspace/jakartaeetck-certification --strip-components=5
+ for f in *junitreports.tar.gz
+ tar zxf jstl-junitreports.tar.gz -C /home/jenkins/agent/workspace/jakartaeetck-certification --strip-components=5
+ for f in *junitreports.tar.gz
+ tar zxf jta-junitreports.tar.gz -C /home/jenkins/agent/workspace/jakartaeetck-certification --strip-components=5
+ for f in *junitreports.tar.gz
+ tar zxf rmiiiop-junitreports.tar.gz -C /home/jenkins/agent/workspace/jakartaeetck-certification --strip-components=5
+ for f in *junitreports.tar.gz
+ tar zxf samples-junitreports.tar.gz -C /home/jenkins/agent/workspace/jakartaeetck-certification --strip-components=5
+ for f in *junitreports.tar.gz
+ tar zxf securityapi-junitreports.tar.gz -C /home/jenkins/agent/workspace/jakartaeetck-certification --strip-components=5
+ for f in *junitreports.tar.gz
+ tar zxf servlet-junitreports.tar.gz -C /home/jenkins/agent/workspace/jakartaeetck-certification --strip-components=5
+ for f in *junitreports.tar.gz
+ tar zxf signaturetest_javaee-junitreports.tar.gz -C /home/jenkins/agent/workspace/jakartaeetck-certification --strip-components=5
+ for f in *junitreports.tar.gz
+ tar zxf webservices-junitreports.tar.gz -C /home/jenkins/agent/workspace/jakartaeetck-certification --strip-components=5
+ for f in *junitreports.tar.gz
+ tar zxf webservices12-junitreports.tar.gz -C /home/jenkins/agent/workspace/jakartaeetck-certification --strip-components=5
+ for f in *junitreports.tar.gz
+ tar zxf webservices13-junitreports.tar.gz -C /home/jenkins/agent/workspace/jakartaeetck-certification --strip-components=5
+ for f in *junitreports.tar.gz
+ tar zxf websocket-junitreports.tar.gz -C /home/jenkins/agent/workspace/jakartaeetck-certification --strip-components=5
+ for f in *junitreports.tar.gz
+ tar zxf xa-junitreports.tar.gz -C /home/jenkins/agent/workspace/jakartaeetck-certification --strip-components=5
+ '[' JAKARTAEE8_LATEST == JAKARTAEE9_NIGHTLY_LATEST ']'
+ '[' JAKARTAEE8_LATEST == JAKARTAEE8_LATEST ']'
+ export BUNDLE_URL=https://download.eclipse.org/jakartaee/platform/8
+ BUNDLE_URL=https://download.eclipse.org/jakartaee/platform/8
+ export BUNDLE_FILE=jakarta-jakartaeetck-8.0.2.zip
+ BUNDLE_FILE=jakarta-jakartaeetck-8.0.2.zip
+ rm -rf /home/jenkins/agent/workspace/jakartaeetck-certification/jakartaeetckinfo.txt
+ touch /home/jenkins/agent/workspace/jakartaeetck-certification/jakartaeetckinfo.txt
+ '[' JAKARTAEE8_LATEST '!=' JAKARTAEE_BUILD_LATEST ']'
+ export NAME=jakarta-jakartaeetck-8.0.2.zip
+ NAME=jakarta-jakartaeetck-8.0.2.zip
+ echo '***********************************************************************************'
+ echo '***                        TCK bundle information                               ***'
+ echo '*** Name:       jakarta-jakartaeetck-8.0.2.zip                                     ***'
+ echo '*** Download URL:    https://download.eclipse.org/jakartaee/platform/8/jakarta-jakartaeetck-8.0.2.zip ***'
++ ssh genie.jakartaee-tck@projects-storage.eclipse.org stat -c '"%y"' jakarta-jakartaeetck-8.0.2.zip /home/data/httpd/https://download.eclipse.org/jakartaee/platform/8
stat: cannot stat `jakarta-jakartaeetck-8.0.2.zip': No such file or directory
stat: cannot stat `/home/data/httpd/https://download.eclipse.org/jakartaee/platform/8': No such file or directory
+ echo '*** Date:         ***'
++ ssh genie.jakartaee-tck@projects-storage.eclipse.org wc -c /home/data/httpd/https://download.eclipse.org/jakartaee/platform/8/jakarta-jakartaeetck-8.0.2.zip
++ awk '{print $1}'
wc: /home/data/httpd/https://download.eclipse.org/jakartaee/platform/8/jakarta-jakartaeetck-8.0.2.zip: No such file or directory
+ echo '*** Size(b):  ***'
++ ssh genie.jakartaee-tck@projects-storage.eclipse.org sha256sum /home/data/httpd/https://download.eclipse.org/jakartaee/platform/8/jakarta-jakartaeetck-8.0.2.zip
++ awk '{print $1}'
sha256sum: /home/data/httpd/https://download.eclipse.org/jakartaee/platform/8/jakarta-jakartaeetck-8.0.2.zip: No such file or directory
+ echo '*** SHA256SUM:  ***'
+ echo '***                                                                             ***'
+ echo '***********************************************************************************'
+ rm -rf '*.zip'
$ ssh-agent -k
unset SSH_AUTH_SOCK;
unset SSH_AGENT_PID;
echo Agent pid 62 killed;
[ssh-agent] Stopped.
Recording test results
ERROR: Step ‘Publish JUnit test result report’ aborted due to exception: 
Also:   hudson.remoting.Channel$CallSiteStackTrace: Remote call to JNLP4-connect connection from 10.129.14.1/10.129.14.1:48794
		at hudson.remoting.Channel.attachCallSiteStackTrace(Channel.java:1788)
		at hudson.remoting.UserRequest$ExceptionResponse.retrieve(UserRequest.java:356)
		at hudson.remoting.Channel.call(Channel.java:998)
		at hudson.FilePath.act(FilePath.java:1069)
		at hudson.FilePath.act(FilePath.java:1058)
		at hudson.tasks.junit.JUnitParser.parseResult(JUnitParser.java:114)
		at hudson.tasks.junit.JUnitResultArchiver.parse(JUnitResultArchiver.java:137)
		at hudson.tasks.junit.JUnitResultArchiver.parseAndAttach(JUnitResultArchiver.java:167)
		at hudson.tasks.junit.JUnitResultArchiver.perform(JUnitResultArchiver.java:154)
		at hudson.tasks.BuildStepCompatibilityLayer.perform(BuildStepCompatibilityLayer.java:78)
		at hudson.tasks.BuildStepMonitor$1.perform(BuildStepMonitor.java:20)
		at hudson.model.AbstractBuild$AbstractBuildExecution.perform(AbstractBuild.java:741)
		at hudson.model.AbstractBuild$AbstractBuildExecution.performAllBuildSteps(AbstractBuild.java:690)
		at hudson.model.Build$BuildExecution.post2(Build.java:186)
		at hudson.model.AbstractBuild$AbstractBuildExecution.post(AbstractBuild.java:635)
		at hudson.model.Run.execute(Run.java:1881)
		at hudson.model.FreeStyleBuild.run(FreeStyleBuild.java:43)
		at hudson.model.ResourceController.execute(ResourceController.java:97)
		at hudson.model.Executor.run(Executor.java:428)
java.lang.OutOfMemoryError: Java heap space
	at java.util.Arrays.copyOf(Unknown Source)
	at java.io.ByteArrayOutputStream.grow(Unknown Source)
	at java.io.ByteArrayOutputStream.ensureCapacity(Unknown Source)
	at java.io.ByteArrayOutputStream.write(Unknown Source)
	at java.io.ObjectOutputStream$BlockDataOutputStream.drain(Unknown Source)
	at java.io.ObjectOutputStream$BlockDataOutputStream.setBlockDataMode(Unknown Source)
	at java.io.ObjectOutputStream.writeObject0(Unknown Source)
	at java.io.ObjectOutputStream.writeObject(Unknown Source)
	at java.util.ArrayList.writeObject(Unknown Source)
	at sun.reflect.NativeMethodAccessorImpl.invoke0(Native Method)
	at sun.reflect.NativeMethodAccessorImpl.invoke(Unknown Source)
	at sun.reflect.DelegatingMethodAccessorImpl.invoke(Unknown Source)
	at java.lang.reflect.Method.invoke(Unknown Source)
	at java.io.ObjectStreamClass.invokeWriteObject(Unknown Source)
	at java.io.ObjectOutputStream.writeSerialData(Unknown Source)
	at java.io.ObjectOutputStream.writeOrdinaryObject(Unknown Source)
	at java.io.ObjectOutputStream.writeObject0(Unknown Source)
	at java.io.ObjectOutputStream.defaultWriteFields(Unknown Source)
	at java.io.ObjectOutputStream.writeSerialData(Unknown Source)
	at java.io.ObjectOutputStream.writeOrdinaryObject(Unknown Source)
	at java.io.ObjectOutputStream.writeObject0(Unknown Source)
	at java.io.ObjectOutputStream.writeObject(Unknown Source)
	at hudson.remoting.UserRequest._serialize(UserRequest.java:263)
	at hudson.remoting.UserRequest.serialize(UserRequest.java:272)
	at hudson.remoting.UserRequest.perform(UserRequest.java:222)
	at hudson.remoting.UserRequest.perform(UserRequest.java:54)
	at hudson.remoting.Request$2.run(Request.java:369)
	at hudson.remoting.InterceptingExecutorService$1.call(InterceptingExecutorService.java:72)
	at java.util.concurrent.FutureTask.run(Unknown Source)
	at java.util.concurrent.ThreadPoolExecutor.runWorker(Unknown Source)
	at java.util.concurrent.ThreadPoolExecutor$Worker.run(Unknown Source)
	at hudson.remoting.Engine$1.lambda$newThread$0(Engine.java:117)
	at hudson.remoting.Engine$1$$Lambda$4/000000001403FA50.run(Unknown Source)
	at java.lang.Thread.run(Unknown Source)
Caused: java.io.IOException: Remote call on JNLP4-connect connection from 10.129.14.1/10.129.14.1:48794 failed
	at hudson.remoting.Channel.call(Channel.java:1004)
	at hudson.FilePath.act(FilePath.java:1069)
	at hudson.FilePath.act(FilePath.java:1058)
	at hudson.tasks.junit.JUnitParser.parseResult(JUnitParser.java:114)
	at hudson.tasks.junit.JUnitResultArchiver.parse(JUnitResultArchiver.java:137)
	at hudson.tasks.junit.JUnitResultArchiver.parseAndAttach(JUnitResultArchiver.java:167)
	at hudson.tasks.junit.JUnitResultArchiver.perform(JUnitResultArchiver.java:154)
	at hudson.tasks.BuildStepCompatibilityLayer.perform(BuildStepCompatibilityLayer.java:78)
	at hudson.tasks.BuildStepMonitor$1.perform(BuildStepMonitor.java:20)
	at hudson.model.AbstractBuild$AbstractBuildExecution.perform(AbstractBuild.java:741)
	at hudson.model.AbstractBuild$AbstractBuildExecution.performAllBuildSteps(AbstractBuild.java:690)
	at hudson.model.Build$BuildExecution.post2(Build.java:186)
	at hudson.model.AbstractBuild$AbstractBuildExecution.post(AbstractBuild.java:635)
	at hudson.model.Run.execute(Run.java:1881)
	at hudson.model.FreeStyleBuild.run(FreeStyleBuild.java:43)
	at hudson.model.ResourceController.execute(ResourceController.java:97)
	at hudson.model.Executor.run(Executor.java:428)
[JUnitReportPublisher] Compiling JUnit Html Reports ...
[JUnit test report builder] Copying XML files from slave: /home/jenkins/agent/workspace/jakartaeetck-certification to master reports directory: /var/jenkins/jobs/jakartaeetck-certification/builds/93/junit-reports-with-handlebars
[JUnitReportPublisher] Found 63 xml files.
[JUnit test report builder] 0. Found a xml file: results/junitreports/appclient-junit-report.xml
[JUnit test report builder] 1. Found a xml file: results/junitreports/compat12-junit-report.xml
[JUnit test report builder] 2. Found a xml file: results/junitreports/compat13-junit-report.xml
[JUnit test report builder] 3. Found a xml file: results/junitreports/concurrency-junit-report.xml
[JUnit test report builder] 4. Found a xml file: results/junitreports/connector-junit-report.xml
[JUnit test report builder] 5. Found a xml file: results/junitreports/ejb30_assembly-junit-report.xml
[JUnit test report builder] 6. Found a xml file: results/junitreports/ejb30_bb-junit-report.xml
[JUnit test report builder] 7. Found a xml file: results/junitreports/ejb30_lite_appexception-junit-report.xml
[JUnit test report builder] 8. Found a xml file: results/junitreports/ejb30_lite_async-junit-report.xml
[JUnit test report builder] 9. Found a xml file: results/junitreports/ejb30_lite_basic-junit-report.xml
[JUnit test report builder] 10. Found a xml file: results/junitreports/ejb30_lite_ejbcontext-junit-report.xml
[JUnit test report builder] 11. Found a xml file: results/junitreports/ejb30_lite_enventry-junit-report.xml
[JUnit test report builder] 12. Found a xml file: results/junitreports/ejb30_lite_interceptor-junit-report.xml
[JUnit test report builder] 13. Found a xml file: results/junitreports/ejb30_lite_lookup-junit-report.xml
[JUnit test report builder] 14. Found a xml file: results/junitreports/ejb30_lite_naming-junit-report.xml
[JUnit test report builder] 15. Found a xml file: results/junitreports/ejb30_lite_nointerface-junit-report.xml
[JUnit test report builder] 16. Found a xml file: results/junitreports/ejb30_lite_packaging-junit-report.xml
[JUnit test report builder] 17. Found a xml file: results/junitreports/ejb30_lite_singleton-junit-report.xml
[JUnit test report builder] 18. Found a xml file: results/junitreports/ejb30_lite_stateful-junit-report.xml
[JUnit test report builder] 19. Found a xml file: results/junitreports/ejb30_lite_view-junit-report.xml
[JUnit test report builder] 20. Found a xml file: results/junitreports/ejb30_lite_xmloverride-junit-report.xml
[JUnit test report builder] 21. Found a xml file: results/junitreports/ejb30_sec-junit-report.xml
[JUnit test report builder] 22. Found a xml file: results/junitreports/ejb30_timer-junit-report.xml
[JUnit test report builder] 23. Found a xml file: results/junitreports/ejb30_zombie-junit-report.xml
[JUnit test report builder] 24. Found a xml file: results/junitreports/ejb32-junit-report.xml
[JUnit test report builder] 25. Found a xml file: results/junitreports/integration-junit-report.xml
[JUnit test report builder] 26. Found a xml file: results/junitreports/interop-junit-report.xml
[JUnit test report builder] 27. Found a xml file: results/junitreports/j2eetools-junit-report.xml
[JUnit test report builder] 28. Found a xml file: results/junitreports/jacc-junit-report.xml
[JUnit test report builder] 29. Found a xml file: results/junitreports/jaspic-junit-report.xml
[JUnit test report builder] 30. Found a xml file: results/junitreports/javaee-junit-report.xml
[JUnit test report builder] 31. Found a xml file: results/junitreports/javamail-junit-report.xml
[JUnit test report builder] 32. Found a xml file: results/junitreports/jaxr-junit-report.xml
[JUnit test report builder] 33. Found a xml file: results/junitreports/jaxrpc-junit-report.xml
[JUnit test report builder] 34. Found a xml file: results/junitreports/jaxrs-junit-report.xml
[JUnit test report builder] 35. Found a xml file: results/junitreports/jbatch-junit-report.xml
[JUnit test report builder] 36. Found a xml file: results/junitreports/jdbc_appclient-junit-report.xml
[JUnit test report builder] 37. Found a xml file: results/junitreports/jdbc_ejb-junit-report.xml
[JUnit test report builder] 38. Found a xml file: results/junitreports/jdbc_jsp-junit-report.xml
[JUnit test report builder] 39. Found a xml file: results/junitreports/jdbc_servlet-junit-report.xml
[JUnit test report builder] 40. Found a xml file: results/junitreports/jms-junit-report.xml
[JUnit test report builder] 41. Found a xml file: results/junitreports/jpa_appmanaged-junit-report.xml
[JUnit test report builder] 42. Found a xml file: results/junitreports/jpa_appmanagedNoTx-junit-report.xml
[JUnit test report builder] 43. Found a xml file: results/junitreports/jpa_pmservlet-junit-report.xml
[JUnit test report builder] 44. Found a xml file: results/junitreports/jpa_puservlet-junit-report.xml
[JUnit test report builder] 45. Found a xml file: results/junitreports/jpa_stateful3-junit-report.xml
[JUnit test report builder] 46. Found a xml file: results/junitreports/jpa_stateless3-junit-report.xml
[JUnit test report builder] 47. Found a xml file: results/junitreports/jsf-junit-report.xml
[JUnit test report builder] 48. Found a xml file: results/junitreports/jsonb-junit-report.xml
[JUnit test report builder] 49. Found a xml file: results/junitreports/jsonp-junit-report.xml
[JUnit test report builder] 50. Found a xml file: results/junitreports/jsp-junit-report.xml
[JUnit test report builder] 51. Found a xml file: results/junitreports/jstl-junit-report.xml
[JUnit test report builder] 52. Found a xml file: results/junitreports/jta-junit-report.xml
[JUnit test report builder] 53. Found a xml file: results/junitreports/rmiiiop-junit-report.xml
[JUnit test report builder] 54. Found a xml file: results/junitreports/samples-junit-report.xml
[JUnit test report builder] 55. Found a xml file: results/junitreports/securityapi-junit-report.xml
[JUnit test report builder] 56. Found a xml file: results/junitreports/servlet-junit-report.xml
[JUnit test report builder] 57. Found a xml file: results/junitreports/signaturetest_javaee-junit-report.xml
[JUnit test report builder] 58. Found a xml file: results/junitreports/webservices-junit-report.xml
[JUnit test report builder] 59. Found a xml file: results/junitreports/webservices12-junit-report.xml
[JUnit test report builder] 60. Found a xml file: results/junitreports/webservices13-junit-report.xml
[JUnit test report builder] 61. Found a xml file: results/junitreports/websocket-junit-report.xml
[JUnit test report builder] 62. Found a xml file: results/junitreports/xa-junit-report.xml
[JUnit test report builder] Generating HTML reports
processing: /var/jenkins/jobs/jakartaeetck-certification/builds/93/junit-reports-with-handlebars/xmlData/results/junitreports/appclient-junit-report.xml
processing: /var/jenkins/jobs/jakartaeetck-certification/builds/93/junit-reports-with-handlebars/xmlData/results/junitreports/compat12-junit-report.xml
processing: /var/jenkins/jobs/jakartaeetck-certification/builds/93/junit-reports-with-handlebars/xmlData/results/junitreports/compat13-junit-report.xml
processing: /var/jenkins/jobs/jakartaeetck-certification/builds/93/junit-reports-with-handlebars/xmlData/results/junitreports/concurrency-junit-report.xml
processing: /var/jenkins/jobs/jakartaeetck-certification/builds/93/junit-reports-with-handlebars/xmlData/results/junitreports/connector-junit-report.xml
processing: /var/jenkins/jobs/jakartaeetck-certification/builds/93/junit-reports-with-handlebars/xmlData/results/junitreports/ejb30_assembly-junit-report.xml
processing: /var/jenkins/jobs/jakartaeetck-certification/builds/93/junit-reports-with-handlebars/xmlData/results/junitreports/ejb30_bb-junit-report.xml
processing: /var/jenkins/jobs/jakartaeetck-certification/builds/93/junit-reports-with-handlebars/xmlData/results/junitreports/ejb30_lite_appexception-junit-report.xml
processing: /var/jenkins/jobs/jakartaeetck-certification/builds/93/junit-reports-with-handlebars/xmlData/results/junitreports/ejb30_lite_async-junit-report.xml
processing: /var/jenkins/jobs/jakartaeetck-certification/builds/93/junit-reports-with-handlebars/xmlData/results/junitreports/ejb30_lite_basic-junit-report.xml
processing: /var/jenkins/jobs/jakartaeetck-certification/builds/93/junit-reports-with-handlebars/xmlData/results/junitreports/ejb30_lite_ejbcontext-junit-report.xml
processing: /var/jenkins/jobs/jakartaeetck-certification/builds/93/junit-reports-with-handlebars/xmlData/results/junitreports/ejb30_lite_enventry-junit-report.xml
processing: /var/jenkins/jobs/jakartaeetck-certification/builds/93/junit-reports-with-handlebars/xmlData/results/junitreports/ejb30_lite_interceptor-junit-report.xml
processing: /var/jenkins/jobs/jakartaeetck-certification/builds/93/junit-reports-with-handlebars/xmlData/results/junitreports/ejb30_lite_lookup-junit-report.xml
processing: /var/jenkins/jobs/jakartaeetck-certification/builds/93/junit-reports-with-handlebars/xmlData/results/junitreports/ejb30_lite_naming-junit-report.xml
processing: /var/jenkins/jobs/jakartaeetck-certification/builds/93/junit-reports-with-handlebars/xmlData/results/junitreports/ejb30_lite_nointerface-junit-report.xml
processing: /var/jenkins/jobs/jakartaeetck-certification/builds/93/junit-reports-with-handlebars/xmlData/results/junitreports/ejb30_lite_packaging-junit-report.xml
processing: /var/jenkins/jobs/jakartaeetck-certification/builds/93/junit-reports-with-handlebars/xmlData/results/junitreports/ejb30_lite_singleton-junit-report.xml
processing: /var/jenkins/jobs/jakartaeetck-certification/builds/93/junit-reports-with-handlebars/xmlData/results/junitreports/ejb30_lite_stateful-junit-report.xml
processing: /var/jenkins/jobs/jakartaeetck-certification/builds/93/junit-reports-with-handlebars/xmlData/results/junitreports/ejb30_lite_view-junit-report.xml
processing: /var/jenkins/jobs/jakartaeetck-certification/builds/93/junit-reports-with-handlebars/xmlData/results/junitreports/ejb30_lite_xmloverride-junit-report.xml
processing: /var/jenkins/jobs/jakartaeetck-certification/builds/93/junit-reports-with-handlebars/xmlData/results/junitreports/ejb30_sec-junit-report.xml
processing: /var/jenkins/jobs/jakartaeetck-certification/builds/93/junit-reports-with-handlebars/xmlData/results/junitreports/ejb30_timer-junit-report.xml
processing: /var/jenkins/jobs/jakartaeetck-certification/builds/93/junit-reports-with-handlebars/xmlData/results/junitreports/ejb30_zombie-junit-report.xml
processing: /var/jenkins/jobs/jakartaeetck-certification/builds/93/junit-reports-with-handlebars/xmlData/results/junitreports/ejb32-junit-report.xml
processing: /var/jenkins/jobs/jakartaeetck-certification/builds/93/junit-reports-with-handlebars/xmlData/results/junitreports/integration-junit-report.xml
processing: /var/jenkins/jobs/jakartaeetck-certification/builds/93/junit-reports-with-handlebars/xmlData/results/junitreports/interop-junit-report.xml
processing: /var/jenkins/jobs/jakartaeetck-certification/builds/93/junit-reports-with-handlebars/xmlData/results/junitreports/j2eetools-junit-report.xml
processing: /var/jenkins/jobs/jakartaeetck-certification/builds/93/junit-reports-with-handlebars/xmlData/results/junitreports/jacc-junit-report.xml
processing: /var/jenkins/jobs/jakartaeetck-certification/builds/93/junit-reports-with-handlebars/xmlData/results/junitreports/jaspic-junit-report.xml
processing: /var/jenkins/jobs/jakartaeetck-certification/builds/93/junit-reports-with-handlebars/xmlData/results/junitreports/javaee-junit-report.xml
processing: /var/jenkins/jobs/jakartaeetck-certification/builds/93/junit-reports-with-handlebars/xmlData/results/junitreports/javamail-junit-report.xml
processing: /var/jenkins/jobs/jakartaeetck-certification/builds/93/junit-reports-with-handlebars/xmlData/results/junitreports/jaxr-junit-report.xml
processing: /var/jenkins/jobs/jakartaeetck-certification/builds/93/junit-reports-with-handlebars/xmlData/results/junitreports/jaxrpc-junit-report.xml
processing: /var/jenkins/jobs/jakartaeetck-certification/builds/93/junit-reports-with-handlebars/xmlData/results/junitreports/jaxrs-junit-report.xml
processing: /var/jenkins/jobs/jakartaeetck-certification/builds/93/junit-reports-with-handlebars/xmlData/results/junitreports/jbatch-junit-report.xml
processing: /var/jenkins/jobs/jakartaeetck-certification/builds/93/junit-reports-with-handlebars/xmlData/results/junitreports/jdbc_appclient-junit-report.xml
processing: /var/jenkins/jobs/jakartaeetck-certification/builds/93/junit-reports-with-handlebars/xmlData/results/junitreports/jdbc_ejb-junit-report.xml
processing: /var/jenkins/jobs/jakartaeetck-certification/builds/93/junit-reports-with-handlebars/xmlData/results/junitreports/jdbc_jsp-junit-report.xml
processing: /var/jenkins/jobs/jakartaeetck-certification/builds/93/junit-reports-with-handlebars/xmlData/results/junitreports/jdbc_servlet-junit-report.xml
processing: /var/jenkins/jobs/jakartaeetck-certification/builds/93/junit-reports-with-handlebars/xmlData/results/junitreports/jms-junit-report.xml
processing: /var/jenkins/jobs/jakartaeetck-certification/builds/93/junit-reports-with-handlebars/xmlData/results/junitreports/jpa_appmanaged-junit-report.xml
processing: /var/jenkins/jobs/jakartaeetck-certification/builds/93/junit-reports-with-handlebars/xmlData/results/junitreports/jpa_appmanagedNoTx-junit-report.xml
processing: /var/jenkins/jobs/jakartaeetck-certification/builds/93/junit-reports-with-handlebars/xmlData/results/junitreports/jpa_pmservlet-junit-report.xml
processing: /var/jenkins/jobs/jakartaeetck-certification/builds/93/junit-reports-with-handlebars/xmlData/results/junitreports/jpa_puservlet-junit-report.xml
processing: /var/jenkins/jobs/jakartaeetck-certification/builds/93/junit-reports-with-handlebars/xmlData/results/junitreports/jpa_stateful3-junit-report.xml
processing: /var/jenkins/jobs/jakartaeetck-certification/builds/93/junit-reports-with-handlebars/xmlData/results/junitreports/jpa_stateless3-junit-report.xml
processing: /var/jenkins/jobs/jakartaeetck-certification/builds/93/junit-reports-with-handlebars/xmlData/results/junitreports/jsf-junit-report.xml
processing: /var/jenkins/jobs/jakartaeetck-certification/builds/93/junit-reports-with-handlebars/xmlData/results/junitreports/jsonb-junit-report.xml
processing: /var/jenkins/jobs/jakartaeetck-certification/builds/93/junit-reports-with-handlebars/xmlData/results/junitreports/jsonp-junit-report.xml
processing: /var/jenkins/jobs/jakartaeetck-certification/builds/93/junit-reports-with-handlebars/xmlData/results/junitreports/jsp-junit-report.xml
processing: /var/jenkins/jobs/jakartaeetck-certification/builds/93/junit-reports-with-handlebars/xmlData/results/junitreports/jstl-junit-report.xml
processing: /var/jenkins/jobs/jakartaeetck-certification/builds/93/junit-reports-with-handlebars/xmlData/results/junitreports/jta-junit-report.xml
processing: /var/jenkins/jobs/jakartaeetck-certification/builds/93/junit-reports-with-handlebars/xmlData/results/junitreports/rmiiiop-junit-report.xml
processing: /var/jenkins/jobs/jakartaeetck-certification/builds/93/junit-reports-with-handlebars/xmlData/results/junitreports/samples-junit-report.xml
processing: /var/jenkins/jobs/jakartaeetck-certification/builds/93/junit-reports-with-handlebars/xmlData/results/junitreports/securityapi-junit-report.xml
processing: /var/jenkins/jobs/jakartaeetck-certification/builds/93/junit-reports-with-handlebars/xmlData/results/junitreports/servlet-junit-report.xml
processing: /var/jenkins/jobs/jakartaeetck-certification/builds/93/junit-reports-with-handlebars/xmlData/results/junitreports/signaturetest_javaee-junit-report.xml
processing: /var/jenkins/jobs/jakartaeetck-certification/builds/93/junit-reports-with-handlebars/xmlData/results/junitreports/webservices-junit-report.xml
processing: /var/jenkins/jobs/jakartaeetck-certification/builds/93/junit-reports-with-handlebars/xmlData/results/junitreports/webservices12-junit-report.xml
processing: /var/jenkins/jobs/jakartaeetck-certification/builds/93/junit-reports-with-handlebars/xmlData/results/junitreports/webservices13-junit-report.xml
processing: /var/jenkins/jobs/jakartaeetck-certification/builds/93/junit-reports-with-handlebars/xmlData/results/junitreports/websocket-junit-report.xml
processing: /var/jenkins/jobs/jakartaeetck-certification/builds/93/junit-reports-with-handlebars/xmlData/results/junitreports/xa-junit-report.xml
[JUnit test report builder] Copying report to workspace directory: file:/home/jenkins/agent/workspace/jakartaeetck-certification/junit-reports-with-handlebars
Archiving artifacts
[description-setter] Description set: 
Finished: FAILURE