Skip to content

Regression

com.sun.ts.tests.jstl.spec.core.iteration.foreach.JSTLClient.positiveItemsNullTest (from tags-tck)

Failing for the past 1 build (Since #67 )
Took 2 sec.

Error Message

test result: Failed. Test case throws exception: [BaseUrlClient] positiveItemsNullTest failed! Check output for cause of failure.

Stacktrace

test result: Failed. Test case throws exception: [BaseUrlClient] positiveItemsNullTest failed! Check output for cause of failure.

Standard Output

#Test Results (version 2)
#Tue Aug 18 13:11:25 UTC 2020
#-----testdescription-----
$file=/home/jenkins/agent/workspace/jakartaee-tck_master/tags-tck/src/com/sun/ts/tests/jstl/spec/core/iteration/foreach/JSTLClient.java
$root=/home/jenkins/agent/workspace/jakartaee-tck_master/tags-tck/src
assertion_ids=JSTL\:SPEC\:21  The  < c\:forEach >  action repeats its nested body\n\t\t\t\tcontent over a collection of objects or repeats a fixed number of \n\t\t\t\ttimes.\nJSTL\:SPEC\:21.12  If 'items' is null, it is treated as an empty\n\t\t\t\t\t\tcollection (no iteration is performed).
classname=com.sun.ts.tests.jstl.spec.core.iteration.foreach.JSTLClient
direction=forward
finder=cts
id=positiveItemsNullTest
keywords=all jstl javaee javaee_web_profile positiveItemsNullTest novehicle forward
service_eetest=no
testName=positiveItemsNullTest
testProps=\ webServerHost  webServerPort  ts_home
test_directory=com/sun/ts/tests/jstl/spec/core/iteration/foreach

#-----environment-----
JAVA_HOME=/opt/jdk1.8.0_191/jre
JAVA_OPTIONS=
LOCAL_CLASSES=/home/jenkins/agent/workspace/jakartaee-tck_master/tags-tck/bin/xml/../../lib/tsharness.jar\:/home/jenkins/agent/workspace/jakartaee-tck_master/tags-tck/bin/xml/../../lib/jstltck.jar\:/home/jenkins/agent/workspace/jakartaee-tck_master/tags-tck/bin/xml/../../lib/javatest.jar\:/home/jenkins/agent/workspace/jakartaee-tck_master/tags-tck/bin/xml/../../classes\:/home/jenkins/agent/workspace/jakartaee-tck_master/glassfish6/glassfish/modules/jakarta.servlet.jsp.jstl.jar\:/home/jenkins/agent/workspace/jakartaee-tck_master/glassfish6/glassfish/modules/jakarta.servlet.jsp.jstl-api.jar\:/home/jenkins/agent/workspace/jakartaee-tck_master/glassfish6/glassfish/modules/jakarta.servlet-api.jar\:/home/jenkins/agent/workspace/jakartaee-tck_master/glassfish6/glassfish/modules/jakarta.servlet.jsp.jar\:/home/jenkins/agent/workspace/jakartaee-tck_master/glassfish6/glassfish/modules/jakarta.servlet.jsp-api.jar\:/home/jenkins/agent/workspace/jakartaee-tck_master/glassfish6/glassfish/modules/jakarta.el.jar\:/home/jenkins/agent/workspace/jakartaee-tck_master/glassfish6/glassfish/modules/jakarta.el-api.jar\:/home/jenkins/agent/workspace/jakartaee-tck_master/glassfish6/glassfish/../javadb/lib/derbyclient.jar\:/home/jenkins/agent/workspace/jakartaee-tck_master/tags-tck/bin/xml/../../lib/commons-httpclient-3.1.jar\:/home/jenkins/agent/workspace/jakartaee-tck_master/tags-tck/bin/xml/../../lib/commons-codec-1.9.jar\:/home/jenkins/agent/workspace/jakartaee-tck_master/tags-tck/bin/xml/../../lib/commons-logging-1.1.3.jar\:/home/jenkins/agent/workspace/jakartaee-tck_master/tags-tck/bin/xml/../../lib/sigtest.jar
SYSTEMROOT=${env.SystemRoot}
TS_HOME=/home/jenkins/agent/workspace/jakartaee-tck_master/tags-tck/bin/xml/../..
command.testExecute=com.sun.ts.lib.harness.ExecTSTestCmd CLASSPATH\=${JAVA_HOME}/lib/rt.jar${pathsep}${LOCAL_CLASSES} HOME\="${user.home}" windir\=${windir} SYSTEMROOT\=${SYSTEMROOT} ${JAVA_HOME}/bin/java ${JAVA_OPTIONS} $testExecuteClass $testExecuteArgs
harness.executeMode=2
harness.log.delayseconds=1
harness.log.port=2000
harness.log.traceflag=true
harness.socket.retry.count=10
harness.temp.directory=${ts.home}/tmp
pathsep=\:
porting.ts.url.class.1=com.sun.ts.lib.implementation.sun.common.SunRIURL
ts.home=/home/jenkins/agent/workspace/jakartaee-tck_master/tags-tck/bin/xml/../..
ts_home=${TS_HOME}
user.home=?
webServerHost=localhost
webServerPort=8080
windir=${env.windir}

#-----testresult-----
description=file\:/home/jenkins/agent/workspace/jakartaee-tck_master/tags-tck/src/com/sun/ts/tests/jstl/spec/core/iteration/foreach/JSTLClient.java\#positiveItemsNullTest
end=Tue Aug 18 13\:11\:25 UTC 2020
environment=ts_unix
execStatus=Failed. Test case throws exception\: [BaseUrlClient] positiveItemsNullTest failed\! Check output for cause of failure.
harnessLoaderMode=Classpath Loader
harnessVariety=Full Bundle
javatestOS=Linux 3.10.0-1062.12.1.el7.x86_64 (amd64)
javatestVersion=5.0
script=com.sun.ts.lib.harness.TSScript
sections=script_messages TestRun
start=Tue Aug 18 13\:11\:23 UTC 2020
test=com/sun/ts/tests/jstl/spec/core/iteration/foreach/JSTLClient.java\#positiveItemsNullTest
timeoutSeconds=600
totalTime=1497
work=/home/jenkins/agent/workspace/jakartaee-tck_master/tags-tckwork/tags-tck/com/sun/ts/tests/jstl/spec/core/iteration/foreach

#section:script_messages
----------messages:(0/0)----------

#section:TestRun
----------messages:(1/1914)----------
command: com.sun.ts.lib.harness.ExecTSTestCmd CLASSPATH=:/opt/jdk1.8.0_191/jre/lib/rt.jar:/home/jenkins/agent/workspace/jakartaee-tck_master/tags-tck/bin/xml/../../lib/tsharness.jar:/home/jenkins/agent/workspace/jakartaee-tck_master/tags-tck/bin/xml/../../lib/jstltck.jar:/home/jenkins/agent/workspace/jakartaee-tck_master/tags-tck/bin/xml/../../lib/javatest.jar:/home/jenkins/agent/workspace/jakartaee-tck_master/tags-tck/bin/xml/../../classes:/home/jenkins/agent/workspace/jakartaee-tck_master/glassfish6/glassfish/modules/jakarta.servlet.jsp.jstl.jar:/home/jenkins/agent/workspace/jakartaee-tck_master/glassfish6/glassfish/modules/jakarta.servlet.jsp.jstl-api.jar:/home/jenkins/agent/workspace/jakartaee-tck_master/glassfish6/glassfish/modules/jakarta.servlet-api.jar:/home/jenkins/agent/workspace/jakartaee-tck_master/glassfish6/glassfish/modules/jakarta.servlet.jsp.jar:/home/jenkins/agent/workspace/jakartaee-tck_master/glassfish6/glassfish/modules/jakarta.servlet.jsp-api.jar:/home/jenkins/agent/workspace/jakartaee-tck_master/glassfish6/glassfish/modules/jakarta.el.jar:/home/jenkins/agent/workspace/jakartaee-tck_master/glassfish6/glassfish/modules/jakarta.el-api.jar:/home/jenkins/agent/workspace/jakartaee-tck_master/glassfish6/glassfish/../javadb/lib/derbyclient.jar:/home/jenkins/agent/workspace/jakartaee-tck_master/tags-tck/bin/xml/../../lib/commons-httpclient-3.1.jar:/home/jenkins/agent/workspace/jakartaee-tck_master/tags-tck/bin/xml/../../lib/commons-codec-1.9.jar:/home/jenkins/agent/workspace/jakartaee-tck_master/tags-tck/bin/xml/../../lib/commons-logging-1.1.3.jar:/home/jenkins/agent/workspace/jakartaee-tck_master/tags-tck/bin/xml/../../lib/sigtest.jar HOME=? windir= SYSTEMROOT= /opt/jdk1.8.0_191/jre/bin/java com.sun.ts.tests.jstl.spec.core.iteration.foreach.JSTLClient -p /home/jenkins/agent/workspace/jakartaee-tck_master/tags-tck/bin/xml/../../tmp/tstest.jte -t positiveItemsNullTest
----------log:(88/6513)----------
************************************************************
* props file set to "/tmp/?-cts-props.txt"
************************************************************
08-18-2020 13:11:24:  TRACE: #######  Value of harness.socket.retry.count is "10"
08-18-2020 13:11:24:  TRACE: #######  Value of harness.log.port is "2000"
08-18-2020 13:11:24:  TRACE: #######  Actual bind value of harness.log.port is "2000"
08-18-2020 13:11:24:  TRACE: *** in EETest.run(argv,p)
08-18-2020 13:11:24:  TRACE: TESTCLASS=com.sun.ts.tests.jstl.spec.core.iteration.foreach.JSTLClient
08-18-2020 13:11:24:  TRACE: ** IN getRunMethod: testClass=com.sun.ts.tests.jstl.spec.core.iteration.foreach.JSTLClient
08-18-2020 13:11:24:  TRACE: ** IN getRunMethod: testname=positiveItemsNullTest
08-18-2020 13:11:24:  TRACE: ** GOT RUN METHOD!
08-18-2020 13:11:24:  TRACE: **runmethod=positiveItemsNullTest
08-18-2020 13:11:24:  TRACE: ABOUT TO GET SETUP METHOD!
08-18-2020 13:11:24:  TRACE: No setupMethod annotation present
08-18-2020 13:11:24:  TRACE: getSetupMethod - checking for testcase specific setup method:  positiveItemsNullTest_setup
08-18-2020 13:11:24:  TRACE: getSetupMethod - checking for default class specific setup method
08-18-2020 13:11:24:  TRACE: GOT SETUP METHOD!
08-18-2020 13:11:24:  TRACE: No cleanupMethod annotation present
08-18-2020 13:11:24:  TRACE: getCleanupMethod - checking for testcase specific cleanup method:  positiveItemsNullTest_cleanup
08-18-2020 13:11:24:  TRACE: getCleanupMethod - checking for default class specific cleanup method
08-18-2020 13:11:24:  TRACE: GOT CLEANUP METHOD!
08-18-2020 13:11:24:  TRACE: ABOUT TO INVOKE SETUP METHOD!
08-18-2020 13:11:24:  [BaseUrlClient] Test setup OK
08-18-2020 13:11:24:  TRACE: INVOKED SETUP METHOD!
08-18-2020 13:11:24:  TRACE: ABOUT TO INVOKE EETEST RUN METHOD!
08-18-2020 13:11:24:  TRACE: [BaseUrlClient] EXECUTING
08-18-2020 13:11:24:  ERROR: Root cause of Failure: Connection refused (Connection refused)
08-18-2020 13:11:24:  ERROR: java.net.ConnectException: Connection refused (Connection refused)
	at java.net.PlainSocketImpl.socketConnect(Native Method)
	at java.net.AbstractPlainSocketImpl.doConnect(AbstractPlainSocketImpl.java:350)
	at java.net.AbstractPlainSocketImpl.connectToAddress(AbstractPlainSocketImpl.java:206)
	at java.net.AbstractPlainSocketImpl.connect(AbstractPlainSocketImpl.java:188)
	at java.net.SocksSocketImpl.connect(SocksSocketImpl.java:392)
	at java.net.Socket.connect(Socket.java:589)
	at java.net.Socket.connect(Socket.java:538)
	at java.net.Socket.<init>(Socket.java:434)
	at java.net.Socket.<init>(Socket.java:286)
	at org.apache.commons.httpclient.protocol.DefaultProtocolSocketFactory.createSocket(DefaultProtocolSocketFactory.java:80)
	at org.apache.commons.httpclient.protocol.DefaultProtocolSocketFactory.createSocket(DefaultProtocolSocketFactory.java:122)
	at org.apache.commons.httpclient.HttpConnection.open(HttpConnection.java:707)
	at com.sun.ts.tests.common.webclient.http.HttpRequest.execute(HttpRequest.java:409)
	at com.sun.ts.tests.common.webclient.WebTestCase.execute(WebTestCase.java:171)
	at com.sun.ts.tests.common.webclient.BaseUrlClient.invoke(BaseUrlClient.java:455)
	at com.sun.ts.tests.jstl.spec.core.iteration.foreach.JSTLClient.positiveItemsNullTest(JSTLClient.java:267)
	at sun.reflect.NativeMethodAccessorImpl.invoke0(Native Method)
	at sun.reflect.NativeMethodAccessorImpl.invoke(NativeMethodAccessorImpl.java:62)
	at sun.reflect.DelegatingMethodAccessorImpl.invoke(DelegatingMethodAccessorImpl.java:43)
	at java.lang.reflect.Method.invoke(Method.java:498)
	at com.sun.ts.lib.harness.EETest.run(EETest.java:596)
	at com.sun.ts.lib.harness.EETest.getPropsReady(EETest.java:486)
	at com.sun.ts.lib.harness.EETest.run(EETest.java:337)
	at com.sun.ts.tests.jstl.spec.core.iteration.foreach.JSTLClient.run(JSTLClient.java:64)
	at com.sun.ts.tests.jstl.spec.core.iteration.foreach.JSTLClient.main(JSTLClient.java:50)

08-18-2020 13:11:24:  ERROR: Test case throws exception: [BaseUrlClient] positiveItemsNullTest failed! Check output for cause of failure.
08-18-2020 13:11:24:  ERROR: Exception at:  
08-18-2020 13:11:24:  ERROR: com.sun.ts.tests.common.webclient.TestFailureException: [FATAL] Unexpected failure during test execution.Connection refused (Connection refused)
	at com.sun.ts.tests.common.webclient.WebTestCase.execute(WebTestCase.java:175)
	at com.sun.ts.tests.common.webclient.BaseUrlClient.invoke(BaseUrlClient.java:455)
	at com.sun.ts.tests.jstl.spec.core.iteration.foreach.JSTLClient.positiveItemsNullTest(JSTLClient.java:267)
	at sun.reflect.NativeMethodAccessorImpl.invoke0(Native Method)
	at sun.reflect.NativeMethodAccessorImpl.invoke(NativeMethodAccessorImpl.java:62)
	at sun.reflect.DelegatingMethodAccessorImpl.invoke(DelegatingMethodAccessorImpl.java:43)
	at java.lang.reflect.Method.invoke(Method.java:498)
	at com.sun.ts.lib.harness.EETest.run(EETest.java:596)
	at com.sun.ts.lib.harness.EETest.getPropsReady(EETest.java:486)
	at com.sun.ts.lib.harness.EETest.run(EETest.java:337)
	at com.sun.ts.tests.jstl.spec.core.iteration.foreach.JSTLClient.run(JSTLClient.java:64)
	at com.sun.ts.tests.jstl.spec.core.iteration.foreach.JSTLClient.main(JSTLClient.java:50)
Caused by: java.net.ConnectException: Connection refused (Connection refused)
	at java.net.PlainSocketImpl.socketConnect(Native Method)
	at java.net.AbstractPlainSocketImpl.doConnect(AbstractPlainSocketImpl.java:350)
	at java.net.AbstractPlainSocketImpl.connectToAddress(AbstractPlainSocketImpl.java:206)
	at java.net.AbstractPlainSocketImpl.connect(AbstractPlainSocketImpl.java:188)
	at java.net.SocksSocketImpl.connect(SocksSocketImpl.java:392)
	at java.net.Socket.connect(Socket.java:589)
	at java.net.Socket.connect(Socket.java:538)
	at java.net.Socket.<init>(Socket.java:434)
	at java.net.Socket.<init>(Socket.java:286)
	at org.apache.commons.httpclient.protocol.DefaultProtocolSocketFactory.createSocket(DefaultProtocolSocketFactory.java:80)
	at org.apache.commons.httpclient.protocol.DefaultProtocolSocketFactory.createSocket(DefaultProtocolSocketFactory.java:122)
	at org.apache.commons.httpclient.HttpConnection.open(HttpConnection.java:707)
	at com.sun.ts.tests.common.webclient.http.HttpRequest.execute(HttpRequest.java:409)
	at com.sun.ts.tests.common.webclient.WebTestCase.execute(WebTestCase.java:171)
	... 11 more

08-18-2020 13:11:24:  [BaseUrlClient] Test cleanup OK
STATUS:Failed.Test case throws exception: [BaseUrlClient] positiveItemsNullTest failed! Check output for cause of failure.
result: Failed. Test case throws exception: [BaseUrlClient] positiveItemsNullTest failed! Check output for cause of failure.


test result: Failed. Test case throws exception: [BaseUrlClient] positiveItemsNullTest failed! Check output for cause of failure.