Failed

com.sun.ts.tests.securityapi.securitycontext.callerdata.Client.testSecurityContextHasAccessToWebResource (from security-tck)

Failing for the past 1 build (Since Unstable#63 )
Took 2 sec.

Error Message

test result: Failed. Test case throws exception: [BaseUrlClient] null failed! Check output for cause of failure.

Stacktrace

test result: Failed. Test case throws exception: [BaseUrlClient] null failed! Check output for cause of failure.

Standard Output

#Test Results (version 2)
#Thu Jul 23 11:34:25 UTC 2020
#-----testdescription-----
$file=/home/jenkins/agent/workspace/jakartaee-tck_master/security-tck/src/com/sun/ts/tests/securityapi/securitycontext/callerdata/Client.java
$root=/home/jenkins/agent/workspace/jakartaee-tck_master/security-tck/src
assertion_ids=Security\:JAVADOC\:7  See assertion html documents.\nSecurity\:JAVADOC\:8  See assertion html documents.\nSecurity\:SPEC\:4.3-1  See assertion html documents.
classname=com.sun.ts.tests.securityapi.securitycontext.callerdata.Client
direction=forward
finder=cts
id=testSecurityContextHasAccessToWebResource
keywords=all securityapi javaee javaee_web_profile testSecurityContextHasAccessToWebResource novehicle forward
service_eetest=no
testName=testSecurityContextHasAccessToWebResource
testProps=\ webServerHost  webServerPort  ts_home
test_directory=com/sun/ts/tests/securityapi/securitycontext/callerdata

#-----environment-----
JAVA_HOME=/opt/jdk1.8.0_191/jre
JAVA_OPTIONS=
LOCAL_CLASSES=/home/jenkins/agent/workspace/jakartaee-tck_master/security-tck/bin/xml/../../classes\:/home/jenkins/agent/workspace/jakartaee-tck_master/glassfish6/glassfish/modules/jakarta.servlet-api.jar\:/home/jenkins/agent/workspace/jakartaee-tck_master/glassfish6/glassfish/modules/jakarta.security.enterprise-api.jar\:/home/jenkins/agent/workspace/jakartaee-tck_master/glassfish6/glassfish/modules/jakarta.security.auth.message-api.jar\:/home/jenkins/agent/workspace/jakartaee-tck_master/glassfish6/glassfish/modules/jakarta.annotation-api.jar\:/home/jenkins/agent/workspace/jakartaee-tck_master/glassfish6/glassfish/modules/jakarta.inject-api.jar\:/home/jenkins/agent/workspace/jakartaee-tck_master/glassfish6/glassfish/modules/jakarta.enterprise.cdi-api.jar\:/home/jenkins/agent/workspace/jakartaee-tck_master/glassfish6/glassfish/modules/jakarta.faces.jar\:/home/jenkins/agent/workspace/jakartaee-tck_master/glassfish6/glassfish/modules/jakarta.interceptor-api.jar\:/home/jenkins/agent/workspace/jakartaee-tck_master/glassfish6/glassfish/modules/jakarta.authentication-api.jar\:/home/jenkins/agent/workspace/jakartaee-tck_master/glassfish6/glassfish/modules/jakarta.ejb-api.jar\://home/jenkins/agent/workspace/jakartaee-tck_master/security-tck/bin/xml/../../lib/unboundid-ldapsdk.jar\:/home/jenkins/agent/workspace/jakartaee-tck_master/security-tck/bin/xml/../../lib/commons-httpclient-3.1.jar\:/home/jenkins/agent/workspace/jakartaee-tck_master/security-tck/bin/xml/../../lib/commons-logging-1.1.3.jar\:/home/jenkins/agent/workspace/jakartaee-tck_master/security-tck/bin/xml/../../lib/commons-codec-1.9.jar\:/home/jenkins/agent/workspace/jakartaee-tck_master/security-tck/bin/xml/../../lib/sigtest.jar\:/home/jenkins/agent/workspace/jakartaee-tck_master/security-tck/bin/xml/../../lib/javatest.jar\:/home/jenkins/agent/workspace/jakartaee-tck_master/security-tck/bin/xml/../../lib/tsharness.jar\:/home/jenkins/agent/workspace/jakartaee-tck_master/security-tck/bin/xml/../../lib/securityapitck.jar\:/home/jenkins/agent/workspace/jakartaee-tck_master/glassfish6/glassfish/../javadb/lib/derbyclient.jar\:/home/jenkins/agent/workspace/jakartaee-tck_master/security-tck/bin/xml/../../lib/jaxb-xjc.jar\:/home/jenkins/agent/workspace/jakartaee-tck_master/security-tck/bin/xml/../../lib/tsharness.jar\:/home/jenkins/agent/workspace/jakartaee-tck_master/security-tck/bin/xml/../../lib/securityapitck.jar\:/home/jenkins/agent/workspace/jakartaee-tck_master/security-tck/bin/xml/../../lib/javatest.jar\:/usr/share/ant/lib/ant.jar\:/home/jenkins/agent/workspace/jakartaee-tck_master/security-tck/bin/xml/../../lib/commons-logging-1.1.3.jar\:/home/jenkins/agent/workspace/jakartaee-tck_master/security-tck/bin/xml/../../lib/commons-io-2.4.jar\:/home/jenkins/agent/workspace/jakartaee-tck_master/security-tck/bin/xml/../../lib/commons-lang3-3.3.2.jar\:/home/jenkins/agent/workspace/jakartaee-tck_master/security-tck/bin/xml/../../lib/commons-codec-1.9.jar\:/home/jenkins/agent/workspace/jakartaee-tck_master/security-tck/bin/xml/../../lib/commons-collections-3.2.1.jar\:/home/jenkins/agent/workspace/jakartaee-tck_master/security-tck/bin/xml/../../lib/commons-httpclient-3.1.jar\:/home/jenkins/agent/workspace/jakartaee-tck_master/security-tck/bin/xml/../../lib/cssparser-0.9.25.jar\:/home/jenkins/agent/workspace/jakartaee-tck_master/security-tck/bin/xml/../../lib/htmlunit-2.15.jar\:/home/jenkins/agent/workspace/jakartaee-tck_master/security-tck/bin/xml/../../lib/htmlunit-core-js-2.15.jar\:/home/jenkins/agent/workspace/jakartaee-tck_master/security-tck/bin/xml/../../lib/httpcore-4.4.9.jar\:/home/jenkins/agent/workspace/jakartaee-tck_master/security-tck/bin/xml/../../lib/httpclient-4.5.5.jar\:/home/jenkins/agent/workspace/jakartaee-tck_master/security-tck/bin/xml/../../lib/httpmime-4.5.5.jar\:/home/jenkins/agent/workspace/jakartaee-tck_master/security-tck/bin/xml/../../lib/nekohtml-1.9.21.jar\:/home/jenkins/agent/workspace/jakartaee-tck_master/security-tck/bin/xml/../../lib/xercesImpl-2.11.0.jar\:/home/jenkins/agent/workspace/jakartaee-tck_master/security-tck/bin/xml/../../lib/xalan-2.7.2.jar\:/home/jenkins/agent/workspace/jakartaee-tck_master/security-tck/bin/xml/../../lib/serializer-2.7.2.jar\:/home/jenkins/agent/workspace/jakartaee-tck_master/security-tck/bin/xml/../../lib/relaxngDatatype.jar\:/home/jenkins/agent/workspace/jakartaee-tck_master/security-tck/bin/xml/../../lib/sac-1.3.jar\:/home/jenkins/agent/workspace/jakartaee-tck_master/security-tck/bin/xml/../../lib/saxpath.jar\:/home/jenkins/agent/workspace/jakartaee-tck_master/security-tck/bin/xml/../../lib/jaxen-1.1.6.jar\:/home/jenkins/agent/workspace/jakartaee-tck_master/security-tck/bin/xml/../../lib/jaxen-core-1.0.jar\:/home/jenkins/agent/workspace/jakartaee-tck_master/security-tck/bin/xml/../../lib/jdom-1.1.3.jar\:/home/jenkins/agent/workspace/jakartaee-tck_master/security-tck/bin/xml/../../lib/xml-apis-1.4.01.jar
SYSTEMROOT=${env.SystemRoot}
TS_HOME=/home/jenkins/agent/workspace/jakartaee-tck_master/security-tck/bin/xml/../..
command.testExecute=com.sun.ts.lib.harness.ExecTSTestCmd CLASSPATH\=${JAVA_HOME}/lib/rt.jar${pathsep}${LOCAL_CLASSES} HOME\="${user.home}" windir\=${windir} SYSTEMROOT\=${SYSTEMROOT} ${JAVA_HOME}/bin/java -Dbytecheck\=true -Djava.protocol.handler.pkgs\=javax.net.ssl -Djavax.net.ssl.keyStore\=${ts.home}/bin/certificates/clientcert.jks -Djavax.net.ssl.keyStorePassword\=changeit -Djavax.net.ssl.trustStore\=${web.home}/domains/domain1/config/cacerts.jks ${JAVA_OPTIONS} $testExecuteClass $testExecuteArgs
harness.executeMode=2
harness.log.delayseconds=1 
harness.log.port=2000
harness.log.traceflag=true
harness.socket.retry.count=10
harness.temp.directory=${TS_HOME}
pathsep=\:
porting.ts.HttpsURLConnection.class.1=com.sun.ts.lib.implementation.sun.javaee.SunRIHttpsURLConnection
porting.ts.url.class.1=com.sun.ts.lib.implementation.sun.common.SunRIURL
ts.home=/home/jenkins/agent/workspace/jakartaee-tck_master/security-tck/bin/xml/../..
ts_home=${ts.home}
user.home=?
web.home=/home/jenkins/agent/workspace/jakartaee-tck_master/glassfish6/glassfish
webServerHost=localhost
webServerPort=8080
windir=${env.windir}

#-----testresult-----
description=file\:/home/jenkins/agent/workspace/jakartaee-tck_master/security-tck/src/com/sun/ts/tests/securityapi/securitycontext/callerdata/Client.java\#testSecurityContextHasAccessToWebResource
end=Thu Jul 23 11\:34\:25 UTC 2020
environment=ts_unix
execStatus=Failed. Test case throws exception\: [BaseUrlClient] null failed\! Check output for cause of failure.
harnessLoaderMode=Classpath Loader
harnessVariety=Full Bundle
javatestOS=Linux 3.10.0-1062.el7.x86_64 (amd64)
javatestVersion=5.0
script=com.sun.ts.lib.harness.TSScript
sections=script_messages TestRun
start=Thu Jul 23 11\:34\:23 UTC 2020
test=com/sun/ts/tests/securityapi/securitycontext/callerdata/Client.java\#testSecurityContextHasAccessToWebResource
timeoutSeconds=600
totalTime=1494
work=/home/jenkins/agent/workspace/jakartaee-tck_master/security-tckwork/security-tck/com/sun/ts/tests/securityapi/securitycontext/callerdata

#section:script_messages
----------messages:(0/0)----------

#section:TestRun
----------messages:(1/5564)----------
command: com.sun.ts.lib.harness.ExecTSTestCmd CLASSPATH=:/opt/jdk1.8.0_191/jre/lib/rt.jar:/home/jenkins/agent/workspace/jakartaee-tck_master/security-tck/bin/xml/../../classes:/home/jenkins/agent/workspace/jakartaee-tck_master/glassfish6/glassfish/modules/jakarta.servlet-api.jar:/home/jenkins/agent/workspace/jakartaee-tck_master/glassfish6/glassfish/modules/jakarta.security.enterprise-api.jar:/home/jenkins/agent/workspace/jakartaee-tck_master/glassfish6/glassfish/modules/jakarta.security.auth.message-api.jar:/home/jenkins/agent/workspace/jakartaee-tck_master/glassfish6/glassfish/modules/jakarta.annotation-api.jar:/home/jenkins/agent/workspace/jakartaee-tck_master/glassfish6/glassfish/modules/jakarta.inject-api.jar:/home/jenkins/agent/workspace/jakartaee-tck_master/glassfish6/glassfish/modules/jakarta.enterprise.cdi-api.jar:/home/jenkins/agent/workspace/jakartaee-tck_master/glassfish6/glassfish/modules/jakarta.faces.jar:/home/jenkins/agent/workspace/jakartaee-tck_master/glassfish6/glassfish/modules/jakarta.interceptor-api.jar:/home/jenkins/agent/workspace/jakartaee-tck_master/glassfish6/glassfish/modules/jakarta.authentication-api.jar:/home/jenkins/agent/workspace/jakartaee-tck_master/glassfish6/glassfish/modules/jakarta.ejb-api.jar://home/jenkins/agent/workspace/jakartaee-tck_master/security-tck/bin/xml/../../lib/unboundid-ldapsdk.jar:/home/jenkins/agent/workspace/jakartaee-tck_master/security-tck/bin/xml/../../lib/commons-httpclient-3.1.jar:/home/jenkins/agent/workspace/jakartaee-tck_master/security-tck/bin/xml/../../lib/commons-logging-1.1.3.jar:/home/jenkins/agent/workspace/jakartaee-tck_master/security-tck/bin/xml/../../lib/commons-codec-1.9.jar:/home/jenkins/agent/workspace/jakartaee-tck_master/security-tck/bin/xml/../../lib/sigtest.jar:/home/jenkins/agent/workspace/jakartaee-tck_master/security-tck/bin/xml/../../lib/javatest.jar:/home/jenkins/agent/workspace/jakartaee-tck_master/security-tck/bin/xml/../../lib/tsharness.jar:/home/jenkins/agent/workspace/jakartaee-tck_master/security-tck/bin/xml/../../lib/securityapitck.jar:/home/jenkins/agent/workspace/jakartaee-tck_master/glassfish6/glassfish/../javadb/lib/derbyclient.jar:/home/jenkins/agent/workspace/jakartaee-tck_master/security-tck/bin/xml/../../lib/jaxb-xjc.jar:/home/jenkins/agent/workspace/jakartaee-tck_master/security-tck/bin/xml/../../lib/tsharness.jar:/home/jenkins/agent/workspace/jakartaee-tck_master/security-tck/bin/xml/../../lib/securityapitck.jar:/home/jenkins/agent/workspace/jakartaee-tck_master/security-tck/bin/xml/../../lib/javatest.jar:/usr/share/ant/lib/ant.jar:/home/jenkins/agent/workspace/jakartaee-tck_master/security-tck/bin/xml/../../lib/commons-logging-1.1.3.jar:/home/jenkins/agent/workspace/jakartaee-tck_master/security-tck/bin/xml/../../lib/commons-io-2.4.jar:/home/jenkins/agent/workspace/jakartaee-tck_master/security-tck/bin/xml/../../lib/commons-lang3-3.3.2.jar:/home/jenkins/agent/workspace/jakartaee-tck_master/security-tck/bin/xml/../../lib/commons-codec-1.9.jar:/home/jenkins/agent/workspace/jakartaee-tck_master/security-tck/bin/xml/../../lib/commons-collections-3.2.1.jar:/home/jenkins/agent/workspace/jakartaee-tck_master/security-tck/bin/xml/../../lib/commons-httpclient-3.1.jar:/home/jenkins/agent/workspace/jakartaee-tck_master/security-tck/bin/xml/../../lib/cssparser-0.9.25.jar:/home/jenkins/agent/workspace/jakartaee-tck_master/security-tck/bin/xml/../../lib/htmlunit-2.15.jar:/home/jenkins/agent/workspace/jakartaee-tck_master/security-tck/bin/xml/../../lib/htmlunit-core-js-2.15.jar:/home/jenkins/agent/workspace/jakartaee-tck_master/security-tck/bin/xml/../../lib/httpcore-4.4.9.jar:/home/jenkins/agent/workspace/jakartaee-tck_master/security-tck/bin/xml/../../lib/httpclient-4.5.5.jar:/home/jenkins/agent/workspace/jakartaee-tck_master/security-tck/bin/xml/../../lib/httpmime-4.5.5.jar:/home/jenkins/agent/workspace/jakartaee-tck_master/security-tck/bin/xml/../../lib/nekohtml-1.9.21.jar:/home/jenkins/agent/workspace/jakartaee-tck_master/security-tck/bin/xml/../../lib/xercesImpl-2.11.0.jar:/home/jenkins/agent/workspace/jakartaee-tck_master/security-tck/bin/xml/../../lib/xalan-2.7.2.jar:/home/jenkins/agent/workspace/jakartaee-tck_master/security-tck/bin/xml/../../lib/serializer-2.7.2.jar:/home/jenkins/agent/workspace/jakartaee-tck_master/security-tck/bin/xml/../../lib/relaxngDatatype.jar:/home/jenkins/agent/workspace/jakartaee-tck_master/security-tck/bin/xml/../../lib/sac-1.3.jar:/home/jenkins/agent/workspace/jakartaee-tck_master/security-tck/bin/xml/../../lib/saxpath.jar:/home/jenkins/agent/workspace/jakartaee-tck_master/security-tck/bin/xml/../../lib/jaxen-1.1.6.jar:/home/jenkins/agent/workspace/jakartaee-tck_master/security-tck/bin/xml/../../lib/jaxen-core-1.0.jar:/home/jenkins/agent/workspace/jakartaee-tck_master/security-tck/bin/xml/../../lib/jdom-1.1.3.jar:/home/jenkins/agent/workspace/jakartaee-tck_master/security-tck/bin/xml/../../lib/xml-apis-1.4.01.jar HOME=? windir= SYSTEMROOT= /opt/jdk1.8.0_191/jre/bin/java -Dbytecheck=true -Djava.protocol.handler.pkgs=javax.net.ssl -Djavax.net.ssl.keyStore=/home/jenkins/agent/workspace/jakartaee-tck_master/security-tck/bin/xml/../../bin/certificates/clientcert.jks -Djavax.net.ssl.keyStorePassword=changeit -Djavax.net.ssl.trustStore=/home/jenkins/agent/workspace/jakartaee-tck_master/glassfish6/glassfish/domains/domain1/config/cacerts.jks com.sun.ts.tests.securityapi.securitycontext.callerdata.Client -p /home/jenkins/agent/workspace/jakartaee-tck_master/security-tck/bin/xml/../../tmp/tstest.jte -t testSecurityContextHasAccessToWebResource
----------log:(67/7822)*----------
************************************************************
* props file set to "/tmp/?-cts-props.txt"
************************************************************
07-23-2020 11:34:23:  TRACE: #######  Value of harness.socket.retry.count is "10"
07-23-2020 11:34:23:  TRACE: #######  Value of harness.log.port is "2000"
07-23-2020 11:34:23:  TRACE: #######  Actual bind value of harness.log.port is "2000"
07-23-2020 11:34:23:  TRACE: *** in EETest.run(argv,p)
07-23-2020 11:34:23:  TRACE: TESTCLASS=com.sun.ts.tests.securityapi.securitycontext.callerdata.Client
07-23-2020 11:34:23:  TRACE: ** IN getRunMethod: testClass=com.sun.ts.tests.securityapi.securitycontext.callerdata.Client
07-23-2020 11:34:23:  TRACE: ** IN getRunMethod: testname=testSecurityContextHasAccessToWebResource
07-23-2020 11:34:23:  TRACE: ** GOT RUN METHOD!
07-23-2020 11:34:23:  TRACE: **runmethod=testSecurityContextHasAccessToWebResource
07-23-2020 11:34:23:  TRACE: ABOUT TO GET SETUP METHOD!
07-23-2020 11:34:23:  TRACE: No setupMethod annotation present
07-23-2020 11:34:23:  TRACE: getSetupMethod - checking for testcase specific setup method:  testSecurityContextHasAccessToWebResource_setup
07-23-2020 11:34:23:  TRACE: getSetupMethod - checking for default class specific setup method
07-23-2020 11:34:23:  TRACE: GOT SETUP METHOD!
07-23-2020 11:34:23:  TRACE: No cleanupMethod annotation present
07-23-2020 11:34:23:  TRACE: getCleanupMethod - checking for testcase specific cleanup method:  testSecurityContextHasAccessToWebResource_cleanup
07-23-2020 11:34:23:  TRACE: getCleanupMethod - checking for default class specific cleanup method
07-23-2020 11:34:23:  TRACE: GOT CLEANUP METHOD!
07-23-2020 11:34:23:  TRACE: ABOUT TO INVOKE SETUP METHOD!
07-23-2020 11:34:23:  [BaseUrlClient] Test setup OK
07-23-2020 11:34:23:  TRACE: INVOKED SETUP METHOD!
07-23-2020 11:34:23:  TRACE: ABOUT TO INVOKE EETEST RUN METHOD!
07-23-2020 11:34:23:  [Client]: Sending request with Authroization header...
07-23-2020 11:34:24:  TRACE: [HttpRequest] Added credentials for 'tom' with password 'secret1' in realm 'null'
07-23-2020 11:34:24:  TRACE: [HttpRequest] Added credentials for 'tom' with password 'secret1' in realm 'null'
07-23-2020 11:34:24:  TRACE: [BaseUrlClient] EXECUTING
07-23-2020 11:34:24:  [HttpRequest] Dispatching request: 'GET /securityapi_securitycontext_callerdata_web/servlet2 HTTP/1.1' to target server at 'localhost:8080'
07-23-2020 11:34:24:  TRACE: ########## The real value set: false
07-23-2020 11:34:24:  TRACE: [WIRE] - >> "GET /securityapi_securitycontext_callerdata_web/servlet2 HTTP/1.1[\\r][\\n]"
07-23-2020 11:34:24:  TRACE: [WIRE] - >> "Authorization: Basic dG9tOnNlY3JldDE=[\\r][\\n]"
07-23-2020 11:34:24:  TRACE: [WIRE] - >> "User-Agent: Jakarta Commons-HttpClient/3.1[\\r][\\n]"
07-23-2020 11:34:24:  TRACE: [WIRE] - >> "Host: localhost:8080[\\r][\\n]"
07-23-2020 11:34:24:  TRACE: [WIRE] - >> "[\\r][\\n]"
07-23-2020 11:34:24:  TRACE: [WIRE] - << "HTTP/1.1 500 Internal Server Error[\\r][\\n]"
07-23-2020 11:34:24:  TRACE: [WIRE] - << "HTTP/1.1 500 Internal Server Error[\\r][\\n]"
07-23-2020 11:34:24:  TRACE: [WIRE] - << "Content-Language: [\\r][\\n]"
07-23-2020 11:34:24:  TRACE: [WIRE] - << "Content-Type: text/html[\\r][\\n]"
07-23-2020 11:34:24:  TRACE: [WIRE] - << "Connection: close[\\r][\\n]"
07-23-2020 11:34:24:  TRACE: [WIRE] - << "Content-Length: 1350[\\r][\\n]"
07-23-2020 11:34:24:  TRACE: [WIRE] - << "[\\r][\\n]"
07-23-2020 11:34:24:  TRACE: [WIRE] - << "<!DOCTYPE html PUBLIC "-//W3C//DTD XHTML 1.0 Strict//EN" "http://www.w3.org/TR/xhtml1/DTD/xhtml1-strict.dtd"><html xmlns="http://www.w3.org/1999/xhtml"><head><title>Eclipse GlassFish  6.0.0  - Error report</title><style type="text/css"><!--H1 {font-family:Tahoma,Arial,sans-serif;color:white;background-color:#525D76;font-size:22px;} H2 {font-family:Tahoma,Arial,sans-serif;color:white;background-color:#525D76;font-size:16px;} H3 {font-family:Tahoma,Arial,sans-serif;color:white;background-color:#525D76;font-size:14px;} BODY {font-family:Tahoma,Arial,sans-serif;color:black;background-color:white;} B {font-family:Tahoma,Arial,sans-serif;color:white;background-color:#525D76;} P {font-family:Tahoma,Arial,sans-serif;background:white;color:black;font-size:12px;}A {color : black;}HR {color : #525D76;}--></style> </head><body><h1>HTTP Status 500 - Internal Server Error</h1><hr/><p><b>type</b> Exception report</p><p><b>message</b>Internal Server Error</p><p><b>description</b>The server encountered an internal error that prevented it from fulfilling this request.</p><p><b>exception</b> <pre>java.lang.IllegalArgumentException: unknown handler key</pre></p><p><b>note</b> <u>The full stack traces of the exception and its root causes are available in the Eclipse GlassFish  6.0.0  logs.</u></p><hr/><h3>Eclipse GlassFish  6.0.0 </h3></body></html>"
07-23-2020 11:34:24:  TRACE: [WIRE] - HttpConnectionManager is null.  Connection cannot be released.
07-23-2020 11:34:24:  ERROR: [WebValidatorBase] Unexpected '500' received from target server!
Error response recieved from server:
------------------------------------------------
<!DOCTYPE html PUBLIC "-//W3C//DTD XHTML 1.0 Strict//EN" "http://www.w3.org/TR/xhtml1/DTD/xhtml1-strict.dtd"><html xmlns="http://www.w3.org/1999/xhtml"><head><title>Eclipse GlassFish  6.0.0  - Error report</title><style type="text/css"><!--H1 {font-family:Tahoma,Arial,sans-serif;color:white;background-color:#525D76;font-size:22px;} H2 {font-family:Tahoma,Arial,sans-serif;color:white;background-color:#525D76;font-size:16px;} H3 {font-family:Tahoma,Arial,sans-serif;color:white;background-color:#525D76;font-size:14px;} BODY {font-family:Tahoma,Arial,sans-serif;color:black;background-color:white;} B {font-family:Tahoma,Arial,sans-serif;color:white;background-color:#525D76;} P {font-family:Tahoma,Arial,sans-serif;background:white;color:black;font-size:12px;}A {color : black;}HR {color : #525D76;}--></style> </head><body><h1>HTTP Status 500 - Internal Server Error</h1><hr/><p><b>type</b> Exception report</p><p><b>message</b>Internal Server Error</p><p><b>description</b>The server encountered an internal error that prevented it from fulfilling this request.</p><p><b>exception</b> <pre>java.lang.IllegalArgumentException: unknown handler key</pre></p><p><b>note</b> <u>The full stack traces of the exception and its root causes are available in the Eclipse GlassFish  6.0.0  logs.</u></p><hr/><h3>Eclipse GlassFish  6.0.0 </h3></body></html>
07-23-2020 11:34:24:  ERROR: Test case throws exception: [BaseUrlClient] null failed! Check output for cause of failure.
07-23-2020 11:34:24:  ERROR: Exception at:  
07-23-2020 11:34:24:  ERROR: com.sun.ts.tests.common.webclient.TestFailureException: Test FAILED!
	at com.sun.ts.tests.common.webclient.WebTestCase.execute(WebTestCase.java:180)
	at com.sun.ts.tests.common.webclient.BaseUrlClient.invoke(BaseUrlClient.java:455)
	at com.sun.ts.tests.securityapi.securitycontext.callerdata.Client.testSecurityContextHasAccessToWebResource(Client.java:146)
	at sun.reflect.NativeMethodAccessorImpl.invoke0(Native Method)
	at sun.reflect.NativeMethodAccessorImpl.invoke(NativeMethodAccessorImpl.java:62)
	at sun.reflect.DelegatingMethodAccessorImpl.invoke(DelegatingMethodAccessorImpl.java:43)
	at java.lang.reflect.Method.invoke(Method.java:498)
	at com.sun.ts.lib.harness.EETest.run(EETest.java:596)
	at com.sun.ts.lib.harness.EETest.getPropsReady(EETest.java:486)
	at com.sun.ts.lib.harness.EETest.run(EETest.java:337)
	at com.sun.ts.tests.securityapi.securitycontext.callerdata.Client.run(Client.java:58)
	at com.sun.ts.tests.securityapi.securitycontext.callerdata.Client.main(Client.java:45)

07-23-2020 11:34:24:  [BaseUrlClient] Test cleanup OK
STATUS:Failed.Test case throws exception: [BaseUrlClient] null failed! Check output for cause of failure.
result: Failed. Test case throws exception: [BaseUrlClient] null failed! Check output for cause of failure.


test result: Failed. Test case throws exception: [BaseUrlClient] null failed! Check output for cause of failure.