FailedConsole Output

Started by GitHub push by bshannon
Agent default-java-vntm0 is provisioned from template Kubernetes Pod Template
Agent specification [Kubernetes Pod Template] (): 

[EnvInject] - Loading node environment variables.
Building remotely on default-java-vntm0 in workspace /home/jenkins/workspace/firstcup-publish
[ssh-agent] Looking for ssh-agent implementation...
[ssh-agent]   Exec ssh-agent (binary ssh-agent on a remote machine)
$ ssh-agent
SSH_AUTH_SOCK=/tmp/ssh-S0PP23na4yDV/agent.96
SSH_AGENT_PID=98
[ssh-agent] Started.
Running ssh-add (command line suppressed)
Identity added: /home/jenkins/workspace/firstcup-publish@tmp/private_key_3396837008056656998.key (/home/jenkins/workspace/firstcup-publish@tmp/private_key_3396837008056656998.key)
[ssh-agent] Using credentials eclipse-jakartaee-platform-bot (GitHub Bot (SSH))
using credential d9f6b8a6-b073-4bee-83ac-76bc3eadc1f7
Cloning the remote Git repository
Cloning repository git@github.com:eclipse-ee4j/jakartaee-firstcup.git
 > git init /home/jenkins/workspace/firstcup-publish # timeout=10
Fetching upstream changes from git@github.com:eclipse-ee4j/jakartaee-firstcup.git
 > git --version # timeout=10
using GIT_SSH to set credentials GitHub Bot (SSH)
 > git fetch --tags --progress git@github.com:eclipse-ee4j/jakartaee-firstcup.git +refs/heads/*:refs/remotes/origin/*
 > git config remote.origin.url git@github.com:eclipse-ee4j/jakartaee-firstcup.git # timeout=10
 > git config --add remote.origin.fetch +refs/heads/*:refs/remotes/origin/* # timeout=10
 > git config remote.origin.url git@github.com:eclipse-ee4j/jakartaee-firstcup.git # timeout=10
Fetching upstream changes from git@github.com:eclipse-ee4j/jakartaee-firstcup.git
using GIT_SSH to set credentials GitHub Bot (SSH)
 > git fetch --tags --progress git@github.com:eclipse-ee4j/jakartaee-firstcup.git +refs/heads/*:refs/remotes/origin/*
 > git rev-parse refs/remotes/origin/master^{commit} # timeout=10
 > git rev-parse refs/remotes/origin/origin/master^{commit} # timeout=10
Checking out Revision 6b578aa6943f53bd054962dd60f23fc32b7d3b77 (refs/remotes/origin/master)
 > git config core.sparsecheckout # timeout=10
 > git checkout -f 6b578aa6943f53bd054962dd60f23fc32b7d3b77
Commit message: "Generate PDF file; include release status in header/footer."
 > git rev-list --no-walk d3a529c368eea5e61e17106994aa7cd3ce711300 # timeout=10
provisioning config files...
copy managed file [settings-jakartaee-platform.xml] to file:/home/jenkins/.m2/settings.xml
copy managed file [settings-security.xml] to file:/home/jenkins/.m2/settings-security.xml
[firstcup-publish] $ /bin/sh -xe /tmp/jenkins6843431892519685198.sh
+ gpg --batch --import ****
gpg: directory '/home/jenkins/.gnupg' created
gpg: keybox '/home/jenkins/.gnupg/pubring.kbx' created
gpg: /home/jenkins/.gnupg/trustdb.gpg: trustdb created
gpg: key 049FE94F2D5DAD9D: public key "Eclipse Jakarta EE Platform <jakarta-platform-dev@eclipse.org>" imported
gpg: To migrate 'secring.gpg', with each smartcard, run: gpg --card-status
gpg: key 049FE94F2D5DAD9D: secret key imported
gpg: Total number processed: 1
gpg:               imported: 1
gpg:       secret keys read: 1
gpg:   secret keys imported: 1
+ gpg --list-keys --with-colons
+ awk -F: '/fpr:/ {print $10}'
+ sort -u
+ echo -e '5\ny\n'
+ gpg --batch --command-fd 0 --expert --edit-key 2B34821418CF19CF1F2A8352953E02E4F573B46F trust
Secret subkeys are available.

pub  rsa4096/049FE94F2D5DAD9D
     created: 2019-02-14  expires: 2024-02-13  usage: SCEA
     trust: unknown       validity: unknown
ssb  rsa4096/953E02E4F573B46F
     created: 2019-02-14  expires: 2024-02-13  usage: S   
[ unknown] (1). Eclipse Jakarta EE Platform <jakarta-platform-dev@eclipse.org>

pub  rsa4096/049FE94F2D5DAD9D
     created: 2019-02-14  expires: 2024-02-13  usage: SCEA
     trust: unknown       validity: unknown
ssb  rsa4096/953E02E4F573B46F
     created: 2019-02-14  expires: 2024-02-13  usage: S   
[ unknown] (1). Eclipse Jakarta EE Platform <jakarta-platform-dev@eclipse.org>

Please decide how far you trust this user to correctly verify other users' keys
(by looking at passports, checking fingerprints from different sources, etc.)

  1 = I don't know or won't say
  2 = I do NOT trust
  3 = I trust marginally
  4 = I trust fully
  5 = I trust ultimately
  m = back to the main menu


pub  rsa4096/049FE94F2D5DAD9D
     created: 2019-02-14  expires: 2024-02-13  usage: SCEA
     trust: ultimate      validity: unknown
ssb  rsa4096/953E02E4F573B46F
     created: 2019-02-14  expires: 2024-02-13  usage: S   
[ unknown] (1). Eclipse Jakarta EE Platform <jakarta-platform-dev@eclipse.org>
Please note that the shown key validity is not necessarily correct
unless you restart the program.

+ echo -e '5\ny\n'
+ gpg --batch --command-fd 0 --expert --edit-key 71C524683EEC78CCAD6D5554049FE94F2D5DAD9D trust
Secret subkeys are available.

gpg: checking the trustdb
gpg: marginals needed: 3  completes needed: 1  trust model: pgp
gpg: depth: 0  valid:   1  signed:   0  trust: 0-, 0q, 0n, 0m, 0f, 1u
gpg: next trustdb check due at 2024-02-13
pub  rsa4096/049FE94F2D5DAD9D
     created: 2019-02-14  expires: 2024-02-13  usage: SCEA
     trust: ultimate      validity: ultimate
ssb  rsa4096/953E02E4F573B46F
     created: 2019-02-14  expires: 2024-02-13  usage: S   
[ultimate] (1). Eclipse Jakarta EE Platform <jakarta-platform-dev@eclipse.org>

pub  rsa4096/049FE94F2D5DAD9D
     created: 2019-02-14  expires: 2024-02-13  usage: SCEA
     trust: ultimate      validity: ultimate
ssb  rsa4096/953E02E4F573B46F
     created: 2019-02-14  expires: 2024-02-13  usage: S   
[ultimate] (1). Eclipse Jakarta EE Platform <jakarta-platform-dev@eclipse.org>

Please decide how far you trust this user to correctly verify other users' keys
(by looking at passports, checking fingerprints from different sources, etc.)

  1 = I don't know or won't say
  2 = I do NOT trust
  3 = I trust marginally
  4 = I trust fully
  5 = I trust ultimately
  m = back to the main menu


pub  rsa4096/049FE94F2D5DAD9D
     created: 2019-02-14  expires: 2024-02-13  usage: SCEA
     trust: ultimate      validity: ultimate
ssb  rsa4096/953E02E4F573B46F
     created: 2019-02-14  expires: 2024-02-13  usage: S   
[ultimate] (1). Eclipse Jakarta EE Platform <jakarta-platform-dev@eclipse.org>

+ git config --global user.email eclipse-jakartaee-platform-bot@eclipse.org
+ git config --global user.name 'Eclipse Jakarta EE Platform Bot'
Parsing POMs
Downloaded artifact https://repo.eclipse.org/content/repositories/maven_central/org/eclipse/ee4j/project/1.0.5/project-1.0.5.pom
Modules changed, recalculating dependency graph
Established TCP socket on 41002
Copied maven33-agent.jar
Copied maven33-interceptor.jar
Copied maven3-interceptor-commons.jar
[firstcup-publish] $ /opt/tools/java/oracle/jdk-8/latest/bin/java -cp /home/jenkins/maven33-agent.jar:/opt/tools/apache-maven/3.3.9/boot/plexus-classworlds-2.5.2.jar:/opt/tools/apache-maven/3.3.9/conf/logging jenkins.maven3.agent.Maven33Main /opt/tools/apache-maven/3.3.9 /usr/share/jenkins/slave.jar /home/jenkins/maven33-interceptor.jar /home/jenkins/maven3-interceptor-commons.jar 41002
<===[JENKINS REMOTING CAPACITY]===>channel started
Executing Maven:  -B -f /home/jenkins/workspace/firstcup-publish/pom.xml -Ppublish-site deploy
[INFO] Scanning for projects...
[INFO]                                                                         
[INFO] ------------------------------------------------------------------------
[INFO] Building First Cup of Jakarta EE Tutorial 8.1-SNAPSHOT
[INFO] ------------------------------------------------------------------------
[INFO] Downloading: https://repo.eclipse.org/content/repositories/maven_central/org/apache/maven/plugins/maven-enforcer-plugin/1.4.1/maven-enforcer-plugin-1.4.1.pom
[INFO] Downloaded: https://repo.eclipse.org/content/repositories/maven_central/org/apache/maven/plugins/maven-enforcer-plugin/1.4.1/maven-enforcer-plugin-1.4.1.pom (8 KB at 54.2 KB/sec)
[INFO] Downloading: https://repo.eclipse.org/content/repositories/maven_central/org/apache/maven/enforcer/enforcer/1.4.1/enforcer-1.4.1.pom
[INFO] Downloaded: https://repo.eclipse.org/content/repositories/maven_central/org/apache/maven/enforcer/enforcer/1.4.1/enforcer-1.4.1.pom (8 KB at 319.9 KB/sec)
[INFO] Downloading: https://repo.eclipse.org/content/repositories/maven_central/org/apache/maven/maven-parent/26/maven-parent-26.pom
[INFO] Downloaded: https://repo.eclipse.org/content/repositories/maven_central/org/apache/maven/maven-parent/26/maven-parent-26.pom (39 KB at 1689.2 KB/sec)
[INFO] Downloading: https://repo.eclipse.org/content/repositories/maven_central/org/apache/apache/16/apache-16.pom
[INFO] Downloaded: https://repo.eclipse.org/content/repositories/maven_central/org/apache/apache/16/apache-16.pom (16 KB at 716.0 KB/sec)
[INFO] Downloading: https://repo.eclipse.org/content/repositories/maven_central/org/apache/maven/plugins/maven-enforcer-plugin/1.4.1/maven-enforcer-plugin-1.4.1.jar
[INFO] Downloaded: https://repo.eclipse.org/content/repositories/maven_central/org/apache/maven/plugins/maven-enforcer-plugin/1.4.1/maven-enforcer-plugin-1.4.1.jar (27 KB at 1157.4 KB/sec)
[INFO] Downloading: https://repo.eclipse.org/content/repositories/maven_central/org/glassfish/doc/glassfish-doc-maven-plugin/1.2/glassfish-doc-maven-plugin-1.2.pom
[WARNING] The POM for org.glassfish.doc:glassfish-doc-maven-plugin:jar:1.2 is missing, no dependency information available
[INFO] Downloading: https://repo.eclipse.org/content/repositories/maven_central/org/glassfish/doc/glassfish-doc-maven-plugin/1.2/glassfish-doc-maven-plugin-1.2.jar
[WARNING] Attempt to (de-)serialize anonymous class hudson.maven.reporters.MavenArtifactArchiver$2; see: https://jenkins.io/redirect/serialization-of-anonymous-classes/
[WARNING] Attempt to (de-)serialize anonymous class hudson.maven.reporters.MavenFingerprinter$1; see: https://jenkins.io/redirect/serialization-of-anonymous-classes/
Started calculate disk usage of build
Finished Calculation of disk usage of build in 0 seconds
Started calculate disk usage of workspace
Finished Calculation of disk usage of workspace in 0 seconds
[INFO] ------------------------------------------------------------------------
[INFO] BUILD FAILURE
[INFO] ------------------------------------------------------------------------
[INFO] Total time: 2.502 s
[INFO] Finished at: 2019-03-26T23:02:31+00:00
[INFO] Final Memory: 11M/97M
[INFO] ------------------------------------------------------------------------
[ERROR] Plugin org.glassfish.doc:glassfish-doc-maven-plugin:1.2 or one of its dependencies could not be resolved: Could not find artifact org.glassfish.doc:glassfish-doc-maven-plugin:jar:1.2 in eclipse.maven.central.mirror (https://repo.eclipse.org/content/repositories/maven_central/) -> [Help 1]
[ERROR] 
[ERROR] To see the full stack trace of the errors, re-run Maven with the -e switch.
[ERROR] Re-run Maven using the -X switch to enable full debug logging.
[ERROR] 
[ERROR] For more information about the errors and possible solutions, please read the following articles:
[ERROR] [Help 1] http://cwiki.apache.org/confluence/display/MAVEN/PluginResolutionException
[JENKINS] Archiving /home/jenkins/workspace/firstcup-publish/pom.xml to jakarta.firstcup/firstcup/8.1-SNAPSHOT/firstcup-8.1-SNAPSHOT.pom
channel stopped
$ ssh-agent -k
unset SSH_AUTH_SOCK;
unset SSH_AGENT_PID;
echo Agent pid 98 killed;
[ssh-agent] Stopped.
Started calculate disk usage of build
Finished Calculation of disk usage of build in 0 seconds
Started calculate disk usage of workspace
Finished Calculation of disk usage of workspace in 0 seconds
Finished: FAILURE