Console Output

+ mvn -B clean install
----- withMaven Wrapper script -----
Picked up JAVA_TOOL_OPTIONS: -Dmaven.ext.class.path="/home/jenkins/agent/workspace/Hono CI Pipeline@tmp/withMavend39871b0/pipeline-maven-spy.jar" -Dorg.jenkinsci.plugins.pipeline.maven.reportsFolder="/home/jenkins/agent/workspace/Hono CI Pipeline@tmp/withMavend39871b0" 
Apache Maven 3.6.3 (cecedd343002696d0abb50b32b541b8a6ba2883f)
Maven home: /opt/tools/apache-maven/latest
Java version: 11.0.2, vendor: Oracle Corporation, runtime: /opt/tools/java/openjdk/jdk-11/11.0.2+9
Default locale: en_US, platform encoding: UTF-8
OS name: "linux", version: "5.6.19-300.fc32.x86_64", arch: "amd64", family: "unix"
[INFO] [jenkins-event-spy] Generate /home/jenkins/agent/workspace/Hono CI Pipeline@tmp/withMavend39871b0/maven-spy-20201218-132552-7775914307530451742971.log.tmp ...
[INFO] Scanning for projects...
[INFO] ------------------------------------------------------------------------
[INFO] BUILD FAILURE
[INFO] ------------------------------------------------------------------------
[INFO] Total time:  0.300 s
[INFO] Finished at: 2020-12-18T13:25:53Z
[INFO] ------------------------------------------------------------------------
[INFO] [jenkins-event-spy] Generated /home/jenkins/agent/workspace/Hono CI Pipeline@tmp/withMavend39871b0/maven-spy-20201218-132552-7775914307530451742971.log
[ERROR] The goal you specified requires a project to execute but there is no POM in this directory (/home/jenkins/agent/workspace/Hono CI Pipeline). Please verify you invoked Maven from the correct directory. -> [Help 1]
[ERROR] 
[ERROR] To see the full stack trace of the errors, re-run Maven with the -e switch.
[ERROR] Re-run Maven using the -X switch to enable full debug logging.
[ERROR] 
[ERROR] For more information about the errors and possible solutions, please read the following articles:
[ERROR] [Help 1] http://cwiki.apache.org/confluence/display/MAVEN/MissingProjectException