FailedConsole Output

GitHub pull request #47 of commit 14e009649d433c3711af0a6a5f3e5baec093992d, no merge conflicts.
Building in workspace /home/hudson/genie.hawkbit/.jenkins/jobs/PR_Builder_Hawkbit-Extensions/workspace
[WS-CLEANUP] Deleting project workspace...
[WS-CLEANUP] Deferred wipeout is used...
[WS-CLEANUP] Done
using credential 99b4f7d7-eb02-4509-b901-c9240c90222c
Cloning the remote Git repository
Cloning repository https://github.com/eclipse/hawkbit-extensions
 > /usr/local/bin/git init /home/hudson/genie.hawkbit/.jenkins/jobs/PR_Builder_Hawkbit-Extensions/workspace # timeout=10
Fetching upstream changes from https://github.com/eclipse/hawkbit-extensions
 > /usr/local/bin/git --version # timeout=10
using GIT_ASKPASS to set credentials GitHub bot
 > /usr/local/bin/git fetch --tags --progress https://github.com/eclipse/hawkbit-extensions +refs/heads/*:refs/remotes/origin/*
 > /usr/local/bin/git config remote.origin.url https://github.com/eclipse/hawkbit-extensions # timeout=10
 > /usr/local/bin/git config --add remote.origin.fetch +refs/heads/*:refs/remotes/origin/* # timeout=10
 > /usr/local/bin/git config remote.origin.url https://github.com/eclipse/hawkbit-extensions # timeout=10
Fetching upstream changes from https://github.com/eclipse/hawkbit-extensions
using GIT_ASKPASS to set credentials GitHub bot
 > /usr/local/bin/git fetch --tags --progress https://github.com/eclipse/hawkbit-extensions +refs/pull/47/*:refs/remotes/origin/pr/47/*
 > /usr/local/bin/git rev-parse refs/remotes/origin/pr/47/merge^{commit} # timeout=10
 > /usr/local/bin/git rev-parse refs/remotes/origin/origin/pr/47/merge^{commit} # timeout=10
Checking out Revision 94c9d6e603e083225c28fb3a7be143dd88675308 (refs/remotes/origin/pr/47/merge)
 > /usr/local/bin/git config core.sparsecheckout # timeout=10
 > /usr/local/bin/git checkout -f 94c9d6e603e083225c28fb3a7be143dd88675308
Commit message: "Merge 14e009649d433c3711af0a6a5f3e5baec093992d into 7073a500842a3e55853e4793aa42bea259c90a82"
First time build. Skipping changelog.
Parsing POMs
Failed to transfer Could not find metadata org.eclipse.hawkbit:hawkbit-parent:0.3.0-SNAPSHOT/maven-metadata.xml in vaadin-addons (https://maven.vaadin.com/vaadin-addons)
Modules changed, recalculating dependency graph
Established TCP socket on 48089
[workspace] $ /shared/common/jdk1.8.0_x64-latest/bin/java -Xmx2G -Djava.io.tmpdir=/tmp/genie.hawkbit -cp /home/hudson/genie.hawkbit/.jenkins/plugins/maven-plugin/WEB-INF/lib/maven35-agent-1.12.jar:/shared/common/apache-maven-latest/boot/plexus-classworlds-2.5.2.jar:/shared/common/apache-maven-latest/conf/logging jenkins.maven3.agent.Maven35Main /shared/common/apache-maven-latest /home/hudson/genie.hawkbit/.jenkins/war/WEB-INF/lib/remoting-3.27.jar /home/hudson/genie.hawkbit/.jenkins/plugins/maven-plugin/WEB-INF/lib/maven35-interceptor-1.12.jar /home/hudson/genie.hawkbit/.jenkins/plugins/maven-plugin/WEB-INF/lib/maven3-interceptor-commons-1.12.jar 48089
Picked up JAVA_TOOL_OPTIONS: -Xmx2G -Djava.io.tmpdir=/tmp/genie.hawkbit
<===[JENKINS REMOTING CAPACITY]===>channel started
Executing Maven:  -B -f /home/hudson/genie.hawkbit/.jenkins/jobs/PR_Builder_Hawkbit-Extensions/workspace/pom.xml clean compile sonar:sonar --fail-at-end -Dsonar.analysis.mode=preview -Dsonar.github.pullRequest=47 -Dsonar.github.repository=eclipse/hawkbit-extensions -Dsonar.github.oauth=**** -Dsonar.login=****
[INFO] Scanning for projects...
[INFO] Inspecting build with total of 8 modules...
[INFO] Installing Nexus Staging features:
[INFO]   ... total of 8 executions of maven-deploy-plugin replaced with nexus-staging-maven-plugin
[INFO] ------------------------------------------------------------------------
[INFO] Reactor Build Order:
[INFO] 
[INFO] hawkBit :: Extensions                                              [pom]
[INFO] hawkBit :: Extensions :: Artifact Repository Mongo                 [jar]
[INFO] hawkBit :: Extensions :: S3 Repository                             [jar]
[INFO] hawkBit :: Extensions :: GCS Repository                            [jar]
[INFO] hawkBit :: Extensions :: Azure                                     [pom]
[INFO] hawkBit :: Extensions :: Azure Block Storage Repository            [jar]
[INFO] hawkBit :: Extensions :: Runtimes                                  [pom]
[INFO] hawkBit :: Extensions :: Azure enabled Update Server               [jar]
[WARNING] The POM for org.eclipse.m2e:lifecycle-mapping:jar:1.0.0 is missing, no dependency information available
[WARNING] Failed to retrieve plugin descriptor for org.eclipse.m2e:lifecycle-mapping:1.0.0: Plugin org.eclipse.m2e:lifecycle-mapping:1.0.0 or one of its dependencies could not be resolved: Failure to find org.eclipse.m2e:lifecycle-mapping:jar:1.0.0 in https://repo.eclipse.org/content/repositories/maven_central/ was cached in the local repository, resolution will not be reattempted until the update interval of eclipse.maven.central.mirror has elapsed or updates are forced
[INFO] 
[INFO] -----------< org.eclipse.hawkbit:hawkbit-extensions-parent >------------
[INFO] Building hawkBit :: Extensions 0.3.0-SNAPSHOT                      [1/8]
[INFO] --------------------------------[ pom ]---------------------------------
[INFO] 
[INFO] --- maven-clean-plugin:3.1.0:clean (default-clean) @ hawkbit-extensions-parent ---
[INFO] 
[INFO] --- maven-enforcer-plugin:3.0.0-M2:enforce (enforce-no-snapshots) @ hawkbit-extensions-parent ---
[INFO] Skipping Rule Enforcement.
Started calculate disk usage of build
Finished Calculation of disk usage of build in 0 seconds
Started calculate disk usage of workspace
Finished Calculation of disk usage of workspace in 0 seconds
[INFO] 
[INFO] --< org.eclipse.hawkbit:hawkbit-extension-artifact-repository-mongo >---
[INFO] Building hawkBit :: Extensions :: Artifact Repository Mongo 0.3.0-SNAPSHOT [2/8]
[INFO] --------------------------------[ jar ]---------------------------------
[INFO] Downloading from vaadin-addons: https://maven.vaadin.com/vaadin-addons/org/eclipse/hawkbit/hawkbit-core/0.3.0-SNAPSHOT/maven-metadata.xml
[INFO] 
[INFO] --- maven-clean-plugin:3.1.0:clean (default-clean) @ hawkbit-extension-artifact-repository-mongo ---
[INFO] 
[INFO] --- maven-enforcer-plugin:3.0.0-M2:enforce (enforce-no-snapshots) @ hawkbit-extension-artifact-repository-mongo ---
[INFO] Skipping Rule Enforcement.
[INFO] 
[INFO] --- maven-resources-plugin:3.1.0:resources (default-resources) @ hawkbit-extension-artifact-repository-mongo ---
[INFO] Using 'UTF-8' encoding to copy filtered resources.
[INFO] Copying 0 resource
[INFO] Copying 2 resources
[INFO] 
[INFO] --- maven-compiler-plugin:3.8.0:compile (default-compile) @ hawkbit-extension-artifact-repository-mongo ---
[INFO] Changes detected - recompiling the module!
[INFO] Compiling 3 source files to /home/hudson/genie.hawkbit/.jenkins/jobs/PR_Builder_Hawkbit-Extensions/workspace/hawkbit-extension-artifact-repository-mongo/target/classes
[INFO] -------------------------------------------------------------
[WARNING] COMPILATION WARNING : 
[INFO] -------------------------------------------------------------
[WARNING] /home/hudson/genie.hawkbit/.jenkins/jobs/PR_Builder_Hawkbit-Extensions/workspace/hawkbit-extension-artifact-repository-mongo/src/main/java/org/eclipse/hawkbit/artifact/repository/MongoDBArtifactStore.java:[202,60] getMD5() in com.mongodb.client.gridfs.model.GridFSFile has been deprecated
[WARNING] /home/hudson/genie.hawkbit/.jenkins/jobs/PR_Builder_Hawkbit-Extensions/workspace/hawkbit-extension-artifact-repository-mongo/src/main/java/org/eclipse/hawkbit/artifact/repository/MongoDBArtifactStore.java:[240,35] getContentType() in com.mongodb.client.gridfs.model.GridFSFile has been deprecated
[INFO] 2 warnings 
[INFO] -------------------------------------------------------------
[INFO] -------------------------------------------------------------
[ERROR] COMPILATION ERROR : 
[INFO] -------------------------------------------------------------
[ERROR] /home/hudson/genie.hawkbit/.jenkins/jobs/PR_Builder_Hawkbit-Extensions/workspace/hawkbit-extension-artifact-repository-mongo/src/main/java/org/eclipse/hawkbit/artifact/repository/MongoDBArtifactStore.java:[36,8] org.eclipse.hawkbit.artifact.repository.MongoDBArtifactStore is not abstract and does not override abstract method store(java.lang.String,java.lang.String,java.lang.String,java.lang.String,java.lang.String) in org.eclipse.hawkbit.artifact.repository.AbstractArtifactRepository
[ERROR] /home/hudson/genie.hawkbit/.jenkins/jobs/PR_Builder_Hawkbit-Extensions/workspace/hawkbit-extension-artifact-repository-mongo/src/main/java/org/eclipse/hawkbit/artifact/repository/MongoDBArtifactStore.java:[118,5] method does not override or implement a method from a supertype
[ERROR] /home/hudson/genie.hawkbit/.jenkins/jobs/PR_Builder_Hawkbit-Extensions/workspace/hawkbit-extension-artifact-repository-mongo/src/main/java/org/eclipse/hawkbit/artifact/repository/MongoDBArtifactStore.java:[202,17] constructor DbArtifactHash in class org.eclipse.hawkbit.artifact.repository.model.DbArtifactHash cannot be applied to given types;
  required: java.lang.String,java.lang.String
  found: java.lang.String,java.lang.String,<nulltype>
  reason: actual and formal argument lists differ in length
[INFO] 3 errors 
[INFO] -------------------------------------------------------------
Started calculate disk usage of build
Finished Calculation of disk usage of build in 0 seconds
Started calculate disk usage of workspace
Finished Calculation of disk usage of workspace in 0 seconds
[INFO] 
[INFO] ----< org.eclipse.hawkbit:hawkbit-extension-artifact-repository-s3 >----
[INFO] Building hawkBit :: Extensions :: S3 Repository 0.3.0-SNAPSHOT     [3/8]
[INFO] --------------------------------[ jar ]---------------------------------
[INFO] 
[INFO] --- maven-clean-plugin:3.1.0:clean (default-clean) @ hawkbit-extension-artifact-repository-s3 ---
[INFO] 
[INFO] --- maven-enforcer-plugin:3.0.0-M2:enforce (enforce-no-snapshots) @ hawkbit-extension-artifact-repository-s3 ---
[INFO] Skipping Rule Enforcement.
[INFO] 
[INFO] --- maven-resources-plugin:3.1.0:resources (default-resources) @ hawkbit-extension-artifact-repository-s3 ---
[INFO] Using 'UTF-8' encoding to copy filtered resources.
[INFO] Copying 0 resource
[INFO] Copying 1 resource
[INFO] 
[INFO] --- maven-compiler-plugin:3.8.0:compile (default-compile) @ hawkbit-extension-artifact-repository-s3 ---
[INFO] Changes detected - recompiling the module!
[INFO] Compiling 4 source files to /home/hudson/genie.hawkbit/.jenkins/jobs/PR_Builder_Hawkbit-Extensions/workspace/hawkbit-extension-artifact-repository-s3/target/classes
[INFO] -------------------------------------------------------------
[ERROR] COMPILATION ERROR : 
[INFO] -------------------------------------------------------------
[ERROR] /home/hudson/genie.hawkbit/.jenkins/jobs/PR_Builder_Hawkbit-Extensions/workspace/hawkbit-extension-artifact-repository-s3/src/main/java/org/eclipse/hawkbit/artifact/repository/S3Repository.java:[49,8] org.eclipse.hawkbit.artifact.repository.S3Repository is not abstract and does not override abstract method store(java.lang.String,java.lang.String,java.lang.String,java.lang.String,java.lang.String) in org.eclipse.hawkbit.artifact.repository.AbstractArtifactRepository
[ERROR] /home/hudson/genie.hawkbit/.jenkins/jobs/PR_Builder_Hawkbit-Extensions/workspace/hawkbit-extension-artifact-repository-s3/src/main/java/org/eclipse/hawkbit/artifact/repository/S3Repository.java:[69,5] method does not override or implement a method from a supertype
[ERROR] /home/hudson/genie.hawkbit/.jenkins/jobs/PR_Builder_Hawkbit-Extensions/workspace/hawkbit-extension-artifact-repository-s3/src/main/java/org/eclipse/hawkbit/artifact/repository/S3Repository.java:[145,21] constructor DbArtifactHash in class org.eclipse.hawkbit.artifact.repository.model.DbArtifactHash cannot be applied to given types;
  required: java.lang.String,java.lang.String
  found: java.lang.String,java.lang.String,<nulltype>
  reason: actual and formal argument lists differ in length
[INFO] 3 errors 
[INFO] -------------------------------------------------------------
Started calculate disk usage of build
Finished Calculation of disk usage of build in 0 seconds
Started calculate disk usage of workspace
Finished Calculation of disk usage of workspace in 0 seconds
[INFO] 
[INFO] ---< org.eclipse.hawkbit:hawkbit-extension-artifact-repository-gcs >----
[INFO] Building hawkBit :: Extensions :: GCS Repository 0.3.0-SNAPSHOT    [4/8]
[INFO] --------------------------------[ jar ]---------------------------------
[INFO] 
[INFO] --- maven-clean-plugin:3.1.0:clean (default-clean) @ hawkbit-extension-artifact-repository-gcs ---
[INFO] 
[INFO] --- maven-enforcer-plugin:3.0.0-M2:enforce (enforce-no-snapshots) @ hawkbit-extension-artifact-repository-gcs ---
[INFO] Skipping Rule Enforcement.
[INFO] 
[INFO] --- maven-resources-plugin:3.1.0:resources (default-resources) @ hawkbit-extension-artifact-repository-gcs ---
[INFO] Using 'UTF-8' encoding to copy filtered resources.
[INFO] Copying 0 resource
[INFO] Copying 1 resource
[INFO] 
[INFO] --- maven-compiler-plugin:3.8.0:compile (default-compile) @ hawkbit-extension-artifact-repository-gcs ---
[INFO] Changes detected - recompiling the module!
[INFO] Compiling 5 source files to /home/hudson/genie.hawkbit/.jenkins/jobs/PR_Builder_Hawkbit-Extensions/workspace/hawkbit-extension-artifact-repository-gcs/target/classes
[INFO] -------------------------------------------------------------
[ERROR] COMPILATION ERROR : 
[INFO] -------------------------------------------------------------
[ERROR] /home/hudson/genie.hawkbit/.jenkins/jobs/PR_Builder_Hawkbit-Extensions/workspace/hawkbit-extension-artifact-repository-gcs/src/main/java/org/eclipse/hawkbit/artifact/repository/GcsRepository.java:[37,8] org.eclipse.hawkbit.artifact.repository.GcsRepository is not abstract and does not override abstract method store(java.lang.String,java.lang.String,java.lang.String,java.lang.String,java.lang.String) in org.eclipse.hawkbit.artifact.repository.AbstractArtifactRepository
[ERROR] /home/hudson/genie.hawkbit/.jenkins/jobs/PR_Builder_Hawkbit-Extensions/workspace/hawkbit-extension-artifact-repository-gcs/src/main/java/org/eclipse/hawkbit/artifact/repository/GcsRepository.java:[61,5] method does not override or implement a method from a supertype
[ERROR] /home/hudson/genie.hawkbit/.jenkins/jobs/PR_Builder_Hawkbit-Extensions/workspace/hawkbit-extension-artifact-repository-gcs/src/main/java/org/eclipse/hawkbit/artifact/repository/GcsRepository.java:[113,17] constructor DbArtifactHash in class org.eclipse.hawkbit.artifact.repository.model.DbArtifactHash cannot be applied to given types;
  required: java.lang.String,java.lang.String
  found: java.lang.String,java.lang.String,<nulltype>
  reason: actual and formal argument lists differ in length
[INFO] 3 errors 
[INFO] -------------------------------------------------------------
Started calculate disk usage of build
Finished Calculation of disk usage of build in 0 seconds
Started calculate disk usage of workspace
Finished Calculation of disk usage of workspace in 0 seconds
[INFO] 
[INFO] ------------< org.eclipse.hawkbit:hawkbit-extensions-azure >------------
[INFO] Building hawkBit :: Extensions :: Azure 0.3.0-SNAPSHOT             [5/8]
[INFO] --------------------------------[ pom ]---------------------------------
[INFO] 
[INFO] --- maven-clean-plugin:3.1.0:clean (default-clean) @ hawkbit-extensions-azure ---
[INFO] 
[INFO] --- maven-enforcer-plugin:3.0.0-M2:enforce (enforce-no-snapshots) @ hawkbit-extensions-azure ---
[INFO] Skipping Rule Enforcement.
Started calculate disk usage of build
Finished Calculation of disk usage of build in 0 seconds
Started calculate disk usage of workspace
Finished Calculation of disk usage of workspace in 0 seconds
[INFO] 
[INFO] --< org.eclipse.hawkbit:hawkbit-extension-artifact-repository-azure >---
[INFO] Building hawkBit :: Extensions :: Azure Block Storage Repository 0.3.0-SNAPSHOT [6/8]
[INFO] --------------------------------[ jar ]---------------------------------
[INFO] 
[INFO] --- maven-clean-plugin:3.1.0:clean (default-clean) @ hawkbit-extension-artifact-repository-azure ---
[INFO] 
[INFO] --- maven-enforcer-plugin:3.0.0-M2:enforce (enforce-no-snapshots) @ hawkbit-extension-artifact-repository-azure ---
[INFO] Skipping Rule Enforcement.
[INFO] 
[INFO] --- maven-resources-plugin:3.1.0:resources (default-resources) @ hawkbit-extension-artifact-repository-azure ---
[INFO] Using 'UTF-8' encoding to copy filtered resources.
[INFO] Copying 0 resource
[INFO] Copying 2 resources
[INFO] 
[INFO] --- maven-compiler-plugin:3.8.0:compile (default-compile) @ hawkbit-extension-artifact-repository-azure ---
[INFO] Changes detected - recompiling the module!
[INFO] Compiling 4 source files to /home/hudson/genie.hawkbit/.jenkins/jobs/PR_Builder_Hawkbit-Extensions/workspace/hawkbit-extensions-azure/hawkbit-extension-artifact-repository-azure/target/classes
[INFO] -------------------------------------------------------------
[ERROR] COMPILATION ERROR : 
[INFO] -------------------------------------------------------------
[ERROR] /home/hudson/genie.hawkbit/.jenkins/jobs/PR_Builder_Hawkbit-Extensions/workspace/hawkbit-extensions-azure/hawkbit-extension-artifact-repository-azure/src/main/java/org/eclipse/hawkbit/artifact/repository/AzureStorageRepository.java:[40,8] org.eclipse.hawkbit.artifact.repository.AzureStorageRepository is not abstract and does not override abstract method store(java.lang.String,java.lang.String,java.lang.String,java.lang.String,java.lang.String) in org.eclipse.hawkbit.artifact.repository.AbstractArtifactRepository
[ERROR] /home/hudson/genie.hawkbit/.jenkins/jobs/PR_Builder_Hawkbit-Extensions/workspace/hawkbit-extensions-azure/hawkbit-extension-artifact-repository-azure/src/main/java/org/eclipse/hawkbit/artifact/repository/AzureStorageRepository.java:[63,5] method does not override or implement a method from a supertype
[ERROR] /home/hudson/genie.hawkbit/.jenkins/jobs/PR_Builder_Hawkbit-Extensions/workspace/hawkbit-extensions-azure/hawkbit-extension-artifact-repository-azure/src/main/java/org/eclipse/hawkbit/artifact/repository/AzureStorageRepository.java:[150,21] constructor DbArtifactHash in class org.eclipse.hawkbit.artifact.repository.model.DbArtifactHash cannot be applied to given types;
  required: java.lang.String,java.lang.String
  found: java.lang.String,java.lang.String,<nulltype>
  reason: actual and formal argument lists differ in length
[INFO] 3 errors 
[INFO] -------------------------------------------------------------
Started calculate disk usage of build
Finished Calculation of disk usage of build in 0 seconds
Started calculate disk usage of workspace
Finished Calculation of disk usage of workspace in 0 seconds
[INFO] 
[INFO] -----------< org.eclipse.hawkbit:hawkbit-extended-runtimes >------------
[INFO] Building hawkBit :: Extensions :: Runtimes 0.3.0-SNAPSHOT          [7/8]
[INFO] --------------------------------[ pom ]---------------------------------
[INFO] 
[INFO] --- maven-clean-plugin:3.1.0:clean (default-clean) @ hawkbit-extended-runtimes ---
[INFO] 
[INFO] --- maven-enforcer-plugin:3.0.0-M2:enforce (enforce-no-snapshots) @ hawkbit-extended-runtimes ---
[INFO] Skipping Rule Enforcement.
Started calculate disk usage of build
Finished Calculation of disk usage of build in 0 seconds
Started calculate disk usage of workspace
Finished Calculation of disk usage of workspace in 0 seconds
[INFO] 
[INFO] ------------------------------------------------------------------------
[INFO] Skipping hawkBit :: Extensions :: Azure enabled Update Server
[INFO] This project has been banned from the build due to previous failures.
[INFO] ------------------------------------------------------------------------
[INFO] 
[INFO] -----------< org.eclipse.hawkbit:hawkbit-extensions-parent >------------
[INFO] Building hawkBit :: Extensions 0.3.0-SNAPSHOT                      [8/8]
[INFO] --------------------------------[ pom ]---------------------------------
[WARNING] The POM for org.eclipse.m2e:lifecycle-mapping:jar:1.0.0 is missing, no dependency information available
[WARNING] Failed to retrieve plugin descriptor for org.eclipse.m2e:lifecycle-mapping:1.0.0: Plugin org.eclipse.m2e:lifecycle-mapping:1.0.0 or one of its dependencies could not be resolved: Failure to find org.eclipse.m2e:lifecycle-mapping:jar:1.0.0 in https://repo.eclipse.org/content/repositories/maven_central/ was cached in the local repository, resolution will not be reattempted until the update interval of eclipse.maven.central.mirror has elapsed or updates are forced
[INFO] Downloading from vaadin-addons: https://maven.vaadin.com/vaadin-addons/org/eclipse/hawkbit/hawkbit-boot-starter-ddi-api/0.3.0-SNAPSHOT/maven-metadata.xml
[INFO] Downloading from vaadin-addons: https://maven.vaadin.com/vaadin-addons/org/eclipse/hawkbit/hawkbit-starters/0.3.0-SNAPSHOT/maven-metadata.xml
[INFO] Downloading from vaadin-addons: https://maven.vaadin.com/vaadin-addons/org/eclipse/hawkbit/hawkbit-ddi-resource/0.3.0-SNAPSHOT/maven-metadata.xml
[INFO] Downloading from vaadin-addons: https://maven.vaadin.com/vaadin-addons/org/eclipse/hawkbit/hawkbit-rest-parent/0.3.0-SNAPSHOT/maven-metadata.xml
[INFO] Downloading from vaadin-addons: https://maven.vaadin.com/vaadin-addons/org/eclipse/hawkbit/hawkbit-ddi-api/0.3.0-SNAPSHOT/maven-metadata.xml
[INFO] Downloading from vaadin-addons: https://maven.vaadin.com/vaadin-addons/org/eclipse/hawkbit/hawkbit-rest-core/0.3.0-SNAPSHOT/maven-metadata.xml
[INFO] Downloading from vaadin-addons: https://maven.vaadin.com/vaadin-addons/org/eclipse/hawkbit/hawkbit-repository-api/0.3.0-SNAPSHOT/maven-metadata.xml
[INFO] Downloading from vaadin-addons: https://maven.vaadin.com/vaadin-addons/org/eclipse/hawkbit/hawkbit-repository/0.3.0-SNAPSHOT/maven-metadata.xml
[INFO] Downloading from vaadin-addons: https://maven.vaadin.com/vaadin-addons/org/eclipse/hawkbit/hawkbit-security-core/0.3.0-SNAPSHOT/maven-metadata.xml
[INFO] Downloading from vaadin-addons: https://maven.vaadin.com/vaadin-addons/org/eclipse/hawkbit/hawkbit-security-integration/0.3.0-SNAPSHOT/maven-metadata.xml
[INFO] Downloading from vaadin-addons: https://maven.vaadin.com/vaadin-addons/org/eclipse/hawkbit/hawkbit-http-security/0.3.0-SNAPSHOT/maven-metadata.xml
[INFO] Downloading from vaadin-addons: https://maven.vaadin.com/vaadin-addons/org/eclipse/hawkbit/hawkbit-repository-jpa/0.3.0-SNAPSHOT/maven-metadata.xml
[INFO] Downloading from vaadin-addons: https://maven.vaadin.com/vaadin-addons/org/eclipse/hawkbit/hawkbit-repository-core/0.3.0-SNAPSHOT/maven-metadata.xml
[INFO] Downloading from vaadin-addons: https://maven.vaadin.com/vaadin-addons/org/eclipse/hawkbit/hawkbit-artifact-repository-filesystem/0.3.0-SNAPSHOT/maven-metadata.xml
[INFO] Downloading from vaadin-addons: https://maven.vaadin.com/vaadin-addons/org/eclipse/hawkbit/hawkbit-autoconfigure/0.3.0-SNAPSHOT/maven-metadata.xml
[INFO] Downloading from vaadin-addons: https://maven.vaadin.com/vaadin-addons/org/eclipse/hawkbit/hawkbit-boot-starter-mgmt-api/0.3.0-SNAPSHOT/maven-metadata.xml
[INFO] Downloading from vaadin-addons: https://maven.vaadin.com/vaadin-addons/org/eclipse/hawkbit/hawkbit-mgmt-resource/0.3.0-SNAPSHOT/maven-metadata.xml
[INFO] Downloading from vaadin-addons: https://maven.vaadin.com/vaadin-addons/org/eclipse/hawkbit/hawkbit-mgmt-api/0.3.0-SNAPSHOT/maven-metadata.xml
[INFO] Downloading from vaadin-addons: https://maven.vaadin.com/vaadin-addons/org/eclipse/hawkbit/hawkbit-boot-starter-mgmt-ui/0.3.0-SNAPSHOT/maven-metadata.xml
[INFO] Downloading from vaadin-addons: https://maven.vaadin.com/vaadin-addons/org/eclipse/hawkbit/hawkbit-ui/0.3.0-SNAPSHOT/maven-metadata.xml
[INFO] Downloading from vaadin-addons: https://maven.vaadin.com/vaadin-addons/org/eclipse/hawkbit/hawkbit-extension-artifact-repository-azure/0.3.0-SNAPSHOT/maven-metadata.xml
[INFO] Downloading from vaadin-addons: https://maven.vaadin.com/vaadin-addons/io/grpc/grpc-core/maven-metadata.xml
[INFO] Downloading from eclipse.maven.central.mirror: https://repo.eclipse.org/content/repositories/maven_central/io/grpc/grpc-core/maven-metadata.xml
[INFO] Downloaded from eclipse.maven.central.mirror: https://repo.eclipse.org/content/repositories/maven_central/io/grpc/grpc-core/maven-metadata.xml (2.0 kB at 6.6 kB/s)
[INFO] 
[INFO] --- sonar-maven-plugin:3.4.0.905:sonar (default-cli) @ hawkbit-extensions-parent ---
[INFO] User cache: /opt/public/hipp/homes/genie.hawkbit/.sonar/cache
[INFO] SonarQube version: 6.7.7
[INFO] Default locale: "en_US", source code encoding: "UTF-8"
[INFO] Issues mode
[WARNING] The use of the issues mode (sonar.analysis.mode=issues) is deprecated. This mode will be dropped in the future.
[INFO] Load global settings
[INFO] Load global settings (done) | time=765ms
[INFO] Server id: F5109064-AVpmEkJ7rFznI0buuiR0
[INFO] User cache: /opt/public/hipp/homes/genie.hawkbit/.sonar/cache
[INFO] Exclude plugins: devcockpit, ldap, authgithub, authbitbucket, pdfreport, authaad, googleanalytics, governance
[INFO] Load plugins index
[INFO] Load plugins index (done) | time=184ms
[INFO] Process project properties
[INFO] Load project repositories
[INFO] Load project repositories (done) | time=248ms
[INFO] Scanning only changed files
[INFO] Execute project builders
[INFO] Starting analysis of pull request: https://github.com/eclipse/hawkbit-extensions/pull/47
[INFO] Execute project builders (done) | time=2081ms
[INFO] Load quality profiles
[INFO] Load quality profiles (done) | time=145ms
[INFO] Load active rules
[INFO] Load active rules (done) | time=523ms
[INFO] Load metrics repository
[INFO] Load metrics repository (done) | time=128ms
[INFO] Project key: org.eclipse.hawkbit:hawkbit-extensions-parent
[INFO] -------------  Scan hawkBit :: Extensions :: GCS Repository
[INFO] Load server rules
[INFO] Load server rules (done) | time=134ms
[INFO] Base dir: /home/hudson/genie.hawkbit/.jenkins/jobs/PR_Builder_Hawkbit-Extensions/workspace/hawkbit-extension-artifact-repository-gcs
[INFO] Working dir: /home/hudson/genie.hawkbit/.jenkins/jobs/PR_Builder_Hawkbit-Extensions/workspace/hawkbit-extension-artifact-repository-gcs/target/sonar
[INFO] Source paths: pom.xml, src/main/java
[INFO] Test paths: src/test/java
[INFO] Source encoding: UTF-8, default locale: en_US
[INFO] Index files
[INFO] Excluded sources: 
[INFO]   **/target/generated-sources/apt/**
[INFO]   **/src/test/**
[INFO]   **/src/main/java/org/eclipse/hawkbit/repository/test/**
[INFO] 7 files indexed
[INFO] 0 files ignored because of inclusion/exclusion patterns
[INFO] Quality profile for java: hawkBit
[INFO] Excluded sources for coverage: 
[INFO]   **/src/main/java/org/eclipse/hawkbit/ui/**
[INFO]   **/target/generated-sources/apt/**
[INFO]   **/src/main/java/org/eclipse/hawkbit/repository/test/**
[INFO]   **/examples/**
[INFO] Sensor JavaSquidSensor [java]
[INFO] Configured Java source version (sonar.java.source): 8
[INFO] JavaClasspath initialization
[INFO] JavaClasspath initialization (done) | time=22ms
[INFO] JavaTestClasspath initialization
[INFO] JavaTestClasspath initialization (done) | time=9ms
[INFO] Java Main Files AST scan
[INFO] 1 source files to be analyzed
[INFO] 1/1 source files have been analyzed
[INFO] Java Main Files AST scan (done) | time=579ms
[INFO] Java Test Files AST scan
[INFO] 1 source files to be analyzed
[INFO] 1/1 source files have been analyzed
[INFO] Java Test Files AST scan (done) | time=247ms
[INFO] Sensor JavaSquidSensor [java] (done) | time=2264ms
[INFO] Sensor SurefireSensor [java]
[INFO] parsing [/home/hudson/genie.hawkbit/.jenkins/jobs/PR_Builder_Hawkbit-Extensions/workspace/hawkbit-extension-artifact-repository-gcs/target/surefire-reports]
[INFO] Sensor SurefireSensor [java] (done) | time=3ms
[INFO] Sensor JaCoCoSensor [java]
[INFO] JaCoCo report not found: '/home/hudson/genie.hawkbit/.jenkins/jobs/PR_Builder_Hawkbit-Extensions/workspace/hawkbit-extension-artifact-repository-gcs/../../target//jacoco-ut.exec'
[INFO] JaCoCo report not found: '/home/hudson/genie.hawkbit/.jenkins/jobs/PR_Builder_Hawkbit-Extensions/workspace/hawkbit-extension-artifact-repository-gcs/../../target//jacoco-it.exec'
[INFO] Sensor JaCoCoSensor [java] (done) | time=3ms
[INFO] Sensor JavaXmlSensor [java]
[INFO] Sensor JavaXmlSensor [java] (done) | time=3ms
[INFO] -------------  Scan hawkBit :: Extensions :: Artifact Repository Mongo
[INFO] Base dir: /home/hudson/genie.hawkbit/.jenkins/jobs/PR_Builder_Hawkbit-Extensions/workspace/hawkbit-extension-artifact-repository-mongo
[INFO] Working dir: /home/hudson/genie.hawkbit/.jenkins/jobs/PR_Builder_Hawkbit-Extensions/workspace/hawkbit-extension-artifact-repository-mongo/target/sonar
[INFO] Source paths: pom.xml, src/main/java
[INFO] Test paths: src/test/java
[INFO] Source encoding: UTF-8, default locale: en_US
[INFO] Index files
[INFO] Excluded sources: 
[INFO]   **/target/generated-sources/apt/**
[INFO]   **/src/test/**
[INFO]   **/src/main/java/org/eclipse/hawkbit/repository/test/**
[INFO] 6 files indexed
[INFO] 0 files ignored because of inclusion/exclusion patterns
[INFO] Quality profile for java: hawkBit
[INFO] Excluded sources for coverage: 
[INFO]   **/src/main/java/org/eclipse/hawkbit/ui/**
[INFO]   **/target/generated-sources/apt/**
[INFO]   **/src/main/java/org/eclipse/hawkbit/repository/test/**
[INFO]   **/examples/**
[INFO] Sensor JavaSquidSensor [java]
[INFO] Configured Java source version (sonar.java.source): 8
[INFO] JavaClasspath initialization
[INFO] JavaClasspath initialization (done) | time=3ms
[INFO] JavaTestClasspath initialization
[INFO] JavaTestClasspath initialization (done) | time=5ms
[INFO] Java Main Files AST scan
[INFO] 2 source files to be analyzed
[INFO] 2/2 source files have been analyzed
[WARNING] Classes not found during the analysis : [javax.annotation.meta.When]
[INFO] Java Main Files AST scan (done) | time=446ms
[INFO] Java Test Files AST scan
[INFO] 1 source files to be analyzed
[INFO] 1/1 source files have been analyzed
[INFO] Java Test Files AST scan (done) | time=172ms
[INFO] Sensor JavaSquidSensor [java] (done) | time=807ms
[INFO] Sensor SurefireSensor [java]
[INFO] parsing [/home/hudson/genie.hawkbit/.jenkins/jobs/PR_Builder_Hawkbit-Extensions/workspace/hawkbit-extension-artifact-repository-mongo/target/surefire-reports]
[INFO] Sensor SurefireSensor [java] (done) | time=1ms
[INFO] Sensor JaCoCoSensor [java]
[INFO] JaCoCo report not found: '/home/hudson/genie.hawkbit/.jenkins/jobs/PR_Builder_Hawkbit-Extensions/workspace/hawkbit-extension-artifact-repository-mongo/../../target//jacoco-ut.exec'
[INFO] JaCoCo report not found: '/home/hudson/genie.hawkbit/.jenkins/jobs/PR_Builder_Hawkbit-Extensions/workspace/hawkbit-extension-artifact-repository-mongo/../../target//jacoco-it.exec'
[INFO] Sensor JaCoCoSensor [java] (done) | time=0ms
[INFO] Sensor JavaXmlSensor [java]
[INFO] Sensor JavaXmlSensor [java] (done) | time=1ms
[INFO] -------------  Scan hawkBit :: Extensions :: S3 Repository
[INFO] Base dir: /home/hudson/genie.hawkbit/.jenkins/jobs/PR_Builder_Hawkbit-Extensions/workspace/hawkbit-extension-artifact-repository-s3
[INFO] Working dir: /home/hudson/genie.hawkbit/.jenkins/jobs/PR_Builder_Hawkbit-Extensions/workspace/hawkbit-extension-artifact-repository-s3/target/sonar
[INFO] Source paths: pom.xml, src/main/java
[INFO] Test paths: src/test/java
[INFO] Source encoding: UTF-8, default locale: en_US
[INFO] Index files
[INFO] Excluded sources: 
[INFO]   **/target/generated-sources/apt/**
[INFO]   **/src/test/**
[INFO]   **/src/main/java/org/eclipse/hawkbit/repository/test/**
[INFO] 6 files indexed
[INFO] 0 files ignored because of inclusion/exclusion patterns
[INFO] Quality profile for java: hawkBit
[INFO] Excluded sources for coverage: 
[INFO]   **/src/main/java/org/eclipse/hawkbit/ui/**
[INFO]   **/target/generated-sources/apt/**
[INFO]   **/src/main/java/org/eclipse/hawkbit/repository/test/**
[INFO]   **/examples/**
[INFO] Sensor JavaSquidSensor [java]
[INFO] Configured Java source version (sonar.java.source): 8
[INFO] JavaClasspath initialization
[INFO] JavaClasspath initialization (done) | time=3ms
[INFO] JavaTestClasspath initialization
[INFO] JavaTestClasspath initialization (done) | time=1ms
[INFO] Java Main Files AST scan
[INFO] 1 source files to be analyzed
[INFO] 1/1 source files have been analyzed
[INFO] Java Main Files AST scan (done) | time=175ms
[INFO] Java Test Files AST scan
[INFO] 1 source files to be analyzed
[INFO] 1/1 source files have been analyzed
[INFO] Java Test Files AST scan (done) | time=110ms
[INFO] Sensor JavaSquidSensor [java] (done) | time=314ms
[INFO] Sensor SurefireSensor [java]
[INFO] parsing [/home/hudson/genie.hawkbit/.jenkins/jobs/PR_Builder_Hawkbit-Extensions/workspace/hawkbit-extension-artifact-repository-s3/target/surefire-reports]
[INFO] Sensor SurefireSensor [java] (done) | time=0ms
[INFO] Sensor JaCoCoSensor [java]
[INFO] JaCoCo report not found: '/home/hudson/genie.hawkbit/.jenkins/jobs/PR_Builder_Hawkbit-Extensions/workspace/hawkbit-extension-artifact-repository-s3/../../target//jacoco-ut.exec'
[INFO] JaCoCo report not found: '/home/hudson/genie.hawkbit/.jenkins/jobs/PR_Builder_Hawkbit-Extensions/workspace/hawkbit-extension-artifact-repository-s3/../../target//jacoco-it.exec'
[INFO] Sensor JaCoCoSensor [java] (done) | time=1ms
[INFO] Sensor JavaXmlSensor [java]
[INFO] Sensor JavaXmlSensor [java] (done) | time=0ms
[INFO] -------------  Scan hawkBit :: Extensions :: Azure Block Storage Repository
[INFO] Base dir: /home/hudson/genie.hawkbit/.jenkins/jobs/PR_Builder_Hawkbit-Extensions/workspace/hawkbit-extensions-azure/hawkbit-extension-artifact-repository-azure
[INFO] Working dir: /home/hudson/genie.hawkbit/.jenkins/jobs/PR_Builder_Hawkbit-Extensions/workspace/hawkbit-extensions-azure/hawkbit-extension-artifact-repository-azure/target/sonar
[INFO] Source paths: pom.xml, src/main/java
[INFO] Source encoding: UTF-8, default locale: en_US
[INFO] Index files
[INFO] Excluded sources: 
[INFO]   **/target/generated-sources/apt/**
[INFO]   **/src/test/**
[INFO]   **/src/main/java/org/eclipse/hawkbit/repository/test/**
[INFO] 5 files indexed
[INFO] 0 files ignored because of inclusion/exclusion patterns
[INFO] Quality profile for java: hawkBit
[INFO] Excluded sources for coverage: 
[INFO]   **/src/main/java/org/eclipse/hawkbit/ui/**
[INFO]   **/target/generated-sources/apt/**
[INFO]   **/src/main/java/org/eclipse/hawkbit/repository/test/**
[INFO]   **/examples/**
[INFO] Sensor JavaSquidSensor [java]
[INFO] Configured Java source version (sonar.java.source): 8
[INFO] JavaClasspath initialization
[INFO] JavaClasspath initialization (done) | time=2ms
[INFO] JavaTestClasspath initialization
[INFO] JavaTestClasspath initialization (done) | time=1ms
[INFO] Java Main Files AST scan
[INFO] 1 source files to be analyzed
[INFO] 1/1 source files have been analyzed
[INFO] Java Main Files AST scan (done) | time=161ms
[INFO] Java Test Files AST scan
[INFO] 0 source files to be analyzed
[INFO] 0/0 source files have been analyzed
[INFO] Java Test Files AST scan (done) | time=1ms
[INFO] Sensor JavaSquidSensor [java] (done) | time=182ms
[INFO] Sensor SurefireSensor [java]
[INFO] parsing [/home/hudson/genie.hawkbit/.jenkins/jobs/PR_Builder_Hawkbit-Extensions/workspace/hawkbit-extensions-azure/hawkbit-extension-artifact-repository-azure/target/surefire-reports]
[INFO] Sensor SurefireSensor [java] (done) | time=0ms
[INFO] Sensor JaCoCoSensor [java]
[INFO] JaCoCo report not found: '/home/hudson/genie.hawkbit/.jenkins/jobs/PR_Builder_Hawkbit-Extensions/workspace/hawkbit-extensions-azure/hawkbit-extension-artifact-repository-azure/../../target//jacoco-ut.exec'
[INFO] JaCoCo report not found: '/home/hudson/genie.hawkbit/.jenkins/jobs/PR_Builder_Hawkbit-Extensions/workspace/hawkbit-extensions-azure/hawkbit-extension-artifact-repository-azure/../../target//jacoco-it.exec'
[INFO] Sensor JaCoCoSensor [java] (done) | time=1ms
[INFO] Sensor JavaXmlSensor [java]
[INFO] Sensor JavaXmlSensor [java] (done) | time=0ms
[INFO] -------------  Scan hawkBit :: Extensions :: Azure
[INFO] Base dir: /home/hudson/genie.hawkbit/.jenkins/jobs/PR_Builder_Hawkbit-Extensions/workspace/hawkbit-extensions-azure
[INFO] Working dir: /home/hudson/genie.hawkbit/.jenkins/jobs/PR_Builder_Hawkbit-Extensions/workspace/hawkbit-extensions-azure/target/sonar
[INFO] Source paths: pom.xml
[INFO] Source encoding: UTF-8, default locale: en_US
[INFO] Index files
[INFO] Excluded sources: 
[INFO]   **/target/generated-sources/apt/**
[INFO]   **/src/test/**
[INFO]   **/src/main/java/org/eclipse/hawkbit/repository/test/**
[INFO] 1 file indexed
[INFO] 0 files ignored because of inclusion/exclusion patterns
[INFO] Excluded sources for coverage: 
[INFO]   **/src/main/java/org/eclipse/hawkbit/ui/**
[INFO]   **/target/generated-sources/apt/**
[INFO]   **/src/main/java/org/eclipse/hawkbit/repository/test/**
[INFO]   **/examples/**
[INFO] Sensor JavaXmlSensor [java]
[INFO] Sensor JavaXmlSensor [java] (done) | time=0ms
[INFO] -------------  Scan hawkBit :: Extensions :: Azure enabled Update Server
[INFO] Base dir: /home/hudson/genie.hawkbit/.jenkins/jobs/PR_Builder_Hawkbit-Extensions/workspace/hawkbit-extended-runtimes/hawkbit-update-server-azure
[INFO] Working dir: /home/hudson/genie.hawkbit/.jenkins/jobs/PR_Builder_Hawkbit-Extensions/workspace/hawkbit-extended-runtimes/hawkbit-update-server-azure/target/sonar
[INFO] Source paths: pom.xml, src/main/java
[INFO] Source encoding: UTF-8, default locale: en_US
[INFO] Index files
[INFO] Excluded sources: 
[INFO]   **/target/generated-sources/apt/**
[INFO]   **/src/test/**
[INFO]   **/src/main/java/org/eclipse/hawkbit/repository/test/**
[INFO] 5 files indexed
[INFO] 0 files ignored because of inclusion/exclusion patterns
[INFO] Quality profile for java: hawkBit
[INFO] Excluded sources for coverage: 
[INFO]   **/src/main/java/org/eclipse/hawkbit/ui/**
[INFO]   **/target/generated-sources/apt/**
[INFO]   **/src/main/java/org/eclipse/hawkbit/repository/test/**
[INFO]   **/examples/**
[INFO] Sensor JavaXmlSensor [java]
[INFO] Sensor JavaXmlSensor [java] (done) | time=0ms
[INFO] -------------  Scan hawkBit :: Extensions :: Runtimes
[INFO] Base dir: /home/hudson/genie.hawkbit/.jenkins/jobs/PR_Builder_Hawkbit-Extensions/workspace/hawkbit-extended-runtimes
[INFO] Working dir: /home/hudson/genie.hawkbit/.jenkins/jobs/PR_Builder_Hawkbit-Extensions/workspace/hawkbit-extended-runtimes/target/sonar
[INFO] Source paths: pom.xml
[INFO] Source encoding: UTF-8, default locale: en_US
[INFO] Index files
[INFO] Excluded sources: 
[INFO]   **/target/generated-sources/apt/**
[INFO]   **/src/test/**
[INFO]   **/src/main/java/org/eclipse/hawkbit/repository/test/**
[INFO] 1 file indexed
[INFO] 0 files ignored because of inclusion/exclusion patterns
[INFO] Excluded sources for coverage: 
[INFO]   **/src/main/java/org/eclipse/hawkbit/ui/**
[INFO]   **/target/generated-sources/apt/**
[INFO]   **/src/main/java/org/eclipse/hawkbit/repository/test/**
[INFO]   **/examples/**
[INFO] Sensor JavaXmlSensor [java]
[INFO] Sensor JavaXmlSensor [java] (done) | time=0ms
[INFO] -------------  Scan hawkBit :: Extensions
[INFO] Base dir: /home/hudson/genie.hawkbit/.jenkins/jobs/PR_Builder_Hawkbit-Extensions/workspace
[INFO] Working dir: /home/hudson/genie.hawkbit/.jenkins/jobs/PR_Builder_Hawkbit-Extensions/workspace/target/sonar
[INFO] Source paths: pom.xml
[INFO] Source encoding: UTF-8, default locale: en_US
[INFO] Index files
[INFO] Excluded sources: 
[INFO]   **/target/generated-sources/apt/**
[INFO]   **/src/test/**
[INFO]   **/src/main/java/org/eclipse/hawkbit/repository/test/**
[INFO] 1 file indexed
[INFO] 0 files ignored because of inclusion/exclusion patterns
[INFO] Excluded sources for coverage: 
[INFO]   **/src/main/java/org/eclipse/hawkbit/ui/**
[INFO]   **/target/generated-sources/apt/**
[INFO]   **/src/main/java/org/eclipse/hawkbit/repository/test/**
[INFO]   **/examples/**
[INFO] Sensor JavaXmlSensor [java]
[INFO] 1 source files to be analyzed
[INFO] Sensor JavaXmlSensor [java] (done) | time=192ms
[INFO] 1/1 source files have been analyzed
[INFO] Load server issues
[INFO] Load server issues (done) | time=122ms
[INFO] Performing issue tracking
[INFO] 57/57 components tracked
[INFO] ANALYSIS SUCCESSFUL
[INFO] Executing post-job GitHub Pull Request Issue Publisher
[INFO] Task total time: 22.271 s
Started calculate disk usage of build
Finished Calculation of disk usage of build in 0 seconds
Started calculate disk usage of workspace
Finished Calculation of disk usage of workspace in 0 seconds
[INFO] ------------------------------------------------------------------------
[INFO] Reactor Summary for hawkBit :: Extensions 0.3.0-SNAPSHOT:
[INFO] 
[INFO] hawkBit :: Extensions .............................. SUCCESS [ 35.365 s]
[INFO] hawkBit :: Extensions :: Artifact Repository Mongo . FAILURE [  6.458 s]
[INFO] hawkBit :: Extensions :: S3 Repository ............. FAILURE [  1.257 s]
[INFO] hawkBit :: Extensions :: GCS Repository ............ FAILURE [  2.015 s]
[INFO] hawkBit :: Extensions :: Azure ..................... SUCCESS [  0.112 s]
[INFO] hawkBit :: Extensions :: Azure Block Storage Repository FAILURE [  1.451 s]
[INFO] hawkBit :: Extensions :: Runtimes .................. SUCCESS [  0.103 s]
[INFO] hawkBit :: Extensions :: Azure enabled Update Server SKIPPED
[INFO] ------------------------------------------------------------------------
[INFO] BUILD FAILURE
[INFO] ------------------------------------------------------------------------
[INFO] Total time:  01:00 min
[INFO] Finished at: 2019-07-29T07:37:27-04:00
[INFO] ------------------------------------------------------------------------
Waiting for Jenkins to finish collecting data
[ERROR] Failed to execute goal org.apache.maven.plugins:maven-compiler-plugin:3.8.0:compile (default-compile) on project hawkbit-extension-artifact-repository-mongo: Compilation failure: Compilation failure:
[ERROR] /home/hudson/genie.hawkbit/.jenkins/jobs/PR_Builder_Hawkbit-Extensions/workspace/hawkbit-extension-artifact-repository-mongo/src/main/java/org/eclipse/hawkbit/artifact/repository/MongoDBArtifactStore.java:[36,8] org.eclipse.hawkbit.artifact.repository.MongoDBArtifactStore is not abstract and does not override abstract method store(java.lang.String,java.lang.String,java.lang.String,java.lang.String,java.lang.String) in org.eclipse.hawkbit.artifact.repository.AbstractArtifactRepository
[ERROR] /home/hudson/genie.hawkbit/.jenkins/jobs/PR_Builder_Hawkbit-Extensions/workspace/hawkbit-extension-artifact-repository-mongo/src/main/java/org/eclipse/hawkbit/artifact/repository/MongoDBArtifactStore.java:[118,5] method does not override or implement a method from a supertype
[ERROR] /home/hudson/genie.hawkbit/.jenkins/jobs/PR_Builder_Hawkbit-Extensions/workspace/hawkbit-extension-artifact-repository-mongo/src/main/java/org/eclipse/hawkbit/artifact/repository/MongoDBArtifactStore.java:[202,17] constructor DbArtifactHash in class org.eclipse.hawkbit.artifact.repository.model.DbArtifactHash cannot be applied to given types;
[ERROR] required: java.lang.String,java.lang.String
[ERROR] found: java.lang.String,java.lang.String,<nulltype>
[ERROR] reason: actual and formal argument lists differ in length
[ERROR] -> [Help 1]
[ERROR] Failed to execute goal org.apache.maven.plugins:maven-compiler-plugin:3.8.0:compile (default-compile) on project hawkbit-extension-artifact-repository-s3: Compilation failure: Compilation failure:
[ERROR] /home/hudson/genie.hawkbit/.jenkins/jobs/PR_Builder_Hawkbit-Extensions/workspace/hawkbit-extension-artifact-repository-s3/src/main/java/org/eclipse/hawkbit/artifact/repository/S3Repository.java:[49,8] org.eclipse.hawkbit.artifact.repository.S3Repository is not abstract and does not override abstract method store(java.lang.String,java.lang.String,java.lang.String,java.lang.String,java.lang.String) in org.eclipse.hawkbit.artifact.repository.AbstractArtifactRepository
[ERROR] /home/hudson/genie.hawkbit/.jenkins/jobs/PR_Builder_Hawkbit-Extensions/workspace/hawkbit-extension-artifact-repository-s3/src/main/java/org/eclipse/hawkbit/artifact/repository/S3Repository.java:[69,5] method does not override or implement a method from a supertype
[ERROR] /home/hudson/genie.hawkbit/.jenkins/jobs/PR_Builder_Hawkbit-Extensions/workspace/hawkbit-extension-artifact-repository-s3/src/main/java/org/eclipse/hawkbit/artifact/repository/S3Repository.java:[145,21] constructor DbArtifactHash in class org.eclipse.hawkbit.artifact.repository.model.DbArtifactHash cannot be applied to given types;
[JENKINS] Archiving /home/hudson/genie.hawkbit/.jenkins/jobs/PR_Builder_Hawkbit-Extensions/workspace/hawkbit-extension-artifact-repository-mongo/pom.xml to org.eclipse.hawkbit/hawkbit-extension-artifact-repository-mongo/0.3.0-SNAPSHOT/hawkbit-extension-artifact-repository-mongo-0.3.0-SNAPSHOT.pom
[ERROR] required: java.lang.String,java.lang.String
[ERROR] found: java.lang.String,java.lang.String,<nulltype>
[ERROR] reason: actual and formal argument lists differ in length
[ERROR] -> [Help 1]
[ERROR] Failed to execute goal org.apache.maven.plugins:maven-compiler-plugin:3.8.0:compile (default-compile) on project hawkbit-extension-artifact-repository-gcs: Compilation failure: Compilation failure:
[ERROR] /home/hudson/genie.hawkbit/.jenkins/jobs/PR_Builder_Hawkbit-Extensions/workspace/hawkbit-extension-artifact-repository-gcs/src/main/java/org/eclipse/hawkbit/artifact/repository/GcsRepository.java:[37,8] org.eclipse.hawkbit.artifact.repository.GcsRepository is not abstract and does not override abstract method store(java.lang.String,java.lang.String,java.lang.String,java.lang.String,java.lang.String) in org.eclipse.hawkbit.artifact.repository.AbstractArtifactRepository
[ERROR] /home/hudson/genie.hawkbit/.jenkins/jobs/PR_Builder_Hawkbit-Extensions/workspace/hawkbit-extension-artifact-repository-gcs/src/main/java/org/eclipse/hawkbit/artifact/repository/GcsRepository.java:[61,5] method does not override or implement a method from a supertype
[ERROR] /home/hudson/genie.hawkbit/.jenkins/jobs/PR_Builder_Hawkbit-Extensions/workspace/hawkbit-extension-artifact-repository-gcs/src/main/java/org/eclipse/hawkbit/artifact/repository/GcsRepository.java:[113,17] constructor DbArtifactHash in class org.eclipse.hawkbit.artifact.repository.model.DbArtifactHash cannot be applied to given types;
[ERROR] required: java.lang.String,java.lang.String
[ERROR] found: java.lang.String,java.lang.String,<nulltype>
[JENKINS] Archiving /home/hudson/genie.hawkbit/.jenkins/jobs/PR_Builder_Hawkbit-Extensions/workspace/hawkbit-extension-artifact-repository-s3/pom.xml to org.eclipse.hawkbit/hawkbit-extension-artifact-repository-s3/0.3.0-SNAPSHOT/hawkbit-extension-artifact-repository-s3-0.3.0-SNAPSHOT.pom
[JENKINS] Archiving /home/hudson/genie.hawkbit/.jenkins/jobs/PR_Builder_Hawkbit-Extensions/workspace/hawkbit-extension-artifact-repository-gcs/pom.xml to org.eclipse.hawkbit/hawkbit-extension-artifact-repository-gcs/0.3.0-SNAPSHOT/hawkbit-extension-artifact-repository-gcs-0.3.0-SNAPSHOT.pom
[JENKINS] Archiving /home/hudson/genie.hawkbit/.jenkins/jobs/PR_Builder_Hawkbit-Extensions/workspace/hawkbit-extended-runtimes/hawkbit-update-server-azure/pom.xml to org.eclipse.hawkbit/hawkbit-update-server-azure/0.3.0-SNAPSHOT/hawkbit-update-server-azure-0.3.0-SNAPSHOT.pom
[JENKINS] Archiving /home/hudson/genie.hawkbit/.jenkins/jobs/PR_Builder_Hawkbit-Extensions/workspace/pom.xml to org.eclipse.hawkbit/hawkbit-extensions-parent/0.3.0-SNAPSHOT/hawkbit-extensions-parent-0.3.0-SNAPSHOT.pom
[JENKINS] Archiving /home/hudson/genie.hawkbit/.jenkins/jobs/PR_Builder_Hawkbit-Extensions/workspace/hawkbit-extended-runtimes/pom.xml to org.eclipse.hawkbit/hawkbit-extended-runtimes/0.3.0-SNAPSHOT/hawkbit-extended-runtimes-0.3.0-SNAPSHOT.pom
[JENKINS] Archiving /home/hudson/genie.hawkbit/.jenkins/jobs/PR_Builder_Hawkbit-Extensions/workspace/hawkbit-extensions-azure/pom.xml to org.eclipse.hawkbit/hawkbit-extensions-azure/0.3.0-SNAPSHOT/hawkbit-extensions-azure-0.3.0-SNAPSHOT.pom
[JENKINS] Archiving /home/hudson/genie.hawkbit/.jenkins/jobs/PR_Builder_Hawkbit-Extensions/workspace/hawkbit-extensions-azure/hawkbit-extension-artifact-repository-azure/pom.xml to org.eclipse.hawkbit/hawkbit-extension-artifact-repository-azure/0.3.0-SNAPSHOT/hawkbit-extension-artifact-repository-azure-0.3.0-SNAPSHOT.pom
[ERROR] reason: actual and formal argument lists differ in length
[ERROR] -> [Help 1]
[ERROR] Failed to execute goal org.apache.maven.plugins:maven-compiler-plugin:3.8.0:compile (default-compile) on project hawkbit-extension-artifact-repository-azure: Compilation failure: Compilation failure:
[ERROR] /home/hudson/genie.hawkbit/.jenkins/jobs/PR_Builder_Hawkbit-Extensions/workspace/hawkbit-extensions-azure/hawkbit-extension-artifact-repository-azure/src/main/java/org/eclipse/hawkbit/artifact/repository/AzureStorageRepository.java:[40,8] org.eclipse.hawkbit.artifact.repository.AzureStorageRepository is not abstract and does not override abstract method store(java.lang.String,java.lang.String,java.lang.String,java.lang.String,java.lang.String) in org.eclipse.hawkbit.artifact.repository.AbstractArtifactRepository
[ERROR] /home/hudson/genie.hawkbit/.jenkins/jobs/PR_Builder_Hawkbit-Extensions/workspace/hawkbit-extensions-azure/hawkbit-extension-artifact-repository-azure/src/main/java/org/eclipse/hawkbit/artifact/repository/AzureStorageRepository.java:[63,5] method does not override or implement a method from a supertype
[ERROR] /home/hudson/genie.hawkbit/.jenkins/jobs/PR_Builder_Hawkbit-Extensions/workspace/hawkbit-extensions-azure/hawkbit-extension-artifact-repository-azure/src/main/java/org/eclipse/hawkbit/artifact/repository/AzureStorageRepository.java:[150,21] constructor DbArtifactHash in class org.eclipse.hawkbit.artifact.repository.model.DbArtifactHash cannot be applied to given types;
[ERROR] required: java.lang.String,java.lang.String
[ERROR] found: java.lang.String,java.lang.String,<nulltype>
[ERROR] reason: actual and formal argument lists differ in length
[ERROR] -> [Help 1]
[ERROR] 
[ERROR] To see the full stack trace of the errors, re-run Maven with the -e switch.
[ERROR] Re-run Maven using the -X switch to enable full debug logging.
[ERROR] 
[ERROR] For more information about the errors and possible solutions, please read the following articles:
[ERROR] [Help 1] http://cwiki.apache.org/confluence/display/MAVEN/MojoFailureException
[ERROR] 
[ERROR] After correcting the problems, you can resume the build with the command
[ERROR]   mvn <goals> -rf :hawkbit-extension-artifact-repository-mongo
channel stopped
Started calculate disk usage of build
Finished Calculation of disk usage of build in 0 seconds
Started calculate disk usage of workspace
Finished Calculation of disk usage of workspace in 0 seconds
Finished: FAILURE