FailedConsole Output

Skipping 9,590 KB.. Full Log
/hawtbuf-proto/1.9/hawtbuf-proto-1.9.pom (4.5 kB at 74 kB/s)
[INFO] Downloading from cbi: https://repo.eclipse.org/content/repositories/cbi-releases/org/fusesource/hawtbuf/hawtbuf-project/1.9/hawtbuf-project-1.9.pom
[INFO] Downloading from eclipse.maven.central.mirror: https://repo.eclipse.org/content/repositories/maven_central/org/fusesource/hawtbuf/hawtbuf-project/1.9/hawtbuf-project-1.9.pom
[INFO] Downloaded from eclipse.maven.central.mirror: https://repo.eclipse.org/content/repositories/maven_central/org/fusesource/hawtbuf/hawtbuf-project/1.9/hawtbuf-project-1.9.pom (11 kB at 243 kB/s)
[INFO] Downloading from cbi: https://repo.eclipse.org/content/repositories/cbi-releases/org/fusesource/hawtbuf/hawtbuf/1.9/hawtbuf-1.9.pom
[INFO] Downloading from eclipse.maven.central.mirror: https://repo.eclipse.org/content/repositories/maven_central/org/fusesource/hawtbuf/hawtbuf/1.9/hawtbuf-1.9.pom
[INFO] Downloaded from eclipse.maven.central.mirror: https://repo.eclipse.org/content/repositories/maven_central/org/fusesource/hawtbuf/hawtbuf/1.9/hawtbuf-1.9.pom (2.6 kB at 68 kB/s)
[INFO] Downloading from cbi: https://repo.eclipse.org/content/repositories/cbi-releases/org/sonatype/aether/aether-api/1.13.1/aether-api-1.13.1.pom
[INFO] Downloading from eclipse.maven.central.mirror: https://repo.eclipse.org/content/repositories/maven_central/org/sonatype/aether/aether-api/1.13.1/aether-api-1.13.1.pom
[INFO] Downloaded from eclipse.maven.central.mirror: https://repo.eclipse.org/content/repositories/maven_central/org/sonatype/aether/aether-api/1.13.1/aether-api-1.13.1.pom (1.4 kB at 27 kB/s)
[INFO] Downloading from cbi: https://repo.eclipse.org/content/repositories/cbi-releases/org/sonatype/aether/aether/1.13.1/aether-1.13.1.pom
[INFO] Downloading from eclipse.maven.central.mirror: https://repo.eclipse.org/content/repositories/maven_central/org/sonatype/aether/aether/1.13.1/aether-1.13.1.pom
[INFO] Downloaded from eclipse.maven.central.mirror: https://repo.eclipse.org/content/repositories/maven_central/org/sonatype/aether/aether/1.13.1/aether-1.13.1.pom (10 kB at 317 kB/s)
[INFO] Downloading from cbi: https://repo.eclipse.org/content/repositories/cbi-releases/ch/qos/logback/logback-core/1.1.2/logback-core-1.1.2.pom
[INFO] Downloading from eclipse.maven.central.mirror: https://repo.eclipse.org/content/repositories/maven_central/ch/qos/logback/logback-core/1.1.2/logback-core-1.1.2.pom
[INFO] Downloaded from eclipse.maven.central.mirror: https://repo.eclipse.org/content/repositories/maven_central/ch/qos/logback/logback-core/1.1.2/logback-core-1.1.2.pom (5.0 kB at 111 kB/s)
[INFO] Downloading from cbi: https://repo.eclipse.org/content/repositories/cbi-releases/ch/qos/logback/logback-parent/1.1.2/logback-parent-1.1.2.pom
[INFO] Downloading from eclipse.maven.central.mirror: https://repo.eclipse.org/content/repositories/maven_central/ch/qos/logback/logback-parent/1.1.2/logback-parent-1.1.2.pom
[INFO] Downloaded from eclipse.maven.central.mirror: https://repo.eclipse.org/content/repositories/maven_central/ch/qos/logback/logback-parent/1.1.2/logback-parent-1.1.2.pom (15 kB at 372 kB/s)
[INFO] Downloading from cbi: https://repo.eclipse.org/content/repositories/cbi-releases/ch/qos/logback/logback-classic/1.1.2/logback-classic-1.1.2.pom
[INFO] Downloading from eclipse.maven.central.mirror: https://repo.eclipse.org/content/repositories/maven_central/ch/qos/logback/logback-classic/1.1.2/logback-classic-1.1.2.pom
[INFO] Downloaded from eclipse.maven.central.mirror: https://repo.eclipse.org/content/repositories/maven_central/ch/qos/logback/logback-classic/1.1.2/logback-classic-1.1.2.pom (12 kB at 409 kB/s)
[INFO] Downloading from cbi: https://repo.eclipse.org/content/repositories/cbi-releases/org/sonatype/plugins/nexus-staging-maven-plugin/1.6.8/nexus-staging-maven-plugin-1.6.8.jar
[INFO] Downloading from cbi: https://repo.eclipse.org/content/repositories/cbi-releases/org/sonatype/plexus/plexus-sec-dispatcher/1.4/plexus-sec-dispatcher-1.4.jar
[INFO] Downloading from cbi: https://repo.eclipse.org/content/repositories/cbi-releases/org/sonatype/nexus/maven/nexus-common/1.6.8/nexus-common-1.6.8.jar
[INFO] Downloading from cbi: https://repo.eclipse.org/content/repositories/cbi-releases/org/sonatype/nexus/nexus-client-core/2.14.3-02/nexus-client-core-2.14.3-02.jar
[INFO] Downloading from cbi: https://repo.eclipse.org/content/repositories/cbi-releases/com/google/guava/guava/14.0.1/guava-14.0.1.jar
[INFO] Downloading from cbi: https://repo.eclipse.org/content/repositories/cbi-releases/org/sonatype/nexus/plugins/nexus-restlet1x-model/2.14.3-02/nexus-restlet1x-model-2.14.3-02.jar
[INFO] Downloading from cbi: https://repo.eclipse.org/content/repositories/cbi-releases/org/apache/maven/maven-model/3.0.4/maven-model-3.0.4.jar
[INFO] Downloading from cbi: https://repo.eclipse.org/content/repositories/cbi-releases/com/intellij/annotations/9.0.4/annotations-9.0.4.jar
[INFO] Downloading from cbi: https://repo.eclipse.org/content/repositories/cbi-releases/commons-io/commons-io/2.4/commons-io-2.4.jar
[INFO] Downloading from cbi: https://repo.eclipse.org/content/repositories/cbi-releases/com/thoughtworks/xstream/xstream/1.4.7/xstream-1.4.7.jar
[INFO] Downloading from cbi: https://repo.eclipse.org/content/repositories/cbi-releases/joda-time/joda-time/2.2/joda-time-2.2.jar
[INFO] Downloading from cbi: https://repo.eclipse.org/content/repositories/cbi-releases/commons-lang/commons-lang/2.6/commons-lang-2.6.jar
[INFO] Downloading from cbi: https://repo.eclipse.org/content/repositories/cbi-releases/commons-beanutils/commons-beanutils-core/1.8.3/commons-beanutils-core-1.8.3.jar
[INFO] Downloading from cbi: https://repo.eclipse.org/content/repositories/cbi-releases/org/sonatype/sisu/siesta/siesta-client/1.7/siesta-client-1.7.jar
[INFO] Downloading from cbi: https://repo.eclipse.org/content/repositories/cbi-releases/org/sonatype/sisu/siesta/siesta-common/1.7/siesta-common-1.7.jar
[INFO] Downloading from cbi: https://repo.eclipse.org/content/repositories/cbi-releases/javax/ws/rs/jsr311-api/1.1.1/jsr311-api-1.1.1.jar
[INFO] Downloading from cbi: https://repo.eclipse.org/content/repositories/cbi-releases/com/sun/jersey/jersey-core/1.17.1/jersey-core-1.17.1.jar
[INFO] Downloading from cbi: https://repo.eclipse.org/content/repositories/cbi-releases/javax/validation/validation-api/1.1.0.Final/validation-api-1.1.0.Final.jar
[INFO] Downloading from cbi: https://repo.eclipse.org/content/repositories/cbi-releases/com/sun/jersey/jersey-client/1.17.1/jersey-client-1.17.1.jar
[INFO] Downloading from cbi: https://repo.eclipse.org/content/repositories/cbi-releases/com/sun/jersey/contribs/jersey-apache-client4/1.17.1/jersey-apache-client4-1.17.1.jar
[INFO] Downloading from cbi: https://repo.eclipse.org/content/repositories/cbi-releases/org/sonatype/sisu/siesta/siesta-jackson/1.7/siesta-jackson-1.7.jar
[INFO] Downloading from cbi: https://repo.eclipse.org/content/repositories/cbi-releases/com/fasterxml/jackson/core/jackson-annotations/2.3.1/jackson-annotations-2.3.1.jar
[INFO] Downloading from cbi: https://repo.eclipse.org/content/repositories/cbi-releases/com/fasterxml/jackson/core/jackson-core/2.3.1/jackson-core-2.3.1.jar
[INFO] Downloading from cbi: https://repo.eclipse.org/content/repositories/cbi-releases/com/fasterxml/jackson/core/jackson-databind/2.3.1/jackson-databind-2.3.1.jar
[INFO] Downloading from cbi: https://repo.eclipse.org/content/repositories/cbi-releases/com/fasterxml/jackson/jaxrs/jackson-jaxrs-json-provider/2.3.1/jackson-jaxrs-json-provider-2.3.1.jar
[INFO] Downloading from cbi: https://repo.eclipse.org/content/repositories/cbi-releases/com/fasterxml/jackson/jaxrs/jackson-jaxrs-base/2.3.1/jackson-jaxrs-base-2.3.1.jar
[INFO] Downloading from cbi: https://repo.eclipse.org/content/repositories/cbi-releases/com/fasterxml/jackson/module/jackson-module-jaxb-annotations/2.3.1/jackson-module-jaxb-annotations-2.3.1.jar
[INFO] Downloading from cbi: https://repo.eclipse.org/content/repositories/cbi-releases/org/apache/httpcomponents/httpclient/4.3.5/httpclient-4.3.5.jar
[INFO] Downloading from cbi: https://repo.eclipse.org/content/repositories/cbi-releases/commons-codec/commons-codec/1.6/commons-codec-1.6.jar
[INFO] Downloading from cbi: https://repo.eclipse.org/content/repositories/cbi-releases/org/apache/httpcomponents/httpcore/4.3.2/httpcore-4.3.2.jar
[INFO] Downloading from cbi: https://repo.eclipse.org/content/repositories/cbi-releases/org/slf4j/jcl-over-slf4j/1.7.7/jcl-over-slf4j-1.7.7.jar
[INFO] Downloading from cbi: https://repo.eclipse.org/content/repositories/cbi-releases/org/sonatype/spice/zapper/spice-zapper/1.3/spice-zapper-1.3.jar
[INFO] Downloading from cbi: https://repo.eclipse.org/content/repositories/cbi-releases/org/fusesource/hawtbuf/hawtbuf-proto/1.9/hawtbuf-proto-1.9.jar
[INFO] Downloading from cbi: https://repo.eclipse.org/content/repositories/cbi-releases/org/fusesource/hawtbuf/hawtbuf/1.9/hawtbuf-1.9.jar
[INFO] Downloading from cbi: https://repo.eclipse.org/content/repositories/cbi-releases/org/sonatype/aether/aether-api/1.13.1/aether-api-1.13.1.jar
[INFO] Downloading from cbi: https://repo.eclipse.org/content/repositories/cbi-releases/ch/qos/logback/logback-classic/1.1.2/logback-classic-1.1.2.jar
[INFO] Downloading from cbi: https://repo.eclipse.org/content/repositories/cbi-releases/ch/qos/logback/logback-core/1.1.2/logback-core-1.1.2.jar
[INFO] Downloading from eclipse.maven.central.mirror: https://repo.eclipse.org/content/repositories/maven_central/org/sonatype/plugins/nexus-staging-maven-plugin/1.6.8/nexus-staging-maven-plugin-1.6.8.jar
[INFO] Downloading from eclipse.maven.central.mirror: https://repo.eclipse.org/content/repositories/maven_central/org/sonatype/nexus/nexus-client-core/2.14.3-02/nexus-client-core-2.14.3-02.jar
[INFO] Downloading from eclipse.maven.central.mirror: https://repo.eclipse.org/content/repositories/maven_central/com/google/guava/guava/14.0.1/guava-14.0.1.jar
[INFO] Downloading from eclipse.maven.central.mirror: https://repo.eclipse.org/content/repositories/maven_central/org/sonatype/plexus/plexus-sec-dispatcher/1.4/plexus-sec-dispatcher-1.4.jar
[INFO] Downloading from eclipse.maven.central.mirror: https://repo.eclipse.org/content/repositories/maven_central/org/sonatype/nexus/maven/nexus-common/1.6.8/nexus-common-1.6.8.jar
[INFO] Downloaded from eclipse.maven.central.mirror: https://repo.eclipse.org/content/repositories/maven_central/org/sonatype/nexus/maven/nexus-common/1.6.8/nexus-common-1.6.8.jar (16 kB at 181 kB/s)
[INFO] Downloading from eclipse.maven.central.mirror: https://repo.eclipse.org/content/repositories/maven_central/org/sonatype/nexus/plugins/nexus-restlet1x-model/2.14.3-02/nexus-restlet1x-model-2.14.3-02.jar
[INFO] Downloaded from eclipse.maven.central.mirror: https://repo.eclipse.org/content/repositories/maven_central/org/sonatype/plexus/plexus-sec-dispatcher/1.4/plexus-sec-dispatcher-1.4.jar (28 kB at 195 kB/s)
[INFO] Downloading from eclipse.maven.central.mirror: https://repo.eclipse.org/content/repositories/maven_central/org/apache/maven/maven-model/3.0.4/maven-model-3.0.4.jar
[INFO] Downloaded from eclipse.maven.central.mirror: https://repo.eclipse.org/content/repositories/maven_central/org/sonatype/nexus/nexus-client-core/2.14.3-02/nexus-client-core-2.14.3-02.jar (216 kB at 1.4 MB/s)
[INFO] Downloading from eclipse.maven.central.mirror: https://repo.eclipse.org/content/repositories/maven_central/com/intellij/annotations/9.0.4/annotations-9.0.4.jar
[INFO] Downloaded from eclipse.maven.central.mirror: https://repo.eclipse.org/content/repositories/maven_central/org/sonatype/nexus/plugins/nexus-restlet1x-model/2.14.3-02/nexus-restlet1x-model-2.14.3-02.jar (163 kB at 1.0 MB/s)
[INFO] Downloading from eclipse.maven.central.mirror: https://repo.eclipse.org/content/repositories/maven_central/commons-io/commons-io/2.4/commons-io-2.4.jar
[INFO] Downloaded from eclipse.maven.central.mirror: https://repo.eclipse.org/content/repositories/maven_central/org/sonatype/plugins/nexus-staging-maven-plugin/1.6.8/nexus-staging-maven-plugin-1.6.8.jar (251 kB at 1.5 MB/s)
[INFO] Downloading from eclipse.maven.central.mirror: https://repo.eclipse.org/content/repositories/maven_central/com/thoughtworks/xstream/xstream/1.4.7/xstream-1.4.7.jar
[INFO] Downloaded from eclipse.maven.central.mirror: https://repo.eclipse.org/content/repositories/maven_central/org/apache/maven/maven-model/3.0.4/maven-model-3.0.4.jar (164 kB at 856 kB/s)
[INFO] Downloading from eclipse.maven.central.mirror: https://repo.eclipse.org/content/repositories/maven_central/joda-time/joda-time/2.2/joda-time-2.2.jar
[INFO] Downloaded from eclipse.maven.central.mirror: https://repo.eclipse.org/content/repositories/maven_central/com/google/guava/guava/14.0.1/guava-14.0.1.jar (2.2 MB at 8.4 MB/s)
[INFO] Downloading from eclipse.maven.central.mirror: https://repo.eclipse.org/content/repositories/maven_central/commons-lang/commons-lang/2.6/commons-lang-2.6.jar
[INFO] Downloaded from eclipse.maven.central.mirror: https://repo.eclipse.org/content/repositories/maven_central/commons-io/commons-io/2.4/commons-io-2.4.jar (185 kB at 709 kB/s)
[INFO] Downloaded from eclipse.maven.central.mirror: https://repo.eclipse.org/content/repositories/maven_central/com/intellij/annotations/9.0.4/annotations-9.0.4.jar (10.0 kB at 38 kB/s)
[INFO] Downloading from eclipse.maven.central.mirror: https://repo.eclipse.org/content/repositories/maven_central/commons-beanutils/commons-beanutils-core/1.8.3/commons-beanutils-core-1.8.3.jar
[INFO] Downloading from eclipse.maven.central.mirror: https://repo.eclipse.org/content/repositories/maven_central/org/sonatype/sisu/siesta/siesta-client/1.7/siesta-client-1.7.jar
[INFO] Downloaded from eclipse.maven.central.mirror: https://repo.eclipse.org/content/repositories/maven_central/com/thoughtworks/xstream/xstream/1.4.7/xstream-1.4.7.jar (532 kB at 1.8 MB/s)
[INFO] Downloading from eclipse.maven.central.mirror: https://repo.eclipse.org/content/repositories/maven_central/org/sonatype/sisu/siesta/siesta-common/1.7/siesta-common-1.7.jar
[INFO] Downloaded from eclipse.maven.central.mirror: https://repo.eclipse.org/content/repositories/maven_central/org/sonatype/sisu/siesta/siesta-client/1.7/siesta-client-1.7.jar (20 kB at 62 kB/s)
[INFO] Downloading from eclipse.maven.central.mirror: https://repo.eclipse.org/content/repositories/maven_central/javax/ws/rs/jsr311-api/1.1.1/jsr311-api-1.1.1.jar
[INFO] Downloaded from eclipse.maven.central.mirror: https://repo.eclipse.org/content/repositories/maven_central/org/sonatype/sisu/siesta/siesta-common/1.7/siesta-common-1.7.jar (11 kB at 33 kB/s)
[INFO] Downloading from eclipse.maven.central.mirror: https://repo.eclipse.org/content/repositories/maven_central/com/sun/jersey/jersey-core/1.17.1/jersey-core-1.17.1.jar
[INFO] Downloaded from eclipse.maven.central.mirror: https://repo.eclipse.org/content/repositories/maven_central/commons-beanutils/commons-beanutils-core/1.8.3/commons-beanutils-core-1.8.3.jar (207 kB at 604 kB/s)
[INFO] Downloading from eclipse.maven.central.mirror: https://repo.eclipse.org/content/repositories/maven_central/javax/validation/validation-api/1.1.0.Final/validation-api-1.1.0.Final.jar
[INFO] Downloaded from eclipse.maven.central.mirror: https://repo.eclipse.org/content/repositories/maven_central/joda-time/joda-time/2.2/joda-time-2.2.jar (574 kB at 1.6 MB/s)
[INFO] Downloading from eclipse.maven.central.mirror: https://repo.eclipse.org/content/repositories/maven_central/com/sun/jersey/jersey-client/1.17.1/jersey-client-1.17.1.jar
[INFO] Downloaded from eclipse.maven.central.mirror: https://repo.eclipse.org/content/repositories/maven_central/commons-lang/commons-lang/2.6/commons-lang-2.6.jar (284 kB at 738 kB/s)
[INFO] Downloading from eclipse.maven.central.mirror: https://repo.eclipse.org/content/repositories/maven_central/com/sun/jersey/contribs/jersey-apache-client4/1.17.1/jersey-apache-client4-1.17.1.jar
[INFO] Downloaded from eclipse.maven.central.mirror: https://repo.eclipse.org/content/repositories/maven_central/javax/ws/rs/jsr311-api/1.1.1/jsr311-api-1.1.1.jar (46 kB at 116 kB/s)
[INFO] Downloading from eclipse.maven.central.mirror: https://repo.eclipse.org/content/repositories/maven_central/org/sonatype/sisu/siesta/siesta-jackson/1.7/siesta-jackson-1.7.jar
[INFO] Downloaded from eclipse.maven.central.mirror: https://repo.eclipse.org/content/repositories/maven_central/javax/validation/validation-api/1.1.0.Final/validation-api-1.1.0.Final.jar (64 kB at 157 kB/s)
[INFO] Downloading from eclipse.maven.central.mirror: https://repo.eclipse.org/content/repositories/maven_central/com/fasterxml/jackson/core/jackson-annotations/2.3.1/jackson-annotations-2.3.1.jar
[INFO] Downloaded from eclipse.maven.central.mirror: https://repo.eclipse.org/content/repositories/maven_central/org/sonatype/sisu/siesta/siesta-jackson/1.7/siesta-jackson-1.7.jar (6.3 kB at 15 kB/s)
[INFO] Downloading from eclipse.maven.central.mirror: https://repo.eclipse.org/content/repositories/maven_central/com/fasterxml/jackson/core/jackson-core/2.3.1/jackson-core-2.3.1.jar
[INFO] Downloaded from eclipse.maven.central.mirror: https://repo.eclipse.org/content/repositories/maven_central/com/sun/jersey/contribs/jersey-apache-client4/1.17.1/jersey-apache-client4-1.17.1.jar (16 kB at 38 kB/s)
[INFO] Downloading from eclipse.maven.central.mirror: https://repo.eclipse.org/content/repositories/maven_central/com/fasterxml/jackson/core/jackson-databind/2.3.1/jackson-databind-2.3.1.jar
[INFO] Downloaded from eclipse.maven.central.mirror: https://repo.eclipse.org/content/repositories/maven_central/com/sun/jersey/jersey-core/1.17.1/jersey-core-1.17.1.jar (467 kB at 1.1 MB/s)
[INFO] Downloading from eclipse.maven.central.mirror: https://repo.eclipse.org/content/repositories/maven_central/com/fasterxml/jackson/jaxrs/jackson-jaxrs-json-provider/2.3.1/jackson-jaxrs-json-provider-2.3.1.jar
[INFO] Downloaded from eclipse.maven.central.mirror: https://repo.eclipse.org/content/repositories/maven_central/com/sun/jersey/jersey-client/1.17.1/jersey-client-1.17.1.jar (131 kB at 307 kB/s)
[INFO] Downloading from eclipse.maven.central.mirror: https://repo.eclipse.org/content/repositories/maven_central/com/fasterxml/jackson/jaxrs/jackson-jaxrs-base/2.3.1/jackson-jaxrs-base-2.3.1.jar
[INFO] Downloaded from eclipse.maven.central.mirror: https://repo.eclipse.org/content/repositories/maven_central/com/fasterxml/jackson/core/jackson-annotations/2.3.1/jackson-annotations-2.3.1.jar (37 kB at 86 kB/s)
[INFO] Downloading from eclipse.maven.central.mirror: https://repo.eclipse.org/content/repositories/maven_central/com/fasterxml/jackson/module/jackson-module-jaxb-annotations/2.3.1/jackson-module-jaxb-annotations-2.3.1.jar
[INFO] Downloaded from eclipse.maven.central.mirror: https://repo.eclipse.org/content/repositories/maven_central/com/fasterxml/jackson/jaxrs/jackson-jaxrs-json-provider/2.3.1/jackson-jaxrs-json-provider-2.3.1.jar (16 kB at 37 kB/s)
[INFO] Downloading from eclipse.maven.central.mirror: https://repo.eclipse.org/content/repositories/maven_central/org/apache/httpcomponents/httpclient/4.3.5/httpclient-4.3.5.jar
[INFO] Downloaded from eclipse.maven.central.mirror: https://repo.eclipse.org/content/repositories/maven_central/com/fasterxml/jackson/jaxrs/jackson-jaxrs-base/2.3.1/jackson-jaxrs-base-2.3.1.jar (28 kB at 62 kB/s)
[INFO] Downloading from eclipse.maven.central.mirror: https://repo.eclipse.org/content/repositories/maven_central/commons-codec/commons-codec/1.6/commons-codec-1.6.jar
[INFO] Downloaded from eclipse.maven.central.mirror: https://repo.eclipse.org/content/repositories/maven_central/commons-codec/commons-codec/1.6/commons-codec-1.6.jar (233 kB at 488 kB/s)
[INFO] Downloading from eclipse.maven.central.mirror: https://repo.eclipse.org/content/repositories/maven_central/org/apache/httpcomponents/httpcore/4.3.2/httpcore-4.3.2.jar
[INFO] Downloaded from eclipse.maven.central.mirror: https://repo.eclipse.org/content/repositories/maven_central/com/fasterxml/jackson/core/jackson-core/2.3.1/jackson-core-2.3.1.jar (198 kB at 412 kB/s)
[INFO] Downloading from eclipse.maven.central.mirror: https://repo.eclipse.org/content/repositories/maven_central/org/slf4j/jcl-over-slf4j/1.7.7/jcl-over-slf4j-1.7.7.jar
[INFO] Downloaded from eclipse.maven.central.mirror: https://repo.eclipse.org/content/repositories/maven_central/com/fasterxml/jackson/module/jackson-module-jaxb-annotations/2.3.1/jackson-module-jaxb-annotations-2.3.1.jar (32 kB at 66 kB/s)
[INFO] Downloading from eclipse.maven.central.mirror: https://repo.eclipse.org/content/repositories/maven_central/org/sonatype/spice/zapper/spice-zapper/1.3/spice-zapper-1.3.jar
[INFO] Downloaded from eclipse.maven.central.mirror: https://repo.eclipse.org/content/repositories/maven_central/com/fasterxml/jackson/core/jackson-databind/2.3.1/jackson-databind-2.3.1.jar (914 kB at 1.9 MB/s)
[INFO] Downloading from eclipse.maven.central.mirror: https://repo.eclipse.org/content/repositories/maven_central/org/fusesource/hawtbuf/hawtbuf-proto/1.9/hawtbuf-proto-1.9.jar
[INFO] Downloaded from eclipse.maven.central.mirror: https://repo.eclipse.org/content/repositories/maven_central/org/apache/httpcomponents/httpclient/4.3.5/httpclient-4.3.5.jar (591 kB at 1.2 MB/s)
[INFO] Downloading from eclipse.maven.central.mirror: https://repo.eclipse.org/content/repositories/maven_central/org/fusesource/hawtbuf/hawtbuf/1.9/hawtbuf-1.9.jar
[INFO] Downloaded from eclipse.maven.central.mirror: https://repo.eclipse.org/content/repositories/maven_central/org/slf4j/jcl-over-slf4j/1.7.7/jcl-over-slf4j-1.7.7.jar (17 kB at 33 kB/s)
[INFO] Downloading from eclipse.maven.central.mirror: https://repo.eclipse.org/content/repositories/maven_central/org/sonatype/aether/aether-api/1.13.1/aether-api-1.13.1.jar
[INFO] Downloaded from eclipse.maven.central.mirror: https://repo.eclipse.org/content/repositories/maven_central/org/sonatype/spice/zapper/spice-zapper/1.3/spice-zapper-1.3.jar (121 kB at 240 kB/s)
[INFO] Downloading from eclipse.maven.central.mirror: https://repo.eclipse.org/content/repositories/maven_central/ch/qos/logback/logback-core/1.1.2/logback-core-1.1.2.jar
[INFO] Downloaded from eclipse.maven.central.mirror: https://repo.eclipse.org/content/repositories/maven_central/org/apache/httpcomponents/httpcore/4.3.2/httpcore-4.3.2.jar (282 kB at 558 kB/s)
[INFO] Downloading from eclipse.maven.central.mirror: https://repo.eclipse.org/content/repositories/maven_central/ch/qos/logback/logback-classic/1.1.2/logback-classic-1.1.2.jar
[INFO] Downloaded from eclipse.maven.central.mirror: https://repo.eclipse.org/content/repositories/maven_central/org/sonatype/aether/aether-api/1.13.1/aether-api-1.13.1.jar (90 kB at 162 kB/s)
[INFO] Downloaded from eclipse.maven.central.mirror: https://repo.eclipse.org/content/repositories/maven_central/org/fusesource/hawtbuf/hawtbuf-proto/1.9/hawtbuf-proto-1.9.jar (27 kB at 49 kB/s)
[INFO] Downloaded from eclipse.maven.central.mirror: https://repo.eclipse.org/content/repositories/maven_central/org/fusesource/hawtbuf/hawtbuf/1.9/hawtbuf-1.9.jar (50 kB at 89 kB/s)
[INFO] Downloaded from eclipse.maven.central.mirror: https://repo.eclipse.org/content/repositories/maven_central/ch/qos/logback/logback-classic/1.1.2/logback-classic-1.1.2.jar (271 kB at 468 kB/s)
[INFO] Downloaded from eclipse.maven.central.mirror: https://repo.eclipse.org/content/repositories/maven_central/ch/qos/logback/logback-core/1.1.2/logback-core-1.1.2.jar (428 kB at 527 kB/s)
[INFO] Inspecting build with total of 16 modules...
[INFO] Installing Nexus Staging features:
[INFO]   ... total of 16 executions of maven-deploy-plugin replaced with nexus-staging-maven-plugin
[INFO] ------------------------------------------------------------------------
[INFO] Reactor Build Order:
[INFO] 
[INFO] mondo-hawk-plain                                                   [pom]
[INFO] org.eclipse.hawk.core                                              [jar]
[INFO] org.eclipse.hawk.graph                                             [jar]
[INFO] org.eclipse.hawk.epsilon                                           [jar]
[INFO] org.eclipse.hawk.emf                                               [jar]
[INFO] org.eclipse.hawk.emfresource                                       [jar]
[INFO] org.eclipse.hawk.http                                              [jar]
[INFO] org.eclipse.hawk.jgit                                              [jar]
[INFO] org.eclipse.hawk.localfolder                                       [jar]
[INFO] org.eclipse.hawk.modelio.exml                                      [jar]
[INFO] org.eclipse.hawk.orientdb                                          [jar]
[INFO] org.eclipse.hawk.timeaware                                         [jar]
[INFO] org.eclipse.hawk.greycat                                           [jar]
[INFO] org.eclipse.hawk.service.artemis                                   [jar]
[INFO] org.eclipse.hawk.service.api                                       [jar]
[INFO] org.eclipse.hawk.service.emf                                       [jar]
[INFO] 
[INFO] -----------------< org.eclipse.hawk:mondo-hawk-plain >------------------
[INFO] Building mondo-hawk-plain 2.0.0                                   [1/16]
[INFO] --------------------------------[ pom ]---------------------------------
[INFO] Downloading from cbi: https://repo.eclipse.org/content/repositories/cbi-releases/org/apache/maven/plugins/maven-gpg-plugin/1.6/maven-gpg-plugin-1.6.pom
[INFO] Downloading from eclipse.maven.central.mirror: https://repo.eclipse.org/content/repositories/maven_central/org/apache/maven/plugins/maven-gpg-plugin/1.6/maven-gpg-plugin-1.6.pom
[INFO] Downloaded from eclipse.maven.central.mirror: https://repo.eclipse.org/content/repositories/maven_central/org/apache/maven/plugins/maven-gpg-plugin/1.6/maven-gpg-plugin-1.6.pom (5.3 kB at 310 kB/s)
[INFO] Downloading from cbi: https://repo.eclipse.org/content/repositories/cbi-releases/org/apache/maven/plugins/maven-gpg-plugin/1.6/maven-gpg-plugin-1.6.jar
[INFO] Downloading from eclipse.maven.central.mirror: https://repo.eclipse.org/content/repositories/maven_central/org/apache/maven/plugins/maven-gpg-plugin/1.6/maven-gpg-plugin-1.6.jar
[INFO] Downloaded from eclipse.maven.central.mirror: https://repo.eclipse.org/content/repositories/maven_central/org/apache/maven/plugins/maven-gpg-plugin/1.6/maven-gpg-plugin-1.6.jar (47 kB at 1.0 MB/s)
[INFO] 
[INFO] --- eclipse-jarsigner-plugin:1.1.7:sign (signjars) @ mondo-hawk-plain ---
[INFO] 
[INFO] --- maven-gpg-plugin:1.6:sign (sign-artifacts) @ mondo-hawk-plain ---
[INFO] 
[INFO] --- maven-install-plugin:2.4:install (default-install) @ mondo-hawk-plain ---
[INFO] Installing /home/jenkins/agent/workspace/hawk_master/pom-plain.xml to /home/jenkins/.m2/repository/org/eclipse/hawk/mondo-hawk-plain/2.0.0/mondo-hawk-plain-2.0.0.pom
[INFO] Installing /home/jenkins/agent/workspace/hawk_master/target-plain/mondo-hawk-plain-2.0.0.pom.asc to /home/jenkins/.m2/repository/org/eclipse/hawk/mondo-hawk-plain/2.0.0/mondo-hawk-plain-2.0.0.pom.asc
[INFO] 
[INFO] --- nexus-staging-maven-plugin:1.6.8:deploy (injected-nexus-deploy) @ mondo-hawk-plain ---
[INFO] Performing local staging (local stagingDirectory="/home/jenkins/agent/workspace/hawk_master/target-plain/nexus-staging/staging")...
[INFO]  + Using server credentials "ossrh" from Maven settings.
[INFO]  * Connected to Nexus at https://oss.sonatype.org:443/, is version 2.14.18-01 and edition "Professional"
[INFO]  * Using staging profile ID "442bf4071bd05" (matched by Nexus).
[INFO] Installing /home/jenkins/agent/workspace/hawk_master/pom-plain.xml to /home/jenkins/agent/workspace/hawk_master/target-plain/nexus-staging/staging/442bf4071bd05/org/eclipse/hawk/mondo-hawk-plain/2.0.0/mondo-hawk-plain-2.0.0.pom
[INFO] Installing /home/jenkins/agent/workspace/hawk_master/target-plain/mondo-hawk-plain-2.0.0.pom.asc to /home/jenkins/agent/workspace/hawk_master/target-plain/nexus-staging/staging/442bf4071bd05/org/eclipse/hawk/mondo-hawk-plain/2.0.0/mondo-hawk-plain-2.0.0.pom.asc
[INFO] Execution skipped to the last project...
[INFO] 
[INFO] ---------------< org.eclipse.hawk:org.eclipse.hawk.core >---------------
[INFO] Building org.eclipse.hawk.core 2.0.0                              [2/16]
[INFO] --------------------------------[ jar ]---------------------------------
[INFO] 
[INFO] --- maven-resources-plugin:2.6:resources (default-resources) @ org.eclipse.hawk.core ---
[INFO] Using 'UTF-8' encoding to copy filtered resources.
[INFO] skip non existing resourceDirectory /home/jenkins/agent/workspace/hawk_master/core/plugins/org.eclipse.hawk.core/src/main/resources
[INFO] 
[INFO] --- maven-compiler-plugin:3.3:compile (default-compile) @ org.eclipse.hawk.core ---
[INFO] Nothing to compile - all classes are up to date
[INFO] 
[INFO] --- maven-resources-plugin:2.6:testResources (default-testResources) @ org.eclipse.hawk.core ---
[INFO] Using 'UTF-8' encoding to copy filtered resources.
[INFO] skip non existing resourceDirectory /home/jenkins/agent/workspace/hawk_master/core/plugins/org.eclipse.hawk.core/src/test/resources
[INFO] 
[INFO] --- maven-compiler-plugin:3.3:testCompile (default-testCompile) @ org.eclipse.hawk.core ---
[INFO] No sources to compile
[INFO] 
[INFO] --- maven-surefire-plugin:2.12.4:test (default-test) @ org.eclipse.hawk.core ---
[INFO] No tests to run.
[INFO] 
[INFO] --- maven-jar-plugin:2.4:jar (default-jar) @ org.eclipse.hawk.core ---
[INFO] 
[INFO] --- eclipse-jarsigner-plugin:1.1.7:sign (signjars) @ org.eclipse.hawk.core ---
[INFO] Jar '/home/jenkins/agent/workspace/hawk_master/core/plugins/org.eclipse.hawk.core/target-plain/org.eclipse.hawk.core-2.0.0.jar' is already signed and will be resigned.
[INFO] Signing jar: /home/jenkins/agent/workspace/hawk_master/core/plugins/org.eclipse.hawk.core/target-plain/org.eclipse.hawk.core-2.0.0.jar
[INFO] 
[INFO] --- maven-gpg-plugin:1.6:sign (sign-artifacts) @ org.eclipse.hawk.core ---
[INFO] 
[INFO] --- maven-install-plugin:2.4:install (default-install) @ org.eclipse.hawk.core ---
[INFO] Installing /home/jenkins/agent/workspace/hawk_master/core/plugins/org.eclipse.hawk.core/target-plain/org.eclipse.hawk.core-2.0.0.jar to /home/jenkins/.m2/repository/org/eclipse/hawk/org.eclipse.hawk.core/2.0.0/org.eclipse.hawk.core-2.0.0.jar
[INFO] Installing /home/jenkins/agent/workspace/hawk_master/core/plugins/org.eclipse.hawk.core/pom-plain.xml to /home/jenkins/.m2/repository/org/eclipse/hawk/org.eclipse.hawk.core/2.0.0/org.eclipse.hawk.core-2.0.0.pom
[INFO] Installing /home/jenkins/agent/workspace/hawk_master/core/plugins/org.eclipse.hawk.core/target-plain/org.eclipse.hawk.core-2.0.0.jar.asc to /home/jenkins/.m2/repository/org/eclipse/hawk/org.eclipse.hawk.core/2.0.0/org.eclipse.hawk.core-2.0.0.jar.asc
[INFO] Installing /home/jenkins/agent/workspace/hawk_master/core/plugins/org.eclipse.hawk.core/target-plain/org.eclipse.hawk.core-2.0.0.pom.asc to /home/jenkins/.m2/repository/org/eclipse/hawk/org.eclipse.hawk.core/2.0.0/org.eclipse.hawk.core-2.0.0.pom.asc
[INFO] 
[INFO] --- nexus-staging-maven-plugin:1.6.8:deploy (injected-nexus-deploy) @ org.eclipse.hawk.core ---
[INFO] Performing local staging (local stagingDirectory="/home/jenkins/agent/workspace/hawk_master/target-plain/nexus-staging/staging")...
[INFO]  + Using server credentials "ossrh" from Maven settings.
[INFO]  * Connected to Nexus at https://oss.sonatype.org:443/, is version 2.14.18-01 and edition "Professional"
[INFO]  * Using staging profile ID "442bf4071bd05" (matched by Nexus).
[INFO] Installing /home/jenkins/agent/workspace/hawk_master/core/plugins/org.eclipse.hawk.core/target-plain/org.eclipse.hawk.core-2.0.0.jar to /home/jenkins/agent/workspace/hawk_master/target-plain/nexus-staging/staging/442bf4071bd05/org/eclipse/hawk/org.eclipse.hawk.core/2.0.0/org.eclipse.hawk.core-2.0.0.jar
[INFO] Installing /home/jenkins/agent/workspace/hawk_master/core/plugins/org.eclipse.hawk.core/pom-plain.xml to /home/jenkins/agent/workspace/hawk_master/target-plain/nexus-staging/staging/442bf4071bd05/org/eclipse/hawk/org.eclipse.hawk.core/2.0.0/org.eclipse.hawk.core-2.0.0.pom
[INFO] Installing /home/jenkins/agent/workspace/hawk_master/core/plugins/org.eclipse.hawk.core/target-plain/org.eclipse.hawk.core-2.0.0.jar.asc to /home/jenkins/agent/workspace/hawk_master/target-plain/nexus-staging/staging/442bf4071bd05/org/eclipse/hawk/org.eclipse.hawk.core/2.0.0/org.eclipse.hawk.core-2.0.0.jar.asc
[INFO] Installing /home/jenkins/agent/workspace/hawk_master/core/plugins/org.eclipse.hawk.core/target-plain/org.eclipse.hawk.core-2.0.0.pom.asc to /home/jenkins/agent/workspace/hawk_master/target-plain/nexus-staging/staging/442bf4071bd05/org/eclipse/hawk/org.eclipse.hawk.core/2.0.0/org.eclipse.hawk.core-2.0.0.pom.asc
[INFO] Execution skipped to the last project...
[INFO] 
[INFO] --------------< org.eclipse.hawk:org.eclipse.hawk.graph >---------------
[INFO] Building org.eclipse.hawk.graph 2.0.0                             [3/16]
[INFO] --------------------------------[ jar ]---------------------------------
[INFO] 
[INFO] --- maven-resources-plugin:2.6:resources (default-resources) @ org.eclipse.hawk.graph ---
[INFO] Using 'UTF-8' encoding to copy filtered resources.
[INFO] skip non existing resourceDirectory /home/jenkins/agent/workspace/hawk_master/core/plugins/org.eclipse.hawk.graph/src/main/resources
[INFO] 
[INFO] --- maven-compiler-plugin:3.3:compile (default-compile) @ org.eclipse.hawk.graph ---
[INFO] Nothing to compile - all classes are up to date
[INFO] 
[INFO] --- maven-resources-plugin:2.6:testResources (default-testResources) @ org.eclipse.hawk.graph ---
[INFO] Using 'UTF-8' encoding to copy filtered resources.
[INFO] skip non existing resourceDirectory /home/jenkins/agent/workspace/hawk_master/core/plugins/org.eclipse.hawk.graph/src/test/resources
[INFO] 
[INFO] --- maven-compiler-plugin:3.3:testCompile (default-testCompile) @ org.eclipse.hawk.graph ---
[INFO] No sources to compile
[INFO] 
[INFO] --- maven-surefire-plugin:2.12.4:test (default-test) @ org.eclipse.hawk.graph ---
[INFO] No tests to run.
[INFO] 
[INFO] --- maven-jar-plugin:2.4:jar (default-jar) @ org.eclipse.hawk.graph ---
[INFO] 
[INFO] --- eclipse-jarsigner-plugin:1.1.7:sign (signjars) @ org.eclipse.hawk.graph ---
[INFO] Jar '/home/jenkins/agent/workspace/hawk_master/core/plugins/org.eclipse.hawk.graph/target-plain/org.eclipse.hawk.graph-2.0.0.jar' is already signed and will be resigned.
[INFO] Signing jar: /home/jenkins/agent/workspace/hawk_master/core/plugins/org.eclipse.hawk.graph/target-plain/org.eclipse.hawk.graph-2.0.0.jar
[INFO] 
[INFO] --- maven-gpg-plugin:1.6:sign (sign-artifacts) @ org.eclipse.hawk.graph ---
[INFO] 
[INFO] --- maven-install-plugin:2.4:install (default-install) @ org.eclipse.hawk.graph ---
[INFO] Installing /home/jenkins/agent/workspace/hawk_master/core/plugins/org.eclipse.hawk.graph/target-plain/org.eclipse.hawk.graph-2.0.0.jar to /home/jenkins/.m2/repository/org/eclipse/hawk/org.eclipse.hawk.graph/2.0.0/org.eclipse.hawk.graph-2.0.0.jar
[INFO] Installing /home/jenkins/agent/workspace/hawk_master/core/plugins/org.eclipse.hawk.graph/pom-plain.xml to /home/jenkins/.m2/repository/org/eclipse/hawk/org.eclipse.hawk.graph/2.0.0/org.eclipse.hawk.graph-2.0.0.pom
[INFO] Installing /home/jenkins/agent/workspace/hawk_master/core/plugins/org.eclipse.hawk.graph/target-plain/org.eclipse.hawk.graph-2.0.0.jar.asc to /home/jenkins/.m2/repository/org/eclipse/hawk/org.eclipse.hawk.graph/2.0.0/org.eclipse.hawk.graph-2.0.0.jar.asc
[INFO] Installing /home/jenkins/agent/workspace/hawk_master/core/plugins/org.eclipse.hawk.graph/target-plain/org.eclipse.hawk.graph-2.0.0.pom.asc to /home/jenkins/.m2/repository/org/eclipse/hawk/org.eclipse.hawk.graph/2.0.0/org.eclipse.hawk.graph-2.0.0.pom.asc
[INFO] 
[INFO] --- nexus-staging-maven-plugin:1.6.8:deploy (injected-nexus-deploy) @ org.eclipse.hawk.graph ---
[INFO] Performing local staging (local stagingDirectory="/home/jenkins/agent/workspace/hawk_master/target-plain/nexus-staging/staging")...
[INFO]  + Using server credentials "ossrh" from Maven settings.
[INFO]  * Connected to Nexus at https://oss.sonatype.org:443/, is version 2.14.18-01 and edition "Professional"
[INFO]  * Using staging profile ID "442bf4071bd05" (matched by Nexus).
[INFO] Installing /home/jenkins/agent/workspace/hawk_master/core/plugins/org.eclipse.hawk.graph/target-plain/org.eclipse.hawk.graph-2.0.0.jar to /home/jenkins/agent/workspace/hawk_master/target-plain/nexus-staging/staging/442bf4071bd05/org/eclipse/hawk/org.eclipse.hawk.graph/2.0.0/org.eclipse.hawk.graph-2.0.0.jar
[INFO] Installing /home/jenkins/agent/workspace/hawk_master/core/plugins/org.eclipse.hawk.graph/pom-plain.xml to /home/jenkins/agent/workspace/hawk_master/target-plain/nexus-staging/staging/442bf4071bd05/org/eclipse/hawk/org.eclipse.hawk.graph/2.0.0/org.eclipse.hawk.graph-2.0.0.pom
[INFO] Installing /home/jenkins/agent/workspace/hawk_master/core/plugins/org.eclipse.hawk.graph/target-plain/org.eclipse.hawk.graph-2.0.0.jar.asc to /home/jenkins/agent/workspace/hawk_master/target-plain/nexus-staging/staging/442bf4071bd05/org/eclipse/hawk/org.eclipse.hawk.graph/2.0.0/org.eclipse.hawk.graph-2.0.0.jar.asc
[INFO] Installing /home/jenkins/agent/workspace/hawk_master/core/plugins/org.eclipse.hawk.graph/target-plain/org.eclipse.hawk.graph-2.0.0.pom.asc to /home/jenkins/agent/workspace/hawk_master/target-plain/nexus-staging/staging/442bf4071bd05/org/eclipse/hawk/org.eclipse.hawk.graph/2.0.0/org.eclipse.hawk.graph-2.0.0.pom.asc
[INFO] Execution skipped to the last project...
[INFO] 
[INFO] -------------< org.eclipse.hawk:org.eclipse.hawk.epsilon >--------------
[INFO] Building org.eclipse.hawk.epsilon 2.0.0                           [4/16]
[INFO] --------------------------------[ jar ]---------------------------------
[INFO] 
[INFO] --- maven-resources-plugin:2.6:resources (default-resources) @ org.eclipse.hawk.epsilon ---
[INFO] Using 'UTF-8' encoding to copy filtered resources.
[INFO] skip non existing resourceDirectory /home/jenkins/agent/workspace/hawk_master/core/plugins/org.eclipse.hawk.epsilon/src/main/resources
[INFO] 
[INFO] --- maven-compiler-plugin:3.3:compile (default-compile) @ org.eclipse.hawk.epsilon ---
[INFO] Nothing to compile - all classes are up to date
[INFO] 
[INFO] --- maven-resources-plugin:2.6:testResources (default-testResources) @ org.eclipse.hawk.epsilon ---
[INFO] Using 'UTF-8' encoding to copy filtered resources.
[INFO] skip non existing resourceDirectory /home/jenkins/agent/workspace/hawk_master/core/plugins/org.eclipse.hawk.epsilon/src/test/resources
[INFO] 
[INFO] --- maven-compiler-plugin:3.3:testCompile (default-testCompile) @ org.eclipse.hawk.epsilon ---
[INFO] No sources to compile
[INFO] 
[INFO] --- maven-surefire-plugin:2.12.4:test (default-test) @ org.eclipse.hawk.epsilon ---
[INFO] No tests to run.
[INFO] 
[INFO] --- maven-jar-plugin:2.4:jar (default-jar) @ org.eclipse.hawk.epsilon ---
[INFO] 
[INFO] --- eclipse-jarsigner-plugin:1.1.7:sign (signjars) @ org.eclipse.hawk.epsilon ---
[INFO] Jar '/home/jenkins/agent/workspace/hawk_master/core/plugins/org.eclipse.hawk.epsilon/target-plain/org.eclipse.hawk.epsilon-2.0.0.jar' is already signed and will be resigned.
[INFO] Signing jar: /home/jenkins/agent/workspace/hawk_master/core/plugins/org.eclipse.hawk.epsilon/target-plain/org.eclipse.hawk.epsilon-2.0.0.jar
[INFO] 
[INFO] --- maven-gpg-plugin:1.6:sign (sign-artifacts) @ org.eclipse.hawk.epsilon ---
[INFO] 
[INFO] --- maven-install-plugin:2.4:install (default-install) @ org.eclipse.hawk.epsilon ---
[INFO] Installing /home/jenkins/agent/workspace/hawk_master/core/plugins/org.eclipse.hawk.epsilon/target-plain/org.eclipse.hawk.epsilon-2.0.0.jar to /home/jenkins/.m2/repository/org/eclipse/hawk/org.eclipse.hawk.epsilon/2.0.0/org.eclipse.hawk.epsilon-2.0.0.jar
[INFO] Installing /home/jenkins/agent/workspace/hawk_master/core/plugins/org.eclipse.hawk.epsilon/pom-plain.xml to /home/jenkins/.m2/repository/org/eclipse/hawk/org.eclipse.hawk.epsilon/2.0.0/org.eclipse.hawk.epsilon-2.0.0.pom
[INFO] Installing /home/jenkins/agent/workspace/hawk_master/core/plugins/org.eclipse.hawk.epsilon/target-plain/org.eclipse.hawk.epsilon-2.0.0.jar.asc to /home/jenkins/.m2/repository/org/eclipse/hawk/org.eclipse.hawk.epsilon/2.0.0/org.eclipse.hawk.epsilon-2.0.0.jar.asc
[INFO] Installing /home/jenkins/agent/workspace/hawk_master/core/plugins/org.eclipse.hawk.epsilon/target-plain/org.eclipse.hawk.epsilon-2.0.0.pom.asc to /home/jenkins/.m2/repository/org/eclipse/hawk/org.eclipse.hawk.epsilon/2.0.0/org.eclipse.hawk.epsilon-2.0.0.pom.asc
[INFO] 
[INFO] --- nexus-staging-maven-plugin:1.6.8:deploy (injected-nexus-deploy) @ org.eclipse.hawk.epsilon ---
[INFO] Performing local staging (local stagingDirectory="/home/jenkins/agent/workspace/hawk_master/target-plain/nexus-staging/staging")...
[INFO]  + Using server credentials "ossrh" from Maven settings.
[INFO]  * Connected to Nexus at https://oss.sonatype.org:443/, is version 2.14.18-01 and edition "Professional"
[INFO]  * Using staging profile ID "442bf4071bd05" (matched by Nexus).
[INFO] Installing /home/jenkins/agent/workspace/hawk_master/core/plugins/org.eclipse.hawk.epsilon/target-plain/org.eclipse.hawk.epsilon-2.0.0.jar to /home/jenkins/agent/workspace/hawk_master/target-plain/nexus-staging/staging/442bf4071bd05/org/eclipse/hawk/org.eclipse.hawk.epsilon/2.0.0/org.eclipse.hawk.epsilon-2.0.0.jar
[INFO] Installing /home/jenkins/agent/workspace/hawk_master/core/plugins/org.eclipse.hawk.epsilon/pom-plain.xml to /home/jenkins/agent/workspace/hawk_master/target-plain/nexus-staging/staging/442bf4071bd05/org/eclipse/hawk/org.eclipse.hawk.epsilon/2.0.0/org.eclipse.hawk.epsilon-2.0.0.pom
[INFO] Installing /home/jenkins/agent/workspace/hawk_master/core/plugins/org.eclipse.hawk.epsilon/target-plain/org.eclipse.hawk.epsilon-2.0.0.jar.asc to /home/jenkins/agent/workspace/hawk_master/target-plain/nexus-staging/staging/442bf4071bd05/org/eclipse/hawk/org.eclipse.hawk.epsilon/2.0.0/org.eclipse.hawk.epsilon-2.0.0.jar.asc
[INFO] Installing /home/jenkins/agent/workspace/hawk_master/core/plugins/org.eclipse.hawk.epsilon/target-plain/org.eclipse.hawk.epsilon-2.0.0.pom.asc to /home/jenkins/agent/workspace/hawk_master/target-plain/nexus-staging/staging/442bf4071bd05/org/eclipse/hawk/org.eclipse.hawk.epsilon/2.0.0/org.eclipse.hawk.epsilon-2.0.0.pom.asc
[INFO] Execution skipped to the last project...
[INFO] 
[INFO] ---------------< org.eclipse.hawk:org.eclipse.hawk.emf >----------------
[INFO] Building org.eclipse.hawk.emf 2.0.0                               [5/16]
[INFO] --------------------------------[ jar ]---------------------------------
[INFO] 
[INFO] --- maven-resources-plugin:2.6:resources (default-resources) @ org.eclipse.hawk.emf ---
[INFO] Using 'UTF-8' encoding to copy filtered resources.
[INFO] skip non existing resourceDirectory /home/jenkins/agent/workspace/hawk_master/core/plugins/org.eclipse.hawk.emf/src/main/resources
[INFO] 
[INFO] --- maven-compiler-plugin:3.3:compile (default-compile) @ org.eclipse.hawk.emf ---
[INFO] Nothing to compile - all classes are up to date
[INFO] 
[INFO] --- maven-resources-plugin:2.6:testResources (default-testResources) @ org.eclipse.hawk.emf ---
[INFO] Using 'UTF-8' encoding to copy filtered resources.
[INFO] skip non existing resourceDirectory /home/jenkins/agent/workspace/hawk_master/core/plugins/org.eclipse.hawk.emf/src/test/resources
[INFO] 
[INFO] --- maven-compiler-plugin:3.3:testCompile (default-testCompile) @ org.eclipse.hawk.emf ---
[INFO] No sources to compile
[INFO] 
[INFO] --- maven-surefire-plugin:2.12.4:test (default-test) @ org.eclipse.hawk.emf ---
[INFO] No tests to run.
[INFO] 
[INFO] --- maven-jar-plugin:2.4:jar (default-jar) @ org.eclipse.hawk.emf ---
[INFO] 
[INFO] --- eclipse-jarsigner-plugin:1.1.7:sign (signjars) @ org.eclipse.hawk.emf ---
[INFO] Jar '/home/jenkins/agent/workspace/hawk_master/core/plugins/org.eclipse.hawk.emf/target-plain/org.eclipse.hawk.emf-2.0.0.jar' is already signed and will be resigned.
[INFO] Signing jar: /home/jenkins/agent/workspace/hawk_master/core/plugins/org.eclipse.hawk.emf/target-plain/org.eclipse.hawk.emf-2.0.0.jar
[INFO] 
[INFO] --- maven-gpg-plugin:1.6:sign (sign-artifacts) @ org.eclipse.hawk.emf ---
[INFO] 
[INFO] --- maven-install-plugin:2.4:install (default-install) @ org.eclipse.hawk.emf ---
[INFO] Installing /home/jenkins/agent/workspace/hawk_master/core/plugins/org.eclipse.hawk.emf/target-plain/org.eclipse.hawk.emf-2.0.0.jar to /home/jenkins/.m2/repository/org/eclipse/hawk/org.eclipse.hawk.emf/2.0.0/org.eclipse.hawk.emf-2.0.0.jar
[INFO] Installing /home/jenkins/agent/workspace/hawk_master/core/plugins/org.eclipse.hawk.emf/pom-plain.xml to /home/jenkins/.m2/repository/org/eclipse/hawk/org.eclipse.hawk.emf/2.0.0/org.eclipse.hawk.emf-2.0.0.pom
[INFO] Installing /home/jenkins/agent/workspace/hawk_master/core/plugins/org.eclipse.hawk.emf/target-plain/org.eclipse.hawk.emf-2.0.0.jar.asc to /home/jenkins/.m2/repository/org/eclipse/hawk/org.eclipse.hawk.emf/2.0.0/org.eclipse.hawk.emf-2.0.0.jar.asc
[INFO] Installing /home/jenkins/agent/workspace/hawk_master/core/plugins/org.eclipse.hawk.emf/target-plain/org.eclipse.hawk.emf-2.0.0.pom.asc to /home/jenkins/.m2/repository/org/eclipse/hawk/org.eclipse.hawk.emf/2.0.0/org.eclipse.hawk.emf-2.0.0.pom.asc
[INFO] 
[INFO] --- nexus-staging-maven-plugin:1.6.8:deploy (injected-nexus-deploy) @ org.eclipse.hawk.emf ---
[INFO] Performing local staging (local stagingDirectory="/home/jenkins/agent/workspace/hawk_master/target-plain/nexus-staging/staging")...
[INFO]  + Using server credentials "ossrh" from Maven settings.
[INFO]  * Connected to Nexus at https://oss.sonatype.org:443/, is version 2.14.18-01 and edition "Professional"
[INFO]  * Using staging profile ID "442bf4071bd05" (matched by Nexus).
[INFO] Installing /home/jenkins/agent/workspace/hawk_master/core/plugins/org.eclipse.hawk.emf/target-plain/org.eclipse.hawk.emf-2.0.0.jar to /home/jenkins/agent/workspace/hawk_master/target-plain/nexus-staging/staging/442bf4071bd05/org/eclipse/hawk/org.eclipse.hawk.emf/2.0.0/org.eclipse.hawk.emf-2.0.0.jar
[INFO] Installing /home/jenkins/agent/workspace/hawk_master/core/plugins/org.eclipse.hawk.emf/pom-plain.xml to /home/jenkins/agent/workspace/hawk_master/target-plain/nexus-staging/staging/442bf4071bd05/org/eclipse/hawk/org.eclipse.hawk.emf/2.0.0/org.eclipse.hawk.emf-2.0.0.pom
[INFO] Installing /home/jenkins/agent/workspace/hawk_master/core/plugins/org.eclipse.hawk.emf/target-plain/org.eclipse.hawk.emf-2.0.0.jar.asc to /home/jenkins/agent/workspace/hawk_master/target-plain/nexus-staging/staging/442bf4071bd05/org/eclipse/hawk/org.eclipse.hawk.emf/2.0.0/org.eclipse.hawk.emf-2.0.0.jar.asc
[INFO] Installing /home/jenkins/agent/workspace/hawk_master/core/plugins/org.eclipse.hawk.emf/target-plain/org.eclipse.hawk.emf-2.0.0.pom.asc to /home/jenkins/agent/workspace/hawk_master/target-plain/nexus-staging/staging/442bf4071bd05/org/eclipse/hawk/org.eclipse.hawk.emf/2.0.0/org.eclipse.hawk.emf-2.0.0.pom.asc
[INFO] Execution skipped to the last project...
[INFO] 
[INFO] -----------< org.eclipse.hawk:org.eclipse.hawk.emfresource >------------
[INFO] Building org.eclipse.hawk.emfresource 2.0.0                       [6/16]
[INFO] --------------------------------[ jar ]---------------------------------
[INFO] 
[INFO] --- maven-resources-plugin:2.6:resources (default-resources) @ org.eclipse.hawk.emfresource ---
[INFO] Using 'UTF-8' encoding to copy filtered resources.
[INFO] skip non existing resourceDirectory /home/jenkins/agent/workspace/hawk_master/core/plugins/org.eclipse.hawk.emfresource/src/main/resources
[INFO] 
[INFO] --- maven-compiler-plugin:3.3:compile (default-compile) @ org.eclipse.hawk.emfresource ---
[INFO] Nothing to compile - all classes are up to date
[INFO] 
[INFO] --- maven-resources-plugin:2.6:testResources (default-testResources) @ org.eclipse.hawk.emfresource ---
[INFO] Using 'UTF-8' encoding to copy filtered resources.
[INFO] skip non existing resourceDirectory /home/jenkins/agent/workspace/hawk_master/core/plugins/org.eclipse.hawk.emfresource/src/test/resources
[INFO] 
[INFO] --- maven-compiler-plugin:3.3:testCompile (default-testCompile) @ org.eclipse.hawk.emfresource ---
[INFO] No sources to compile
[INFO] 
[INFO] --- maven-surefire-plugin:2.12.4:test (default-test) @ org.eclipse.hawk.emfresource ---
[INFO] No tests to run.
[INFO] 
[INFO] --- maven-jar-plugin:2.4:jar (default-jar) @ org.eclipse.hawk.emfresource ---
[INFO] 
[INFO] --- eclipse-jarsigner-plugin:1.1.7:sign (signjars) @ org.eclipse.hawk.emfresource ---
[INFO] Jar '/home/jenkins/agent/workspace/hawk_master/core/plugins/org.eclipse.hawk.emfresource/target-plain/org.eclipse.hawk.emfresource-2.0.0.jar' is already signed and will be resigned.
[INFO] Signing jar: /home/jenkins/agent/workspace/hawk_master/core/plugins/org.eclipse.hawk.emfresource/target-plain/org.eclipse.hawk.emfresource-2.0.0.jar
[INFO] 
[INFO] --- maven-gpg-plugin:1.6:sign (sign-artifacts) @ org.eclipse.hawk.emfresource ---
[INFO] 
[INFO] --- maven-install-plugin:2.4:install (default-install) @ org.eclipse.hawk.emfresource ---
[INFO] Installing /home/jenkins/agent/workspace/hawk_master/core/plugins/org.eclipse.hawk.emfresource/target-plain/org.eclipse.hawk.emfresource-2.0.0.jar to /home/jenkins/.m2/repository/org/eclipse/hawk/org.eclipse.hawk.emfresource/2.0.0/org.eclipse.hawk.emfresource-2.0.0.jar
[INFO] Installing /home/jenkins/agent/workspace/hawk_master/core/plugins/org.eclipse.hawk.emfresource/pom-plain.xml to /home/jenkins/.m2/repository/org/eclipse/hawk/org.eclipse.hawk.emfresource/2.0.0/org.eclipse.hawk.emfresource-2.0.0.pom
[INFO] Installing /home/jenkins/agent/workspace/hawk_master/core/plugins/org.eclipse.hawk.emfresource/target-plain/org.eclipse.hawk.emfresource-2.0.0.jar.asc to /home/jenkins/.m2/repository/org/eclipse/hawk/org.eclipse.hawk.emfresource/2.0.0/org.eclipse.hawk.emfresource-2.0.0.jar.asc
[INFO] Installing /home/jenkins/agent/workspace/hawk_master/core/plugins/org.eclipse.hawk.emfresource/target-plain/org.eclipse.hawk.emfresource-2.0.0.pom.asc to /home/jenkins/.m2/repository/org/eclipse/hawk/org.eclipse.hawk.emfresource/2.0.0/org.eclipse.hawk.emfresource-2.0.0.pom.asc
[INFO] 
[INFO] --- nexus-staging-maven-plugin:1.6.8:deploy (injected-nexus-deploy) @ org.eclipse.hawk.emfresource ---
[INFO] Performing local staging (local stagingDirectory="/home/jenkins/agent/workspace/hawk_master/target-plain/nexus-staging/staging")...
[INFO]  + Using server credentials "ossrh" from Maven settings.
[INFO]  * Connected to Nexus at https://oss.sonatype.org:443/, is version 2.14.18-01 and edition "Professional"
[INFO]  * Using staging profile ID "442bf4071bd05" (matched by Nexus).
[INFO] Installing /home/jenkins/agent/workspace/hawk_master/core/plugins/org.eclipse.hawk.emfresource/target-plain/org.eclipse.hawk.emfresource-2.0.0.jar to /home/jenkins/agent/workspace/hawk_master/target-plain/nexus-staging/staging/442bf4071bd05/org/eclipse/hawk/org.eclipse.hawk.emfresource/2.0.0/org.eclipse.hawk.emfresource-2.0.0.jar
[INFO] Installing /home/jenkins/agent/workspace/hawk_master/core/plugins/org.eclipse.hawk.emfresource/pom-plain.xml to /home/jenkins/agent/workspace/hawk_master/target-plain/nexus-staging/staging/442bf4071bd05/org/eclipse/hawk/org.eclipse.hawk.emfresource/2.0.0/org.eclipse.hawk.emfresource-2.0.0.pom
[INFO] Installing /home/jenkins/agent/workspace/hawk_master/core/plugins/org.eclipse.hawk.emfresource/target-plain/org.eclipse.hawk.emfresource-2.0.0.jar.asc to /home/jenkins/agent/workspace/hawk_master/target-plain/nexus-staging/staging/442bf4071bd05/org/eclipse/hawk/org.eclipse.hawk.emfresource/2.0.0/org.eclipse.hawk.emfresource-2.0.0.jar.asc
[INFO] Installing /home/jenkins/agent/workspace/hawk_master/core/plugins/org.eclipse.hawk.emfresource/target-plain/org.eclipse.hawk.emfresource-2.0.0.pom.asc to /home/jenkins/agent/workspace/hawk_master/target-plain/nexus-staging/staging/442bf4071bd05/org/eclipse/hawk/org.eclipse.hawk.emfresource/2.0.0/org.eclipse.hawk.emfresource-2.0.0.pom.asc
[INFO] Execution skipped to the last project...
[INFO] 
[INFO] ---------------< org.eclipse.hawk:org.eclipse.hawk.http >---------------
[INFO] Building org.eclipse.hawk.http 2.0.0                              [7/16]
[INFO] --------------------------------[ jar ]---------------------------------
[INFO] 
[INFO] --- maven-resources-plugin:2.6:resources (default-resources) @ org.eclipse.hawk.http ---
[INFO] Using 'UTF-8' encoding to copy filtered resources.
[INFO] skip non existing resourceDirectory /home/jenkins/agent/workspace/hawk_master/core/plugins/org.eclipse.hawk.http/src/main/resources
[INFO] 
[INFO] --- maven-compiler-plugin:3.3:compile (default-compile) @ org.eclipse.hawk.http ---
[INFO] Nothing to compile - all classes are up to date
[INFO] 
[INFO] --- maven-resources-plugin:2.6:testResources (default-testResources) @ org.eclipse.hawk.http ---
[INFO] Using 'UTF-8' encoding to copy filtered resources.
[INFO] skip non existing resourceDirectory /home/jenkins/agent/workspace/hawk_master/core/plugins/org.eclipse.hawk.http/src/test/resources
[INFO] 
[INFO] --- maven-compiler-plugin:3.3:testCompile (default-testCompile) @ org.eclipse.hawk.http ---
[INFO] No sources to compile
[INFO] 
[INFO] --- maven-surefire-plugin:2.12.4:test (default-test) @ org.eclipse.hawk.http ---
[INFO] No tests to run.
[INFO] 
[INFO] --- maven-jar-plugin:2.4:jar (default-jar) @ org.eclipse.hawk.http ---
[INFO] 
[INFO] --- eclipse-jarsigner-plugin:1.1.7:sign (signjars) @ org.eclipse.hawk.http ---
[INFO] Jar '/home/jenkins/agent/workspace/hawk_master/core/plugins/org.eclipse.hawk.http/target-plain/org.eclipse.hawk.http-2.0.0.jar' is already signed and will be resigned.
[INFO] Signing jar: /home/jenkins/agent/workspace/hawk_master/core/plugins/org.eclipse.hawk.http/target-plain/org.eclipse.hawk.http-2.0.0.jar
[INFO] 
[INFO] --- maven-gpg-plugin:1.6:sign (sign-artifacts) @ org.eclipse.hawk.http ---
[INFO] 
[INFO] --- maven-install-plugin:2.4:install (default-install) @ org.eclipse.hawk.http ---
[INFO] Installing /home/jenkins/agent/workspace/hawk_master/core/plugins/org.eclipse.hawk.http/target-plain/org.eclipse.hawk.http-2.0.0.jar to /home/jenkins/.m2/repository/org/eclipse/hawk/org.eclipse.hawk.http/2.0.0/org.eclipse.hawk.http-2.0.0.jar
[INFO] Installing /home/jenkins/agent/workspace/hawk_master/core/plugins/org.eclipse.hawk.http/pom-plain.xml to /home/jenkins/.m2/repository/org/eclipse/hawk/org.eclipse.hawk.http/2.0.0/org.eclipse.hawk.http-2.0.0.pom
[INFO] Installing /home/jenkins/agent/workspace/hawk_master/core/plugins/org.eclipse.hawk.http/target-plain/org.eclipse.hawk.http-2.0.0.jar.asc to /home/jenkins/.m2/repository/org/eclipse/hawk/org.eclipse.hawk.http/2.0.0/org.eclipse.hawk.http-2.0.0.jar.asc
[INFO] Installing /home/jenkins/agent/workspace/hawk_master/core/plugins/org.eclipse.hawk.http/target-plain/org.eclipse.hawk.http-2.0.0.pom.asc to /home/jenkins/.m2/repository/org/eclipse/hawk/org.eclipse.hawk.http/2.0.0/org.eclipse.hawk.http-2.0.0.pom.asc
[INFO] 
[INFO] --- nexus-staging-maven-plugin:1.6.8:deploy (injected-nexus-deploy) @ org.eclipse.hawk.http ---
[INFO] Performing local staging (local stagingDirectory="/home/jenkins/agent/workspace/hawk_master/target-plain/nexus-staging/staging")...
[INFO]  + Using server credentials "ossrh" from Maven settings.
[INFO]  * Connected to Nexus at https://oss.sonatype.org:443/, is version 2.14.18-01 and edition "Professional"
[INFO]  * Using staging profile ID "442bf4071bd05" (matched by Nexus).
[INFO] Installing /home/jenkins/agent/workspace/hawk_master/core/plugins/org.eclipse.hawk.http/target-plain/org.eclipse.hawk.http-2.0.0.jar to /home/jenkins/agent/workspace/hawk_master/target-plain/nexus-staging/staging/442bf4071bd05/org/eclipse/hawk/org.eclipse.hawk.http/2.0.0/org.eclipse.hawk.http-2.0.0.jar
[INFO] Installing /home/jenkins/agent/workspace/hawk_master/core/plugins/org.eclipse.hawk.http/pom-plain.xml to /home/jenkins/agent/workspace/hawk_master/target-plain/nexus-staging/staging/442bf4071bd05/org/eclipse/hawk/org.eclipse.hawk.http/2.0.0/org.eclipse.hawk.http-2.0.0.pom
[INFO] Installing /home/jenkins/agent/workspace/hawk_master/core/plugins/org.eclipse.hawk.http/target-plain/org.eclipse.hawk.http-2.0.0.jar.asc to /home/jenkins/agent/workspace/hawk_master/target-plain/nexus-staging/staging/442bf4071bd05/org/eclipse/hawk/org.eclipse.hawk.http/2.0.0/org.eclipse.hawk.http-2.0.0.jar.asc
[INFO] Installing /home/jenkins/agent/workspace/hawk_master/core/plugins/org.eclipse.hawk.http/target-plain/org.eclipse.hawk.http-2.0.0.pom.asc to /home/jenkins/agent/workspace/hawk_master/target-plain/nexus-staging/staging/442bf4071bd05/org/eclipse/hawk/org.eclipse.hawk.http/2.0.0/org.eclipse.hawk.http-2.0.0.pom.asc
[INFO] Execution skipped to the last project...
[INFO] 
[INFO] ---------------< org.eclipse.hawk:org.eclipse.hawk.jgit >---------------
[INFO] Building org.eclipse.hawk.jgit 2.0.0                              [8/16]
[INFO] --------------------------------[ jar ]---------------------------------
[INFO] 
[INFO] --- maven-resources-plugin:2.6:resources (default-resources) @ org.eclipse.hawk.jgit ---
[INFO] Using 'UTF-8' encoding to copy filtered resources.
[INFO] skip non existing resourceDirectory /home/jenkins/agent/workspace/hawk_master/core/plugins/org.eclipse.hawk.jgit/src/main/resources
[INFO] 
[INFO] --- maven-compiler-plugin:3.3:compile (default-compile) @ org.eclipse.hawk.jgit ---
[INFO] Nothing to compile - all classes are up to date
[INFO] 
[INFO] --- maven-resources-plugin:2.6:testResources (default-testResources) @ org.eclipse.hawk.jgit ---
[INFO] Using 'UTF-8' encoding to copy filtered resources.
[INFO] skip non existing resourceDirectory /home/jenkins/agent/workspace/hawk_master/core/plugins/org.eclipse.hawk.jgit/src/test/resources
[INFO] 
[INFO] --- maven-compiler-plugin:3.3:testCompile (default-testCompile) @ org.eclipse.hawk.jgit ---
[INFO] No sources to compile
[INFO] 
[INFO] --- maven-surefire-plugin:2.12.4:test (default-test) @ org.eclipse.hawk.jgit ---
[INFO] No tests to run.
[INFO] 
[INFO] --- maven-jar-plugin:2.4:jar (default-jar) @ org.eclipse.hawk.jgit ---
[INFO] 
[INFO] --- eclipse-jarsigner-plugin:1.1.7:sign (signjars) @ org.eclipse.hawk.jgit ---
[INFO] Jar '/home/jenkins/agent/workspace/hawk_master/core/plugins/org.eclipse.hawk.jgit/target-plain/org.eclipse.hawk.jgit-2.0.0.jar' is already signed and will be resigned.
[INFO] Signing jar: /home/jenkins/agent/workspace/hawk_master/core/plugins/org.eclipse.hawk.jgit/target-plain/org.eclipse.hawk.jgit-2.0.0.jar
[INFO] 
[INFO] --- maven-gpg-plugin:1.6:sign (sign-artifacts) @ org.eclipse.hawk.jgit ---
[INFO] 
[INFO] --- maven-install-plugin:2.4:install (default-install) @ org.eclipse.hawk.jgit ---
[INFO] Installing /home/jenkins/agent/workspace/hawk_master/core/plugins/org.eclipse.hawk.jgit/target-plain/org.eclipse.hawk.jgit-2.0.0.jar to /home/jenkins/.m2/repository/org/eclipse/hawk/org.eclipse.hawk.jgit/2.0.0/org.eclipse.hawk.jgit-2.0.0.jar
[INFO] Installing /home/jenkins/agent/workspace/hawk_master/core/plugins/org.eclipse.hawk.jgit/pom-plain.xml to /home/jenkins/.m2/repository/org/eclipse/hawk/org.eclipse.hawk.jgit/2.0.0/org.eclipse.hawk.jgit-2.0.0.pom
[INFO] Installing /home/jenkins/agent/workspace/hawk_master/core/plugins/org.eclipse.hawk.jgit/target-plain/org.eclipse.hawk.jgit-2.0.0.jar.asc to /home/jenkins/.m2/repository/org/eclipse/hawk/org.eclipse.hawk.jgit/2.0.0/org.eclipse.hawk.jgit-2.0.0.jar.asc
[INFO] Installing /home/jenkins/agent/workspace/hawk_master/core/plugins/org.eclipse.hawk.jgit/target-plain/org.eclipse.hawk.jgit-2.0.0.pom.asc to /home/jenkins/.m2/repository/org/eclipse/hawk/org.eclipse.hawk.jgit/2.0.0/org.eclipse.hawk.jgit-2.0.0.pom.asc
[INFO] 
[INFO] --- nexus-staging-maven-plugin:1.6.8:deploy (injected-nexus-deploy) @ org.eclipse.hawk.jgit ---
[INFO] Performing local staging (local stagingDirectory="/home/jenkins/agent/workspace/hawk_master/target-plain/nexus-staging/staging")...
[INFO]  + Using server credentials "ossrh" from Maven settings.
[INFO]  * Connected to Nexus at https://oss.sonatype.org:443/, is version 2.14.18-01 and edition "Professional"
[INFO]  * Using staging profile ID "442bf4071bd05" (matched by Nexus).
[INFO] Installing /home/jenkins/agent/workspace/hawk_master/core/plugins/org.eclipse.hawk.jgit/target-plain/org.eclipse.hawk.jgit-2.0.0.jar to /home/jenkins/agent/workspace/hawk_master/target-plain/nexus-staging/staging/442bf4071bd05/org/eclipse/hawk/org.eclipse.hawk.jgit/2.0.0/org.eclipse.hawk.jgit-2.0.0.jar
[INFO] Installing /home/jenkins/agent/workspace/hawk_master/core/plugins/org.eclipse.hawk.jgit/pom-plain.xml to /home/jenkins/agent/workspace/hawk_master/target-plain/nexus-staging/staging/442bf4071bd05/org/eclipse/hawk/org.eclipse.hawk.jgit/2.0.0/org.eclipse.hawk.jgit-2.0.0.pom
[INFO] Installing /home/jenkins/agent/workspace/hawk_master/core/plugins/org.eclipse.hawk.jgit/target-plain/org.eclipse.hawk.jgit-2.0.0.jar.asc to /home/jenkins/agent/workspace/hawk_master/target-plain/nexus-staging/staging/442bf4071bd05/org/eclipse/hawk/org.eclipse.hawk.jgit/2.0.0/org.eclipse.hawk.jgit-2.0.0.jar.asc
[INFO] Installing /home/jenkins/agent/workspace/hawk_master/core/plugins/org.eclipse.hawk.jgit/target-plain/org.eclipse.hawk.jgit-2.0.0.pom.asc to /home/jenkins/agent/workspace/hawk_master/target-plain/nexus-staging/staging/442bf4071bd05/org/eclipse/hawk/org.eclipse.hawk.jgit/2.0.0/org.eclipse.hawk.jgit-2.0.0.pom.asc
[INFO] Execution skipped to the last project...
[INFO] 
[INFO] -----------< org.eclipse.hawk:org.eclipse.hawk.localfolder >------------
[INFO] Building org.eclipse.hawk.localfolder 2.0.0                       [9/16]
[INFO] --------------------------------[ jar ]---------------------------------
[INFO] 
[INFO] --- maven-resources-plugin:2.6:resources (default-resources) @ org.eclipse.hawk.localfolder ---
[INFO] Using 'UTF-8' encoding to copy filtered resources.
[INFO] skip non existing resourceDirectory /home/jenkins/agent/workspace/hawk_master/core/plugins/org.eclipse.hawk.localfolder/src/main/resources
[INFO] 
[INFO] --- maven-compiler-plugin:3.3:compile (default-compile) @ org.eclipse.hawk.localfolder ---
[INFO] Nothing to compile - all classes are up to date
[INFO] 
[INFO] --- maven-resources-plugin:2.6:testResources (default-testResources) @ org.eclipse.hawk.localfolder ---
[INFO] Using 'UTF-8' encoding to copy filtered resources.
[INFO] skip non existing resourceDirectory /home/jenkins/agent/workspace/hawk_master/core/plugins/org.eclipse.hawk.localfolder/src/test/resources
[INFO] 
[INFO] --- maven-compiler-plugin:3.3:testCompile (default-testCompile) @ org.eclipse.hawk.localfolder ---
[INFO] No sources to compile
[INFO] 
[INFO] --- maven-surefire-plugin:2.12.4:test (default-test) @ org.eclipse.hawk.localfolder ---
[INFO] No tests to run.
[INFO] 
[INFO] --- maven-jar-plugin:2.4:jar (default-jar) @ org.eclipse.hawk.localfolder ---
[INFO] 
[INFO] --- eclipse-jarsigner-plugin:1.1.7:sign (signjars) @ org.eclipse.hawk.localfolder ---
[INFO] Jar '/home/jenkins/agent/workspace/hawk_master/core/plugins/org.eclipse.hawk.localfolder/target-plain/org.eclipse.hawk.localfolder-2.0.0.jar' is already signed and will be resigned.
[INFO] Signing jar: /home/jenkins/agent/workspace/hawk_master/core/plugins/org.eclipse.hawk.localfolder/target-plain/org.eclipse.hawk.localfolder-2.0.0.jar
[INFO] 
[INFO] --- maven-gpg-plugin:1.6:sign (sign-artifacts) @ org.eclipse.hawk.localfolder ---
[INFO] 
[INFO] --- maven-install-plugin:2.4:install (default-install) @ org.eclipse.hawk.localfolder ---
[INFO] Installing /home/jenkins/agent/workspace/hawk_master/core/plugins/org.eclipse.hawk.localfolder/target-plain/org.eclipse.hawk.localfolder-2.0.0.jar to /home/jenkins/.m2/repository/org/eclipse/hawk/org.eclipse.hawk.localfolder/2.0.0/org.eclipse.hawk.localfolder-2.0.0.jar
[INFO] Installing /home/jenkins/agent/workspace/hawk_master/core/plugins/org.eclipse.hawk.localfolder/pom-plain.xml to /home/jenkins/.m2/repository/org/eclipse/hawk/org.eclipse.hawk.localfolder/2.0.0/org.eclipse.hawk.localfolder-2.0.0.pom
[INFO] Installing /home/jenkins/agent/workspace/hawk_master/core/plugins/org.eclipse.hawk.localfolder/target-plain/org.eclipse.hawk.localfolder-2.0.0.jar.asc to /home/jenkins/.m2/repository/org/eclipse/hawk/org.eclipse.hawk.localfolder/2.0.0/org.eclipse.hawk.localfolder-2.0.0.jar.asc
[INFO] Installing /home/jenkins/agent/workspace/hawk_master/core/plugins/org.eclipse.hawk.localfolder/target-plain/org.eclipse.hawk.localfolder-2.0.0.pom.asc to /home/jenkins/.m2/repository/org/eclipse/hawk/org.eclipse.hawk.localfolder/2.0.0/org.eclipse.hawk.localfolder-2.0.0.pom.asc
[INFO] 
[INFO] --- nexus-staging-maven-plugin:1.6.8:deploy (injected-nexus-deploy) @ org.eclipse.hawk.localfolder ---
[INFO] Performing local staging (local stagingDirectory="/home/jenkins/agent/workspace/hawk_master/target-plain/nexus-staging/staging")...
[INFO]  + Using server credentials "ossrh" from Maven settings.
[INFO]  * Connected to Nexus at https://oss.sonatype.org:443/, is version 2.14.18-01 and edition "Professional"
[INFO]  * Using staging profile ID "442bf4071bd05" (matched by Nexus).
[INFO] Installing /home/jenkins/agent/workspace/hawk_master/core/plugins/org.eclipse.hawk.localfolder/target-plain/org.eclipse.hawk.localfolder-2.0.0.jar to /home/jenkins/agent/workspace/hawk_master/target-plain/nexus-staging/staging/442bf4071bd05/org/eclipse/hawk/org.eclipse.hawk.localfolder/2.0.0/org.eclipse.hawk.localfolder-2.0.0.jar
[INFO] Installing /home/jenkins/agent/workspace/hawk_master/core/plugins/org.eclipse.hawk.localfolder/pom-plain.xml to /home/jenkins/agent/workspace/hawk_master/target-plain/nexus-staging/staging/442bf4071bd05/org/eclipse/hawk/org.eclipse.hawk.localfolder/2.0.0/org.eclipse.hawk.localfolder-2.0.0.pom
[INFO] Installing /home/jenkins/agent/workspace/hawk_master/core/plugins/org.eclipse.hawk.localfolder/target-plain/org.eclipse.hawk.localfolder-2.0.0.jar.asc to /home/jenkins/agent/workspace/hawk_master/target-plain/nexus-staging/staging/442bf4071bd05/org/eclipse/hawk/org.eclipse.hawk.localfolder/2.0.0/org.eclipse.hawk.localfolder-2.0.0.jar.asc
[INFO] Installing /home/jenkins/agent/workspace/hawk_master/core/plugins/org.eclipse.hawk.localfolder/target-plain/org.eclipse.hawk.localfolder-2.0.0.pom.asc to /home/jenkins/agent/workspace/hawk_master/target-plain/nexus-staging/staging/442bf4071bd05/org/eclipse/hawk/org.eclipse.hawk.localfolder/2.0.0/org.eclipse.hawk.localfolder-2.0.0.pom.asc
[INFO] Execution skipped to the last project...
[INFO] 
[INFO] -----------< org.eclipse.hawk:org.eclipse.hawk.modelio.exml >-----------
[INFO] Building org.eclipse.hawk.modelio.exml 2.0.0                     [10/16]
[INFO] --------------------------------[ jar ]---------------------------------
[INFO] 
[INFO] --- maven-resources-plugin:2.6:resources (default-resources) @ org.eclipse.hawk.modelio.exml ---
[INFO] Using 'UTF-8' encoding to copy filtered resources.
[INFO] skip non existing resourceDirectory /home/jenkins/agent/workspace/hawk_master/core/plugins/org.eclipse.hawk.modelio.exml/src/main/resources
[INFO] 
[INFO] --- maven-compiler-plugin:3.3:compile (default-compile) @ org.eclipse.hawk.modelio.exml ---
[INFO] Nothing to compile - all classes are up to date
[INFO] 
[INFO] --- maven-resources-plugin:2.6:testResources (default-testResources) @ org.eclipse.hawk.modelio.exml ---
[INFO] Using 'UTF-8' encoding to copy filtered resources.
[INFO] skip non existing resourceDirectory /home/jenkins/agent/workspace/hawk_master/core/plugins/org.eclipse.hawk.modelio.exml/src/test/resources
[INFO] 
[INFO] --- maven-compiler-plugin:3.3:testCompile (default-testCompile) @ org.eclipse.hawk.modelio.exml ---
[INFO] No sources to compile
[INFO] 
[INFO] --- maven-surefire-plugin:2.12.4:test (default-test) @ org.eclipse.hawk.modelio.exml ---
[INFO] No tests to run.
[INFO] 
[INFO] --- maven-jar-plugin:2.4:jar (default-jar) @ org.eclipse.hawk.modelio.exml ---
[INFO] 
[INFO] --- eclipse-jarsigner-plugin:1.1.7:sign (signjars) @ org.eclipse.hawk.modelio.exml ---
[INFO] Jar '/home/jenkins/agent/workspace/hawk_master/core/plugins/org.eclipse.hawk.modelio.exml/target-plain/org.eclipse.hawk.modelio.exml-2.0.0.jar' is already signed and will be resigned.
[INFO] Signing jar: /home/jenkins/agent/workspace/hawk_master/core/plugins/org.eclipse.hawk.modelio.exml/target-plain/org.eclipse.hawk.modelio.exml-2.0.0.jar
[INFO] 
[INFO] --- maven-gpg-plugin:1.6:sign (sign-artifacts) @ org.eclipse.hawk.modelio.exml ---
[INFO] 
[INFO] --- maven-install-plugin:2.4:install (default-install) @ org.eclipse.hawk.modelio.exml ---
[INFO] Installing /home/jenkins/agent/workspace/hawk_master/core/plugins/org.eclipse.hawk.modelio.exml/target-plain/org.eclipse.hawk.modelio.exml-2.0.0.jar to /home/jenkins/.m2/repository/org/eclipse/hawk/org.eclipse.hawk.modelio.exml/2.0.0/org.eclipse.hawk.modelio.exml-2.0.0.jar
[INFO] Installing /home/jenkins/agent/workspace/hawk_master/core/plugins/org.eclipse.hawk.modelio.exml/pom-plain.xml to /home/jenkins/.m2/repository/org/eclipse/hawk/org.eclipse.hawk.modelio.exml/2.0.0/org.eclipse.hawk.modelio.exml-2.0.0.pom
[INFO] Installing /home/jenkins/agent/workspace/hawk_master/core/plugins/org.eclipse.hawk.modelio.exml/target-plain/org.eclipse.hawk.modelio.exml-2.0.0.jar.asc to /home/jenkins/.m2/repository/org/eclipse/hawk/org.eclipse.hawk.modelio.exml/2.0.0/org.eclipse.hawk.modelio.exml-2.0.0.jar.asc
[INFO] Installing /home/jenkins/agent/workspace/hawk_master/core/plugins/org.eclipse.hawk.modelio.exml/target-plain/org.eclipse.hawk.modelio.exml-2.0.0.pom.asc to /home/jenkins/.m2/repository/org/eclipse/hawk/org.eclipse.hawk.modelio.exml/2.0.0/org.eclipse.hawk.modelio.exml-2.0.0.pom.asc
[INFO] 
[INFO] --- nexus-staging-maven-plugin:1.6.8:deploy (injected-nexus-deploy) @ org.eclipse.hawk.modelio.exml ---
[INFO] Performing local staging (local stagingDirectory="/home/jenkins/agent/workspace/hawk_master/target-plain/nexus-staging/staging")...
[INFO]  + Using server credentials "ossrh" from Maven settings.
[INFO]  * Connected to Nexus at https://oss.sonatype.org:443/, is version 2.14.18-01 and edition "Professional"
[INFO]  * Using staging profile ID "442bf4071bd05" (matched by Nexus).
[INFO] Installing /home/jenkins/agent/workspace/hawk_master/core/plugins/org.eclipse.hawk.modelio.exml/target-plain/org.eclipse.hawk.modelio.exml-2.0.0.jar to /home/jenkins/agent/workspace/hawk_master/target-plain/nexus-staging/staging/442bf4071bd05/org/eclipse/hawk/org.eclipse.hawk.modelio.exml/2.0.0/org.eclipse.hawk.modelio.exml-2.0.0.jar
[INFO] Installing /home/jenkins/agent/workspace/hawk_master/core/plugins/org.eclipse.hawk.modelio.exml/pom-plain.xml to /home/jenkins/agent/workspace/hawk_master/target-plain/nexus-staging/staging/442bf4071bd05/org/eclipse/hawk/org.eclipse.hawk.modelio.exml/2.0.0/org.eclipse.hawk.modelio.exml-2.0.0.pom
[INFO] Installing /home/jenkins/agent/workspace/hawk_master/core/plugins/org.eclipse.hawk.modelio.exml/target-plain/org.eclipse.hawk.modelio.exml-2.0.0.jar.asc to /home/jenkins/agent/workspace/hawk_master/target-plain/nexus-staging/staging/442bf4071bd05/org/eclipse/hawk/org.eclipse.hawk.modelio.exml/2.0.0/org.eclipse.hawk.modelio.exml-2.0.0.jar.asc
[INFO] Installing /home/jenkins/agent/workspace/hawk_master/core/plugins/org.eclipse.hawk.modelio.exml/target-plain/org.eclipse.hawk.modelio.exml-2.0.0.pom.asc to /home/jenkins/agent/workspace/hawk_master/target-plain/nexus-staging/staging/442bf4071bd05/org/eclipse/hawk/org.eclipse.hawk.modelio.exml/2.0.0/org.eclipse.hawk.modelio.exml-2.0.0.pom.asc
[INFO] Execution skipped to the last project...
[INFO] 
[INFO] -------------< org.eclipse.hawk:org.eclipse.hawk.orientdb >-------------
[INFO] Building org.eclipse.hawk.orientdb 2.0.0                         [11/16]
[INFO] --------------------------------[ jar ]---------------------------------
[INFO] 
[INFO] --- maven-resources-plugin:2.6:resources (default-resources) @ org.eclipse.hawk.orientdb ---
[INFO] Using 'UTF-8' encoding to copy filtered resources.
[INFO] skip non existing resourceDirectory /home/jenkins/agent/workspace/hawk_master/core/plugins/org.eclipse.hawk.orientdb/src/main/resources
[INFO] 
[INFO] --- maven-compiler-plugin:3.3:compile (default-compile) @ org.eclipse.hawk.orientdb ---
[INFO] Nothing to compile - all classes are up to date
[INFO] 
[INFO] --- maven-resources-plugin:2.6:testResources (default-testResources) @ org.eclipse.hawk.orientdb ---
[INFO] Using 'UTF-8' encoding to copy filtered resources.
[INFO] skip non existing resourceDirectory /home/jenkins/agent/workspace/hawk_master/core/plugins/org.eclipse.hawk.orientdb/src/test/resources
[INFO] 
[INFO] --- maven-compiler-plugin:3.3:testCompile (default-testCompile) @ org.eclipse.hawk.orientdb ---
[INFO] No sources to compile
[INFO] 
[INFO] --- maven-surefire-plugin:2.12.4:test (default-test) @ org.eclipse.hawk.orientdb ---
[INFO] No tests to run.
[INFO] 
[INFO] --- maven-jar-plugin:2.4:jar (default-jar) @ org.eclipse.hawk.orientdb ---
[INFO] 
[INFO] --- eclipse-jarsigner-plugin:1.1.7:sign (signjars) @ org.eclipse.hawk.orientdb ---
[INFO] Jar '/home/jenkins/agent/workspace/hawk_master/core/plugins/org.eclipse.hawk.orientdb/target-plain/org.eclipse.hawk.orientdb-2.0.0.jar' is already signed and will be resigned.
[INFO] Signing jar: /home/jenkins/agent/workspace/hawk_master/core/plugins/org.eclipse.hawk.orientdb/target-plain/org.eclipse.hawk.orientdb-2.0.0.jar
[INFO] 
[INFO] --- maven-gpg-plugin:1.6:sign (sign-artifacts) @ org.eclipse.hawk.orientdb ---
[INFO] 
[INFO] --- maven-install-plugin:2.4:install (default-install) @ org.eclipse.hawk.orientdb ---
[INFO] Installing /home/jenkins/agent/workspace/hawk_master/core/plugins/org.eclipse.hawk.orientdb/target-plain/org.eclipse.hawk.orientdb-2.0.0.jar to /home/jenkins/.m2/repository/org/eclipse/hawk/org.eclipse.hawk.orientdb/2.0.0/org.eclipse.hawk.orientdb-2.0.0.jar
[INFO] Installing /home/jenkins/agent/workspace/hawk_master/core/plugins/org.eclipse.hawk.orientdb/pom-plain.xml to /home/jenkins/.m2/repository/org/eclipse/hawk/org.eclipse.hawk.orientdb/2.0.0/org.eclipse.hawk.orientdb-2.0.0.pom
[INFO] Installing /home/jenkins/agent/workspace/hawk_master/core/plugins/org.eclipse.hawk.orientdb/target-plain/org.eclipse.hawk.orientdb-2.0.0.jar.asc to /home/jenkins/.m2/repository/org/eclipse/hawk/org.eclipse.hawk.orientdb/2.0.0/org.eclipse.hawk.orientdb-2.0.0.jar.asc
[INFO] Installing /home/jenkins/agent/workspace/hawk_master/core/plugins/org.eclipse.hawk.orientdb/target-plain/org.eclipse.hawk.orientdb-2.0.0.pom.asc to /home/jenkins/.m2/repository/org/eclipse/hawk/org.eclipse.hawk.orientdb/2.0.0/org.eclipse.hawk.orientdb-2.0.0.pom.asc
[INFO] 
[INFO] --- nexus-staging-maven-plugin:1.6.8:deploy (injected-nexus-deploy) @ org.eclipse.hawk.orientdb ---
[INFO] Performing local staging (local stagingDirectory="/home/jenkins/agent/workspace/hawk_master/target-plain/nexus-staging/staging")...
[INFO]  + Using server credentials "ossrh" from Maven settings.
[INFO]  * Connected to Nexus at https://oss.sonatype.org:443/, is version 2.14.18-01 and edition "Professional"
[INFO]  * Using staging profile ID "442bf4071bd05" (matched by Nexus).
[INFO] Installing /home/jenkins/agent/workspace/hawk_master/core/plugins/org.eclipse.hawk.orientdb/target-plain/org.eclipse.hawk.orientdb-2.0.0.jar to /home/jenkins/agent/workspace/hawk_master/target-plain/nexus-staging/staging/442bf4071bd05/org/eclipse/hawk/org.eclipse.hawk.orientdb/2.0.0/org.eclipse.hawk.orientdb-2.0.0.jar
[INFO] Installing /home/jenkins/agent/workspace/hawk_master/core/plugins/org.eclipse.hawk.orientdb/pom-plain.xml to /home/jenkins/agent/workspace/hawk_master/target-plain/nexus-staging/staging/442bf4071bd05/org/eclipse/hawk/org.eclipse.hawk.orientdb/2.0.0/org.eclipse.hawk.orientdb-2.0.0.pom
[INFO] Installing /home/jenkins/agent/workspace/hawk_master/core/plugins/org.eclipse.hawk.orientdb/target-plain/org.eclipse.hawk.orientdb-2.0.0.jar.asc to /home/jenkins/agent/workspace/hawk_master/target-plain/nexus-staging/staging/442bf4071bd05/org/eclipse/hawk/org.eclipse.hawk.orientdb/2.0.0/org.eclipse.hawk.orientdb-2.0.0.jar.asc
[INFO] Installing /home/jenkins/agent/workspace/hawk_master/core/plugins/org.eclipse.hawk.orientdb/target-plain/org.eclipse.hawk.orientdb-2.0.0.pom.asc to /home/jenkins/agent/workspace/hawk_master/target-plain/nexus-staging/staging/442bf4071bd05/org/eclipse/hawk/org.eclipse.hawk.orientdb/2.0.0/org.eclipse.hawk.orientdb-2.0.0.pom.asc
[INFO] Execution skipped to the last project...
[INFO] 
[INFO] ------------< org.eclipse.hawk:org.eclipse.hawk.timeaware >-------------
[INFO] Building org.eclipse.hawk.timeaware 2.0.0                        [12/16]
[INFO] --------------------------------[ jar ]---------------------------------
[INFO] 
[INFO] --- maven-resources-plugin:2.6:resources (default-resources) @ org.eclipse.hawk.timeaware ---
[INFO] Using 'UTF-8' encoding to copy filtered resources.
[INFO] skip non existing resourceDirectory /home/jenkins/agent/workspace/hawk_master/core/plugins/org.eclipse.hawk.timeaware/src/main/resources
[INFO] 
[INFO] --- maven-compiler-plugin:3.3:compile (default-compile) @ org.eclipse.hawk.timeaware ---
[INFO] Nothing to compile - all classes are up to date
[INFO] 
[INFO] --- maven-resources-plugin:2.6:testResources (default-testResources) @ org.eclipse.hawk.timeaware ---
[INFO] Using 'UTF-8' encoding to copy filtered resources.
[INFO] skip non existing resourceDirectory /home/jenkins/agent/workspace/hawk_master/core/plugins/org.eclipse.hawk.timeaware/src/test/resources
[INFO] 
[INFO] --- maven-compiler-plugin:3.3:testCompile (default-testCompile) @ org.eclipse.hawk.timeaware ---
[INFO] No sources to compile
[INFO] 
[INFO] --- maven-surefire-plugin:2.12.4:test (default-test) @ org.eclipse.hawk.timeaware ---
[INFO] No tests to run.
[INFO] 
[INFO] --- maven-jar-plugin:2.4:jar (default-jar) @ org.eclipse.hawk.timeaware ---
[INFO] 
[INFO] --- eclipse-jarsigner-plugin:1.1.7:sign (signjars) @ org.eclipse.hawk.timeaware ---
[INFO] Jar '/home/jenkins/agent/workspace/hawk_master/core/plugins/org.eclipse.hawk.timeaware/target-plain/org.eclipse.hawk.timeaware-2.0.0.jar' is already signed and will be resigned.
[INFO] Signing jar: /home/jenkins/agent/workspace/hawk_master/core/plugins/org.eclipse.hawk.timeaware/target-plain/org.eclipse.hawk.timeaware-2.0.0.jar
[INFO] 
[INFO] --- maven-gpg-plugin:1.6:sign (sign-artifacts) @ org.eclipse.hawk.timeaware ---
[INFO] 
[INFO] --- maven-install-plugin:2.4:install (default-install) @ org.eclipse.hawk.timeaware ---
[INFO] Installing /home/jenkins/agent/workspace/hawk_master/core/plugins/org.eclipse.hawk.timeaware/target-plain/org.eclipse.hawk.timeaware-2.0.0.jar to /home/jenkins/.m2/repository/org/eclipse/hawk/org.eclipse.hawk.timeaware/2.0.0/org.eclipse.hawk.timeaware-2.0.0.jar
[INFO] Installing /home/jenkins/agent/workspace/hawk_master/core/plugins/org.eclipse.hawk.timeaware/pom-plain.xml to /home/jenkins/.m2/repository/org/eclipse/hawk/org.eclipse.hawk.timeaware/2.0.0/org.eclipse.hawk.timeaware-2.0.0.pom
[INFO] Installing /home/jenkins/agent/workspace/hawk_master/core/plugins/org.eclipse.hawk.timeaware/target-plain/org.eclipse.hawk.timeaware-2.0.0.jar.asc to /home/jenkins/.m2/repository/org/eclipse/hawk/org.eclipse.hawk.timeaware/2.0.0/org.eclipse.hawk.timeaware-2.0.0.jar.asc
[INFO] Installing /home/jenkins/agent/workspace/hawk_master/core/plugins/org.eclipse.hawk.timeaware/target-plain/org.eclipse.hawk.timeaware-2.0.0.pom.asc to /home/jenkins/.m2/repository/org/eclipse/hawk/org.eclipse.hawk.timeaware/2.0.0/org.eclipse.hawk.timeaware-2.0.0.pom.asc
[INFO] 
[INFO] --- nexus-staging-maven-plugin:1.6.8:deploy (injected-nexus-deploy) @ org.eclipse.hawk.timeaware ---
[INFO] Performing local staging (local stagingDirectory="/home/jenkins/agent/workspace/hawk_master/target-plain/nexus-staging/staging")...
[INFO]  + Using server credentials "ossrh" from Maven settings.
[INFO]  * Connected to Nexus at https://oss.sonatype.org:443/, is version 2.14.18-01 and edition "Professional"
[INFO]  * Using staging profile ID "442bf4071bd05" (matched by Nexus).
[INFO] Installing /home/jenkins/agent/workspace/hawk_master/core/plugins/org.eclipse.hawk.timeaware/target-plain/org.eclipse.hawk.timeaware-2.0.0.jar to /home/jenkins/agent/workspace/hawk_master/target-plain/nexus-staging/staging/442bf4071bd05/org/eclipse/hawk/org.eclipse.hawk.timeaware/2.0.0/org.eclipse.hawk.timeaware-2.0.0.jar
[INFO] Installing /home/jenkins/agent/workspace/hawk_master/core/plugins/org.eclipse.hawk.timeaware/pom-plain.xml to /home/jenkins/agent/workspace/hawk_master/target-plain/nexus-staging/staging/442bf4071bd05/org/eclipse/hawk/org.eclipse.hawk.timeaware/2.0.0/org.eclipse.hawk.timeaware-2.0.0.pom
[INFO] Installing /home/jenkins/agent/workspace/hawk_master/core/plugins/org.eclipse.hawk.timeaware/target-plain/org.eclipse.hawk.timeaware-2.0.0.jar.asc to /home/jenkins/agent/workspace/hawk_master/target-plain/nexus-staging/staging/442bf4071bd05/org/eclipse/hawk/org.eclipse.hawk.timeaware/2.0.0/org.eclipse.hawk.timeaware-2.0.0.jar.asc
[INFO] Installing /home/jenkins/agent/workspace/hawk_master/core/plugins/org.eclipse.hawk.timeaware/target-plain/org.eclipse.hawk.timeaware-2.0.0.pom.asc to /home/jenkins/agent/workspace/hawk_master/target-plain/nexus-staging/staging/442bf4071bd05/org/eclipse/hawk/org.eclipse.hawk.timeaware/2.0.0/org.eclipse.hawk.timeaware-2.0.0.pom.asc
[INFO] Execution skipped to the last project...
[INFO] 
[INFO] -------------< org.eclipse.hawk:org.eclipse.hawk.greycat >--------------
[INFO] Building org.eclipse.hawk.greycat 2.0.0                          [13/16]
[INFO] --------------------------------[ jar ]---------------------------------
[INFO] 
[INFO] --- maven-resources-plugin:2.6:resources (default-resources) @ org.eclipse.hawk.greycat ---
[INFO] Using 'UTF-8' encoding to copy filtered resources.
[INFO] skip non existing resourceDirectory /home/jenkins/agent/workspace/hawk_master/greycat/org.eclipse.hawk.greycat/src/main/resources
[INFO] 
[INFO] --- maven-compiler-plugin:3.3:compile (default-compile) @ org.eclipse.hawk.greycat ---
[INFO] Changes detected - recompiling the module!
[INFO] Compiling 13 source files to /home/jenkins/agent/workspace/hawk_master/greycat/org.eclipse.hawk.greycat/target-plain/classes
[INFO] 
[INFO] --- maven-resources-plugin:2.6:testResources (default-testResources) @ org.eclipse.hawk.greycat ---
[INFO] Using 'UTF-8' encoding to copy filtered resources.
[INFO] skip non existing resourceDirectory /home/jenkins/agent/workspace/hawk_master/greycat/org.eclipse.hawk.greycat/src/test/resources
[INFO] 
[INFO] --- maven-compiler-plugin:3.3:testCompile (default-testCompile) @ org.eclipse.hawk.greycat ---
[INFO] No sources to compile
[INFO] 
[INFO] --- maven-surefire-plugin:2.12.4:test (default-test) @ org.eclipse.hawk.greycat ---
[INFO] No tests to run.
[INFO] 
[INFO] --- maven-jar-plugin:2.4:jar (default-jar) @ org.eclipse.hawk.greycat ---
[INFO] Building jar: /home/jenkins/agent/workspace/hawk_master/greycat/org.eclipse.hawk.greycat/target-plain/org.eclipse.hawk.greycat-2.0.0.jar
[INFO] 
[INFO] --- eclipse-jarsigner-plugin:1.1.7:sign (signjars) @ org.eclipse.hawk.greycat ---
[INFO] Signing jar: /home/jenkins/agent/workspace/hawk_master/greycat/org.eclipse.hawk.greycat/target-plain/org.eclipse.hawk.greycat-2.0.0.jar
[INFO] 
[INFO] --- maven-gpg-plugin:1.6:sign (sign-artifacts) @ org.eclipse.hawk.greycat ---
[INFO] 
[INFO] --- maven-install-plugin:2.4:install (default-install) @ org.eclipse.hawk.greycat ---
[INFO] Installing /home/jenkins/agent/workspace/hawk_master/greycat/org.eclipse.hawk.greycat/target-plain/org.eclipse.hawk.greycat-2.0.0.jar to /home/jenkins/.m2/repository/org/eclipse/hawk/org.eclipse.hawk.greycat/2.0.0/org.eclipse.hawk.greycat-2.0.0.jar
[INFO] Installing /home/jenkins/agent/workspace/hawk_master/greycat/org.eclipse.hawk.greycat/pom-plain.xml to /home/jenkins/.m2/repository/org/eclipse/hawk/org.eclipse.hawk.greycat/2.0.0/org.eclipse.hawk.greycat-2.0.0.pom
[INFO] Installing /home/jenkins/agent/workspace/hawk_master/greycat/org.eclipse.hawk.greycat/target-plain/org.eclipse.hawk.greycat-2.0.0.jar.asc to /home/jenkins/.m2/repository/org/eclipse/hawk/org.eclipse.hawk.greycat/2.0.0/org.eclipse.hawk.greycat-2.0.0.jar.asc
[INFO] Installing /home/jenkins/agent/workspace/hawk_master/greycat/org.eclipse.hawk.greycat/target-plain/org.eclipse.hawk.greycat-2.0.0.pom.asc to /home/jenkins/.m2/repository/org/eclipse/hawk/org.eclipse.hawk.greycat/2.0.0/org.eclipse.hawk.greycat-2.0.0.pom.asc
[INFO] 
[INFO] --- nexus-staging-maven-plugin:1.6.8:deploy (injected-nexus-deploy) @ org.eclipse.hawk.greycat ---
[INFO] Performing local staging (local stagingDirectory="/home/jenkins/agent/workspace/hawk_master/target-plain/nexus-staging/staging")...
[INFO]  + Using server credentials "ossrh" from Maven settings.
[INFO]  * Connected to Nexus at https://oss.sonatype.org:443/, is version 2.14.18-01 and edition "Professional"
[INFO]  * Using staging profile ID "442bf4071bd05" (matched by Nexus).
[INFO] Installing /home/jenkins/agent/workspace/hawk_master/greycat/org.eclipse.hawk.greycat/target-plain/org.eclipse.hawk.greycat-2.0.0.jar to /home/jenkins/agent/workspace/hawk_master/target-plain/nexus-staging/staging/442bf4071bd05/org/eclipse/hawk/org.eclipse.hawk.greycat/2.0.0/org.eclipse.hawk.greycat-2.0.0.jar
[INFO] Installing /home/jenkins/agent/workspace/hawk_master/greycat/org.eclipse.hawk.greycat/pom-plain.xml to /home/jenkins/agent/workspace/hawk_master/target-plain/nexus-staging/staging/442bf4071bd05/org/eclipse/hawk/org.eclipse.hawk.greycat/2.0.0/org.eclipse.hawk.greycat-2.0.0.pom
[INFO] Installing /home/jenkins/agent/workspace/hawk_master/greycat/org.eclipse.hawk.greycat/target-plain/org.eclipse.hawk.greycat-2.0.0.jar.asc to /home/jenkins/agent/workspace/hawk_master/target-plain/nexus-staging/staging/442bf4071bd05/org/eclipse/hawk/org.eclipse.hawk.greycat/2.0.0/org.eclipse.hawk.greycat-2.0.0.jar.asc
[INFO] Installing /home/jenkins/agent/workspace/hawk_master/greycat/org.eclipse.hawk.greycat/target-plain/org.eclipse.hawk.greycat-2.0.0.pom.asc to /home/jenkins/agent/workspace/hawk_master/target-plain/nexus-staging/staging/442bf4071bd05/org/eclipse/hawk/org.eclipse.hawk.greycat/2.0.0/org.eclipse.hawk.greycat-2.0.0.pom.asc
[INFO] Execution skipped to the last project...
[INFO] 
[INFO] -----< org.eclipse.hawk.service:org.eclipse.hawk.service.artemis >------
[INFO] Building org.eclipse.hawk.service.artemis 2.0.0                  [14/16]
[INFO] --------------------------------[ jar ]---------------------------------
[INFO] 
[INFO] --- maven-resources-plugin:2.6:resources (default-resources) @ org.eclipse.hawk.service.artemis ---
[INFO] Using 'UTF-8' encoding to copy filtered resources.
[INFO] skip non existing resourceDirectory /home/jenkins/agent/workspace/hawk_master/server/plugins/org.eclipse.hawk.service.artemis/src/main/resources
[INFO] 
[INFO] --- maven-compiler-plugin:3.3:compile (default-compile) @ org.eclipse.hawk.service.artemis ---
[INFO] Nothing to compile - all classes are up to date
[INFO] 
[INFO] --- maven-resources-plugin:2.6:testResources (default-testResources) @ org.eclipse.hawk.service.artemis ---
[INFO] Using 'UTF-8' encoding to copy filtered resources.
[INFO] skip non existing resourceDirectory /home/jenkins/agent/workspace/hawk_master/server/plugins/org.eclipse.hawk.service.artemis/src/test/resources
[INFO] 
[INFO] --- maven-compiler-plugin:3.3:testCompile (default-testCompile) @ org.eclipse.hawk.service.artemis ---
[INFO] No sources to compile
[INFO] 
[INFO] --- maven-surefire-plugin:2.12.4:test (default-test) @ org.eclipse.hawk.service.artemis ---
[INFO] No tests to run.
[INFO] 
[INFO] --- maven-jar-plugin:2.4:jar (default-jar) @ org.eclipse.hawk.service.artemis ---
[INFO] 
[INFO] --- eclipse-jarsigner-plugin:1.1.7:sign (signjars) @ org.eclipse.hawk.service.artemis ---
[INFO] Jar '/home/jenkins/agent/workspace/hawk_master/server/plugins/org.eclipse.hawk.service.artemis/target-plain/org.eclipse.hawk.service.artemis-2.0.0.jar' is already signed and will be resigned.
[INFO] Signing jar: /home/jenkins/agent/workspace/hawk_master/server/plugins/org.eclipse.hawk.service.artemis/target-plain/org.eclipse.hawk.service.artemis-2.0.0.jar
[INFO] 
[INFO] --- maven-gpg-plugin:1.6:sign (sign-artifacts) @ org.eclipse.hawk.service.artemis ---
[INFO] 
[INFO] --- maven-install-plugin:2.4:install (default-install) @ org.eclipse.hawk.service.artemis ---
[INFO] Installing /home/jenkins/agent/workspace/hawk_master/server/plugins/org.eclipse.hawk.service.artemis/target-plain/org.eclipse.hawk.service.artemis-2.0.0.jar to /home/jenkins/.m2/repository/org/eclipse/hawk/service/org.eclipse.hawk.service.artemis/2.0.0/org.eclipse.hawk.service.artemis-2.0.0.jar
[INFO] Installing /home/jenkins/agent/workspace/hawk_master/server/plugins/org.eclipse.hawk.service.artemis/pom-plain.xml to /home/jenkins/.m2/repository/org/eclipse/hawk/service/org.eclipse.hawk.service.artemis/2.0.0/org.eclipse.hawk.service.artemis-2.0.0.pom
[INFO] Installing /home/jenkins/agent/workspace/hawk_master/server/plugins/org.eclipse.hawk.service.artemis/target-plain/org.eclipse.hawk.service.artemis-2.0.0.jar.asc to /home/jenkins/.m2/repository/org/eclipse/hawk/service/org.eclipse.hawk.service.artemis/2.0.0/org.eclipse.hawk.service.artemis-2.0.0.jar.asc
[INFO] Installing /home/jenkins/agent/workspace/hawk_master/server/plugins/org.eclipse.hawk.service.artemis/target-plain/org.eclipse.hawk.service.artemis-2.0.0.pom.asc to /home/jenkins/.m2/repository/org/eclipse/hawk/service/org.eclipse.hawk.service.artemis/2.0.0/org.eclipse.hawk.service.artemis-2.0.0.pom.asc
[INFO] 
[INFO] --- nexus-staging-maven-plugin:1.6.8:deploy (injected-nexus-deploy) @ org.eclipse.hawk.service.artemis ---
[INFO] Performing local staging (local stagingDirectory="/home/jenkins/agent/workspace/hawk_master/target-plain/nexus-staging/staging")...
[INFO]  + Using server credentials "ossrh" from Maven settings.
[INFO]  * Connected to Nexus at https://oss.sonatype.org:443/, is version 2.14.18-01 and edition "Professional"
[INFO]  * Using staging profile ID "442bf4071bd05" (matched by Nexus).
[INFO] Installing /home/jenkins/agent/workspace/hawk_master/server/plugins/org.eclipse.hawk.service.artemis/target-plain/org.eclipse.hawk.service.artemis-2.0.0.jar to /home/jenkins/agent/workspace/hawk_master/target-plain/nexus-staging/staging/442bf4071bd05/org/eclipse/hawk/service/org.eclipse.hawk.service.artemis/2.0.0/org.eclipse.hawk.service.artemis-2.0.0.jar
[INFO] Installing /home/jenkins/agent/workspace/hawk_master/server/plugins/org.eclipse.hawk.service.artemis/pom-plain.xml to /home/jenkins/agent/workspace/hawk_master/target-plain/nexus-staging/staging/442bf4071bd05/org/eclipse/hawk/service/org.eclipse.hawk.service.artemis/2.0.0/org.eclipse.hawk.service.artemis-2.0.0.pom
[INFO] Installing /home/jenkins/agent/workspace/hawk_master/server/plugins/org.eclipse.hawk.service.artemis/target-plain/org.eclipse.hawk.service.artemis-2.0.0.jar.asc to /home/jenkins/agent/workspace/hawk_master/target-plain/nexus-staging/staging/442bf4071bd05/org/eclipse/hawk/service/org.eclipse.hawk.service.artemis/2.0.0/org.eclipse.hawk.service.artemis-2.0.0.jar.asc
[INFO] Installing /home/jenkins/agent/workspace/hawk_master/server/plugins/org.eclipse.hawk.service.artemis/target-plain/org.eclipse.hawk.service.artemis-2.0.0.pom.asc to /home/jenkins/agent/workspace/hawk_master/target-plain/nexus-staging/staging/442bf4071bd05/org/eclipse/hawk/service/org.eclipse.hawk.service.artemis/2.0.0/org.eclipse.hawk.service.artemis-2.0.0.pom.asc
[INFO] Execution skipped to the last project...
[INFO] 
[INFO] -------< org.eclipse.hawk.service:org.eclipse.hawk.service.api >--------
[INFO] Building org.eclipse.hawk.service.api 2.0.0                      [15/16]
[INFO] --------------------------------[ jar ]---------------------------------
[INFO] 
[INFO] --- build-helper-maven-plugin:1.7:add-source (add-source) @ org.eclipse.hawk.service.api ---
[INFO] Source directory: /home/jenkins/agent/workspace/hawk_master/server/plugins/org.eclipse.hawk.service.api/src-gen added.
[INFO] 
[INFO] --- maven-resources-plugin:2.6:resources (default-resources) @ org.eclipse.hawk.service.api ---
[INFO] Using 'UTF-8' encoding to copy filtered resources.
[INFO] skip non existing resourceDirectory /home/jenkins/agent/workspace/hawk_master/server/plugins/org.eclipse.hawk.service.api/src/main/resources
[INFO] 
[INFO] --- maven-compiler-plugin:3.3:compile (default-compile) @ org.eclipse.hawk.service.api ---
[INFO] Nothing to compile - all classes are up to date
[INFO] 
[INFO] --- maven-resources-plugin:2.6:testResources (default-testResources) @ org.eclipse.hawk.service.api ---
[INFO] Using 'UTF-8' encoding to copy filtered resources.
[INFO] skip non existing resourceDirectory /home/jenkins/agent/workspace/hawk_master/server/plugins/org.eclipse.hawk.service.api/src/test/resources
[INFO] 
[INFO] --- maven-compiler-plugin:3.3:testCompile (default-testCompile) @ org.eclipse.hawk.service.api ---
[INFO] No sources to compile
[INFO] 
[INFO] --- maven-surefire-plugin:2.12.4:test (default-test) @ org.eclipse.hawk.service.api ---
[INFO] No tests to run.
[INFO] 
[INFO] --- maven-jar-plugin:2.4:jar (default-jar) @ org.eclipse.hawk.service.api ---
[INFO] 
[INFO] --- eclipse-jarsigner-plugin:1.1.7:sign (signjars) @ org.eclipse.hawk.service.api ---
[INFO] Jar '/home/jenkins/agent/workspace/hawk_master/server/plugins/org.eclipse.hawk.service.api/target-plain/org.eclipse.hawk.service.api-2.0.0.jar' is already signed and will be resigned.
[INFO] Signing jar: /home/jenkins/agent/workspace/hawk_master/server/plugins/org.eclipse.hawk.service.api/target-plain/org.eclipse.hawk.service.api-2.0.0.jar
[INFO] 
[INFO] --- maven-gpg-plugin:1.6:sign (sign-artifacts) @ org.eclipse.hawk.service.api ---
[INFO] 
[INFO] --- maven-install-plugin:2.4:install (default-install) @ org.eclipse.hawk.service.api ---
[INFO] Installing /home/jenkins/agent/workspace/hawk_master/server/plugins/org.eclipse.hawk.service.api/target-plain/org.eclipse.hawk.service.api-2.0.0.jar to /home/jenkins/.m2/repository/org/eclipse/hawk/service/org.eclipse.hawk.service.api/2.0.0/org.eclipse.hawk.service.api-2.0.0.jar
[INFO] Installing /home/jenkins/agent/workspace/hawk_master/server/plugins/org.eclipse.hawk.service.api/pom-plain.xml to /home/jenkins/.m2/repository/org/eclipse/hawk/service/org.eclipse.hawk.service.api/2.0.0/org.eclipse.hawk.service.api-2.0.0.pom
[INFO] Installing /home/jenkins/agent/workspace/hawk_master/server/plugins/org.eclipse.hawk.service.api/target-plain/org.eclipse.hawk.service.api-2.0.0.jar.asc to /home/jenkins/.m2/repository/org/eclipse/hawk/service/org.eclipse.hawk.service.api/2.0.0/org.eclipse.hawk.service.api-2.0.0.jar.asc
[INFO] Installing /home/jenkins/agent/workspace/hawk_master/server/plugins/org.eclipse.hawk.service.api/target-plain/org.eclipse.hawk.service.api-2.0.0.pom.asc to /home/jenkins/.m2/repository/org/eclipse/hawk/service/org.eclipse.hawk.service.api/2.0.0/org.eclipse.hawk.service.api-2.0.0.pom.asc
[INFO] 
[INFO] --- nexus-staging-maven-plugin:1.6.8:deploy (injected-nexus-deploy) @ org.eclipse.hawk.service.api ---
[INFO] Performing local staging (local stagingDirectory="/home/jenkins/agent/workspace/hawk_master/target-plain/nexus-staging/staging")...
[INFO]  + Using server credentials "ossrh" from Maven settings.
[INFO]  * Connected to Nexus at https://oss.sonatype.org:443/, is version 2.14.18-01 and edition "Professional"
[INFO]  * Using staging profile ID "442bf4071bd05" (matched by Nexus).
[INFO] Installing /home/jenkins/agent/workspace/hawk_master/server/plugins/org.eclipse.hawk.service.api/target-plain/org.eclipse.hawk.service.api-2.0.0.jar to /home/jenkins/agent/workspace/hawk_master/target-plain/nexus-staging/staging/442bf4071bd05/org/eclipse/hawk/service/org.eclipse.hawk.service.api/2.0.0/org.eclipse.hawk.service.api-2.0.0.jar
[INFO] Installing /home/jenkins/agent/workspace/hawk_master/server/plugins/org.eclipse.hawk.service.api/pom-plain.xml to /home/jenkins/agent/workspace/hawk_master/target-plain/nexus-staging/staging/442bf4071bd05/org/eclipse/hawk/service/org.eclipse.hawk.service.api/2.0.0/org.eclipse.hawk.service.api-2.0.0.pom
[INFO] Installing /home/jenkins/agent/workspace/hawk_master/server/plugins/org.eclipse.hawk.service.api/target-plain/org.eclipse.hawk.service.api-2.0.0.jar.asc to /home/jenkins/agent/workspace/hawk_master/target-plain/nexus-staging/staging/442bf4071bd05/org/eclipse/hawk/service/org.eclipse.hawk.service.api/2.0.0/org.eclipse.hawk.service.api-2.0.0.jar.asc
[INFO] Installing /home/jenkins/agent/workspace/hawk_master/server/plugins/org.eclipse.hawk.service.api/target-plain/org.eclipse.hawk.service.api-2.0.0.pom.asc to /home/jenkins/agent/workspace/hawk_master/target-plain/nexus-staging/staging/442bf4071bd05/org/eclipse/hawk/service/org.eclipse.hawk.service.api/2.0.0/org.eclipse.hawk.service.api-2.0.0.pom.asc
[INFO] Execution skipped to the last project...
[INFO] 
[INFO] -------< org.eclipse.hawk.service:org.eclipse.hawk.service.emf >--------
[INFO] Building org.eclipse.hawk.service.emf 2.0.0                      [16/16]
[INFO] --------------------------------[ jar ]---------------------------------
[INFO] 
[INFO] --- maven-resources-plugin:2.6:resources (default-resources) @ org.eclipse.hawk.service.emf ---
[INFO] Using 'UTF-8' encoding to copy filtered resources.
[INFO] skip non existing resourceDirectory /home/jenkins/agent/workspace/hawk_master/server/plugins/org.eclipse.hawk.service.emf/src/main/resources
[INFO] 
[INFO] --- maven-compiler-plugin:3.3:compile (default-compile) @ org.eclipse.hawk.service.emf ---
[INFO] Nothing to compile - all classes are up to date
[INFO] 
[INFO] --- maven-resources-plugin:2.6:testResources (default-testResources) @ org.eclipse.hawk.service.emf ---
[INFO] Using 'UTF-8' encoding to copy filtered resources.
[INFO] skip non existing resourceDirectory /home/jenkins/agent/workspace/hawk_master/server/plugins/org.eclipse.hawk.service.emf/src/test/resources
[INFO] 
[INFO] --- maven-compiler-plugin:3.3:testCompile (default-testCompile) @ org.eclipse.hawk.service.emf ---
[INFO] No sources to compile
[INFO] 
[INFO] --- maven-surefire-plugin:2.12.4:test (default-test) @ org.eclipse.hawk.service.emf ---
[INFO] No tests to run.
[INFO] 
[INFO] --- maven-jar-plugin:2.4:jar (default-jar) @ org.eclipse.hawk.service.emf ---
[INFO] 
[INFO] --- eclipse-jarsigner-plugin:1.1.7:sign (signjars) @ org.eclipse.hawk.service.emf ---
[INFO] Jar '/home/jenkins/agent/workspace/hawk_master/server/plugins/org.eclipse.hawk.service.emf/target-plain/org.eclipse.hawk.service.emf-2.0.0.jar' is already signed and will be resigned.
[INFO] Signing jar: /home/jenkins/agent/workspace/hawk_master/server/plugins/org.eclipse.hawk.service.emf/target-plain/org.eclipse.hawk.service.emf-2.0.0.jar
[INFO] 
[INFO] --- maven-gpg-plugin:1.6:sign (sign-artifacts) @ org.eclipse.hawk.service.emf ---
[INFO] 
[INFO] --- maven-install-plugin:2.4:install (default-install) @ org.eclipse.hawk.service.emf ---
[INFO] Installing /home/jenkins/agent/workspace/hawk_master/server/plugins/org.eclipse.hawk.service.emf/target-plain/org.eclipse.hawk.service.emf-2.0.0.jar to /home/jenkins/.m2/repository/org/eclipse/hawk/service/org.eclipse.hawk.service.emf/2.0.0/org.eclipse.hawk.service.emf-2.0.0.jar
[INFO] Installing /home/jenkins/agent/workspace/hawk_master/server/plugins/org.eclipse.hawk.service.emf/pom-plain.xml to /home/jenkins/.m2/repository/org/eclipse/hawk/service/org.eclipse.hawk.service.emf/2.0.0/org.eclipse.hawk.service.emf-2.0.0.pom
[INFO] Installing /home/jenkins/agent/workspace/hawk_master/server/plugins/org.eclipse.hawk.service.emf/target-plain/org.eclipse.hawk.service.emf-2.0.0.jar.asc to /home/jenkins/.m2/repository/org/eclipse/hawk/service/org.eclipse.hawk.service.emf/2.0.0/org.eclipse.hawk.service.emf-2.0.0.jar.asc
[INFO] Installing /home/jenkins/agent/workspace/hawk_master/server/plugins/org.eclipse.hawk.service.emf/target-plain/org.eclipse.hawk.service.emf-2.0.0.pom.asc to /home/jenkins/.m2/repository/org/eclipse/hawk/service/org.eclipse.hawk.service.emf/2.0.0/org.eclipse.hawk.service.emf-2.0.0.pom.asc
[INFO] 
[INFO] --- nexus-staging-maven-plugin:1.6.8:deploy (injected-nexus-deploy) @ org.eclipse.hawk.service.emf ---
[INFO] Performing local staging (local stagingDirectory="/home/jenkins/agent/workspace/hawk_master/target-plain/nexus-staging/staging")...
[INFO]  + Using server credentials "ossrh" from Maven settings.
[INFO]  * Connected to Nexus at https://oss.sonatype.org:443/, is version 2.14.18-01 and edition "Professional"
[INFO]  * Using staging profile ID "442bf4071bd05" (matched by Nexus).
[INFO] Installing /home/jenkins/agent/workspace/hawk_master/server/plugins/org.eclipse.hawk.service.emf/target-plain/org.eclipse.hawk.service.emf-2.0.0.jar to /home/jenkins/agent/workspace/hawk_master/target-plain/nexus-staging/staging/442bf4071bd05/org/eclipse/hawk/service/org.eclipse.hawk.service.emf/2.0.0/org.eclipse.hawk.service.emf-2.0.0.jar
[INFO] Installing /home/jenkins/agent/workspace/hawk_master/server/plugins/org.eclipse.hawk.service.emf/pom-plain.xml to /home/jenkins/agent/workspace/hawk_master/target-plain/nexus-staging/staging/442bf4071bd05/org/eclipse/hawk/service/org.eclipse.hawk.service.emf/2.0.0/org.eclipse.hawk.service.emf-2.0.0.pom
[INFO] Installing /home/jenkins/agent/workspace/hawk_master/server/plugins/org.eclipse.hawk.service.emf/target-plain/org.eclipse.hawk.service.emf-2.0.0.jar.asc to /home/jenkins/agent/workspace/hawk_master/target-plain/nexus-staging/staging/442bf4071bd05/org/eclipse/hawk/service/org.eclipse.hawk.service.emf/2.0.0/org.eclipse.hawk.service.emf-2.0.0.jar.asc
[INFO] Installing /home/jenkins/agent/workspace/hawk_master/server/plugins/org.eclipse.hawk.service.emf/target-plain/org.eclipse.hawk.service.emf-2.0.0.pom.asc to /home/jenkins/agent/workspace/hawk_master/target-plain/nexus-staging/staging/442bf4071bd05/org/eclipse/hawk/service/org.eclipse.hawk.service.emf/2.0.0/org.eclipse.hawk.service.emf-2.0.0.pom.asc
[INFO] Performing remote staging...
[INFO] 
[INFO]  * Remote staging into staging profile ID "442bf4071bd05"
[INFO]  * Created staging repository with ID "orgeclipsehawk-1003".
[INFO]  * Staging repository at https://oss.sonatype.org:443/service/local/staging/deployByRepositoryId/orgeclipsehawk-1003
[INFO]  * Uploading locally staged artifacts to profile org.eclipse.hawk
[INFO] Uploading to ossrh: https://oss.sonatype.org:443/service/local/staging/deployByRepositoryId/orgeclipsehawk-1003/org/eclipse/hawk/org.eclipse.hawk.http/2.0.0/org.eclipse.hawk.http-2.0.0.jar
[INFO] Uploaded to ossrh: https://oss.sonatype.org:443/service/local/staging/deployByRepositoryId/orgeclipsehawk-1003/org/eclipse/hawk/org.eclipse.hawk.http/2.0.0/org.eclipse.hawk.http-2.0.0.jar (16 kB at 32 kB/s)
[INFO] Uploading to ossrh: https://oss.sonatype.org:443/service/local/staging/deployByRepositoryId/orgeclipsehawk-1003/org/eclipse/hawk/org.eclipse.hawk.http/2.0.0/org.eclipse.hawk.http-2.0.0.pom
[INFO] Uploaded to ossrh: https://oss.sonatype.org:443/service/local/staging/deployByRepositoryId/orgeclipsehawk-1003/org/eclipse/hawk/org.eclipse.hawk.http/2.0.0/org.eclipse.hawk.http-2.0.0.pom (1.1 kB at 5.4 kB/s)
[INFO] Downloading from ossrh: https://oss.sonatype.org:443/service/local/staging/deployByRepositoryId/orgeclipsehawk-1003/org/eclipse/hawk/org.eclipse.hawk.http/maven-metadata.xml
[INFO] Uploading to ossrh: https://oss.sonatype.org:443/service/local/staging/deployByRepositoryId/orgeclipsehawk-1003/org/eclipse/hawk/org.eclipse.hawk.http/maven-metadata.xml
[INFO] Uploaded to ossrh: https://oss.sonatype.org:443/service/local/staging/deployByRepositoryId/orgeclipsehawk-1003/org/eclipse/hawk/org.eclipse.hawk.http/maven-metadata.xml (317 B at 873 B/s)
[INFO] Uploading to ossrh: https://oss.sonatype.org:443/service/local/staging/deployByRepositoryId/orgeclipsehawk-1003/org/eclipse/hawk/org.eclipse.hawk.jgit/2.0.0/org.eclipse.hawk.jgit-2.0.0.jar
[INFO] Uploaded to ossrh: https://oss.sonatype.org:443/service/local/staging/deployByRepositoryId/orgeclipsehawk-1003/org/eclipse/hawk/org.eclipse.hawk.jgit/2.0.0/org.eclipse.hawk.jgit-2.0.0.jar (20 kB at 79 kB/s)
[INFO] Uploading to ossrh: https://oss.sonatype.org:443/service/local/staging/deployByRepositoryId/orgeclipsehawk-1003/org/eclipse/hawk/org.eclipse.hawk.jgit/2.0.0/org.eclipse.hawk.jgit-2.0.0.pom
[INFO] Uploaded to ossrh: https://oss.sonatype.org:443/service/local/staging/deployByRepositoryId/orgeclipsehawk-1003/org/eclipse/hawk/org.eclipse.hawk.jgit/2.0.0/org.eclipse.hawk.jgit-2.0.0.pom (1.1 kB at 5.2 kB/s)
[INFO] Downloading from ossrh: https://oss.sonatype.org:443/service/local/staging/deployByRepositoryId/orgeclipsehawk-1003/org/eclipse/hawk/org.eclipse.hawk.jgit/maven-metadata.xml
[INFO] Uploading to ossrh: https://oss.sonatype.org:443/service/local/staging/deployByRepositoryId/orgeclipsehawk-1003/org/eclipse/hawk/org.eclipse.hawk.jgit/maven-metadata.xml
[INFO] Uploaded to ossrh: https://oss.sonatype.org:443/service/local/staging/deployByRepositoryId/orgeclipsehawk-1003/org/eclipse/hawk/org.eclipse.hawk.jgit/maven-metadata.xml (317 B at 1.0 kB/s)
[INFO] Uploading to ossrh: https://oss.sonatype.org:443/service/local/staging/deployByRepositoryId/orgeclipsehawk-1003/org/eclipse/hawk/org.eclipse.hawk.orientdb/2.0.0/org.eclipse.hawk.orientdb-2.0.0.jar
[INFO] Uploaded to ossrh: https://oss.sonatype.org:443/service/local/staging/deployByRepositoryId/orgeclipsehawk-1003/org/eclipse/hawk/org.eclipse.hawk.orientdb/2.0.0/org.eclipse.hawk.orientdb-2.0.0.jar (89 kB at 337 kB/s)
[INFO] Uploading to ossrh: https://oss.sonatype.org:443/service/local/staging/deployByRepositoryId/orgeclipsehawk-1003/org/eclipse/hawk/org.eclipse.hawk.orientdb/2.0.0/org.eclipse.hawk.orientdb-2.0.0.pom
[INFO] Uploaded to ossrh: https://oss.sonatype.org:443/service/local/staging/deployByRepositoryId/orgeclipsehawk-1003/org/eclipse/hawk/org.eclipse.hawk.orientdb/2.0.0/org.eclipse.hawk.orientdb-2.0.0.pom (1.4 kB at 5.3 kB/s)
[INFO] Downloading from ossrh: https://oss.sonatype.org:443/service/local/staging/deployByRepositoryId/orgeclipsehawk-1003/org/eclipse/hawk/org.eclipse.hawk.orientdb/maven-metadata.xml
[INFO] Uploading to ossrh: https://oss.sonatype.org:443/service/local/staging/deployByRepositoryId/orgeclipsehawk-1003/org/eclipse/hawk/org.eclipse.hawk.orientdb/maven-metadata.xml
[INFO] Uploaded to ossrh: https://oss.sonatype.org:443/service/local/staging/deployByRepositoryId/orgeclipsehawk-1003/org/eclipse/hawk/org.eclipse.hawk.orientdb/maven-metadata.xml (321 B at 1.1 kB/s)
[INFO] Uploading to ossrh: https://oss.sonatype.org:443/service/local/staging/deployByRepositoryId/orgeclipsehawk-1003/org/eclipse/hawk/org.eclipse.hawk.epsilon/2.0.0/org.eclipse.hawk.epsilon-2.0.0.pom.asc
[INFO] Uploaded to ossrh: https://oss.sonatype.org:443/service/local/staging/deployByRepositoryId/orgeclipsehawk-1003/org/eclipse/hawk/org.eclipse.hawk.epsilon/2.0.0/org.eclipse.hawk.epsilon-2.0.0.pom.asc (833 B at 12 kB/s)
[INFO] Downloading from ossrh: https://oss.sonatype.org:443/service/local/staging/deployByRepositoryId/orgeclipsehawk-1003/org/eclipse/hawk/org.eclipse.hawk.epsilon/maven-metadata.xml
[INFO] Uploading to ossrh: https://oss.sonatype.org:443/service/local/staging/deployByRepositoryId/orgeclipsehawk-1003/org/eclipse/hawk/org.eclipse.hawk.epsilon/maven-metadata.xml
[INFO] Uploaded to ossrh: https://oss.sonatype.org:443/service/local/staging/deployByRepositoryId/orgeclipsehawk-1003/org/eclipse/hawk/org.eclipse.hawk.epsilon/maven-metadata.xml (320 B at 1.1 kB/s)
[INFO] Uploading to ossrh: https://oss.sonatype.org:443/service/local/staging/deployByRepositoryId/orgeclipsehawk-1003/org/eclipse/hawk/org.eclipse.hawk.http/2.0.0/org.eclipse.hawk.http-2.0.0.pom.asc
[INFO] Uploaded to ossrh: https://oss.sonatype.org:443/service/local/staging/deployByRepositoryId/orgeclipsehawk-1003/org/eclipse/hawk/org.eclipse.hawk.http/2.0.0/org.eclipse.hawk.http-2.0.0.pom.asc (833 B at 12 kB/s)
[INFO] Uploading to ossrh: https://oss.sonatype.org:443/service/local/staging/deployByRepositoryId/orgeclipsehawk-1003/org/eclipse/hawk/service/org.eclipse.hawk.service.artemis/2.0.0/org.eclipse.hawk.service.artemis-2.0.0.pom.asc
[INFO] Uploaded to ossrh: https://oss.sonatype.org:443/service/local/staging/deployByRepositoryId/orgeclipsehawk-1003/org/eclipse/hawk/service/org.eclipse.hawk.service.artemis/2.0.0/org.eclipse.hawk.service.artemis-2.0.0.pom.asc (833 B at 12 kB/s)
[INFO] Downloading from ossrh: https://oss.sonatype.org:443/service/local/staging/deployByRepositoryId/orgeclipsehawk-1003/org/eclipse/hawk/service/org.eclipse.hawk.service.artemis/maven-metadata.xml
[INFO] Uploading to ossrh: https://oss.sonatype.org:443/service/local/staging/deployByRepositoryId/orgeclipsehawk-1003/org/eclipse/hawk/service/org.eclipse.hawk.service.artemis/maven-metadata.xml
[INFO] Uploaded to ossrh: https://oss.sonatype.org:443/service/local/staging/deployByRepositoryId/orgeclipsehawk-1003/org/eclipse/hawk/service/org.eclipse.hawk.service.artemis/maven-metadata.xml (336 B at 1.1 kB/s)
[INFO] Uploading to ossrh: https://oss.sonatype.org:443/service/local/staging/deployByRepositoryId/orgeclipsehawk-1003/org/eclipse/hawk/org.eclipse.hawk.graph/2.0.0/org.eclipse.hawk.graph-2.0.0.jar.asc
[INFO] Uploaded to ossrh: https://oss.sonatype.org:443/service/local/staging/deployByRepositoryId/orgeclipsehawk-1003/org/eclipse/hawk/org.eclipse.hawk.graph/2.0.0/org.eclipse.hawk.graph-2.0.0.jar.asc (833 B at 12 kB/s)
[INFO] Downloading from ossrh: https://oss.sonatype.org:443/service/local/staging/deployByRepositoryId/orgeclipsehawk-1003/org/eclipse/hawk/org.eclipse.hawk.graph/maven-metadata.xml
[INFO] Uploading to ossrh: https://oss.sonatype.org:443/service/local/staging/deployByRepositoryId/orgeclipsehawk-1003/org/eclipse/hawk/org.eclipse.hawk.graph/maven-metadata.xml
[INFO] Uploaded to ossrh: https://oss.sonatype.org:443/service/local/staging/deployByRepositoryId/orgeclipsehawk-1003/org/eclipse/hawk/org.eclipse.hawk.graph/maven-metadata.xml (318 B at 1.1 kB/s)
[INFO] Uploading to ossrh: https://oss.sonatype.org:443/service/local/staging/deployByRepositoryId/orgeclipsehawk-1003/org/eclipse/hawk/org.eclipse.hawk.modelio.exml/2.0.0/org.eclipse.hawk.modelio.exml-2.0.0.pom.asc
[INFO] Uploaded to ossrh: https://oss.sonatype.org:443/service/local/staging/deployByRepositoryId/orgeclipsehawk-1003/org/eclipse/hawk/org.eclipse.hawk.modelio.exml/2.0.0/org.eclipse.hawk.modelio.exml-2.0.0.pom.asc (833 B at 12 kB/s)
[INFO] Downloading from ossrh: https://oss.sonatype.org:443/service/local/staging/deployByRepositoryId/orgeclipsehawk-1003/org/eclipse/hawk/org.eclipse.hawk.modelio.exml/maven-metadata.xml
[INFO] Uploading to ossrh: https://oss.sonatype.org:443/service/local/staging/deployByRepositoryId/orgeclipsehawk-1003/org/eclipse/hawk/org.eclipse.hawk.modelio.exml/maven-metadata.xml
[INFO] Uploaded to ossrh: https://oss.sonatype.org:443/service/local/staging/deployByRepositoryId/orgeclipsehawk-1003/org/eclipse/hawk/org.eclipse.hawk.modelio.exml/maven-metadata.xml (325 B at 1.1 kB/s)
[INFO] Uploading to ossrh: https://oss.sonatype.org:443/service/local/staging/deployByRepositoryId/orgeclipsehawk-1003/org/eclipse/hawk/service/org.eclipse.hawk.service.emf/2.0.0/org.eclipse.hawk.service.emf-2.0.0.pom.asc
[INFO] Uploaded to ossrh: https://oss.sonatype.org:443/service/local/staging/deployByRepositoryId/orgeclipsehawk-1003/org/eclipse/hawk/service/org.eclipse.hawk.service.emf/2.0.0/org.eclipse.hawk.service.emf-2.0.0.pom.asc (833 B at 12 kB/s)
[INFO] Downloading from ossrh: https://oss.sonatype.org:443/service/local/staging/deployByRepositoryId/orgeclipsehawk-1003/org/eclipse/hawk/service/org.eclipse.hawk.service.emf/maven-metadata.xml
[INFO] Uploading to ossrh: https://oss.sonatype.org:443/service/local/staging/deployByRepositoryId/orgeclipsehawk-1003/org/eclipse/hawk/service/org.eclipse.hawk.service.emf/maven-metadata.xml
[INFO] Uploaded to ossrh: https://oss.sonatype.org:443/service/local/staging/deployByRepositoryId/orgeclipsehawk-1003/org/eclipse/hawk/service/org.eclipse.hawk.service.emf/maven-metadata.xml (332 B at 1.1 kB/s)
[INFO] Uploading to ossrh: https://oss.sonatype.org:443/service/local/staging/deployByRepositoryId/orgeclipsehawk-1003/org/eclipse/hawk/org.eclipse.hawk.timeaware/2.0.0/org.eclipse.hawk.timeaware-2.0.0.jar
[INFO] Uploaded to ossrh: https://oss.sonatype.org:443/service/local/staging/deployByRepositoryId/orgeclipsehawk-1003/org/eclipse/hawk/org.eclipse.hawk.timeaware/2.0.0/org.eclipse.hawk.timeaware-2.0.0.jar (86 kB at 327 kB/s)
[INFO] Uploading to ossrh: https://oss.sonatype.org:443/service/local/staging/deployByRepositoryId/orgeclipsehawk-1003/org/eclipse/hawk/org.eclipse.hawk.timeaware/2.0.0/org.eclipse.hawk.timeaware-2.0.0.pom
[INFO] Uploaded to ossrh: https://oss.sonatype.org:443/service/local/staging/deployByRepositoryId/orgeclipsehawk-1003/org/eclipse/hawk/org.eclipse.hawk.timeaware/2.0.0/org.eclipse.hawk.timeaware-2.0.0.pom (1.3 kB at 6.3 kB/s)
[INFO] Downloading from ossrh: https://oss.sonatype.org:443/service/local/staging/deployByRepositoryId/orgeclipsehawk-1003/org/eclipse/hawk/org.eclipse.hawk.timeaware/maven-metadata.xml
[INFO] Uploading to ossrh: https://oss.sonatype.org:443/service/local/staging/deployByRepositoryId/orgeclipsehawk-1003/org/eclipse/hawk/org.eclipse.hawk.timeaware/maven-metadata.xml
[INFO] Uploaded to ossrh: https://oss.sonatype.org:443/service/local/staging/deployByRepositoryId/orgeclipsehawk-1003/org/eclipse/hawk/org.eclipse.hawk.timeaware/maven-metadata.xml (322 B at 1.1 kB/s)
[INFO] Uploading to ossrh: https://oss.sonatype.org:443/service/local/staging/deployByRepositoryId/orgeclipsehawk-1003/org/eclipse/hawk/org.eclipse.hawk.core/2.0.0/org.eclipse.hawk.core-2.0.0.jar.asc
[INFO] Uploaded to ossrh: https://oss.sonatype.org:443/service/local/staging/deployByRepositoryId/orgeclipsehawk-1003/org/eclipse/hawk/org.eclipse.hawk.core/2.0.0/org.eclipse.hawk.core-2.0.0.jar.asc (833 B at 2.8 kB/s)
[INFO] Downloading from ossrh: https://oss.sonatype.org:443/service/local/staging/deployByRepositoryId/orgeclipsehawk-1003/org/eclipse/hawk/org.eclipse.hawk.core/maven-metadata.xml
[INFO] Uploading to ossrh: https://oss.sonatype.org:443/service/local/staging/deployByRepositoryId/orgeclipsehawk-1003/org/eclipse/hawk/org.eclipse.hawk.core/maven-metadata.xml
[INFO] Uploaded to ossrh: https://oss.sonatype.org:443/service/local/staging/deployByRepositoryId/orgeclipsehawk-1003/org/eclipse/hawk/org.eclipse.hawk.core/maven-metadata.xml (317 B at 935 B/s)
[INFO] Uploading to ossrh: https://oss.sonatype.org:443/service/local/staging/deployByRepositoryId/orgeclipsehawk-1003/org/eclipse/hawk/org.eclipse.hawk.jgit/2.0.0/org.eclipse.hawk.jgit-2.0.0.pom.asc
[INFO] Uploaded to ossrh: https://oss.sonatype.org:443/service/local/staging/deployByRepositoryId/orgeclipsehawk-1003/org/eclipse/hawk/org.eclipse.hawk.jgit/2.0.0/org.eclipse.hawk.jgit-2.0.0.pom.asc (833 B at 12 kB/s)
[INFO] Uploading to ossrh: https://oss.sonatype.org:443/service/local/staging/deployByRepositoryId/orgeclipsehawk-1003/org/eclipse/hawk/org.eclipse.hawk.orientdb/2.0.0/org.eclipse.hawk.orientdb-2.0.0.jar.asc
[INFO] Uploaded to ossrh: https://oss.sonatype.org:443/service/local/staging/deployByRepositoryId/orgeclipsehawk-1003/org/eclipse/hawk/org.eclipse.hawk.orientdb/2.0.0/org.eclipse.hawk.orientdb-2.0.0.jar.asc (833 B at 12 kB/s)
[INFO] Uploading to ossrh: https://oss.sonatype.org:443/service/local/staging/deployByRepositoryId/orgeclipsehawk-1003/org/eclipse/hawk/org.eclipse.hawk.greycat/2.0.0/org.eclipse.hawk.greycat-2.0.0.jar.asc
[INFO] Uploaded to ossrh: https://oss.sonatype.org:443/service/local/staging/deployByRepositoryId/orgeclipsehawk-1003/org/eclipse/hawk/org.eclipse.hawk.greycat/2.0.0/org.eclipse.hawk.greycat-2.0.0.jar.asc (833 B at 11 kB/s)
[INFO] Downloading from ossrh: https://oss.sonatype.org:443/service/local/staging/deployByRepositoryId/orgeclipsehawk-1003/org/eclipse/hawk/org.eclipse.hawk.greycat/maven-metadata.xml
[INFO] Uploading to ossrh: https://oss.sonatype.org:443/service/local/staging/deployByRepositoryId/orgeclipsehawk-1003/org/eclipse/hawk/org.eclipse.hawk.greycat/maven-metadata.xml
[INFO] Uploaded to ossrh: https://oss.sonatype.org:443/service/local/staging/deployByRepositoryId/orgeclipsehawk-1003/org/eclipse/hawk/org.eclipse.hawk.greycat/maven-metadata.xml (320 B at 1.1 kB/s)
[INFO] Uploading to ossrh: https://oss.sonatype.org:443/service/local/staging/deployByRepositoryId/orgeclipsehawk-1003/org/eclipse/hawk/service/org.eclipse.hawk.service.api/2.0.0/org.eclipse.hawk.service.api-2.0.0.jar
[INFO] Uploaded to ossrh: https://oss.sonatype.org:443/service/local/staging/deployByRepositoryId/orgeclipsehawk-1003/org/eclipse/hawk/service/org.eclipse.hawk.service.api/2.0.0/org.eclipse.hawk.service.api-2.0.0.jar (2.1 MB at 4.5 MB/s)
[INFO] Uploading to ossrh: https://oss.sonatype.org:443/service/local/staging/deployByRepositoryId/orgeclipsehawk-1003/org/eclipse/hawk/service/org.eclipse.hawk.service.api/2.0.0/org.eclipse.hawk.service.api-2.0.0.pom
[INFO] Uploaded to ossrh: https://oss.sonatype.org:443/service/local/staging/deployByRepositoryId/orgeclipsehawk-1003/org/eclipse/hawk/service/org.eclipse.hawk.service.api/2.0.0/org.eclipse.hawk.service.api-2.0.0.pom (1.9 kB at 9.0 kB/s)
[INFO] Downloading from ossrh: https://oss.sonatype.org:443/service/local/staging/deployByRepositoryId/orgeclipsehawk-1003/org/eclipse/hawk/service/org.eclipse.hawk.service.api/maven-metadata.xml
[INFO] Uploading to ossrh: https://oss.sonatype.org:443/service/local/staging/deployByRepositoryId/orgeclipsehawk-1003/org/eclipse/hawk/service/org.eclipse.hawk.service.api/maven-metadata.xml
[INFO] Uploaded to ossrh: https://oss.sonatype.org:443/service/local/staging/deployByRepositoryId/orgeclipsehawk-1003/org/eclipse/hawk/service/org.eclipse.hawk.service.api/maven-metadata.xml (332 B at 1.2 kB/s)
[INFO] Uploading to ossrh: https://oss.sonatype.org:443/service/local/staging/deployByRepositoryId/orgeclipsehawk-1003/org/eclipse/hawk/mondo-hawk-plain/2.0.0/mondo-hawk-plain-2.0.0.pom.asc
[INFO] Uploaded to ossrh: https://oss.sonatype.org:443/service/local/staging/deployByRepositoryId/orgeclipsehawk-1003/org/eclipse/hawk/mondo-hawk-plain/2.0.0/mondo-hawk-plain-2.0.0.pom.asc (833 B at 13 kB/s)
[INFO] Downloading from ossrh: https://oss.sonatype.org:443/service/local/staging/deployByRepositoryId/orgeclipsehawk-1003/org/eclipse/hawk/mondo-hawk-plain/maven-metadata.xml
[INFO] Uploading to ossrh: https://oss.sonatype.org:443/service/local/staging/deployByRepositoryId/orgeclipsehawk-1003/org/eclipse/hawk/mondo-hawk-plain/maven-metadata.xml
[INFO] Uploaded to ossrh: https://oss.sonatype.org:443/service/local/staging/deployByRepositoryId/orgeclipsehawk-1003/org/eclipse/hawk/mondo-hawk-plain/maven-metadata.xml (312 B at 827 B/s)
[INFO] Uploading to ossrh: https://oss.sonatype.org:443/service/local/staging/deployByRepositoryId/orgeclipsehawk-1003/org/eclipse/hawk/org.eclipse.hawk.timeaware/2.0.0/org.eclipse.hawk.timeaware-2.0.0.pom.asc
[INFO] Uploaded to ossrh: https://oss.sonatype.org:443/service/local/staging/deployByRepositoryId/orgeclipsehawk-1003/org/eclipse/hawk/org.eclipse.hawk.timeaware/2.0.0/org.eclipse.hawk.timeaware-2.0.0.pom.asc (833 B at 12 kB/s)
[INFO] Uploading to ossrh: https://oss.sonatype.org:443/service/local/staging/deployByRepositoryId/orgeclipsehawk-1003/org/eclipse/hawk/service/org.eclipse.hawk.service.artemis/2.0.0/org.eclipse.hawk.service.artemis-2.0.0.jar
[INFO] Uploaded to ossrh: https://oss.sonatype.org:443/service/local/staging/deployByRepositoryId/orgeclipsehawk-1003/org/eclipse/hawk/service/org.eclipse.hawk.service.artemis/2.0.0/org.eclipse.hawk.service.artemis-2.0.0.jar (14 kB at 67 kB/s)
[INFO] Uploading to ossrh: https://oss.sonatype.org:443/service/local/staging/deployByRepositoryId/orgeclipsehawk-1003/org/eclipse/hawk/service/org.eclipse.hawk.service.artemis/2.0.0/org.eclipse.hawk.service.artemis-2.0.0.pom
[INFO] Uploaded to ossrh: https://oss.sonatype.org:443/service/local/staging/deployByRepositoryId/orgeclipsehawk-1003/org/eclipse/hawk/service/org.eclipse.hawk.service.artemis/2.0.0/org.eclipse.hawk.service.artemis-2.0.0.pom (1.1 kB at 5.2 kB/s)
[INFO] Uploading to ossrh: https://oss.sonatype.org:443/service/local/staging/deployByRepositoryId/orgeclipsehawk-1003/org/eclipse/hawk/org.eclipse.hawk.emf/2.0.0/org.eclipse.hawk.emf-2.0.0.pom.asc
[INFO] Uploaded to ossrh: https://oss.sonatype.org:443/service/local/staging/deployByRepositoryId/orgeclipsehawk-1003/org/eclipse/hawk/org.eclipse.hawk.emf/2.0.0/org.eclipse.hawk.emf-2.0.0.pom.asc (833 B at 12 kB/s)
[INFO] Downloading from ossrh: https://oss.sonatype.org:443/service/local/staging/deployByRepositoryId/orgeclipsehawk-1003/org/eclipse/hawk/org.eclipse.hawk.emf/maven-metadata.xml
[INFO] Uploading to ossrh: https://oss.sonatype.org:443/service/local/staging/deployByRepositoryId/orgeclipsehawk-1003/org/eclipse/hawk/org.eclipse.hawk.emf/maven-metadata.xml
[INFO] Uploaded to ossrh: https://oss.sonatype.org:443/service/local/staging/deployByRepositoryId/orgeclipsehawk-1003/org/eclipse/hawk/org.eclipse.hawk.emf/maven-metadata.xml (316 B at 1.1 kB/s)
[INFO] Uploading to ossrh: https://oss.sonatype.org:443/service/local/staging/deployByRepositoryId/orgeclipsehawk-1003/org/eclipse/hawk/org.eclipse.hawk.modelio.exml/2.0.0/org.eclipse.hawk.modelio.exml-2.0.0.jar
[INFO] Uploaded to ossrh: https://oss.sonatype.org:443/service/local/staging/deployByRepositoryId/orgeclipsehawk-1003/org/eclipse/hawk/org.eclipse.hawk.modelio.exml/2.0.0/org.eclipse.hawk.modelio.exml-2.0.0.jar (92 kB at 325 kB/s)
[INFO] Uploading to ossrh: https://oss.sonatype.org:443/service/local/staging/deployByRepositoryId/orgeclipsehawk-1003/org/eclipse/hawk/org.eclipse.hawk.modelio.exml/2.0.0/org.eclipse.hawk.modelio.exml-2.0.0.pom
[INFO] Uploaded to ossrh: https://oss.sonatype.org:443/service/local/staging/deployByRepositoryId/orgeclipsehawk-1003/org/eclipse/hawk/org.eclipse.hawk.modelio.exml/2.0.0/org.eclipse.hawk.modelio.exml-2.0.0.pom (1.1 kB at 4.3 kB/s)
[INFO] Uploading to ossrh: https://oss.sonatype.org:443/service/local/staging/deployByRepositoryId/orgeclipsehawk-1003/org/eclipse/hawk/org.eclipse.hawk.emfresource/2.0.0/org.eclipse.hawk.emfresource-2.0.0.pom.asc
[INFO] Uploaded to ossrh: https://oss.sonatype.org:443/service/local/staging/deployByRepositoryId/orgeclipsehawk-1003/org/eclipse/hawk/org.eclipse.hawk.emfresource/2.0.0/org.eclipse.hawk.emfresource-2.0.0.pom.asc (833 B at 12 kB/s)
[INFO] Downloading from ossrh: https://oss.sonatype.org:443/service/local/staging/deployByRepositoryId/orgeclipsehawk-1003/org/eclipse/hawk/org.eclipse.hawk.emfresource/maven-metadata.xml
[INFO] Uploading to ossrh: https://oss.sonatype.org:443/service/local/staging/deployByRepositoryId/orgeclipsehawk-1003/org/eclipse/hawk/org.eclipse.hawk.emfresource/maven-metadata.xml
[INFO] Uploaded to ossrh: https://oss.sonatype.org:443/service/local/staging/deployByRepositoryId/orgeclipsehawk-1003/org/eclipse/hawk/org.eclipse.hawk.emfresource/maven-metadata.xml (324 B at 1.1 kB/s)
[INFO] Uploading to ossrh: https://oss.sonatype.org:443/service/local/staging/deployByRepositoryId/orgeclipsehawk-1003/org/eclipse/hawk/service/org.eclipse.hawk.service.artemis/2.0.0/org.eclipse.hawk.service.artemis-2.0.0.jar.asc
[INFO] Uploaded to ossrh: https://oss.sonatype.org:443/service/local/staging/deployByRepositoryId/orgeclipsehawk-1003/org/eclipse/hawk/service/org.eclipse.hawk.service.artemis/2.0.0/org.eclipse.hawk.service.artemis-2.0.0.jar.asc (833 B at 12 kB/s)
[INFO] Uploading to ossrh: https://oss.sonatype.org:443/service/local/staging/deployByRepositoryId/orgeclipsehawk-1003/org/eclipse/hawk/org.eclipse.hawk.http/2.0.0/org.eclipse.hawk.http-2.0.0.jar.asc
[INFO] Uploaded to ossrh: https://oss.sonatype.org:443/service/local/staging/deployByRepositoryId/orgeclipsehawk-1003/org/eclipse/hawk/org.eclipse.hawk.http/2.0.0/org.eclipse.hawk.http-2.0.0.jar.asc (833 B at 12 kB/s)
[INFO] Uploading to ossrh: https://oss.sonatype.org:443/service/local/staging/deployByRepositoryId/orgeclipsehawk-1003/org/eclipse/hawk/service/org.eclipse.hawk.service.emf/2.0.0/org.eclipse.hawk.service.emf-2.0.0.jar
[INFO] Uploaded to ossrh: https://oss.sonatype.org:443/service/local/staging/deployByRepositoryId/orgeclipsehawk-1003/org/eclipse/hawk/service/org.eclipse.hawk.service.emf/2.0.0/org.eclipse.hawk.service.emf-2.0.0.jar (59 kB at 233 kB/s)
[INFO] Uploading to ossrh: https://oss.sonatype.org:443/service/local/staging/deployByRepositoryId/orgeclipsehawk-1003/org/eclipse/hawk/service/org.eclipse.hawk.service.emf/2.0.0/org.eclipse.hawk.service.emf-2.0.0.pom
[INFO] Uploaded to ossrh: https://oss.sonatype.org:443/service/local/staging/deployByRepositoryId/orgeclipsehawk-1003/org/eclipse/hawk/service/org.eclipse.hawk.service.emf/2.0.0/org.eclipse.hawk.service.emf-2.0.0.pom (1.2 kB at 2.7 kB/s)
[INFO] Uploading to ossrh: https://oss.sonatype.org:443/service/local/staging/deployByRepositoryId/orgeclipsehawk-1003/org/eclipse/hawk/org.eclipse.hawk.epsilon/2.0.0/org.eclipse.hawk.epsilon-2.0.0.jar.asc
[INFO] Uploaded to ossrh: https://oss.sonatype.org:443/service/local/staging/deployByRepositoryId/orgeclipsehawk-1003/org/eclipse/hawk/org.eclipse.hawk.epsilon/2.0.0/org.eclipse.hawk.epsilon-2.0.0.jar.asc (833 B at 13 kB/s)
[INFO] Uploading to ossrh: https://oss.sonatype.org:443/service/local/staging/deployByRepositoryId/orgeclipsehawk-1003/org/eclipse/hawk/org.eclipse.hawk.emf/2.0.0/org.eclipse.hawk.emf-2.0.0.jar
[INFO] Uploaded to ossrh: https://oss.sonatype.org:443/service/local/staging/deployByRepositoryId/orgeclipsehawk-1003/org/eclipse/hawk/org.eclipse.hawk.emf/2.0.0/org.eclipse.hawk.emf-2.0.0.jar (40 kB at 195 kB/s)
[INFO] Uploading to ossrh: https://oss.sonatype.org:443/service/local/staging/deployByRepositoryId/orgeclipsehawk-1003/org/eclipse/hawk/org.eclipse.hawk.emf/2.0.0/org.eclipse.hawk.emf-2.0.0.pom
[INFO] Uploaded to ossrh: https://oss.sonatype.org:443/service/local/staging/deployByRepositoryId/orgeclipsehawk-1003/org/eclipse/hawk/org.eclipse.hawk.emf/2.0.0/org.eclipse.hawk.emf-2.0.0.pom (1.7 kB at 5.1 kB/s)
[INFO] Uploading to ossrh: https://oss.sonatype.org:443/service/local/staging/deployByRepositoryId/orgeclipsehawk-1003/org/eclipse/hawk/org.eclipse.hawk.modelio.exml/2.0.0/org.eclipse.hawk.modelio.exml-2.0.0.jar.asc
[INFO] Uploaded to ossrh: https://oss.sonatype.org:443/service/local/staging/deployByRepositoryId/orgeclipsehawk-1003/org/eclipse/hawk/org.eclipse.hawk.modelio.exml/2.0.0/org.eclipse.hawk.modelio.exml-2.0.0.jar.asc (833 B at 13 kB/s)
[INFO] Uploading to ossrh: https://oss.sonatype.org:443/service/local/staging/deployByRepositoryId/orgeclipsehawk-1003/org/eclipse/hawk/org.eclipse.hawk.localfolder/2.0.0/org.eclipse.hawk.localfolder-2.0.0.pom.asc
[INFO] Uploaded to ossrh: https://oss.sonatype.org:443/service/local/staging/deployByRepositoryId/orgeclipsehawk-1003/org/eclipse/hawk/org.eclipse.hawk.localfolder/2.0.0/org.eclipse.hawk.localfolder-2.0.0.pom.asc (833 B at 13 kB/s)
[INFO] Downloading from ossrh: https://oss.sonatype.org:443/service/local/staging/deployByRepositoryId/orgeclipsehawk-1003/org/eclipse/hawk/org.eclipse.hawk.localfolder/maven-metadata.xml
[INFO] Uploading to ossrh: https://oss.sonatype.org:443/service/local/staging/deployByRepositoryId/orgeclipsehawk-1003/org/eclipse/hawk/org.eclipse.hawk.localfolder/maven-metadata.xml
[INFO] Uploaded to ossrh: https://oss.sonatype.org:443/service/local/staging/deployByRepositoryId/orgeclipsehawk-1003/org/eclipse/hawk/org.eclipse.hawk.localfolder/maven-metadata.xml (324 B at 213 B/s)
[INFO] Uploading to ossrh: https://oss.sonatype.org:443/service/local/staging/deployByRepositoryId/orgeclipsehawk-1003/org/eclipse/hawk/service/org.eclipse.hawk.service.emf/2.0.0/org.eclipse.hawk.service.emf-2.0.0.jar.asc
[INFO] Uploaded to ossrh: https://oss.sonatype.org:443/service/local/staging/deployByRepositoryId/orgeclipsehawk-1003/org/eclipse/hawk/service/org.eclipse.hawk.service.emf/2.0.0/org.eclipse.hawk.service.emf-2.0.0.jar.asc (833 B at 12 kB/s)
[INFO] Uploading to ossrh: https://oss.sonatype.org:443/service/local/staging/deployByRepositoryId/orgeclipsehawk-1003/org/eclipse/hawk/service/org.eclipse.hawk.service.api/2.0.0/org.eclipse.hawk.service.api-2.0.0.pom.asc
[INFO] Uploaded to ossrh: https://oss.sonatype.org:443/service/local/staging/deployByRepositoryId/orgeclipsehawk-1003/org/eclipse/hawk/service/org.eclipse.hawk.service.api/2.0.0/org.eclipse.hawk.service.api-2.0.0.pom.asc (833 B at 11 kB/s)
[INFO] Uploading to ossrh: https://oss.sonatype.org:443/service/local/staging/deployByRepositoryId/orgeclipsehawk-1003/org/eclipse/hawk/org.eclipse.hawk.emfresource/2.0.0/org.eclipse.hawk.emfresource-2.0.0.jar
[INFO] Uploaded to ossrh: https://oss.sonatype.org:443/service/local/staging/deployByRepositoryId/orgeclipsehawk-1003/org/eclipse/hawk/org.eclipse.hawk.emfresource/2.0.0/org.eclipse.hawk.emfresource-2.0.0.jar (54 kB at 201 kB/s)
[INFO] Uploading to ossrh: https://oss.sonatype.org:443/service/local/staging/deployByRepositoryId/orgeclipsehawk-1003/org/eclipse/hawk/org.eclipse.hawk.emfresource/2.0.0/org.eclipse.hawk.emfresource-2.0.0.pom
[INFO] Uploaded to ossrh: https://oss.sonatype.org:443/service/local/staging/deployByRepositoryId/orgeclipsehawk-1003/org/eclipse/hawk/org.eclipse.hawk.emfresource/2.0.0/org.eclipse.hawk.emfresource-2.0.0.pom (1.8 kB at 8.6 kB/s)
[INFO] Uploading to ossrh: https://oss.sonatype.org:443/service/local/staging/deployByRepositoryId/orgeclipsehawk-1003/org/eclipse/hawk/org.eclipse.hawk.localfolder/2.0.0/org.eclipse.hawk.localfolder-2.0.0.jar
[INFO] Uploaded to ossrh: https://oss.sonatype.org:443/service/local/staging/deployByRepositoryId/orgeclipsehawk-1003/org/eclipse/hawk/org.eclipse.hawk.localfolder/2.0.0/org.eclipse.hawk.localfolder-2.0.0.jar (19 kB at 89 kB/s)
[INFO] Uploading to ossrh: https://oss.sonatype.org:443/service/local/staging/deployByRepositoryId/orgeclipsehawk-1003/org/eclipse/hawk/org.eclipse.hawk.localfolder/2.0.0/org.eclipse.hawk.localfolder-2.0.0.pom
[INFO] Uploaded to ossrh: https://oss.sonatype.org:443/service/local/staging/deployByRepositoryId/orgeclipsehawk-1003/org/eclipse/hawk/org.eclipse.hawk.localfolder/2.0.0/org.eclipse.hawk.localfolder-2.0.0.pom (965 B at 4.6 kB/s)
[INFO] Uploading to ossrh: https://oss.sonatype.org:443/service/local/staging/deployByRepositoryId/orgeclipsehawk-1003/org/eclipse/hawk/org.eclipse.hawk.jgit/2.0.0/org.eclipse.hawk.jgit-2.0.0.jar.asc
[INFO] Uploaded to ossrh: https://oss.sonatype.org:443/service/local/staging/deployByRepositoryId/orgeclipsehawk-1003/org/eclipse/hawk/org.eclipse.hawk.jgit/2.0.0/org.eclipse.hawk.jgit-2.0.0.jar.asc (833 B at 11 kB/s)
[INFO] Uploading to ossrh: https://oss.sonatype.org:443/service/local/staging/deployByRepositoryId/orgeclipsehawk-1003/org/eclipse/hawk/org.eclipse.hawk.core/2.0.0/org.eclipse.hawk.core-2.0.0.jar
[INFO] Uploaded to ossrh: https://oss.sonatype.org:443/service/local/staging/deployByRepositoryId/orgeclipsehawk-1003/org/eclipse/hawk/org.eclipse.hawk.core/2.0.0/org.eclipse.hawk.core-2.0.0.jar (109 kB at 288 kB/s)
[INFO] Uploading to ossrh: https://oss.sonatype.org:443/service/local/staging/deployByRepositoryId/orgeclipsehawk-1003/org/eclipse/hawk/org.eclipse.hawk.core/2.0.0/org.eclipse.hawk.core-2.0.0.pom
[INFO] Uploaded to ossrh: https://oss.sonatype.org:443/service/local/staging/deployByRepositoryId/orgeclipsehawk-1003/org/eclipse/hawk/org.eclipse.hawk.core/2.0.0/org.eclipse.hawk.core-2.0.0.pom (1.1 kB at 5.1 kB/s)
[INFO] Uploading to ossrh: https://oss.sonatype.org:443/service/local/staging/deployByRepositoryId/orgeclipsehawk-1003/org/eclipse/hawk/mondo-hawk-plain/2.0.0/mondo-hawk-plain-2.0.0.pom
[INFO] Uploaded to ossrh: https://oss.sonatype.org:443/service/local/staging/deployByRepositoryId/orgeclipsehawk-1003/org/eclipse/hawk/mondo-hawk-plain/2.0.0/mondo-hawk-plain-2.0.0.pom (7.6 kB at 37 kB/s)
[INFO] Uploading to ossrh: https://oss.sonatype.org:443/service/local/staging/deployByRepositoryId/orgeclipsehawk-1003/org/eclipse/hawk/org.eclipse.hawk.greycat/2.0.0/org.eclipse.hawk.greycat-2.0.0.jar
[INFO] Uploaded to ossrh: https://oss.sonatype.org:443/service/local/staging/deployByRepositoryId/orgeclipsehawk-1003/org/eclipse/hawk/org.eclipse.hawk.greycat/2.0.0/org.eclipse.hawk.greycat-2.0.0.jar (94 kB at 446 kB/s)
[INFO] Uploading to ossrh: https://oss.sonatype.org:443/service/local/staging/deployByRepositoryId/orgeclipsehawk-1003/org/eclipse/hawk/org.eclipse.hawk.greycat/2.0.0/org.eclipse.hawk.greycat-2.0.0.pom
[INFO] Uploaded to ossrh: https://oss.sonatype.org:443/service/local/staging/deployByRepositoryId/orgeclipsehawk-1003/org/eclipse/hawk/org.eclipse.hawk.greycat/2.0.0/org.eclipse.hawk.greycat-2.0.0.pom (1.9 kB at 9.0 kB/s)
[INFO] Uploading to ossrh: https://oss.sonatype.org:443/service/local/staging/deployByRepositoryId/orgeclipsehawk-1003/org/eclipse/hawk/org.eclipse.hawk.graph/2.0.0/org.eclipse.hawk.graph-2.0.0.pom.asc
[INFO] Uploaded to ossrh: https://oss.sonatype.org:443/service/local/staging/deployByRepositoryId/orgeclipsehawk-1003/org/eclipse/hawk/org.eclipse.hawk.graph/2.0.0/org.eclipse.hawk.graph-2.0.0.pom.asc (833 B at 12 kB/s)
[INFO] Uploading to ossrh: https://oss.sonatype.org:443/service/local/staging/deployByRepositoryId/orgeclipsehawk-1003/org/eclipse/hawk/org.eclipse.hawk.timeaware/2.0.0/org.eclipse.hawk.timeaware-2.0.0.jar.asc
[INFO] Uploaded to ossrh: https://oss.sonatype.org:443/service/local/staging/deployByRepositoryId/orgeclipsehawk-1003/org/eclipse/hawk/org.eclipse.hawk.timeaware/2.0.0/org.eclipse.hawk.timeaware-2.0.0.jar.asc (833 B at 12 kB/s)
[INFO] Uploading to ossrh: https://oss.sonatype.org:443/service/local/staging/deployByRepositoryId/orgeclipsehawk-1003/org/eclipse/hawk/org.eclipse.hawk.emf/2.0.0/org.eclipse.hawk.emf-2.0.0.jar.asc
[INFO] Uploaded to ossrh: https://oss.sonatype.org:443/service/local/staging/deployByRepositoryId/orgeclipsehawk-1003/org/eclipse/hawk/org.eclipse.hawk.emf/2.0.0/org.eclipse.hawk.emf-2.0.0.jar.asc (833 B at 12 kB/s)
[INFO] Uploading to ossrh: https://oss.sonatype.org:443/service/local/staging/deployByRepositoryId/orgeclipsehawk-1003/org/eclipse/hawk/org.eclipse.hawk.core/2.0.0/org.eclipse.hawk.core-2.0.0.pom.asc
[INFO] Uploaded to ossrh: https://oss.sonatype.org:443/service/local/staging/deployByRepositoryId/orgeclipsehawk-1003/org/eclipse/hawk/org.eclipse.hawk.core/2.0.0/org.eclipse.hawk.core-2.0.0.pom.asc (833 B at 12 kB/s)
[INFO] Uploading to ossrh: https://oss.sonatype.org:443/service/local/staging/deployByRepositoryId/orgeclipsehawk-1003/org/eclipse/hawk/org.eclipse.hawk.emfresource/2.0.0/org.eclipse.hawk.emfresource-2.0.0.jar.asc
[INFO] Uploaded to ossrh: https://oss.sonatype.org:443/service/local/staging/deployByRepositoryId/orgeclipsehawk-1003/org/eclipse/hawk/org.eclipse.hawk.emfresource/2.0.0/org.eclipse.hawk.emfresource-2.0.0.jar.asc (833 B at 12 kB/s)
[INFO] Uploading to ossrh: https://oss.sonatype.org:443/service/local/staging/deployByRepositoryId/orgeclipsehawk-1003/org/eclipse/hawk/org.eclipse.hawk.localfolder/2.0.0/org.eclipse.hawk.localfolder-2.0.0.jar.asc
[INFO] Uploaded to ossrh: https://oss.sonatype.org:443/service/local/staging/deployByRepositoryId/orgeclipsehawk-1003/org/eclipse/hawk/org.eclipse.hawk.localfolder/2.0.0/org.eclipse.hawk.localfolder-2.0.0.jar.asc (833 B at 5.1 kB/s)
[INFO] Uploading to ossrh: https://oss.sonatype.org:443/service/local/staging/deployByRepositoryId/orgeclipsehawk-1003/org/eclipse/hawk/org.eclipse.hawk.graph/2.0.0/org.eclipse.hawk.graph-2.0.0.jar
[INFO] Uploaded to ossrh: https://oss.sonatype.org:443/service/local/staging/deployByRepositoryId/orgeclipsehawk-1003/org/eclipse/hawk/org.eclipse.hawk.graph/2.0.0/org.eclipse.hawk.graph-2.0.0.jar (135 kB at 643 kB/s)
[INFO] Uploading to ossrh: https://oss.sonatype.org:443/service/local/staging/deployByRepositoryId/orgeclipsehawk-1003/org/eclipse/hawk/org.eclipse.hawk.graph/2.0.0/org.eclipse.hawk.graph-2.0.0.pom
[INFO] Uploaded to ossrh: https://oss.sonatype.org:443/service/local/staging/deployByRepositoryId/orgeclipsehawk-1003/org/eclipse/hawk/org.eclipse.hawk.graph/2.0.0/org.eclipse.hawk.graph-2.0.0.pom (818 B at 4.0 kB/s)
[INFO] Uploading to ossrh: https://oss.sonatype.org:443/service/local/staging/deployByRepositoryId/orgeclipsehawk-1003/org/eclipse/hawk/org.eclipse.hawk.orientdb/2.0.0/org.eclipse.hawk.orientdb-2.0.0.pom.asc
[INFO] Uploaded to ossrh: https://oss.sonatype.org:443/service/local/staging/deployByRepositoryId/orgeclipsehawk-1003/org/eclipse/hawk/org.eclipse.hawk.orientdb/2.0.0/org.eclipse.hawk.orientdb-2.0.0.pom.asc (833 B at 12 kB/s)
[INFO] Uploading to ossrh: https://oss.sonatype.org:443/service/local/staging/deployByRepositoryId/orgeclipsehawk-1003/org/eclipse/hawk/org.eclipse.hawk.greycat/2.0.0/org.eclipse.hawk.greycat-2.0.0.pom.asc
[INFO] Uploaded to ossrh: https://oss.sonatype.org:443/service/local/staging/deployByRepositoryId/orgeclipsehawk-1003/org/eclipse/hawk/org.eclipse.hawk.greycat/2.0.0/org.eclipse.hawk.greycat-2.0.0.pom.asc (833 B at 12 kB/s)
[INFO] Uploading to ossrh: https://oss.sonatype.org:443/service/local/staging/deployByRepositoryId/orgeclipsehawk-1003/org/eclipse/hawk/org.eclipse.hawk.epsilon/2.0.0/org.eclipse.hawk.epsilon-2.0.0.jar
[INFO] Uploaded to ossrh: https://oss.sonatype.org:443/service/local/staging/deployByRepositoryId/orgeclipsehawk-1003/org/eclipse/hawk/org.eclipse.hawk.epsilon/2.0.0/org.eclipse.hawk.epsilon-2.0.0.jar (89 kB at 424 kB/s)
[INFO] Uploading to ossrh: https://oss.sonatype.org:443/service/local/staging/deployByRepositoryId/orgeclipsehawk-1003/org/eclipse/hawk/org.eclipse.hawk.epsilon/2.0.0/org.eclipse.hawk.epsilon-2.0.0.pom
[INFO] Uploaded to ossrh: https://oss.sonatype.org:443/service/local/staging/deployByRepositoryId/orgeclipsehawk-1003/org/eclipse/hawk/org.eclipse.hawk.epsilon/2.0.0/org.eclipse.hawk.epsilon-2.0.0.pom (1.4 kB at 7.0 kB/s)
[INFO] Uploading to ossrh: https://oss.sonatype.org:443/service/local/staging/deployByRepositoryId/orgeclipsehawk-1003/org/eclipse/hawk/service/org.eclipse.hawk.service.api/2.0.0/org.eclipse.hawk.service.api-2.0.0.jar.asc
[INFO] Uploaded to ossrh: https://oss.sonatype.org:443/service/local/staging/deployByRepositoryId/orgeclipsehawk-1003/org/eclipse/hawk/service/org.eclipse.hawk.service.api/2.0.0/org.eclipse.hawk.service.api-2.0.0.jar.asc (833 B at 12 kB/s)
[INFO]  * Upload of locally staged artifacts finished.
[INFO]  * Closing staging repository with ID "orgeclipsehawk-1003".

Waiting for operation to complete...
.........................

[ERROR] Rule failure while trying to close staging repository with ID "orgeclipsehawk-1003".
[ERROR] 
[ERROR] Nexus Staging Rules Failure Report
[ERROR] ==================================
[ERROR] 
[ERROR] Repository "orgeclipsehawk-1003" failures
[ERROR]   Rule "sources-staging" failures
[ERROR]     * Missing: no sources jar found in folder '/org/eclipse/hawk/org.eclipse.hawk.emf/2.0.0'
[ERROR]     * Missing: no sources jar found in folder '/org/eclipse/hawk/org.eclipse.hawk.core/2.0.0'
[ERROR]     * Missing: no sources jar found in folder '/org/eclipse/hawk/org.eclipse.hawk.jgit/2.0.0'
[ERROR]     * Missing: no sources jar found in folder '/org/eclipse/hawk/service/org.eclipse.hawk.service.api/2.0.0'
[ERROR]     * Missing: no sources jar found in folder '/org/eclipse/hawk/service/org.eclipse.hawk.service.artemis/2.0.0'
[ERROR]     * Missing: no sources jar found in folder '/org/eclipse/hawk/service/org.eclipse.hawk.service.emf/2.0.0'
[ERROR]     * Missing: no sources jar found in folder '/org/eclipse/hawk/org.eclipse.hawk.http/2.0.0'
[ERROR]     * Missing: no sources jar found in folder '/org/eclipse/hawk/org.eclipse.hawk.graph/2.0.0'
[ERROR]     * Missing: no sources jar found in folder '/org/eclipse/hawk/org.eclipse.hawk.epsilon/2.0.0'
[ERROR]     * Missing: no sources jar found in folder '/org/eclipse/hawk/org.eclipse.hawk.orientdb/2.0.0'
[ERROR]     * Missing: no sources jar found in folder '/org/eclipse/hawk/org.eclipse.hawk.greycat/2.0.0'
[ERROR]     * Missing: no sources jar found in folder '/org/eclipse/hawk/org.eclipse.hawk.timeaware/2.0.0'
[ERROR]     * Missing: no sources jar found in folder '/org/eclipse/hawk/org.eclipse.hawk.emfresource/2.0.0'
[ERROR]     * Missing: no sources jar found in folder '/org/eclipse/hawk/org.eclipse.hawk.localfolder/2.0.0'
[ERROR]     * Missing: no sources jar found in folder '/org/eclipse/hawk/org.eclipse.hawk.modelio.exml/2.0.0'
[ERROR]   Rule "pom-staging" failures
[ERROR]     * Invalid POM: /org/eclipse/hawk/mondo-hawk-plain/2.0.0/mondo-hawk-plain-2.0.0.pom: Project name missing, Project description missing, Project URL missing, License information missing, SCM URL missing, Developer information missing
[ERROR]   Rule "javadoc-staging" failures
[ERROR]     * Missing: no javadoc jar found in folder '/org/eclipse/hawk/org.eclipse.hawk.emf/2.0.0'
[ERROR]     * Missing: no javadoc jar found in folder '/org/eclipse/hawk/org.eclipse.hawk.core/2.0.0'
[ERROR]     * Missing: no javadoc jar found in folder '/org/eclipse/hawk/org.eclipse.hawk.jgit/2.0.0'
[ERROR]     * Missing: no javadoc jar found in folder '/org/eclipse/hawk/service/org.eclipse.hawk.service.api/2.0.0'
[ERROR]     * Missing: no javadoc jar found in folder '/org/eclipse/hawk/service/org.eclipse.hawk.service.artemis/2.0.0'
[ERROR]     * Missing: no javadoc jar found in folder '/org/eclipse/hawk/service/org.eclipse.hawk.service.emf/2.0.0'
[ERROR]     * Missing: no javadoc jar found in folder '/org/eclipse/hawk/org.eclipse.hawk.http/2.0.0'
[ERROR]     * Missing: no javadoc jar found in folder '/org/eclipse/hawk/org.eclipse.hawk.graph/2.0.0'
[ERROR]     * Missing: no javadoc jar found in folder '/org/eclipse/hawk/org.eclipse.hawk.epsilon/2.0.0'
[ERROR]     * Missing: no javadoc jar found in folder '/org/eclipse/hawk/org.eclipse.hawk.orientdb/2.0.0'
[ERROR]     * Missing: no javadoc jar found in folder '/org/eclipse/hawk/org.eclipse.hawk.greycat/2.0.0'
[ERROR]     * Missing: no javadoc jar found in folder '/org/eclipse/hawk/org.eclipse.hawk.timeaware/2.0.0'
[ERROR]     * Missing: no javadoc jar found in folder '/org/eclipse/hawk/org.eclipse.hawk.emfresource/2.0.0'
[ERROR]     * Missing: no javadoc jar found in folder '/org/eclipse/hawk/org.eclipse.hawk.localfolder/2.0.0'
[ERROR]     * Missing: no javadoc jar found in folder '/org/eclipse/hawk/org.eclipse.hawk.modelio.exml/2.0.0'
[ERROR] 
[ERROR] 
[ERROR] Cleaning up local stage directory after a Rule failure during close of staging repositories: [orgeclipsehawk-1003]
[ERROR]  * Deleting context 442bf4071bd05.properties
[ERROR] Cleaning up remote stage repositories after a Rule failure during close of staging repositories: [orgeclipsehawk-1003]
[ERROR]  * Dropping failed staging repository with ID "orgeclipsehawk-1003" (Rule failure during close of staging repositories: [orgeclipsehawk-1003]).

Waiting for operation to complete...
.....

[ERROR] Remote staging finished with a failure: Staging rules failure!
[INFO] ------------------------------------------------------------------------
[INFO] Reactor Summary for mondo-hawk-plain 2.0.0:
[INFO] 
[INFO] mondo-hawk-plain ................................... SUCCESS [  2.843 s]
[INFO] org.eclipse.hawk.core .............................. SUCCESS [  3.451 s]
[INFO] org.eclipse.hawk.graph ............................. SUCCESS [  4.175 s]
[INFO] org.eclipse.hawk.epsilon ........................... SUCCESS [  2.366 s]
[INFO] org.eclipse.hawk.emf ............................... SUCCESS [  2.023 s]
[INFO] org.eclipse.hawk.emfresource ....................... SUCCESS [  2.199 s]
[INFO] org.eclipse.hawk.http .............................. SUCCESS [  2.087 s]
[INFO] org.eclipse.hawk.jgit .............................. SUCCESS [  2.103 s]
[INFO] org.eclipse.hawk.localfolder ....................... SUCCESS [  2.096 s]
[INFO] org.eclipse.hawk.modelio.exml ...................... SUCCESS [  2.136 s]
[INFO] org.eclipse.hawk.orientdb .......................... SUCCESS [  2.245 s]
[INFO] org.eclipse.hawk.timeaware ......................... SUCCESS [  2.143 s]
[INFO] org.eclipse.hawk.greycat ........................... SUCCESS [  3.877 s]
[INFO] org.eclipse.hawk.service.artemis ................... SUCCESS [  2.232 s]
[INFO] org.eclipse.hawk.service.api ....................... SUCCESS [  4.322 s]
[INFO] org.eclipse.hawk.service.emf ....................... FAILURE [02:29 min]
[INFO] ------------------------------------------------------------------------
[INFO] BUILD FAILURE
[INFO] ------------------------------------------------------------------------
[INFO] Total time:  03:20 min
[INFO] Finished at: 2020-06-04T21:48:54Z
[INFO] ------------------------------------------------------------------------
[ERROR] Failed to execute goal org.sonatype.plugins:nexus-staging-maven-plugin:1.6.8:deploy (injected-nexus-deploy) on project org.eclipse.hawk.service.emf: Remote staging failed: Staging rules failure! -> [Help 1]
[ERROR] 
[ERROR] To see the full stack trace of the errors, re-run Maven with the -e switch.
[ERROR] Re-run Maven using the -X switch to enable full debug logging.
[ERROR] 
[ERROR] For more information about the errors and possible solutions, please read the following articles:
[ERROR] [Help 1] http://cwiki.apache.org/confluence/display/MAVEN/MojoExecutionException
[ERROR] 
[ERROR] After correcting the problems, you can resume the build with the command
[ERROR]   mvn <args> -rf :org.eclipse.hawk.service.emf
[Pipeline] }
Lock released on resource [ossrh]
[Pipeline] // lock
[Pipeline] }
[Pipeline] // withCredentials
[Pipeline] }
[Pipeline] // container
[Pipeline] }
[Pipeline] // stage
[Pipeline] stage
[Pipeline] { (Downloads)
Stage "Downloads" skipped due to earlier failure(s)
[Pipeline] }
[Pipeline] // stage
[Pipeline] stage
[Pipeline] { (Declarative: Post Actions)
[Pipeline] emailext
An attempt to send an e-mail to empty list of recipients, ignored.
[Pipeline] slackSend
Slack Send Pipeline step running, values are - baseUrl: <empty>, teamDomain: hawk-developers, channel: #ci-notifications, color: #FF0000, botUser: true, tokenCredentialId: slack-token, notifyCommitters: false, iconEmoji: <empty>, username: <empty>, timestamp: <empty>
[Pipeline] }
[Pipeline] // stage
[Pipeline] }
[Pipeline] // withEnv
[Pipeline] }
[Pipeline] // node
[Pipeline] }
[Pipeline] // podTemplate
[Pipeline] End of Pipeline
ERROR: script returned exit code 1
Finished: FAILURE