Console Output

Started by user Vladimir Piskarev
Running as Vladimir Piskarev
Agent centos-7-zx6wf is provisioned from template centos-7
---
apiVersion: "v1"
kind: "Pod"
metadata:
  annotations: {}
  labels:
    jenkins: "slave"
    jenkins/label-digest: "55a177a28a71a1957f582df488f25d8c2f70df30"
    jenkins/label: "migration_jipp-migration_centos-7"
  name: "centos-7-zx6wf"
  namespace: "handly"
spec:
  containers:
  - env:
    - name: "JENKINS_SECRET"
      value: "********"
    - name: "JENKINS_TUNNEL"
      value: "jenkins-discovery.handly.svc.cluster.local:50000"
    - name: "JENKINS_AGENT_NAME"
      value: "centos-7-zx6wf"
    - name: "JENKINS_REMOTING_JAVA_OPTS"
      value: "-showversion -XshowSettings:vm -Xmx256m -Dorg.jenkinsci.remoting.engine.JnlpProtocol3.disabled=true\
        \ -Dorg.jenkinsci.plugins.gitclient.CliGitAPIImpl.useSETSID=true"
    - name: "JAVA_TOOL_OPTIONS"
      value: ""
    - name: "_JAVA_OPTIONS"
      value: ""
    - name: "OPENJ9_JAVA_OPTIONS"
      value: "-XX:+IgnoreUnrecognizedVMOptions -XX:+IdleTuningCompactOnIdle -XX:+IdleTuningGcOnIdle"
    - name: "JENKINS_NAME"
      value: "centos-7-zx6wf"
    - name: "JENKINS_AGENT_WORKDIR"
      value: "/home/jenkins/agent"
    - name: "JENKINS_URL"
      value: "http://jenkins-ui.handly.svc.cluster.local/handly/"
    image: "docker.io/eclipsecbi/jiro-agent-centos-7:remoting-4.13"
    imagePullPolicy: "Always"
    name: "jnlp"
    resources:
      limits:
        cpu: "2000m"
        memory: "4096Mi"
      requests:
        cpu: "1000m"
        memory: "4096Mi"
    tty: true
    volumeMounts:
    - mountPath: "/home/jenkins/.m2/toolchains.xml"
      name: "m2-dir"
      readOnly: true
      subPath: "toolchains.xml"
    - mountPath: "/home/jenkins/.mavenrc"
      name: "m2-dir"
      readOnly: true
      subPath: ".mavenrc"
    - mountPath: "/opt/tools"
      name: "volume-0"
      readOnly: false
    - mountPath: "/home/jenkins"
      name: "volume-2"
      readOnly: false
    - mountPath: "/home/jenkins/.m2/repository"
      name: "volume-3"
      readOnly: false
    - mountPath: "/home/jenkins/.m2/settings-security.xml"
      name: "m2-secret-dir"
      readOnly: true
      subPath: "settings-security.xml"
    - mountPath: "/home/jenkins/.m2/wrapper"
      name: "volume-4"
      readOnly: false
    - mountPath: "/home/jenkins/.m2/settings.xml"
      name: "m2-secret-dir"
      readOnly: true
      subPath: "settings.xml"
    - mountPath: "/home/jenkins/.ssh"
      name: "volume-1"
      readOnly: false
      subPath: ""
    - mountPath: "/home/jenkins/agent"
      name: "workspace-volume"
      readOnly: false
    workingDir: "/home/jenkins/agent"
  nodeSelector:
    kubernetes.io/os: "linux"
  restartPolicy: "Never"
  volumes:
  - name: "volume-0"
    persistentVolumeClaim:
      claimName: "tools-claim-jiro-handly"
      readOnly: true
  - name: "m2-secret-dir"
    secret:
      secretName: "m2-secret-dir"
  - emptyDir:
      medium: ""
    name: "volume-2"
  - configMap:
      name: "m2-dir"
    name: "m2-dir"
  - configMap:
      name: "known-hosts"
    name: "volume-1"
  - emptyDir:
      medium: ""
    name: "workspace-volume"
  - emptyDir:
      medium: ""
    name: "volume-4"
  - emptyDir:
      medium: ""
    name: "volume-3"

Building remotely on centos-7-zx6wf (centos-7 jipp-migration migration) in workspace /home/jenkins/agent/workspace/1.7.x
The recommended git tool is: NONE
No credentials specified
Cloning the remote Git repository
Cloning repository https://git.eclipse.org/r/handly/org.eclipse.handly
 > git init /home/jenkins/agent/workspace/1.7.x # timeout=10
Fetching upstream changes from https://git.eclipse.org/r/handly/org.eclipse.handly
 > git --version # timeout=10
 > git --version # 'git version 2.24.4'
 > git fetch --tags --force --progress -- https://git.eclipse.org/r/handly/org.eclipse.handly +refs/heads/*:refs/remotes/origin/* # timeout=10
 > git config remote.origin.url https://git.eclipse.org/r/handly/org.eclipse.handly # timeout=10
 > git config --add remote.origin.fetch +refs/heads/*:refs/remotes/origin/* # timeout=10
Avoid second fetch
 > git rev-parse origin/master^{commit} # timeout=10
Checking out Revision ab1415e5359a1bdd630a5c29846fc558db6b2cfa (origin/master)
 > git config core.sparsecheckout # timeout=10
 > git checkout -f ab1415e5359a1bdd630a5c29846fc558db6b2cfa # timeout=10
Commit message: "Bug 580150 - Upgrade latest target to 2022-06"
 > git rev-list --no-walk ab1415e5359a1bdd630a5c29846fc558db6b2cfa # timeout=10
$ pkill Xvnc
$ pkill Xrealvnc
$ sh -c "rm -f /tmp/.X*-lock /tmp/.X11-unix/X*"
[1.7.x] $ Xvnc -help
Starting xvnc
[1.7.x] $ Xvnc :23 -geometry 1024x768 -depth 24 -ac -SecurityTypes none -noreset

Xvnc TigerVNC 1.8.0 - built Nov 16 2020 16:47:50
Copyright (C) 1999-2017 TigerVNC Team and many others (see README.txt)
See http://www.tigervnc.org for information on TigerVNC.
Underlying X server release 12004000, The X.Org Foundation


Tue Jun 14 18:26:06 2022
 vncext:      VNC extension running!
 vncext:      Listening for VNC connections on all interface(s), port 5923
 vncext:      created VNC server for screen 0
[1.7.x] $ /bin/sh -xe /tmp/jenkins3128936428014286029.sh
+ rm -rf build
+ mkdir build
+ mkdir build/packages
+ mkdir build/tests
[1.7.x] $ /opt/tools/apache-maven/latest/bin/mvn -f releng/pom.xml -Dmaven.repo.local=/home/jenkins/agent/workspace/1.7.x/.maven/repo clean verify -Psign -Pbree-libs -Pjavadoc -B
Apache Maven 3.8.5 (3599d3414f046de2324203b78ddcf9b5e4388aa0)
Maven home: /opt/tools/apache-maven/latest
Java version: 11.0.2, vendor: Oracle Corporation, runtime: /opt/tools/java/openjdk/jdk-11/11.0.2+9
Default locale: en_US, platform encoding: UTF-8
OS name: "linux", version: "5.14.14-200.fc34.x86_64", arch: "amd64", family: "unix"
[INFO] Scanning for projects...
[WARNING] No explicit target runtime environment configuration. Build is platform dependent.
[WARNING] No explicit target runtime environment configuration. Build is platform dependent.
[WARNING] No explicit target runtime environment configuration. Build is platform dependent.
[WARNING] No explicit target runtime environment configuration. Build is platform dependent.
[WARNING] No explicit target runtime environment configuration. Build is platform dependent.
[WARNING] No explicit target runtime environment configuration. Build is platform dependent.
[WARNING] No explicit target runtime environment configuration. Build is platform dependent.
[WARNING] No explicit target runtime environment configuration. Build is platform dependent.
[WARNING] No explicit target runtime environment configuration. Build is platform dependent.
[WARNING] No explicit target runtime environment configuration. Build is platform dependent.
[WARNING] No explicit target runtime environment configuration. Build is platform dependent.
[WARNING] No explicit target runtime environment configuration. Build is platform dependent.
[WARNING] No explicit target runtime environment configuration. Build is platform dependent.
[WARNING] No explicit target runtime environment configuration. Build is platform dependent.
[WARNING] No explicit target runtime environment configuration. Build is platform dependent.
[WARNING] No explicit target runtime environment configuration. Build is platform dependent.
[WARNING] No explicit target runtime environment configuration. Build is platform dependent.
[WARNING] No explicit target runtime environment configuration. Build is platform dependent.
[WARNING] No explicit target runtime environment configuration. Build is platform dependent.
[WARNING] No explicit target runtime environment configuration. Build is platform dependent.
[WARNING] No explicit target runtime environment configuration. Build is platform dependent.
[WARNING] No explicit target runtime environment configuration. Build is platform dependent.
[INFO] Computing target platform for MavenProject: org.eclipse.handly.bundles:org.eclipse.handly:1.7.0-SNAPSHOT @ /home/jenkins/agent/workspace/1.7.x/org.eclipse.handly/pom.xml
[INFO] Resolving dependencies of MavenProject: org.eclipse.handly.bundles:org.eclipse.handly:1.7.0-SNAPSHOT @ /home/jenkins/agent/workspace/1.7.x/org.eclipse.handly/pom.xml
[INFO] Resolving class path of MavenProject: org.eclipse.handly.bundles:org.eclipse.handly:1.7.0-SNAPSHOT @ /home/jenkins/agent/workspace/1.7.x/org.eclipse.handly/pom.xml
[INFO] Fetching 202206151000&countryCode=us&timeZone=0&format=xml from https://www.eclipse.org/downloads/download.php?format=xml&file=/releases/2022-06/ (63B)
[INFO] Fetching com.google.guava_30.1.0.v20210127-2300.jar from http://download.eclipse.org/releases/2022-06/202206151000/plugins/ (2.89MB)
[INFO] Fetching com.google.inject_5.0.1.v20210324-2015.jar from http://download.eclipse.org/releases/2022-06/202206151000/plugins/ (802.8kB)
[INFO] Fetching javax.inject_1.0.0.v20220405-0441.jar from http://download.eclipse.org/releases/2022-06/202206151000/plugins/ (32.41kB)
[INFO] Fetching org.aopalliance_1.0.0.v20220404-1927.jar from http://download.eclipse.org/releases/2022-06/202206151000/plugins/ (14.17kB)
[INFO] Fetching com.ibm.icu_67.1.0.v20200706-1749.jar from http://download.eclipse.org/releases/2022-06/202206151000/plugins/ (12.94MB)
[INFO] Fetching com.sun.jna_5.8.0.v20210503-0343.jar from http://download.eclipse.org/releases/2022-06/202206151000/plugins/ (1.68MB)
[INFO] Fetching com.sun.jna.platform_5.8.0.v20210406-1004.jar from http://download.eclipse.org/releases/2022-06/202206151000/plugins/ (1.41MB)
[INFO] Fetching javax.annotation_1.3.5.v20200909-1856.jar from http://download.eclipse.org/releases/2022-06/202206151000/plugins/ (46.27kB)
[INFO] Fetching org.eclipse.osgi_3.18.0.v20220516-2155.jar from http://download.eclipse.org/releases/2022-06/202206151000/plugins/ (1.46MB)
[INFO] Fetching org.apache.batik.constants_1.14.0.v20210324-0332.jar from http://download.eclipse.org/releases/2022-06/202206151000/plugins/ (20.34kB)
[INFO] Fetching org.apache.batik.css_1.14.0.v20210324-0332.jar from http://download.eclipse.org/releases/2022-06/202206151000/plugins/ (353.59kB)
[INFO] Fetching org.apache.batik.util_1.14.0.v20210324-0332.jar from http://download.eclipse.org/releases/2022-06/202206151000/plugins/ (144.34kB)
[INFO] Fetching org.apache.batik.i18n_1.14.0.v20210324-0332.jar from http://download.eclipse.org/releases/2022-06/202206151000/plugins/ (23.5kB)
[INFO] Fetching org.apache.xmlgraphics_2.6.0.v20210409-0748.jar from http://download.eclipse.org/releases/2022-06/202206151000/plugins/ (703.81kB)
[INFO] Fetching org.w3c.dom.svg_1.1.0.v201011041433.jar from http://download.eclipse.org/releases/2022-06/202206151000/plugins/ (95.26kB)
[INFO] Fetching org.w3c.dom.events_3.0.0.draft20060413_v201105210656.jar from http://download.eclipse.org/releases/2022-06/202206151000/plugins/ (15.35kB)
[INFO] Fetching org.w3c.css.sac_1.3.1.v200903091627.jar from http://download.eclipse.org/releases/2022-06/202206151000/plugins/ (35.59kB)
[INFO] Fetching org.apache.commons.io_2.8.0.v20210415-0900.jar from http://download.eclipse.org/releases/2022-06/202206151000/plugins/ (302.53kB)
[INFO] Fetching org.apache.commons.logging_1.2.0.v20180409-1502.jar from http://download.eclipse.org/releases/2022-06/202206151000/plugins/ (71.45kB)
[INFO] Fetching org.apache.felix.scr_2.1.24.v20200924-1939.jar from http://download.eclipse.org/releases/2022-06/202206151000/plugins/ (411.93kB)
[INFO] Fetching org.eclipse.osgi.services_3.10.200.v20210723-0643.jar from http://download.eclipse.org/releases/2022-06/202206151000/plugins/ (126.4kB)
[INFO] Fetching org.osgi.util.promise_1.2.0.202109301733.jar from http://download.eclipse.org/releases/2022-06/202206151000/plugins/ (81.45kB)
[INFO] Fetching org.eclipse.core.commands_3.10.200.v20220512-0851.jar from http://download.eclipse.org/releases/2022-06/202206151000/plugins/ (114.56kB)
[INFO] Fetching org.eclipse.equinox.common_3.16.100.v20220315-2327.jar from http://download.eclipse.org/releases/2022-06/202206151000/plugins/ (144.55kB)
[INFO] Fetching org.eclipse.core.contenttype_3.8.100.v20210910-0640.jar from http://download.eclipse.org/releases/2022-06/202206151000/plugins/ (100.02kB)
[INFO] Fetching org.eclipse.equinox.preferences_3.10.0.v20220503-1634.jar from http://download.eclipse.org/releases/2022-06/202206151000/plugins/ (133.99kB)
[INFO] Fetching org.eclipse.equinox.registry_3.11.100.v20211021-1418.jar from http://download.eclipse.org/releases/2022-06/202206151000/plugins/ (194.4kB)
[INFO] Fetching org.eclipse.core.databinding_1.11.0.v20220118-1028.jar from http://download.eclipse.org/releases/2022-06/202206151000/plugins/ (287.81kB)
[INFO] Fetching org.eclipse.core.databinding.observable_1.12.0.v20211231-1006.jar from http://download.eclipse.org/releases/2022-06/202206151000/plugins/ (313kB)
[INFO] Fetching org.eclipse.core.databinding.property_1.9.0.v20210619-1129.jar from http://download.eclipse.org/releases/2022-06/202206151000/plugins/ (163.08kB)
[INFO] Fetching org.eclipse.core.expressions_3.8.100.v20210910-0640.jar from http://download.eclipse.org/releases/2022-06/202206151000/plugins/ (92.12kB)
[INFO] Fetching org.eclipse.core.runtime_3.25.0.v20220506-1157.jar from http://download.eclipse.org/releases/2022-06/202206151000/plugins/ (71.87kB)
[INFO] Fetching org.eclipse.core.filebuffers_3.7.200.v20220202-1008.jar from http://download.eclipse.org/releases/2022-06/202206151000/plugins/ (115.6kB)
[INFO] Fetching org.eclipse.text_3.12.100.v20220506-1404.jar from http://download.eclipse.org/releases/2022-06/202206151000/plugins/ (293.55kB)
[INFO] Fetching org.eclipse.core.filesystem_1.9.400.v20220419-0658.jar from http://download.eclipse.org/releases/2022-06/202206151000/plugins/ (69.85kB)
[INFO] Fetching org.eclipse.core.jobs_3.13.0.v20220512-1935.jar from http://download.eclipse.org/releases/2022-06/202206151000/plugins/ (109.25kB)
[INFO] Fetching org.eclipse.core.resources_3.17.0.v20220517-0751.jar from http://download.eclipse.org/releases/2022-06/202206151000/plugins/ (891.43kB)
[INFO] Fetching org.eclipse.equinox.app_1.6.100.v20211021-1418.jar from http://download.eclipse.org/releases/2022-06/202206151000/plugins/ (89.14kB)
[INFO] Fetching org.eclipse.e4.core.commands_1.0.100.v20211204-1536.jar from http://download.eclipse.org/releases/2022-06/202206151000/plugins/ (25.92kB)
[INFO] Fetching org.eclipse.e4.core.di_1.8.200.v20220512-1957.jar from http://download.eclipse.org/releases/2022-06/202206151000/plugins/ (52.47kB)
[INFO] Fetching org.eclipse.e4.core.contexts_1.10.0.v20220430-0424.jar from http://download.eclipse.org/releases/2022-06/202206151000/plugins/ (55.58kB)
[INFO] Fetching org.eclipse.e4.core.services_2.3.200.v20220513-1235.jar from http://download.eclipse.org/releases/2022-06/202206151000/plugins/ (69.65kB)
[INFO] Fetching org.eclipse.e4.core.di.annotations_1.7.100.v20210910-0640.jar from http://download.eclipse.org/releases/2022-06/202206151000/plugins/ (12kB)
[INFO] Fetching org.eclipse.e4.core.di.extensions_0.17.100.v20210910-0640.jar from http://download.eclipse.org/releases/2022-06/202206151000/plugins/ (11.14kB)
[INFO] Fetching org.eclipse.e4.core.di.extensions.supplier_0.16.300.v20220503-2248.jar from http://download.eclipse.org/releases/2022-06/202206151000/plugins/ (40.48kB)
[INFO] Fetching org.osgi.service.prefs_1.1.2.202109301733.jar from http://download.eclipse.org/releases/2022-06/202206151000/plugins/ (19.69kB)
[INFO] Fetching org.eclipse.e4.emf.xpath_0.3.0.v20210722-1426.jar from http://download.eclipse.org/releases/2022-06/202206151000/plugins/ (51.03kB)
[INFO] Fetching org.apache.commons.jxpath_1.3.0.v200911051830.jar from http://download.eclipse.org/releases/2022-06/202206151000/plugins/ (317.8kB)
[INFO] Fetching org.eclipse.emf.ecore_2.27.0.v20220426-0617.jar from http://download.eclipse.org/releases/2022-06/202206151000/plugins/ (1.26MB)
[INFO] Fetching org.eclipse.e4.ui.bindings_0.13.100.v20210722-1426.jar from http://download.eclipse.org/releases/2022-06/202206151000/plugins/ (45.85kB)
[INFO] Fetching org.eclipse.swt_3.120.0.v20220530-1036.jar from http://download.eclipse.org/releases/2022-06/202206151000/plugins/ (18.79kB)
[INFO] Fetching org.eclipse.e4.ui.services_1.5.0.v20210115-1333.jar from http://download.eclipse.org/releases/2022-06/202206151000/plugins/ (24.31kB)
[INFO] Fetching org.eclipse.jface_3.26.0.v20220513-0449.jar from http://download.eclipse.org/releases/2022-06/202206151000/plugins/ (1.11MB)
[INFO] Fetching org.eclipse.e4.ui.css.core_0.13.200.v20211022-1402.jar from http://download.eclipse.org/releases/2022-06/202206151000/plugins/ (213.89kB)
[INFO] Fetching org.eclipse.e4.ui.css.swt_0.14.500.v20220511-1639.jar from http://download.eclipse.org/releases/2022-06/202206151000/plugins/ (201.76kB)
[INFO] Fetching org.eclipse.e4.ui.css.swt.theme_0.13.100.v20220310-1056.jar from http://download.eclipse.org/releases/2022-06/202206151000/plugins/ (28.11kB)
[INFO] Fetching org.eclipse.e4.ui.di_1.4.0.v20210621-1133.jar from http://download.eclipse.org/releases/2022-06/202206151000/plugins/ (16.41kB)
[INFO] Fetching org.eclipse.e4.ui.dialogs_1.3.200.v20211210-1500.jar from http://download.eclipse.org/releases/2022-06/202206151000/plugins/ (56.73kB)
[INFO] Fetching org.eclipse.e4.ui.model.workbench_2.2.100.v20220331-0744.jar from http://download.eclipse.org/releases/2022-06/202206151000/plugins/ (395.31kB)
[INFO] Fetching org.eclipse.equinox.event_1.6.100.v20211021-1418.jar from http://download.eclipse.org/releases/2022-06/202206151000/plugins/ (33.33kB)
[INFO] Fetching org.eclipse.e4.ui.widgets_1.3.0.v20210621-1136.jar from http://download.eclipse.org/releases/2022-06/202206151000/plugins/ (13.3kB)
[INFO] Fetching org.eclipse.e4.ui.workbench_1.13.100.v20211019-0756.jar from http://download.eclipse.org/releases/2022-06/202206151000/plugins/ (260.38kB)
[INFO] Fetching org.eclipse.emf.ecore.change_2.14.0.v20190528-0725.jar from http://download.eclipse.org/releases/2022-06/202206151000/plugins/ (89.35kB)
[INFO] Fetching org.eclipse.emf.ecore.xmi_2.16.0.v20190528-0725.jar from http://download.eclipse.org/releases/2022-06/202206151000/plugins/ (231.36kB)
[INFO] Fetching org.eclipse.e4.ui.workbench.addons.swt_1.4.400.v20211102-0453.jar from http://download.eclipse.org/releases/2022-06/202206151000/plugins/ (118.14kB)
[INFO] Fetching org.eclipse.e4.ui.workbench.renderers.swt_0.15.500.v20220511-1638.jar from http://download.eclipse.org/releases/2022-06/202206151000/plugins/ (250.33kB)
[INFO] Fetching org.eclipse.e4.ui.workbench.swt_0.16.500.v20220506-1520.jar from http://download.eclipse.org/releases/2022-06/202206151000/plugins/ (147.64kB)
[INFO] Fetching org.eclipse.jface.databinding_1.13.0.v20210619-1146.jar from http://download.eclipse.org/releases/2022-06/202206151000/plugins/ (295.36kB)
[INFO] Fetching org.eclipse.e4.ui.workbench3_0.16.0.v20210619-0956.jar from http://download.eclipse.org/releases/2022-06/202206151000/plugins/ (21.08kB)
[INFO] Fetching org.eclipse.urischeme_1.2.100.v20211001-1648.jar from http://download.eclipse.org/releases/2022-06/202206151000/plugins/ (51.9kB)
[INFO] Fetching org.eclipse.emf.common_2.25.0.v20220325-0806.jar from http://download.eclipse.org/releases/2022-06/202206151000/plugins/ (369.38kB)
[INFO] Fetching org.eclipse.ltk.core.refactoring_3.12.200.v20220502-1514.jar from http://download.eclipse.org/releases/2022-06/202206151000/plugins/ (341.31kB)
[INFO] Fetching org.eclipse.ui_3.201.0.v20220124-1108.jar from http://download.eclipse.org/releases/2022-06/202206151000/plugins/ (432.55kB)
[INFO] Fetching org.eclipse.help_3.9.100.v20210721-0601.jar from http://download.eclipse.org/releases/2022-06/202206151000/plugins/ (270.25kB)
[INFO] Fetching org.osgi.util.function_1.2.0.202109301733.jar from http://download.eclipse.org/releases/2022-06/202206151000/plugins/ (23.09kB)
[INFO] Fetching org.eclipse.swt.gtk.linux.x86_64_3.120.0.v20220530-1036.jar from http://download.eclipse.org/releases/2022-06/202206151000/plugins/ (2.07MB)
[INFO] Fetching org.eclipse.ui.workbench_3.125.100.v20220524-1304.jar from http://download.eclipse.org/releases/2022-06/202206151000/plugins/ (3.49MB)
[INFO] Fetching org.w3c.dom.smil_1.0.1.v200903091627.jar from http://download.eclipse.org/releases/2022-06/202206151000/plugins/ (21.23kB)
[INFO] Computing target platform for MavenProject: org.eclipse.handly.bundles:org.eclipse.handly.tests:1.7.0-SNAPSHOT @ /home/jenkins/agent/workspace/1.7.x/org.eclipse.handly.tests/pom.xml
[INFO] Resolving dependencies of MavenProject: org.eclipse.handly.bundles:org.eclipse.handly.tests:1.7.0-SNAPSHOT @ /home/jenkins/agent/workspace/1.7.x/org.eclipse.handly.tests/pom.xml
[INFO] Resolving class path of MavenProject: org.eclipse.handly.bundles:org.eclipse.handly.tests:1.7.0-SNAPSHOT @ /home/jenkins/agent/workspace/1.7.x/org.eclipse.handly.tests/pom.xml
[INFO] Fetching org.bouncycastle.bcpg_1.70.0.v20220507-1208.jar from http://download.eclipse.org/releases/2022-06/202206151000/plugins/ (360.94kB)
[INFO] Fetching org.bouncycastle.bcprov_1.70.0.v20220507-1208.jar from http://download.eclipse.org/releases/2022-06/202206151000/plugins/ (5.58MB)
[INFO] Fetching org.eclipse.compare_3.8.400.v20220420-1133.jar from http://download.eclipse.org/releases/2022-06/202206151000/plugins/ (804.82kB)
[INFO] Fetching org.eclipse.jface.text_3.20.100.v20220516-0819.jar from http://download.eclipse.org/releases/2022-06/202206151000/plugins/ (1.03MB)
[INFO] Fetching org.eclipse.ui.ide_3.19.0.v20220511-1638.jar from http://download.eclipse.org/releases/2022-06/202206151000/plugins/ (2.41MB)
[INFO] Fetching org.eclipse.ui.views_3.11.100.v20210816-0811.jar from http://download.eclipse.org/releases/2022-06/202206151000/plugins/ (105.57kB)
[INFO] Fetching org.eclipse.ui.workbench.texteditor_3.16.500.v20220331-0848.jar from http://download.eclipse.org/releases/2022-06/202206151000/plugins/ (688.72kB)
[INFO] Fetching org.eclipse.ui.editors_3.14.300.v20210913-0815.jar from http://download.eclipse.org/releases/2022-06/202206151000/plugins/ (618.79kB)
[INFO] Fetching org.eclipse.ui.forms_3.11.300.v20211022-1451.jar from http://download.eclipse.org/releases/2022-06/202206151000/plugins/ (330.12kB)
[INFO] Fetching org.eclipse.compare.core_3.7.0.v20220513-0551.jar from http://download.eclipse.org/releases/2022-06/202206151000/plugins/ (67.45kB)
[INFO] Fetching org.eclipse.core.net_1.3.1200.v20220312-1450.jar from http://download.eclipse.org/releases/2022-06/202206151000/plugins/ (47.62kB)
[INFO] Fetching org.eclipse.equinox.security_1.3.900.v20220108-1321.jar from http://download.eclipse.org/releases/2022-06/202206151000/plugins/ (113.21kB)
[INFO] Fetching org.eclipse.e4.ui.ide_3.16.100.v20220310-1350.jar from http://download.eclipse.org/releases/2022-06/202206151000/plugins/ (11.51kB)
[INFO] Fetching org.eclipse.equinox.bidi_1.4.100.v20211021-1418.jar from http://download.eclipse.org/releases/2022-06/202206151000/plugins/ (50.74kB)
[INFO] Fetching org.eclipse.equinox.launcher_1.6.400.v20210924-0641.jar from http://download.eclipse.org/releases/2022-06/202206151000/plugins/ (52.65kB)
[INFO] Fetching org.eclipse.equinox.p2.artifact.repository_1.4.500.v20220420-1427.jar from http://download.eclipse.org/releases/2022-06/202206151000/plugins/ (169.5kB)
[INFO] Fetching org.eclipse.equinox.p2.metadata_2.6.200.v20220324-1313.jar from http://download.eclipse.org/releases/2022-06/202206151000/plugins/ (360.26kB)
[INFO] Fetching org.tukaani.xz_1.9.0.v20210624-1259.jar from http://download.eclipse.org/releases/2022-06/202206151000/plugins/ (131.39kB)
[INFO] Fetching org.eclipse.equinox.p2.core_2.9.100.v20220310-1733.jar from http://download.eclipse.org/releases/2022-06/202206151000/plugins/ (76.94kB)
[INFO] Fetching org.eclipse.equinox.p2.jarprocessor_1.2.300.v20220420-1427.jar from http://download.eclipse.org/releases/2022-06/202206151000/plugins/ (68.04kB)
[INFO] Fetching org.eclipse.equinox.p2.repository_2.6.100.v20220422-1806.jar from http://download.eclipse.org/releases/2022-06/202206151000/plugins/ (174.42kB)
[INFO] Fetching org.eclipse.equinox.p2.engine_2.7.400.v20220329-1456.jar from http://download.eclipse.org/releases/2022-06/202206151000/plugins/ (218.83kB)
[INFO] Fetching org.eclipse.equinox.p2.metadata.repository_1.4.100.v20220329-1456.jar from http://download.eclipse.org/releases/2022-06/202206151000/plugins/ (132.68kB)
[INFO] Fetching org.junit_4.13.2.v20211018-1956.jar from http://download.eclipse.org/releases/2022-06/202206151000/plugins/ (421.77kB)
[INFO] Fetching org.eclipse.ltk.ui.refactoring_3.12.100.v20220329-1353.jar from http://download.eclipse.org/releases/2022-06/202206151000/plugins/ (468.75kB)
[INFO] Fetching org.eclipse.ui.navigator_3.10.200.v20211009-1706.jar from http://download.eclipse.org/releases/2022-06/202206151000/plugins/ (423.11kB)
[INFO] Fetching org.eclipse.team.core_3.9.400.v20220511-1440.jar from http://download.eclipse.org/releases/2022-06/202206151000/plugins/ (401.02kB)
[INFO] Fetching org.eclipse.team.ui_3.9.300.v20220420-1133.jar from http://download.eclipse.org/releases/2022-06/202206151000/plugins/ (1.42MB)
[INFO] Fetching org.eclipse.ui.ide.application_1.4.400.v20220502-1523.jar from http://download.eclipse.org/releases/2022-06/202206151000/plugins/ (113.08kB)
[INFO] Fetching org.eclipse.ui.navigator.resources_3.8.400.v20220203-1803.jar from http://download.eclipse.org/releases/2022-06/202206151000/plugins/ (172.29kB)
[INFO] Fetching org.eclipse.ui.views.properties.tabbed_3.9.100.v20201223-1348.jar from http://download.eclipse.org/releases/2022-06/202206151000/plugins/ (107.15kB)
[INFO] Fetching org.hamcrest.core_1.3.0.v20180420-1519.jar from http://download.eclipse.org/releases/2022-06/202206151000/plugins/ (65.43kB)
[INFO] Computing target platform for MavenProject: org.eclipse.handly.bundles:org.eclipse.handly.ui:1.7.0-SNAPSHOT @ /home/jenkins/agent/workspace/1.7.x/org.eclipse.handly.ui/pom.xml
[INFO] Resolving dependencies of MavenProject: org.eclipse.handly.bundles:org.eclipse.handly.ui:1.7.0-SNAPSHOT @ /home/jenkins/agent/workspace/1.7.x/org.eclipse.handly.ui/pom.xml
[INFO] Resolving class path of MavenProject: org.eclipse.handly.bundles:org.eclipse.handly.ui:1.7.0-SNAPSHOT @ /home/jenkins/agent/workspace/1.7.x/org.eclipse.handly.ui/pom.xml
[INFO] Fetching org.eclipse.search_3.14.100.v20220120-1549.jar from http://download.eclipse.org/releases/2022-06/202206151000/plugins/ (489.96kB)
[INFO] Computing target platform for MavenProject: org.eclipse.handly.bundles:org.eclipse.handly.xtext:1.7.0-SNAPSHOT @ /home/jenkins/agent/workspace/1.7.x/org.eclipse.handly.xtext/pom.xml
[INFO] Resolving dependencies of MavenProject: org.eclipse.handly.bundles:org.eclipse.handly.xtext:1.7.0-SNAPSHOT @ /home/jenkins/agent/workspace/1.7.x/org.eclipse.handly.xtext/pom.xml
[INFO] Resolving class path of MavenProject: org.eclipse.handly.bundles:org.eclipse.handly.xtext:1.7.0-SNAPSHOT @ /home/jenkins/agent/workspace/1.7.x/org.eclipse.handly.xtext/pom.xml
[INFO] Computing target platform for MavenProject: org.eclipse.handly.bundles:org.eclipse.handly.xtext.ui:1.7.0-SNAPSHOT @ /home/jenkins/agent/workspace/1.7.x/org.eclipse.handly.xtext.ui/pom.xml
[INFO] Resolving dependencies of MavenProject: org.eclipse.handly.bundles:org.eclipse.handly.xtext.ui:1.7.0-SNAPSHOT @ /home/jenkins/agent/workspace/1.7.x/org.eclipse.handly.xtext.ui/pom.xml
[INFO] Resolving class path of MavenProject: org.eclipse.handly.bundles:org.eclipse.handly.xtext.ui:1.7.0-SNAPSHOT @ /home/jenkins/agent/workspace/1.7.x/org.eclipse.handly.xtext.ui/pom.xml
[INFO] Fetching io.github.classgraph_4.8.138.v20211212-1642.jar from http://download.eclipse.org/releases/2022-06/202206151000/plugins/ (590.15kB)
[INFO] Fetching org.antlr.runtime_3.2.0.v20220404-1927.jar from http://download.eclipse.org/releases/2022-06/202206151000/plugins/ (169.92kB)
[INFO] Fetching org.apache.log4j_1.2.19.v20220208-1728.jar from http://download.eclipse.org/releases/2022-06/202206151000/plugins/ (358.42kB)
[INFO] Fetching org.eclipse.core.variables_3.5.100.v20210721-1355.jar from http://download.eclipse.org/releases/2022-06/202206151000/plugins/ (35.64kB)
[INFO] Fetching org.eclipse.debug.core_3.19.100.v20220324-0630.jar from http://download.eclipse.org/releases/2022-06/202206151000/plugins/ (397.87kB)
[INFO] Fetching org.eclipse.emf.common.ui_2.20.0.v20220226-1304.jar.pack.gz from http://download.eclipse.org/releases/2022-06/202206151000/plugins/ (61.75kB)
[INFO] Fetching org.eclipse.emf.edit_2.17.0.v20220201-1551.jar from http://download.eclipse.org/releases/2022-06/202206151000/plugins/ (296.42kB)
[INFO] Fetching org.eclipse.emf.edit.ui_2.21.0.v20220226-1304.jar.pack.gz from http://download.eclipse.org/releases/2022-06/202206151000/plugins/ (110.69kB)
[INFO] Fetching org.eclipse.xtext.ui_2.27.0.v20220530-0416.jar from http://download.eclipse.org/releases/2022-06/202206151000/plugins/ (1.88MB)
[INFO] Fetching org.eclipse.xtext.common.types_2.27.0.v20220530-0402.jar from http://download.eclipse.org/releases/2022-06/202206151000/plugins/ (501.04kB)
[INFO] Fetching org.eclipse.jdt.core_3.30.0.v20220524-1333.jar from http://download.eclipse.org/releases/2022-06/202206151000/plugins/ (6.69MB)
[INFO] Fetching org.eclipse.jdt.debug_3.19.200.v20220430-1851.jar from http://download.eclipse.org/releases/2022-06/202206151000/plugins/ (910.81kB)
[INFO] Fetching org.eclipse.jdt.launching_3.19.600.v20220409-1932.jar from http://download.eclipse.org/releases/2022-06/202206151000/plugins/ (563.82kB)
[INFO] Fetching org.eclipse.xtend.lib_2.27.0.v20220530-0353.jar from http://download.eclipse.org/releases/2022-06/202206151000/plugins/ (109.91kB)
[INFO] Fetching org.eclipse.xtext.xbase.lib_2.27.0.v20220530-0353.jar from http://download.eclipse.org/releases/2022-06/202206151000/plugins/ (162.36kB)
[INFO] Fetching org.eclipse.xtend.lib.macro_2.27.0.v20220530-0353.jar from http://download.eclipse.org/releases/2022-06/202206151000/plugins/ (77.87kB)
[INFO] Fetching org.eclipse.xtext_2.27.0.v20220530-0355.jar from http://download.eclipse.org/releases/2022-06/202206151000/plugins/ (2.62MB)
[INFO] Fetching org.eclipse.xtext.util_2.27.0.v20220530-0355.jar from http://download.eclipse.org/releases/2022-06/202206151000/plugins/ (307.81kB)
[INFO] Fetching org.objectweb.asm_9.3.0.v20220409-0157.jar from http://download.eclipse.org/releases/2022-06/202206151000/plugins/ (132.86kB)
[INFO] Fetching org.eclipse.xtext.ide_2.27.0.v20220530-0355.jar from http://download.eclipse.org/releases/2022-06/202206151000/plugins/ (489.48kB)
[INFO] Computing target platform for MavenProject: org.eclipse.handly.bundles:org.eclipse.handly.junit:1.7.0-SNAPSHOT @ /home/jenkins/agent/workspace/1.7.x/org.eclipse.handly.junit/pom.xml
[INFO] Resolving dependencies of MavenProject: org.eclipse.handly.bundles:org.eclipse.handly.junit:1.7.0-SNAPSHOT @ /home/jenkins/agent/workspace/1.7.x/org.eclipse.handly.junit/pom.xml
[INFO] Resolving class path of MavenProject: org.eclipse.handly.bundles:org.eclipse.handly.junit:1.7.0-SNAPSHOT @ /home/jenkins/agent/workspace/1.7.x/org.eclipse.handly.junit/pom.xml
[INFO] Computing target platform for MavenProject: org.eclipse.handly.bundles:org.eclipse.handly.examples:1.7.0-SNAPSHOT @ /home/jenkins/agent/workspace/1.7.x/org.eclipse.handly.examples/pom.xml
[INFO] Resolving dependencies of MavenProject: org.eclipse.handly.bundles:org.eclipse.handly.examples:1.7.0-SNAPSHOT @ /home/jenkins/agent/workspace/1.7.x/org.eclipse.handly.examples/pom.xml
[INFO] Resolving class path of MavenProject: org.eclipse.handly.bundles:org.eclipse.handly.examples:1.7.0-SNAPSHOT @ /home/jenkins/agent/workspace/1.7.x/org.eclipse.handly.examples/pom.xml
[INFO] Computing target platform for MavenProject: org.eclipse.handly.bundles:org.eclipse.handly.examples.adapter:1.7.0-SNAPSHOT @ /home/jenkins/agent/workspace/1.7.x/org.eclipse.handly.examples.adapter/pom.xml
[INFO] Resolving dependencies of MavenProject: org.eclipse.handly.bundles:org.eclipse.handly.examples.adapter:1.7.0-SNAPSHOT @ /home/jenkins/agent/workspace/1.7.x/org.eclipse.handly.examples.adapter/pom.xml
[INFO] Resolving class path of MavenProject: org.eclipse.handly.bundles:org.eclipse.handly.examples.adapter:1.7.0-SNAPSHOT @ /home/jenkins/agent/workspace/1.7.x/org.eclipse.handly.examples.adapter/pom.xml
[INFO] Computing target platform for MavenProject: org.eclipse.handly.bundles:org.eclipse.handly.examples.adapter.ui:1.7.0-SNAPSHOT @ /home/jenkins/agent/workspace/1.7.x/org.eclipse.handly.examples.adapter.ui/pom.xml
[INFO] Resolving dependencies of MavenProject: org.eclipse.handly.bundles:org.eclipse.handly.examples.adapter.ui:1.7.0-SNAPSHOT @ /home/jenkins/agent/workspace/1.7.x/org.eclipse.handly.examples.adapter.ui/pom.xml
[INFO] Resolving class path of MavenProject: org.eclipse.handly.bundles:org.eclipse.handly.examples.adapter.ui:1.7.0-SNAPSHOT @ /home/jenkins/agent/workspace/1.7.x/org.eclipse.handly.examples.adapter.ui/pom.xml
[INFO] Fetching org.eclipse.debug.ui_3.16.100.v20220526-0826.jar from http://download.eclipse.org/releases/2022-06/202206151000/plugins/ (2.97MB)
[INFO] Fetching org.eclipse.ui.console_3.11.200.v20220324-0630.jar from http://download.eclipse.org/releases/2022-06/202206151000/plugins/ (208.46kB)
[INFO] Fetching org.eclipse.jdt.ui_3.26.100.v20220516-1138.jar from http://download.eclipse.org/releases/2022-06/202206151000/plugins/ (11.18MB)
[INFO] Fetching org.eclipse.jdt.core.manipulation_1.16.100.v20220513-2002.jar from http://download.eclipse.org/releases/2022-06/202206151000/plugins/ (1.94MB)
[INFO] Computing target platform for MavenProject: org.eclipse.handly.bundles:org.eclipse.handly.examples.basic:1.7.0-SNAPSHOT @ /home/jenkins/agent/workspace/1.7.x/org.eclipse.handly.examples.basic/pom.xml
[INFO] Resolving dependencies of MavenProject: org.eclipse.handly.bundles:org.eclipse.handly.examples.basic:1.7.0-SNAPSHOT @ /home/jenkins/agent/workspace/1.7.x/org.eclipse.handly.examples.basic/pom.xml
[INFO] Resolving class path of MavenProject: org.eclipse.handly.bundles:org.eclipse.handly.examples.basic:1.7.0-SNAPSHOT @ /home/jenkins/agent/workspace/1.7.x/org.eclipse.handly.examples.basic/pom.xml
[INFO] Fetching org.apache.ant_1.10.12.v20211102-1452.jar from http://download.eclipse.org/releases/2022-06/202206151000/plugins/ (2.96MB)
[INFO] Fetching org.apache.commons.cli_1.4.0.v20200417-1444.jar from http://download.eclipse.org/releases/2022-06/202206151000/plugins/ (64.23kB)
[INFO] Fetching org.eclipse.emf.codegen_2.22.0.v20210420-0623.jar.pack.gz from http://download.eclipse.org/releases/2022-06/202206151000/plugins/ (128.92kB)
[INFO] Fetching org.eclipse.emf.codegen.ecore_2.30.0.v20220426-0617.jar.pack.gz from http://download.eclipse.org/releases/2022-06/202206151000/plugins/ (422.85kB)
[INFO] Fetching org.eclipse.emf.mwe.core_1.7.0.v20220519-1115.jar from http://download.eclipse.org/releases/2022-06/202206151000/plugins/ (193.98kB)
[INFO] Fetching org.eclipse.emf.mwe2.runtime_2.13.0.v20220519-1115.jar from http://download.eclipse.org/releases/2022-06/202206151000/plugins/ (16.4kB)
[INFO] Fetching org.eclipse.emf.mwe.utils_1.7.0.v20220519-1115.jar from http://download.eclipse.org/releases/2022-06/202206151000/plugins/ (40.19kB)
[INFO] Fetching org.eclipse.emf.mwe2.language_2.13.0.v20220519-1115.jar from http://download.eclipse.org/releases/2022-06/202206151000/plugins/ (230.3kB)
[INFO] Fetching org.eclipse.emf.mwe2.launch_2.13.0.v20220519-1115.jar from http://download.eclipse.org/releases/2022-06/202206151000/plugins/ (23.93kB)
[INFO] Fetching org.eclipse.xtext.generator_2.27.0.v20220530-0402.jar from http://download.eclipse.org/releases/2022-06/202206151000/plugins/ (856.55kB)
[INFO] Fetching org.eclipse.xpand_2.2.0.v201605260315.jar from http://download.eclipse.org/releases/2022-06/202206151000/plugins/ (228.7kB)
[INFO] Fetching org.eclipse.xtend_2.2.0.v201605260315.jar from http://download.eclipse.org/releases/2022-06/202206151000/plugins/ (535.07kB)
[INFO] Fetching org.eclipse.xtend.typesystem.emf_2.2.0.v201605260315.jar from http://download.eclipse.org/releases/2022-06/202206151000/plugins/ (64.36kB)
[INFO] Fetching org.eclipse.xtext.ecore_2.27.0.v20220530-0402.jar from http://download.eclipse.org/releases/2022-06/202206151000/plugins/ (17.81kB)
[INFO] Fetching org.eclipse.xtext.xtext.generator_2.27.0.v20220530-0355.jar from http://download.eclipse.org/releases/2022-06/202206151000/plugins/ (969.14kB)
[INFO] Computing target platform for MavenProject: org.eclipse.handly.bundles:org.eclipse.handly.examples.basic.ide:1.7.0-SNAPSHOT @ /home/jenkins/agent/workspace/1.7.x/org.eclipse.handly.examples.basic.ide/pom.xml
[INFO] Resolving dependencies of MavenProject: org.eclipse.handly.bundles:org.eclipse.handly.examples.basic.ide:1.7.0-SNAPSHOT @ /home/jenkins/agent/workspace/1.7.x/org.eclipse.handly.examples.basic.ide/pom.xml
[INFO] Resolving class path of MavenProject: org.eclipse.handly.bundles:org.eclipse.handly.examples.basic.ide:1.7.0-SNAPSHOT @ /home/jenkins/agent/workspace/1.7.x/org.eclipse.handly.examples.basic.ide/pom.xml
[INFO] Computing target platform for MavenProject: org.eclipse.handly.bundles:org.eclipse.handly.examples.basic.ui:1.7.0-SNAPSHOT @ /home/jenkins/agent/workspace/1.7.x/org.eclipse.handly.examples.basic.ui/pom.xml
[INFO] Resolving dependencies of MavenProject: org.eclipse.handly.bundles:org.eclipse.handly.examples.basic.ui:1.7.0-SNAPSHOT @ /home/jenkins/agent/workspace/1.7.x/org.eclipse.handly.examples.basic.ui/pom.xml
[INFO] Resolving class path of MavenProject: org.eclipse.handly.bundles:org.eclipse.handly.examples.basic.ui:1.7.0-SNAPSHOT @ /home/jenkins/agent/workspace/1.7.x/org.eclipse.handly.examples.basic.ui/pom.xml
[INFO] Fetching org.eclipse.emf.ecore.edit_2.13.0.v20190822-1451.jar.pack.gz from http://download.eclipse.org/releases/2022-06/202206151000/plugins/ (63.24kB)
[INFO] Fetching org.eclipse.emf.ecore.editor_2.17.0.v20190528-0725.jar.pack.gz from http://download.eclipse.org/releases/2022-06/202206151000/plugins/ (46.68kB)
[INFO] Fetching org.eclipse.xtext.ui.shared_2.27.0.v20220530-0416.jar from http://download.eclipse.org/releases/2022-06/202206151000/plugins/ (62.36kB)
[INFO] Fetching org.eclipse.xtext.builder_2.27.0.v20220530-0416.jar from http://download.eclipse.org/releases/2022-06/202206151000/plugins/ (393.86kB)
[INFO] Fetching org.eclipse.xtext.common.types.ui_2.27.0.v20220530-0416.jar from http://download.eclipse.org/releases/2022-06/202206151000/plugins/ (258.74kB)
[INFO] Fetching org.eclipse.xtext.smap_2.27.0.v20220530-0402.jar from http://download.eclipse.org/releases/2022-06/202206151000/plugins/ (20.99kB)
[INFO] Fetching org.eclipse.xtext.common.types.edit_2.27.0.v20220530-0416.jar from http://download.eclipse.org/releases/2022-06/202206151000/plugins/ (250kB)
[INFO] Computing target platform for MavenProject: org.eclipse.handly.bundles:org.eclipse.handly.examples.basic.ui.tests:1.7.0-SNAPSHOT @ /home/jenkins/agent/workspace/1.7.x/org.eclipse.handly.examples.basic.ui.tests/pom.xml
[INFO] Resolving dependencies of MavenProject: org.eclipse.handly.bundles:org.eclipse.handly.examples.basic.ui.tests:1.7.0-SNAPSHOT @ /home/jenkins/agent/workspace/1.7.x/org.eclipse.handly.examples.basic.ui.tests/pom.xml
[INFO] Resolving class path of MavenProject: org.eclipse.handly.bundles:org.eclipse.handly.examples.basic.ui.tests:1.7.0-SNAPSHOT @ /home/jenkins/agent/workspace/1.7.x/org.eclipse.handly.examples.basic.ui.tests/pom.xml
[INFO] Computing target platform for MavenProject: org.eclipse.handly.bundles:org.eclipse.handly.examples.jmodel:1.7.0-SNAPSHOT @ /home/jenkins/agent/workspace/1.7.x/org.eclipse.handly.examples.jmodel/pom.xml
[INFO] Resolving dependencies of MavenProject: org.eclipse.handly.bundles:org.eclipse.handly.examples.jmodel:1.7.0-SNAPSHOT @ /home/jenkins/agent/workspace/1.7.x/org.eclipse.handly.examples.jmodel/pom.xml
[INFO] Resolving class path of MavenProject: org.eclipse.handly.bundles:org.eclipse.handly.examples.jmodel:1.7.0-SNAPSHOT @ /home/jenkins/agent/workspace/1.7.x/org.eclipse.handly.examples.jmodel/pom.xml
[INFO] Computing target platform for MavenProject: org.eclipse.handly.bundles:org.eclipse.handly.examples.jmodel.tests:1.7.0-SNAPSHOT @ /home/jenkins/agent/workspace/1.7.x/org.eclipse.handly.examples.jmodel.tests/pom.xml
[INFO] Resolving dependencies of MavenProject: org.eclipse.handly.bundles:org.eclipse.handly.examples.jmodel.tests:1.7.0-SNAPSHOT @ /home/jenkins/agent/workspace/1.7.x/org.eclipse.handly.examples.jmodel.tests/pom.xml
[INFO] Resolving class path of MavenProject: org.eclipse.handly.bundles:org.eclipse.handly.examples.jmodel.tests:1.7.0-SNAPSHOT @ /home/jenkins/agent/workspace/1.7.x/org.eclipse.handly.examples.jmodel.tests/pom.xml
[INFO] Computing target platform for MavenProject: org.eclipse.handly.bundles:org.eclipse.handly.examples.jmodel.ui:1.7.0-SNAPSHOT @ /home/jenkins/agent/workspace/1.7.x/org.eclipse.handly.examples.jmodel.ui/pom.xml
[INFO] Resolving dependencies of MavenProject: org.eclipse.handly.bundles:org.eclipse.handly.examples.jmodel.ui:1.7.0-SNAPSHOT @ /home/jenkins/agent/workspace/1.7.x/org.eclipse.handly.examples.jmodel.ui/pom.xml
[INFO] Resolving class path of MavenProject: org.eclipse.handly.bundles:org.eclipse.handly.examples.jmodel.ui:1.7.0-SNAPSHOT @ /home/jenkins/agent/workspace/1.7.x/org.eclipse.handly.examples.jmodel.ui/pom.xml
[INFO] Computing target platform for MavenProject: org.eclipse.handly.bundles:org.eclipse.handly.examples.xtext.xtext.ui:1.7.0-SNAPSHOT @ /home/jenkins/agent/workspace/1.7.x/org.eclipse.handly.examples.xtext.xtext.ui/pom.xml
[INFO] Resolving dependencies of MavenProject: org.eclipse.handly.bundles:org.eclipse.handly.examples.xtext.xtext.ui:1.7.0-SNAPSHOT @ /home/jenkins/agent/workspace/1.7.x/org.eclipse.handly.examples.xtext.xtext.ui/pom.xml
[INFO] Resolving class path of MavenProject: org.eclipse.handly.bundles:org.eclipse.handly.examples.xtext.xtext.ui:1.7.0-SNAPSHOT @ /home/jenkins/agent/workspace/1.7.x/org.eclipse.handly.examples.xtext.xtext.ui/pom.xml
[INFO] Fetching org.eclipse.ant.core_3.6.400.v20220317-1003.jar from http://download.eclipse.org/releases/2022-06/202206151000/plugins/ (107.39kB)
[INFO] Fetching org.eclipse.ant.launching_1.3.300.v20220408-0629.jar from http://download.eclipse.org/releases/2022-06/202206151000/plugins/ (161.08kB)
[INFO] Fetching org.eclipse.core.externaltools_1.2.200.v20220125-2302.jar from http://download.eclipse.org/releases/2022-06/202206151000/plugins/ (42.65kB)
[INFO] Fetching org.eclipse.ant.ui_3.8.200.v20220214-2001.jar from http://download.eclipse.org/releases/2022-06/202206151000/plugins/ (1.04MB)
[INFO] Fetching org.eclipse.ui.externaltools_3.5.100.v20210812-1118.jar from http://download.eclipse.org/releases/2022-06/202206151000/plugins/ (140.91kB)
[INFO] Fetching org.eclipse.jdt.debug.ui_3.12.700.v20220513-0809.jar from http://download.eclipse.org/releases/2022-06/202206151000/plugins/ (1.66MB)
[INFO] Fetching org.eclipse.jdt.junit_3.14.100.v20220411-0722.jar from http://download.eclipse.org/releases/2022-06/202206151000/plugins/ (528.22kB)
[INFO] Fetching org.eclipse.core.databinding.beans_1.8.0.v20210619-1111.jar from http://download.eclipse.org/releases/2022-06/202206151000/plugins/ (92.92kB)
[INFO] Fetching org.eclipse.equinox.frameworkadmin_2.2.0.v20210315-2042.jar from http://download.eclipse.org/releases/2022-06/202206151000/plugins/ (36.06kB)
[INFO] Fetching org.eclipse.equinox.frameworkadmin.equinox_1.2.200.v20220315-2155.jar from http://download.eclipse.org/releases/2022-06/202206151000/plugins/ (69.13kB)
[INFO] Fetching org.eclipse.equinox.p2.director_2.5.300.v20220421-0708.jar from http://download.eclipse.org/releases/2022-06/202206151000/plugins/ (110.58kB)
[INFO] Fetching org.sat4j.core_2.3.6.v20201214.jar from http://download.eclipse.org/releases/2022-06/202206151000/plugins/ (429.55kB)
[INFO] Fetching org.sat4j.pb_2.3.6.v20201214.jar from http://download.eclipse.org/releases/2022-06/202206151000/plugins/ (432.64kB)
[INFO] Fetching org.eclipse.equinox.simpleconfigurator_1.4.0.v20210315-2228.jar from http://download.eclipse.org/releases/2022-06/202206151000/plugins/ (45.48kB)
[INFO] Fetching org.eclipse.equinox.p2.director.app_1.2.100.v20211220-1825.jar from http://download.eclipse.org/releases/2022-06/202206151000/plugins/ (58.07kB)
[INFO] Fetching org.eclipse.equinox.p2.directorywatcher_1.3.0.v20210316-1209.jar from http://download.eclipse.org/releases/2022-06/202206151000/plugins/ (31.04kB)
[INFO] Fetching org.eclipse.equinox.p2.touchpoint.eclipse_2.3.200.v20220503-2330.jar from http://download.eclipse.org/releases/2022-06/202206151000/plugins/ (131.95kB)
[INFO] Fetching org.eclipse.equinox.p2.publisher_1.7.100.v20220420-1427.jar from http://download.eclipse.org/releases/2022-06/202206151000/plugins/ (101.89kB)
[INFO] Fetching org.eclipse.equinox.p2.publisher.eclipse_1.4.100.v20220420-1427.jar from http://download.eclipse.org/releases/2022-06/202206151000/plugins/ (242.35kB)
[INFO] Fetching org.eclipse.equinox.p2.extensionlocation_1.4.100.v20220213-0541.jar from http://download.eclipse.org/releases/2022-06/202206151000/plugins/ (35.63kB)
[INFO] Fetching org.eclipse.equinox.p2.garbagecollector_1.2.0.v20210316-1209.jar from http://download.eclipse.org/releases/2022-06/202206151000/plugins/ (24.82kB)
[INFO] Fetching org.eclipse.equinox.p2.operations_2.6.0.v20210315-2228.jar from http://download.eclipse.org/releases/2022-06/202206151000/plugins/ (74.06kB)
[INFO] Fetching org.eclipse.equinox.simpleconfigurator.manipulator_2.2.0.v20210315-2228.jar from http://download.eclipse.org/releases/2022-06/202206151000/plugins/ (26.34kB)
[INFO] Fetching org.eclipse.equinox.p2.repository.tools_2.3.100.v20220504-1755.jar from http://download.eclipse.org/releases/2022-06/202206151000/plugins/ (252.96kB)
[INFO] Fetching org.eclipse.equinox.p2.ui_2.7.500.v20220423-1604.jar from http://download.eclipse.org/releases/2022-06/202206151000/plugins/ (658.09kB)
[INFO] Fetching org.eclipse.equinox.security.ui_1.3.200.v20220115-0654.jar from http://download.eclipse.org/releases/2022-06/202206151000/plugins/ (170.59kB)
[INFO] Fetching org.eclipse.xtext.xtext.ui_2.27.0.v20220530-0416.jar from http://download.eclipse.org/releases/2022-06/202206151000/plugins/ (255.46kB)
[INFO] Fetching org.eclipse.jdt.junit.runtime_3.6.100.v20210708-1502.jar from http://download.eclipse.org/releases/2022-06/202206151000/plugins/ (57.17kB)
[INFO] Fetching org.eclipse.jdt.junit.core_3.11.300.v20220317-1517.jar from http://download.eclipse.org/releases/2022-06/202206151000/plugins/ (176.46kB)
[INFO] Fetching org.eclipse.pde.build_3.11.200.v20220503-0921.jar from http://download.eclipse.org/releases/2022-06/202206151000/plugins/ (491.23kB)
[INFO] Fetching org.eclipse.pde.core_3.15.200.v20220527-1237.jar from http://download.eclipse.org/releases/2022-06/202206151000/plugins/ (1.35MB)
[INFO] Fetching org.eclipse.pde.launching_3.10.0.v20220515-1944.jar from http://download.eclipse.org/releases/2022-06/202206151000/plugins/ (140.54kB)
[INFO] Fetching org.eclipse.pde.ui_3.13.500.v20220531-1442.jar from http://download.eclipse.org/releases/2022-06/202206151000/plugins/ (4.55MB)
[INFO] Fetching org.eclipse.ui.intro_3.6.500.v20220317-1346.jar from http://download.eclipse.org/releases/2022-06/202206151000/plugins/ (344.71kB)
[INFO] Fetching org.eclipse.ui.cheatsheets_3.7.300.v20210507-0822.jar from http://download.eclipse.org/releases/2022-06/202206151000/plugins/ (379kB)
[INFO] Fetching org.eclipse.ui.views.log_1.3.200.v20220310-1555.jar from http://download.eclipse.org/releases/2022-06/202206151000/plugins/ (172.2kB)
[INFO] Fetching org.eclipse.ui.genericeditor_1.2.200.v20211217-1247.jar from http://download.eclipse.org/releases/2022-06/202206151000/plugins/ (152.75kB)
[INFO] Fetching org.eclipse.xtext.ui.codetemplates_2.27.0.v20220530-0416.jar from http://download.eclipse.org/releases/2022-06/202206151000/plugins/ (195.42kB)
[INFO] Fetching org.eclipse.xtext.ui.codetemplates.ide_2.27.0.v20220530-0416.jar from http://download.eclipse.org/releases/2022-06/202206151000/plugins/ (134.64kB)
[INFO] Fetching org.eclipse.xtext.ui.codetemplates.ui_2.27.0.v20220530-0416.jar from http://download.eclipse.org/releases/2022-06/202206151000/plugins/ (134.95kB)
[INFO] Fetching org.eclipse.xtext.xtext.ide_2.27.0.v20220530-0355.jar from http://download.eclipse.org/releases/2022-06/202206151000/plugins/ (121.65kB)
[INFO] Fetching org.eclipse.xtext.xtext.wizard_2.27.0.v20220530-0355.jar from http://download.eclipse.org/releases/2022-06/202206151000/plugins/ (231.74kB)
[INFO] Computing target platform for MavenProject: org.eclipse.handly.features:org.eclipse.handly:1.7.0-SNAPSHOT @ /home/jenkins/agent/workspace/1.7.x/org.eclipse.handly-feature/pom.xml
[INFO] Resolving dependencies of MavenProject: org.eclipse.handly.features:org.eclipse.handly:1.7.0-SNAPSHOT @ /home/jenkins/agent/workspace/1.7.x/org.eclipse.handly-feature/pom.xml
[INFO] Resolving class path of MavenProject: org.eclipse.handly.features:org.eclipse.handly:1.7.0-SNAPSHOT @ /home/jenkins/agent/workspace/1.7.x/org.eclipse.handly-feature/pom.xml
[INFO] Computing target platform for MavenProject: org.eclipse.handly.features:org.eclipse.handly.xtext:1.7.0-SNAPSHOT @ /home/jenkins/agent/workspace/1.7.x/org.eclipse.handly.xtext-feature/pom.xml
[INFO] Resolving dependencies of MavenProject: org.eclipse.handly.features:org.eclipse.handly.xtext:1.7.0-SNAPSHOT @ /home/jenkins/agent/workspace/1.7.x/org.eclipse.handly.xtext-feature/pom.xml
[INFO] Resolving class path of MavenProject: org.eclipse.handly.features:org.eclipse.handly.xtext:1.7.0-SNAPSHOT @ /home/jenkins/agent/workspace/1.7.x/org.eclipse.handly.xtext-feature/pom.xml
[INFO] Computing target platform for MavenProject: org.eclipse.handly.features:org.eclipse.handly.examples:1.7.0-SNAPSHOT @ /home/jenkins/agent/workspace/1.7.x/org.eclipse.handly.examples-feature/pom.xml
[INFO] Resolving dependencies of MavenProject: org.eclipse.handly.features:org.eclipse.handly.examples:1.7.0-SNAPSHOT @ /home/jenkins/agent/workspace/1.7.x/org.eclipse.handly.examples-feature/pom.xml
[INFO] Resolving class path of MavenProject: org.eclipse.handly.features:org.eclipse.handly.examples:1.7.0-SNAPSHOT @ /home/jenkins/agent/workspace/1.7.x/org.eclipse.handly.examples-feature/pom.xml
[INFO] Computing target platform for MavenProject: org.eclipse.handly.features:org.eclipse.handly.tests:1.7.0-SNAPSHOT @ /home/jenkins/agent/workspace/1.7.x/org.eclipse.handly.tests-feature/pom.xml
[INFO] Resolving dependencies of MavenProject: org.eclipse.handly.features:org.eclipse.handly.tests:1.7.0-SNAPSHOT @ /home/jenkins/agent/workspace/1.7.x/org.eclipse.handly.tests-feature/pom.xml
[INFO] Resolving class path of MavenProject: org.eclipse.handly.features:org.eclipse.handly.tests:1.7.0-SNAPSHOT @ /home/jenkins/agent/workspace/1.7.x/org.eclipse.handly.tests-feature/pom.xml
[INFO] Computing target platform for MavenProject: org.eclipse.handly:repository:1.7.0-SNAPSHOT @ /home/jenkins/agent/workspace/1.7.x/repository/pom.xml
[INFO] Resolving dependencies of MavenProject: org.eclipse.handly:repository:1.7.0-SNAPSHOT @ /home/jenkins/agent/workspace/1.7.x/repository/pom.xml
[INFO] Resolving class path of MavenProject: org.eclipse.handly:repository:1.7.0-SNAPSHOT @ /home/jenkins/agent/workspace/1.7.x/repository/pom.xml
[WARNING] The project org.eclipse.handly:releng:pom:1.7.0-SNAPSHOT uses prerequisites which is only intended for maven-plugin projects but not for non maven-plugin projects. For such purposes you should use the maven-enforcer-plugin. See https://maven.apache.org/enforcer/enforcer-rules/requireMavenVersion.html
[INFO] ------------------------------------------------------------------------
[INFO] Reactor Build Order:
[INFO] 
[INFO] releng                                                             [pom]
[INFO] org.eclipse.handly                                      [eclipse-plugin]
[INFO] org.eclipse.handly.junit                                [eclipse-plugin]
[INFO] org.eclipse.handly.tests                           [eclipse-test-plugin]
[INFO] org.eclipse.handly.ui                                   [eclipse-plugin]
[INFO] org.eclipse.handly.xtext                                [eclipse-plugin]
[INFO] org.eclipse.handly.xtext.ui                             [eclipse-plugin]
[INFO] org.eclipse.handly.examples                             [eclipse-plugin]
[INFO] org.eclipse.handly.examples.adapter                     [eclipse-plugin]
[INFO] org.eclipse.handly.examples.adapter.ui                  [eclipse-plugin]
[INFO] org.eclipse.handly.examples.basic                       [eclipse-plugin]
[INFO] org.eclipse.handly.examples.basic.ide                   [eclipse-plugin]
[INFO] org.eclipse.handly.examples.basic.ui                    [eclipse-plugin]
[INFO] org.eclipse.handly.examples.basic.ui.tests         [eclipse-test-plugin]
[INFO] org.eclipse.handly.examples.jmodel                      [eclipse-plugin]
[INFO] org.eclipse.handly.examples.jmodel.tests           [eclipse-test-plugin]
[INFO] org.eclipse.handly.examples.jmodel.ui                   [eclipse-plugin]
[INFO] org.eclipse.handly.examples.xtext.xtext.ui              [eclipse-plugin]
[INFO] org.eclipse.handly-feature                             [eclipse-feature]
[INFO] org.eclipse.handly.xtext-feature                       [eclipse-feature]
[INFO] org.eclipse.handly.examples-feature                    [eclipse-feature]
[INFO] org.eclipse.handly.tests-feature                       [eclipse-feature]
[INFO] repository                                          [eclipse-repository]
[INFO] targets                                                            [pom]
[INFO] base.target                                  [eclipse-target-definition]
[INFO] latest.target                                [eclipse-target-definition]
[INFO] 
[INFO] ---------------------< org.eclipse.handly:releng >----------------------
[INFO] Building releng 1.7.0-SNAPSHOT                                    [1/26]
[INFO] --------------------------------[ pom ]---------------------------------
[INFO] 
[INFO] --- maven-clean-plugin:2.5:clean (default-clean) @ releng ---
[INFO] 
[INFO] --- tycho-source-plugin:2.5.0:plugin-source (plugin-source) @ releng ---
[INFO] 
[INFO] --- tycho-source-plugin:2.5.0:feature-source (feature-source) @ releng ---
[INFO] 
[INFO] --- eclipse-jarsigner-plugin:1.3.1:sign (sign) @ releng ---
[INFO] 
[INFO] -----------< org.eclipse.handly.bundles:org.eclipse.handly >------------
[INFO] Building org.eclipse.handly 1.7.0-SNAPSHOT                        [2/26]
[INFO] ---------------------------[ eclipse-plugin ]---------------------------
[INFO] 
[INFO] --- maven-clean-plugin:2.5:clean (default-clean) @ org.eclipse.handly ---
[INFO] 
[INFO] --- tycho-packaging-plugin:2.5.0:build-qualifier (default-build-qualifier) @ org.eclipse.handly ---
[INFO] The project's OSGi version is 1.7.0.v20220614-1826
[INFO] 
[INFO] --- tycho-packaging-plugin:2.5.0:validate-id (default-validate-id) @ org.eclipse.handly ---
[INFO] 
[INFO] --- tycho-packaging-plugin:2.5.0:validate-version (default-validate-version) @ org.eclipse.handly ---
[INFO] 
[INFO] --- target-platform-configuration:2.5.0:target-platform (default-target-platform) @ org.eclipse.handly ---
[INFO] 
[INFO] --- maven-resources-plugin:2.4.3:resources (default-resources) @ org.eclipse.handly ---
[INFO] Using 'UTF-8' encoding to copy filtered resources.
[INFO] skip non existing resourceDirectory /home/jenkins/agent/workspace/1.7.x/org.eclipse.handly/src/main/resources
[INFO] 
[INFO] --- tycho-compiler-plugin:2.5.0:compile (default-compile) @ org.eclipse.handly ---
[INFO] Compiling 126 source files to /home/jenkins/agent/workspace/1.7.x/org.eclipse.handly/target/classes
[INFO] 
[INFO] --- maven-resources-plugin:2.4.3:testResources (default-testResources) @ org.eclipse.handly ---
[INFO] Using 'UTF-8' encoding to copy filtered resources.
[INFO] skip non existing resourceDirectory /home/jenkins/agent/workspace/1.7.x/org.eclipse.handly/src/test/resources
[INFO] 
[INFO] --- tycho-compiler-plugin:2.5.0:testCompile (default-testCompile) @ org.eclipse.handly ---
[INFO] 
[INFO] --- maven-surefire-plugin:2.22.2:test (default-test) @ org.eclipse.handly ---
[INFO] No tests to run.
[INFO] 
[INFO] --- tycho-source-plugin:2.5.0:plugin-source (plugin-source) @ org.eclipse.handly ---
[INFO] Building jar: /home/jenkins/agent/workspace/1.7.x/org.eclipse.handly/target/org.eclipse.handly-1.7.0-SNAPSHOT-sources.jar
[INFO] 
[INFO] --- tycho-packaging-plugin:2.5.0:package-plugin (default-package-plugin) @ org.eclipse.handly ---
[INFO] Building jar: /home/jenkins/agent/workspace/1.7.x/org.eclipse.handly/target/org.eclipse.handly-1.7.0-SNAPSHOT.jar
[INFO] 
[INFO] --- tycho-p2-plugin:2.5.0:p2-metadata-default (default-p2-metadata-default) @ org.eclipse.handly ---
[INFO] 
[INFO] --- tycho-source-plugin:2.5.0:feature-source (feature-source) @ org.eclipse.handly ---
[INFO] 
[INFO] --- tycho-surefire-plugin:2.5.0:integration-test (default-integration-test) @ org.eclipse.handly ---
[INFO] 
[INFO] --- maven-failsafe-plugin:2.22.2:verify (default-verify) @ org.eclipse.handly ---
[INFO] No tests to run.
[INFO] 
[INFO] --- eclipse-jarsigner-plugin:1.3.1:sign (sign) @ org.eclipse.handly ---
[INFO] Signing jar: /home/jenkins/agent/workspace/1.7.x/org.eclipse.handly/target/org.eclipse.handly-1.7.0-SNAPSHOT.jar
[INFO] Signing jar: /home/jenkins/agent/workspace/1.7.x/org.eclipse.handly/target/org.eclipse.handly-1.7.0-SNAPSHOT-sources.jar
[INFO] 
[INFO] --------< org.eclipse.handly.bundles:org.eclipse.handly.junit >---------
[INFO] Building org.eclipse.handly.junit 1.7.0-SNAPSHOT                  [3/26]
[INFO] ---------------------------[ eclipse-plugin ]---------------------------
[INFO] 
[INFO] --- maven-clean-plugin:2.5:clean (default-clean) @ org.eclipse.handly.junit ---
[INFO] 
[INFO] --- tycho-packaging-plugin:2.5.0:build-qualifier (default-build-qualifier) @ org.eclipse.handly.junit ---
[INFO] The project's OSGi version is 1.7.0.v20220614-1826
[INFO] 
[INFO] --- tycho-packaging-plugin:2.5.0:validate-id (default-validate-id) @ org.eclipse.handly.junit ---
[INFO] 
[INFO] --- tycho-packaging-plugin:2.5.0:validate-version (default-validate-version) @ org.eclipse.handly.junit ---
[INFO] 
[INFO] --- target-platform-configuration:2.5.0:target-platform (default-target-platform) @ org.eclipse.handly.junit ---
[INFO] 
[INFO] --- maven-resources-plugin:2.4.3:resources (default-resources) @ org.eclipse.handly.junit ---
[INFO] Using 'UTF-8' encoding to copy filtered resources.
[INFO] skip non existing resourceDirectory /home/jenkins/agent/workspace/1.7.x/org.eclipse.handly.junit/src/main/resources
[INFO] 
[INFO] --- tycho-compiler-plugin:2.5.0:compile (default-compile) @ org.eclipse.handly.junit ---
[INFO] Compiling 2 source files to /home/jenkins/agent/workspace/1.7.x/org.eclipse.handly.junit/target/classes
[INFO] 
[INFO] --- maven-resources-plugin:2.4.3:testResources (default-testResources) @ org.eclipse.handly.junit ---
[INFO] Using 'UTF-8' encoding to copy filtered resources.
[INFO] skip non existing resourceDirectory /home/jenkins/agent/workspace/1.7.x/org.eclipse.handly.junit/src/test/resources
[INFO] 
[INFO] --- tycho-compiler-plugin:2.5.0:testCompile (default-testCompile) @ org.eclipse.handly.junit ---
[INFO] 
[INFO] --- maven-surefire-plugin:2.22.2:test (default-test) @ org.eclipse.handly.junit ---
[INFO] No tests to run.
[INFO] 
[INFO] --- tycho-source-plugin:2.5.0:plugin-source (plugin-source) @ org.eclipse.handly.junit ---
[INFO] Building jar: /home/jenkins/agent/workspace/1.7.x/org.eclipse.handly.junit/target/org.eclipse.handly.junit-1.7.0-SNAPSHOT-sources.jar
[INFO] 
[INFO] --- tycho-packaging-plugin:2.5.0:package-plugin (default-package-plugin) @ org.eclipse.handly.junit ---
[INFO] Building jar: /home/jenkins/agent/workspace/1.7.x/org.eclipse.handly.junit/target/org.eclipse.handly.junit-1.7.0-SNAPSHOT.jar
[INFO] 
[INFO] --- tycho-p2-plugin:2.5.0:p2-metadata-default (default-p2-metadata-default) @ org.eclipse.handly.junit ---
[INFO] 
[INFO] --- tycho-source-plugin:2.5.0:feature-source (feature-source) @ org.eclipse.handly.junit ---
[INFO] 
[INFO] --- tycho-surefire-plugin:2.5.0:integration-test (default-integration-test) @ org.eclipse.handly.junit ---
[INFO] 
[INFO] --- maven-failsafe-plugin:2.22.2:verify (default-verify) @ org.eclipse.handly.junit ---
[INFO] No tests to run.
[INFO] 
[INFO] --- eclipse-jarsigner-plugin:1.3.1:sign (sign) @ org.eclipse.handly.junit ---
[INFO] Signing jar: /home/jenkins/agent/workspace/1.7.x/org.eclipse.handly.junit/target/org.eclipse.handly.junit-1.7.0-SNAPSHOT.jar
[INFO] Signing jar: /home/jenkins/agent/workspace/1.7.x/org.eclipse.handly.junit/target/org.eclipse.handly.junit-1.7.0-SNAPSHOT-sources.jar
[INFO] 
[INFO] --------< org.eclipse.handly.bundles:org.eclipse.handly.tests >---------
[INFO] Building org.eclipse.handly.tests 1.7.0-SNAPSHOT                  [4/26]
[INFO] ------------------------[ eclipse-test-plugin ]-------------------------
[INFO] 
[INFO] --- maven-clean-plugin:2.5:clean (default-clean) @ org.eclipse.handly.tests ---
[INFO] 
[INFO] --- tycho-packaging-plugin:2.5.0:build-qualifier (default-build-qualifier) @ org.eclipse.handly.tests ---
[INFO] The project's OSGi version is 1.7.0.v20220614-1826
[INFO] 
[INFO] --- tycho-packaging-plugin:2.5.0:validate-id (default-validate-id) @ org.eclipse.handly.tests ---
[INFO] 
[INFO] --- tycho-packaging-plugin:2.5.0:validate-version (default-validate-version) @ org.eclipse.handly.tests ---
[INFO] 
[INFO] --- target-platform-configuration:2.5.0:target-platform (default-target-platform) @ org.eclipse.handly.tests ---
[INFO] 
[INFO] --- maven-resources-plugin:2.4.3:resources (default-resources) @ org.eclipse.handly.tests ---
[INFO] Using 'UTF-8' encoding to copy filtered resources.
[INFO] skip non existing resourceDirectory /home/jenkins/agent/workspace/1.7.x/org.eclipse.handly.tests/src/main/resources
[INFO] 
[INFO] --- tycho-compiler-plugin:2.5.0:compile (default-compile) @ org.eclipse.handly.tests ---
[INFO] Compiling 51 source files to /home/jenkins/agent/workspace/1.7.x/org.eclipse.handly.tests/target/classes
[INFO] 
[INFO] --- maven-resources-plugin:2.4.3:testResources (default-testResources) @ org.eclipse.handly.tests ---
[INFO] Using 'UTF-8' encoding to copy filtered resources.
[INFO] skip non existing resourceDirectory /home/jenkins/agent/workspace/1.7.x/org.eclipse.handly.tests/src/test/resources
[INFO] 
[INFO] --- tycho-source-plugin:2.5.0:plugin-source (plugin-source) @ org.eclipse.handly.tests ---
[INFO] Building jar: /home/jenkins/agent/workspace/1.7.x/org.eclipse.handly.tests/target/org.eclipse.handly.tests-1.7.0-SNAPSHOT-sources.jar
[INFO] 
[INFO] --- tycho-packaging-plugin:2.5.0:package-plugin (default-package-plugin) @ org.eclipse.handly.tests ---
[INFO] Building jar: /home/jenkins/agent/workspace/1.7.x/org.eclipse.handly.tests/target/org.eclipse.handly.tests-1.7.0-SNAPSHOT.jar
[INFO] 
[INFO] --- tycho-p2-plugin:2.5.0:p2-metadata-default (default-p2-metadata-default) @ org.eclipse.handly.tests ---
[INFO] 
[INFO] --- tycho-source-plugin:2.5.0:feature-source (feature-source) @ org.eclipse.handly.tests ---
[INFO] 
[INFO] --- tycho-surefire-plugin:2.5.0:test (default-test) @ org.eclipse.handly.tests ---
[INFO] Executing Test Runtime with timeout 0, logs (if any) will be placed at: /home/jenkins/agent/workspace/1.7.x/org.eclipse.handly.tests/target/work/data/.metadata/.log
[INFO] Command line:
	[/opt/tools/java/openjdk/jdk-11/11.0.2+9/bin/java, -Dosgi.noShutdown=false, -Dosgi.os=linux, -Dosgi.ws=gtk, -Dosgi.arch=x86_64, -Dosgi.clean=true, -jar, /home/jenkins/agent/workspace/1.7.x/.maven/repo/p2/osgi/bundle/org.eclipse.equinox.launcher/1.6.400.v20210924-0641/org.eclipse.equinox.launcher-1.6.400.v20210924-0641.jar, -data, /home/jenkins/agent/workspace/1.7.x/org.eclipse.handly.tests/target/work/data, -install, /home/jenkins/agent/workspace/1.7.x/org.eclipse.handly.tests/target/work, -configuration, /home/jenkins/agent/workspace/1.7.x/org.eclipse.handly.tests/target/work/configuration, -application, org.eclipse.tycho.surefire.osgibooter.headlesstest, -testproperties, /home/jenkins/agent/workspace/1.7.x/org.eclipse.handly.tests/target/surefire.properties]
Running org.eclipse.handly.model.impl.support.BodyTest
Tests run: 3, Failures: 0, Errors: 0, Skipped: 0, Time elapsed: 0.178 s - in org.eclipse.handly.model.impl.support.BodyTest
test1(org.eclipse.handly.model.impl.support.BodyTest)  Time elapsed: 0.151 s
test2(org.eclipse.handly.model.impl.support.BodyTest)  Time elapsed: 0.001 s
test3(org.eclipse.handly.model.impl.support.BodyTest)  Time elapsed: 0 s
Running org.eclipse.handly.model.impl.support.ElementDeltaTest
Tests run: 37, Failures: 0, Errors: 0, Skipped: 0, Time elapsed: 0.035 s - in org.eclipse.handly.model.impl.support.ElementDeltaTest
test00(org.eclipse.handly.model.impl.support.ElementDeltaTest)  Time elapsed: 0.006 s
test01(org.eclipse.handly.model.impl.support.ElementDeltaTest)  Time elapsed: 0 s
test02(org.eclipse.handly.model.impl.support.ElementDeltaTest)  Time elapsed: 0 s
test03(org.eclipse.handly.model.impl.support.ElementDeltaTest)  Time elapsed: 0 s
test04(org.eclipse.handly.model.impl.support.ElementDeltaTest)  Time elapsed: 0.001 s
test05(org.eclipse.handly.model.impl.support.ElementDeltaTest)  Time elapsed: 0 s
test06(org.eclipse.handly.model.impl.support.ElementDeltaTest)  Time elapsed: 0 s
test07(org.eclipse.handly.model.impl.support.ElementDeltaTest)  Time elapsed: 0 s
test08(org.eclipse.handly.model.impl.support.ElementDeltaTest)  Time elapsed: 0 s
test09(org.eclipse.handly.model.impl.support.ElementDeltaTest)  Time elapsed: 0 s
test10(org.eclipse.handly.model.impl.support.ElementDeltaTest)  Time elapsed: 0 s
test11(org.eclipse.handly.model.impl.support.ElementDeltaTest)  Time elapsed: 0 s
test12(org.eclipse.handly.model.impl.support.ElementDeltaTest)  Time elapsed: 0 s
test13(org.eclipse.handly.model.impl.support.ElementDeltaTest)  Time elapsed: 0 s
test14(org.eclipse.handly.model.impl.support.ElementDeltaTest)  Time elapsed: 0 s
test15(org.eclipse.handly.model.impl.support.ElementDeltaTest)  Time elapsed: 0 s
test16(org.eclipse.handly.model.impl.support.ElementDeltaTest)  Time elapsed: 0 s
test17(org.eclipse.handly.model.impl.support.ElementDeltaTest)  Time elapsed: 0.001 s
test18(org.eclipse.handly.model.impl.support.ElementDeltaTest)  Time elapsed: 0 s
test19(org.eclipse.handly.model.impl.support.ElementDeltaTest)  Time elapsed: 0 s
test20(org.eclipse.handly.model.impl.support.ElementDeltaTest)  Time elapsed: 0 s
test21(org.eclipse.handly.model.impl.support.ElementDeltaTest)  Time elapsed: 0 s
test22(org.eclipse.handly.model.impl.support.ElementDeltaTest)  Time elapsed: 0 s
test23(org.eclipse.handly.model.impl.support.ElementDeltaTest)  Time elapsed: 0 s
test24(org.eclipse.handly.model.impl.support.ElementDeltaTest)  Time elapsed: 0 s
test25(org.eclipse.handly.model.impl.support.ElementDeltaTest)  Time elapsed: 0.001 s
test26(org.eclipse.handly.model.impl.support.ElementDeltaTest)  Time elapsed: 0 s
test27(org.eclipse.handly.model.impl.support.ElementDeltaTest)  Time elapsed: 0 s
test28(org.eclipse.handly.model.impl.support.ElementDeltaTest)  Time elapsed: 0 s
test29(org.eclipse.handly.model.impl.support.ElementDeltaTest)  Time elapsed: 0 s
test30(org.eclipse.handly.model.impl.support.ElementDeltaTest)  Time elapsed: 0 s
test31(org.eclipse.handly.model.impl.support.ElementDeltaTest)  Time elapsed: 0 s
test32(org.eclipse.handly.model.impl.support.ElementDeltaTest)  Time elapsed: 0.005 s
test33(org.eclipse.handly.model.impl.support.ElementDeltaTest)  Time elapsed: 0.007 s
testMalformedDeltaTree(org.eclipse.handly.model.impl.support.ElementDeltaTest)  Time elapsed: 0.002 s
testBug456060(org.eclipse.handly.model.impl.support.ElementDeltaTest)  Time elapsed: 0 s
testDefaultFindDelta(org.eclipse.handly.model.impl.support.ElementDeltaTest)  Time elapsed: 0.002 s
Running org.eclipse.handly.model.impl.support.SourceElementBodyTest
Tests run: 1, Failures: 0, Errors: 0, Skipped: 0, Time elapsed: 0.029 s - in org.eclipse.handly.model.impl.support.SourceElementBodyTest
test1(org.eclipse.handly.model.impl.support.SourceElementBodyTest)  Time elapsed: 0.028 s
Running org.eclipse.handly.model.impl.support.SourceFileTest
Tests run: 9, Failures: 0, Errors: 0, Skipped: 0, Time elapsed: 0.235 s - in org.eclipse.handly.model.impl.support.SourceFileTest
test01(org.eclipse.handly.model.impl.support.SourceFileTest)  Time elapsed: 0.131 s
test02(org.eclipse.handly.model.impl.support.SourceFileTest)  Time elapsed: 0.01 s
test03(org.eclipse.handly.model.impl.support.SourceFileTest)  Time elapsed: 0.029 s
test04(org.eclipse.handly.model.impl.support.SourceFileTest)  Time elapsed: 0.008 s
test05(org.eclipse.handly.model.impl.support.SourceFileTest)  Time elapsed: 0.013 s
test06(org.eclipse.handly.model.impl.support.SourceFileTest)  Time elapsed: 0.009 s
test07(org.eclipse.handly.model.impl.support.SourceFileTest)  Time elapsed: 0.013 s
test08(org.eclipse.handly.model.impl.support.SourceFileTest)  Time elapsed: 0.008 s
test09(org.eclipse.handly.model.impl.support.SourceFileTest)  Time elapsed: 0.009 s
Running org.eclipse.handly.model.impl.support.ElementChangeListenerListTest
Tests run: 3, Failures: 0, Errors: 0, Skipped: 0, Time elapsed: 0.004 s - in org.eclipse.handly.model.impl.support.ElementChangeListenerListTest
test1(org.eclipse.handly.model.impl.support.ElementChangeListenerListTest)  Time elapsed: 0.001 s
test2(org.eclipse.handly.model.impl.support.ElementChangeListenerListTest)  Time elapsed: 0 s
test3(org.eclipse.handly.model.impl.support.ElementChangeListenerListTest)  Time elapsed: 0 s
Running org.eclipse.handly.model.impl.support.OutOfSyncSourceFileTest
Tests run: 2, Failures: 0, Errors: 0, Skipped: 0, Time elapsed: 0.048 s - in org.eclipse.handly.model.impl.support.OutOfSyncSourceFileTest
testInSync(org.eclipse.handly.model.impl.support.OutOfSyncSourceFileTest)  Time elapsed: 0.036 s
testOutOfSync(org.eclipse.handly.model.impl.support.OutOfSyncSourceFileTest)  Time elapsed: 0.011 s
Running org.eclipse.handly.model.impl.support.ElementManagerTest
Tests run: 2, Failures: 0, Errors: 0, Skipped: 0, Time elapsed: 0.004 s - in org.eclipse.handly.model.impl.support.ElementManagerTest
test1(org.eclipse.handly.model.impl.support.ElementManagerTest)  Time elapsed: 0.001 s
test2(org.eclipse.handly.model.impl.support.ElementManagerTest)  Time elapsed: 0.002 s
Running org.eclipse.handly.model.impl.support.ElementDeltaPerformanceTest
Tests run: 1, Failures: 0, Errors: 0, Skipped: 0, Time elapsed: 0.134 s - in org.eclipse.handly.model.impl.support.ElementDeltaPerformanceTest
testFindDeltaPerformance(org.eclipse.handly.model.impl.support.ElementDeltaPerformanceTest)  Time elapsed: 0.134 s
Running org.eclipse.handly.model.impl.support.ElementCacheTest
Tests run: 5, Failures: 0, Errors: 0, Skipped: 0, Time elapsed: 0.005 s - in org.eclipse.handly.model.impl.support.ElementCacheTest
test1(org.eclipse.handly.model.impl.support.ElementCacheTest)  Time elapsed: 0 s
test2(org.eclipse.handly.model.impl.support.ElementCacheTest)  Time elapsed: 0.001 s
test3(org.eclipse.handly.model.impl.support.ElementCacheTest)  Time elapsed: 0 s
test4(org.eclipse.handly.model.impl.support.ElementCacheTest)  Time elapsed: 0.002 s
test5(org.eclipse.handly.model.impl.support.ElementCacheTest)  Time elapsed: 0 s
Running org.eclipse.handly.model.impl.support.ElementChangeRecorderTest
Tests run: 35, Failures: 0, Errors: 0, Skipped: 0, Time elapsed: 0.012 s - in org.eclipse.handly.model.impl.support.ElementChangeRecorderTest
test01(org.eclipse.handly.model.impl.support.ElementChangeRecorderTest)  Time elapsed: 0.001 s
test02(org.eclipse.handly.model.impl.support.ElementChangeRecorderTest)  Time elapsed: 0.001 s
test03(org.eclipse.handly.model.impl.support.ElementChangeRecorderTest)  Time elapsed: 0 s
test04(org.eclipse.handly.model.impl.support.ElementChangeRecorderTest)  Time elapsed: 0 s
test05(org.eclipse.handly.model.impl.support.ElementChangeRecorderTest)  Time elapsed: 0 s
test06(org.eclipse.handly.model.impl.support.ElementChangeRecorderTest)  Time elapsed: 0.001 s
test07(org.eclipse.handly.model.impl.support.ElementChangeRecorderTest)  Time elapsed: 0 s
test08(org.eclipse.handly.model.impl.support.ElementChangeRecorderTest)  Time elapsed: 0 s
test09(org.eclipse.handly.model.impl.support.ElementChangeRecorderTest)  Time elapsed: 0 s
test10(org.eclipse.handly.model.impl.support.ElementChangeRecorderTest)  Time elapsed: 0 s
test11(org.eclipse.handly.model.impl.support.ElementChangeRecorderTest)  Time elapsed: 0 s
test12(org.eclipse.handly.model.impl.support.ElementChangeRecorderTest)  Time elapsed: 0 s
test13(org.eclipse.handly.model.impl.support.ElementChangeRecorderTest)  Time elapsed: 0 s
test14(org.eclipse.handly.model.impl.support.ElementChangeRecorderTest)  Time elapsed: 0 s
test15(org.eclipse.handly.model.impl.support.ElementChangeRecorderTest)  Time elapsed: 0 s
test16(org.eclipse.handly.model.impl.support.ElementChangeRecorderTest)  Time elapsed: 0 s
test17(org.eclipse.handly.model.impl.support.ElementChangeRecorderTest)  Time elapsed: 0 s
test18(org.eclipse.handly.model.impl.support.ElementChangeRecorderTest)  Time elapsed: 0.001 s
test19(org.eclipse.handly.model.impl.support.ElementChangeRecorderTest)  Time elapsed: 0 s
test20(org.eclipse.handly.model.impl.support.ElementChangeRecorderTest)  Time elapsed: 0 s
test21(org.eclipse.handly.model.impl.support.ElementChangeRecorderTest)  Time elapsed: 0 s
test22(org.eclipse.handly.model.impl.support.ElementChangeRecorderTest)  Time elapsed: 0 s
test23(org.eclipse.handly.model.impl.support.ElementChangeRecorderTest)  Time elapsed: 0 s
test24(org.eclipse.handly.model.impl.support.ElementChangeRecorderTest)  Time elapsed: 0 s
test25(org.eclipse.handly.model.impl.support.ElementChangeRecorderTest)  Time elapsed: 0.001 s
test26(org.eclipse.handly.model.impl.support.ElementChangeRecorderTest)  Time elapsed: 0 s
test27(org.eclipse.handly.model.impl.support.ElementChangeRecorderTest)  Time elapsed: 0 s
test28(org.eclipse.handly.model.impl.support.ElementChangeRecorderTest)  Time elapsed: 0 s
test29(org.eclipse.handly.model.impl.support.ElementChangeRecorderTest)  Time elapsed: 0 s
test30(org.eclipse.handly.model.impl.support.ElementChangeRecorderTest)  Time elapsed: 0 s
test31(org.eclipse.handly.model.impl.support.ElementChangeRecorderTest)  Time elapsed: 0.001 s
test32(org.eclipse.handly.model.impl.support.ElementChangeRecorderTest)  Time elapsed: 0 s
test33(org.eclipse.handly.model.impl.support.ElementChangeRecorderTest)  Time elapsed: 0 s
test34(org.eclipse.handly.model.impl.support.ElementChangeRecorderTest)  Time elapsed: 0 s
test35(org.eclipse.handly.model.impl.support.ElementChangeRecorderTest)  Time elapsed: 0 s
Running org.eclipse.handly.model.impl.support.WorkingCopyNotificationTest
Tests run: 4, Failures: 0, Errors: 0, Skipped: 0, Time elapsed: 0.053 s - in org.eclipse.handly.model.impl.support.WorkingCopyNotificationTest
test1(org.eclipse.handly.model.impl.support.WorkingCopyNotificationTest)  Time elapsed: 0.008 s
test2(org.eclipse.handly.model.impl.support.WorkingCopyNotificationTest)  Time elapsed: 0.012 s
test3(org.eclipse.handly.model.impl.support.WorkingCopyNotificationTest)  Time elapsed: 0.006 s
test4(org.eclipse.handly.model.impl.support.WorkingCopyNotificationTest)  Time elapsed: 0.01 s
Running org.eclipse.handly.model.impl.support.WorkingCopyTest
Tests run: 2, Failures: 0, Errors: 0, Skipped: 0, Time elapsed: 0.003 s - in org.eclipse.handly.model.impl.support.WorkingCopyTest
testCallbackLifecycle(org.eclipse.handly.model.impl.support.WorkingCopyTest)  Time elapsed: 0.001 s
testBug479623(org.eclipse.handly.model.impl.support.WorkingCopyTest)  Time elapsed: 0.001 s
Running org.eclipse.handly.model.impl.support.NotificationManagerTest
Tests run: 3, Failures: 0, Errors: 0, Skipped: 0, Time elapsed: 0.002 s - in org.eclipse.handly.model.impl.support.NotificationManagerTest
test1(org.eclipse.handly.model.impl.support.NotificationManagerTest)  Time elapsed: 0.001 s
test2(org.eclipse.handly.model.impl.support.NotificationManagerTest)  Time elapsed: 0 s
test3(org.eclipse.handly.model.impl.support.NotificationManagerTest)  Time elapsed: 0.001 s
Running org.eclipse.handly.model.impl.support.SourceElementTest
Tests run: 2, Failures: 0, Errors: 0, Skipped: 0, Time elapsed: 0.004 s - in org.eclipse.handly.model.impl.support.SourceElementTest
test1(org.eclipse.handly.model.impl.support.SourceElementTest)  Time elapsed: 0 s
test2(org.eclipse.handly.model.impl.support.SourceElementTest)  Time elapsed: 0.001 s
Running org.eclipse.handly.model.impl.support.ElementTest
Tests run: 15, Failures: 0, Errors: 0, Skipped: 0, Time elapsed: 0.041 s - in org.eclipse.handly.model.impl.support.ElementTest
test01(org.eclipse.handly.model.impl.support.ElementTest)  Time elapsed: 0.001 s
test02(org.eclipse.handly.model.impl.support.ElementTest)  Time elapsed: 0 s
test03(org.eclipse.handly.model.impl.support.ElementTest)  Time elapsed: 0 s
test04(org.eclipse.handly.model.impl.support.ElementTest)  Time elapsed: 0.001 s
test05(org.eclipse.handly.model.impl.support.ElementTest)  Time elapsed: 0 s
test06(org.eclipse.handly.model.impl.support.ElementTest)  Time elapsed: 0.001 s
test07(org.eclipse.handly.model.impl.support.ElementTest)  Time elapsed: 0 s
test08(org.eclipse.handly.model.impl.support.ElementTest)  Time elapsed: 0 s
test09(org.eclipse.handly.model.impl.support.ElementTest)  Time elapsed: 0.001 s
test10(org.eclipse.handly.model.impl.support.ElementTest)  Time elapsed: 0 s
test11(org.eclipse.handly.model.impl.support.ElementTest)  Time elapsed: 0 s
test12(org.eclipse.handly.model.impl.support.ElementTest)  Time elapsed: 0 s
test13(org.eclipse.handly.model.impl.support.ElementTest)  Time elapsed: 0 s
test14(org.eclipse.handly.model.impl.support.ElementTest)  Time elapsed: 0 s
testBug530821(org.eclipse.handly.model.impl.support.ElementTest)  Time elapsed: 0.034 s
Running org.eclipse.handly.model.impl.support.StructureHelperTest
Tests run: 1, Failures: 0, Errors: 0, Skipped: 0, Time elapsed: 0.003 s - in org.eclipse.handly.model.impl.support.StructureHelperTest
test1(org.eclipse.handly.model.impl.support.StructureHelperTest)  Time elapsed: 0.002 s
Running org.eclipse.handly.model.adapter.NullContentAdapterTest
Tests run: 2, Failures: 0, Errors: 0, Skipped: 0, Time elapsed: 0.001 s - in org.eclipse.handly.model.adapter.NullContentAdapterTest
test1(org.eclipse.handly.model.adapter.NullContentAdapterTest)  Time elapsed: 0 s
test2(org.eclipse.handly.model.adapter.NullContentAdapterTest)  Time elapsed: 0 s
Running org.eclipse.handly.model.adapter.DefaultContentAdapterTest
Tests run: 2, Failures: 0, Errors: 0, Skipped: 0, Time elapsed: 0.008 s - in org.eclipse.handly.model.adapter.DefaultContentAdapterTest
test1(org.eclipse.handly.model.adapter.DefaultContentAdapterTest)  Time elapsed: 0.007 s
test2(org.eclipse.handly.model.adapter.DefaultContentAdapterTest)  Time elapsed: 0 s
Running org.eclipse.handly.model.ElementsTest
Tests run: 30, Failures: 0, Errors: 0, Skipped: 0, Time elapsed: 0.024 s - in org.eclipse.handly.model.ElementsTest
testEnsureReconciled(org.eclipse.handly.model.ElementsTest)  Time elapsed: 0.002 s
testNoSourceElementInfo(org.eclipse.handly.model.ElementsTest)  Time elapsed: 0 s
testFindLastMatchingAncestorUntil(org.eclipse.handly.model.ElementsTest)  Time elapsed: 0.002 s
testFindCommonAncestor(org.eclipse.handly.model.ElementsTest)  Time elapsed: 0 s
testFindAncestorOfType(org.eclipse.handly.model.ElementsTest)  Time elapsed: 0 s
testIsOfModel(org.eclipse.handly.model.ElementsTest)  Time elapsed: 0 s
testCollectParentChainUntil(org.eclipse.handly.model.ElementsTest)  Time elapsed: 0 s
testSplitIntoElementsAndResources(org.eclipse.handly.model.ElementsTest)  Time elapsed: 0.001 s
testGetParentChain(org.eclipse.handly.model.ElementsTest)  Time elapsed: 0.005 s
testGetSourceElementInfo2(org.eclipse.handly.model.ElementsTest)  Time elapsed: 0.002 s
testIsAncestorOf(org.eclipse.handly.model.ElementsTest)  Time elapsed: 0 s
testRemoveDescendants(org.eclipse.handly.model.ElementsTest)  Time elapsed: 0 s
testGetName(org.eclipse.handly.model.ElementsTest)  Time elapsed: 0 s
testGetRoot(org.eclipse.handly.model.ElementsTest)  Time elapsed: 0 s
testFindAncestorOfTypeUntil(org.eclipse.handly.model.ElementsTest)  Time elapsed: 0 s
testFindLastAncestorOfTypeUntil(org.eclipse.handly.model.ElementsTest)  Time elapsed: 0 s
testFindMatchingAncestorUntil(org.eclipse.handly.model.ElementsTest)  Time elapsed: 0.002 s
testGetSourceFile(org.eclipse.handly.model.ElementsTest)  Time elapsed: 0 s
testCollectParentChain(org.eclipse.handly.model.ElementsTest)  Time elapsed: 0 s
testFindLastMatchingAncestor(org.eclipse.handly.model.ElementsTest)  Time elapsed: 0.001 s
testFindCommonAncestor2(org.eclipse.handly.model.ElementsTest)  Time elapsed: 0 s
testFindLastAncestorOfType(org.eclipse.handly.model.ElementsTest)  Time elapsed: 0.001 s
testStreamParentChainUntil(org.eclipse.handly.model.ElementsTest)  Time elapsed: 0.001 s
testFindCommonAncestorUntil(org.eclipse.handly.model.ElementsTest)  Time elapsed: 0 s
testGetSourceElementAt2(org.eclipse.handly.model.ElementsTest)  Time elapsed: 0.001 s
testStreamParentChain(org.eclipse.handly.model.ElementsTest)  Time elapsed: 0.001 s
testGetParent(org.eclipse.handly.model.ElementsTest)  Time elapsed: 0 s
testFindMatchingAncestor(org.eclipse.handly.model.ElementsTest)  Time elapsed: 0.001 s
testGetParentChainUntil(org.eclipse.handly.model.ElementsTest)  Time elapsed: 0 s
testFindCommonAncestorUntil2(org.eclipse.handly.model.ElementsTest)  Time elapsed: 0 s
Running org.eclipse.handly.model.ElementDeltasTest
Tests run: 8, Failures: 0, Errors: 0, Skipped: 0, Time elapsed: 0.002 s - in org.eclipse.handly.model.ElementDeltasTest
test01(org.eclipse.handly.model.ElementDeltasTest)  Time elapsed: 0 s
test02(org.eclipse.handly.model.ElementDeltasTest)  Time elapsed: 0 s
test03(org.eclipse.handly.model.ElementDeltasTest)  Time elapsed: 0 s
test04(org.eclipse.handly.model.ElementDeltasTest)  Time elapsed: 0 s
test05(org.eclipse.handly.model.ElementDeltasTest)  Time elapsed: 0 s
test06(org.eclipse.handly.model.ElementDeltasTest)  Time elapsed: 0 s
test07(org.eclipse.handly.model.ElementDeltasTest)  Time elapsed: 0.001 s
test08(org.eclipse.handly.model.ElementDeltasTest)  Time elapsed: 0 s
Running org.eclipse.handly.context.ContextsTest
Tests run: 13, Failures: 0, Errors: 0, Skipped: 0, Time elapsed: 0.003 s - in org.eclipse.handly.context.ContextsTest
testCompositeContext1(org.eclipse.handly.context.ContextsTest)  Time elapsed: 0.001 s
testCompositeContext2(org.eclipse.handly.context.ContextsTest)  Time elapsed: 0 s
testCompositeContext3(org.eclipse.handly.context.ContextsTest)  Time elapsed: 0 s
testCompositeContext4(org.eclipse.handly.context.ContextsTest)  Time elapsed: 0 s
testCompositeContext5(org.eclipse.handly.context.ContextsTest)  Time elapsed: 0 s
testCompositeContext6(org.eclipse.handly.context.ContextsTest)  Time elapsed: 0 s
testCompositeContext7(org.eclipse.handly.context.ContextsTest)  Time elapsed: 0 s
testCompositeContext8(org.eclipse.handly.context.ContextsTest)  Time elapsed: 0 s
testSingletonContext1(org.eclipse.handly.context.ContextsTest)  Time elapsed: 0 s
testSingletonContext2(org.eclipse.handly.context.ContextsTest)  Time elapsed: 0 s
testSingletonContext3(org.eclipse.handly.context.ContextsTest)  Time elapsed: 0 s
testSingletonContext4(org.eclipse.handly.context.ContextsTest)  Time elapsed: 0 s
testEmptyContext(org.eclipse.handly.context.ContextsTest)  Time elapsed: 0 s
Running org.eclipse.handly.context.GuiceContextTest
Tests run: 8, Failures: 0, Errors: 0, Skipped: 0, Time elapsed: 0.228 s - in org.eclipse.handly.context.GuiceContextTest
test01(org.eclipse.handly.context.GuiceContextTest)  Time elapsed: 0.001 s
test02(org.eclipse.handly.context.GuiceContextTest)  Time elapsed: 0.001 s
test03(org.eclipse.handly.context.GuiceContextTest)  Time elapsed: 0.001 s
test04(org.eclipse.handly.context.GuiceContextTest)  Time elapsed: 0.007 s
test05(org.eclipse.handly.context.GuiceContextTest)  Time elapsed: 0 s
test06(org.eclipse.handly.context.GuiceContextTest)  Time elapsed: 0 s
test07(org.eclipse.handly.context.GuiceContextTest)  Time elapsed: 0 s
test08(org.eclipse.handly.context.GuiceContextTest)  Time elapsed: 0.002 s
Running org.eclipse.handly.context.ContextTest
Tests run: 16, Failures: 0, Errors: 0, Skipped: 0, Time elapsed: 0.011 s - in org.eclipse.handly.context.ContextTest
test01(org.eclipse.handly.context.ContextTest)  Time elapsed: 0 s
test02(org.eclipse.handly.context.ContextTest)  Time elapsed: 0 s
test03(org.eclipse.handly.context.ContextTest)  Time elapsed: 0 s
test04(org.eclipse.handly.context.ContextTest)  Time elapsed: 0.001 s
test05(org.eclipse.handly.context.ContextTest)  Time elapsed: 0 s
test06(org.eclipse.handly.context.ContextTest)  Time elapsed: 0 s
test07(org.eclipse.handly.context.ContextTest)  Time elapsed: 0 s
test08(org.eclipse.handly.context.ContextTest)  Time elapsed: 0 s
test09(org.eclipse.handly.context.ContextTest)  Time elapsed: 0 s
test10(org.eclipse.handly.context.ContextTest)  Time elapsed: 0 s
test11(org.eclipse.handly.context.ContextTest)  Time elapsed: 0 s
test12(org.eclipse.handly.context.ContextTest)  Time elapsed: 0 s
test13(org.eclipse.handly.context.ContextTest)  Time elapsed: 0 s
test14(org.eclipse.handly.context.ContextTest)  Time elapsed: 0 s
test15(org.eclipse.handly.context.ContextTest)  Time elapsed: 0.006 s
test16(org.eclipse.handly.context.ContextTest)  Time elapsed: 0 s
Running org.eclipse.handly.buffer.ChildBufferTest
Tests run: 5, Failures: 0, Errors: 0, Skipped: 0, Time elapsed: 0.003 s - in org.eclipse.handly.buffer.ChildBufferTest
test1(org.eclipse.handly.buffer.ChildBufferTest)  Time elapsed: 0.001 s
test2(org.eclipse.handly.buffer.ChildBufferTest)  Time elapsed: 0 s
test3(org.eclipse.handly.buffer.ChildBufferTest)  Time elapsed: 0 s
test4(org.eclipse.handly.buffer.ChildBufferTest)  Time elapsed: 0.001 s
test5(org.eclipse.handly.buffer.ChildBufferTest)  Time elapsed: 0 s
Running org.eclipse.handly.buffer.UiBufferChangeRunnerTest
Tests run: 3, Failures: 0, Errors: 0, Skipped: 0, Time elapsed: 0.008 s - in org.eclipse.handly.buffer.UiBufferChangeRunnerTest
test1(org.eclipse.handly.buffer.UiBufferChangeRunnerTest)  Time elapsed: 0.003 s
test2(org.eclipse.handly.buffer.UiBufferChangeRunnerTest)  Time elapsed: 0.002 s
test3(org.eclipse.handly.buffer.UiBufferChangeRunnerTest)  Time elapsed: 0.001 s
Running org.eclipse.handly.buffer.CoreTextFileBufferProviderTest
Tests run: 3, Failures: 0, Errors: 0, Skipped: 0, Time elapsed: 0.02 s - in org.eclipse.handly.buffer.CoreTextFileBufferProviderTest
test1(org.eclipse.handly.buffer.CoreTextFileBufferProviderTest)  Time elapsed: 0.017 s
test2(org.eclipse.handly.buffer.CoreTextFileBufferProviderTest)  Time elapsed: 0.002 s
test3(org.eclipse.handly.buffer.CoreTextFileBufferProviderTest)  Time elapsed: 0 s
Running org.eclipse.handly.buffer.TextFileBufferTest
Tests run: 2, Failures: 0, Errors: 0, Skipped: 0, Time elapsed: 3.875 s - in org.eclipse.handly.buffer.TextFileBufferTest
testSaveListener(org.eclipse.handly.buffer.TextFileBufferTest)  Time elapsed: 2.028 s
testBug496840(org.eclipse.handly.buffer.TextFileBufferTest)  Time elapsed: 1.786 s
Running org.eclipse.handly.buffer.BufferChangeOperationTest
Tests run: 4, Failures: 0, Errors: 0, Skipped: 0, Time elapsed: 0.015 s - in org.eclipse.handly.buffer.BufferChangeOperationTest
test1(org.eclipse.handly.buffer.BufferChangeOperationTest)  Time elapsed: 0 s
test2(org.eclipse.handly.buffer.BufferChangeOperationTest)  Time elapsed: 0.014 s
test3(org.eclipse.handly.buffer.BufferChangeOperationTest)  Time elapsed: 0 s
test4(org.eclipse.handly.buffer.BufferChangeOperationTest)  Time elapsed: 0 s
Running org.eclipse.handly.snapshot.ResourceTextFileBufferSnapshotTest
Tests run: 6, Failures: 0, Errors: 0, Skipped: 0, Time elapsed: 0.167 s - in org.eclipse.handly.snapshot.ResourceTextFileBufferSnapshotTest
test1(org.eclipse.handly.snapshot.ResourceTextFileBufferSnapshotTest)  Time elapsed: 0.078 s
test2(org.eclipse.handly.snapshot.ResourceTextFileBufferSnapshotTest)  Time elapsed: 0.009 s
test3(org.eclipse.handly.snapshot.ResourceTextFileBufferSnapshotTest)  Time elapsed: 0.008 s
test4(org.eclipse.handly.snapshot.ResourceTextFileBufferSnapshotTest)  Time elapsed: 0.01 s
test5(org.eclipse.handly.snapshot.ResourceTextFileBufferSnapshotTest)  Time elapsed: 0.008 s
test6(org.eclipse.handly.snapshot.ResourceTextFileBufferSnapshotTest)  Time elapsed: 0.054 s
Running org.eclipse.handly.snapshot.TextFileSnapshotTest
Tests run: 15, Failures: 0, Errors: 0, Skipped: 0, Time elapsed: 0.133 s - in org.eclipse.handly.snapshot.TextFileSnapshotTest
test01(org.eclipse.handly.snapshot.TextFileSnapshotTest)  Time elapsed: 0.008 s
test02(org.eclipse.handly.snapshot.TextFileSnapshotTest)  Time elapsed: 0.006 s
test03(org.eclipse.handly.snapshot.TextFileSnapshotTest)  Time elapsed: 0.007 s
test04(org.eclipse.handly.snapshot.TextFileSnapshotTest)  Time elapsed: 0.007 s
test05(org.eclipse.handly.snapshot.TextFileSnapshotTest)  Time elapsed: 0.007 s
test06(org.eclipse.handly.snapshot.TextFileSnapshotTest)  Time elapsed: 0.007 s
test07(org.eclipse.handly.snapshot.TextFileSnapshotTest)  Time elapsed: 0.006 s
test08(org.eclipse.handly.snapshot.TextFileSnapshotTest)  Time elapsed: 0.036 s
test09(org.eclipse.handly.snapshot.TextFileSnapshotTest)  Time elapsed: 0.007 s
test10(org.eclipse.handly.snapshot.TextFileSnapshotTest)  Time elapsed: 0.007 s
test11(org.eclipse.handly.snapshot.TextFileSnapshotTest)  Time elapsed: 0.006 s
test12(org.eclipse.handly.snapshot.TextFileSnapshotTest)  Time elapsed: 0.006 s
test13(org.eclipse.handly.snapshot.TextFileSnapshotTest)  Time elapsed: 0.006 s
test14(org.eclipse.handly.snapshot.TextFileSnapshotTest)  Time elapsed: 0.006 s
test15(org.eclipse.handly.snapshot.TextFileSnapshotTest)  Time elapsed: 0.01 s
Running org.eclipse.handly.snapshot.TextFileSnapshotWsTest
Tests run: 5, Failures: 0, Errors: 0, Skipped: 0, Time elapsed: 0.106 s - in org.eclipse.handly.snapshot.TextFileSnapshotWsTest
test1(org.eclipse.handly.snapshot.TextFileSnapshotWsTest)  Time elapsed: 0.075 s
test2(org.eclipse.handly.snapshot.TextFileSnapshotWsTest)  Time elapsed: 0.013 s
test3(org.eclipse.handly.snapshot.TextFileSnapshotWsTest)  Time elapsed: 0.006 s
test4(org.eclipse.handly.snapshot.TextFileSnapshotWsTest)  Time elapsed: 0.006 s
test5(org.eclipse.handly.snapshot.TextFileSnapshotWsTest)  Time elapsed: 0.005 s
Running org.eclipse.handly.snapshot.FileStoreTextFileBufferSnapshotTest
Tests run: 5, Failures: 0, Errors: 0, Skipped: 0, Time elapsed: 0.028 s - in org.eclipse.handly.snapshot.FileStoreTextFileBufferSnapshotTest
test1(org.eclipse.handly.snapshot.FileStoreTextFileBufferSnapshotTest)  Time elapsed: 0.005 s
test2(org.eclipse.handly.snapshot.FileStoreTextFileBufferSnapshotTest)  Time elapsed: 0.006 s
test3(org.eclipse.handly.snapshot.FileStoreTextFileBufferSnapshotTest)  Time elapsed: 0.005 s
test4(org.eclipse.handly.snapshot.FileStoreTextFileBufferSnapshotTest)  Time elapsed: 0.006 s
test5(org.eclipse.handly.snapshot.FileStoreTextFileBufferSnapshotTest)  Time elapsed: 0.005 s
Running org.eclipse.handly.snapshot.TextFileStoreSnapshotTest
Tests run: 1, Failures: 0, Errors: 0, Skipped: 0, Time elapsed: 0.006 s - in org.eclipse.handly.snapshot.TextFileStoreSnapshotTest
test1(org.eclipse.handly.snapshot.TextFileStoreSnapshotTest)  Time elapsed: 0.006 s
Running org.eclipse.handly.snapshot.EqualityPredictionTest
Tests run: 10, Failures: 0, Errors: 0, Skipped: 0, Time elapsed: 0.066 s - in org.eclipse.handly.snapshot.EqualityPredictionTest
test01(org.eclipse.handly.snapshot.EqualityPredictionTest)  Time elapsed: 0.007 s
test02(org.eclipse.handly.snapshot.EqualityPredictionTest)  Time elapsed: 0.006 s
test03(org.eclipse.handly.snapshot.EqualityPredictionTest)  Time elapsed: 0.005 s
test04(org.eclipse.handly.snapshot.EqualityPredictionTest)  Time elapsed: 0.006 s
test05(org.eclipse.handly.snapshot.EqualityPredictionTest)  Time elapsed: 0.005 s
test06(org.eclipse.handly.snapshot.EqualityPredictionTest)  Time elapsed: 0.006 s
test07(org.eclipse.handly.snapshot.EqualityPredictionTest)  Time elapsed: 0.005 s
test08(org.eclipse.handly.snapshot.EqualityPredictionTest)  Time elapsed: 0.007 s
test09(org.eclipse.handly.snapshot.EqualityPredictionTest)  Time elapsed: 0.006 s
test10(org.eclipse.handly.snapshot.EqualityPredictionTest)  Time elapsed: 0.012 s
Running org.eclipse.handly.text.DocumentChangeOperationTest
Tests run: 4, Failures: 0, Errors: 0, Skipped: 0, Time elapsed: 0.003 s - in org.eclipse.handly.text.DocumentChangeOperationTest
test1(org.eclipse.handly.text.DocumentChangeOperationTest)  Time elapsed: 0.001 s
test2(org.eclipse.handly.text.DocumentChangeOperationTest)  Time elapsed: 0 s
test3(org.eclipse.handly.text.DocumentChangeOperationTest)  Time elapsed: 0 s
test4(org.eclipse.handly.text.DocumentChangeOperationTest)  Time elapsed: 0.001 s
Running org.eclipse.handly.text.UiDocumentChangeRunnerTest
Tests run: 3, Failures: 0, Errors: 0, Skipped: 0, Time elapsed: 0.004 s - in org.eclipse.handly.text.UiDocumentChangeRunnerTest
test1(org.eclipse.handly.text.UiDocumentChangeRunnerTest)  Time elapsed: 0.001 s
test2(org.eclipse.handly.text.UiDocumentChangeRunnerTest)  Time elapsed: 0.001 s
test3(org.eclipse.handly.text.UiDocumentChangeRunnerTest)  Time elapsed: 0.001 s
Running org.eclipse.handly.util.PropertyTest
Tests run: 6, Failures: 0, Errors: 0, Skipped: 0, Time elapsed: 0.003 s - in org.eclipse.handly.util.PropertyTest
test1(org.eclipse.handly.util.PropertyTest)  Time elapsed: 0 s
test2(org.eclipse.handly.util.PropertyTest)  Time elapsed: 0 s
test3(org.eclipse.handly.util.PropertyTest)  Time elapsed: 0.001 s
test4(org.eclipse.handly.util.PropertyTest)  Time elapsed: 0 s
test5(org.eclipse.handly.util.PropertyTest)  Time elapsed: 0 s
test6(org.eclipse.handly.util.PropertyTest)  Time elapsed: 0.001 s
Running org.eclipse.handly.util.SimpleSynchronizerTest
Tests run: 1, Failures: 0, Errors: 0, Skipped: 0, Time elapsed: 0.001 s - in org.eclipse.handly.util.SimpleSynchronizerTest
test1(org.eclipse.handly.util.SimpleSynchronizerTest)  Time elapsed: 0.001 s
Running org.eclipse.handly.util.TextRangeTest
Tests run: 6, Failures: 0, Errors: 0, Skipped: 0, Time elapsed: 0.001 s - in org.eclipse.handly.util.TextRangeTest
test1(org.eclipse.handly.util.TextRangeTest)  Time elapsed: 0 s
test2(org.eclipse.handly.util.TextRangeTest)  Time elapsed: 0 s
test3(org.eclipse.handly.util.TextRangeTest)  Time elapsed: 0 s
test4(org.eclipse.handly.util.TextRangeTest)  Time elapsed: 0 s
test5(org.eclipse.handly.util.TextRangeTest)  Time elapsed: 0 s
test6(org.eclipse.handly.util.TextRangeTest)  Time elapsed: 0 s
Running org.eclipse.handly.util.LruCacheTest
Tests run: 3, Failures: 0, Errors: 0, Skipped: 0, Time elapsed: 0.001 s - in org.eclipse.handly.util.LruCacheTest
test1(org.eclipse.handly.util.LruCacheTest)  Time elapsed: 0 s
test2(org.eclipse.handly.util.LruCacheTest)  Time elapsed: 0 s
test3(org.eclipse.handly.util.LruCacheTest)  Time elapsed: 0 s
Running org.eclipse.handly.util.BoundedLruCacheTest
Tests run: 3, Failures: 0, Errors: 0, Skipped: 0, Time elapsed: 0.001 s - in org.eclipse.handly.util.BoundedLruCacheTest
test1(org.eclipse.handly.util.BoundedLruCacheTest)  Time elapsed: 0 s
test2(org.eclipse.handly.util.BoundedLruCacheTest)  Time elapsed: 0 s
test3(org.eclipse.handly.util.BoundedLruCacheTest)  Time elapsed: 0 s
Running org.eclipse.handly.util.ArrayUtilTest
Tests run: 14, Failures: 0, Errors: 0, Skipped: 0, Time elapsed: 0.005 s - in org.eclipse.handly.util.ArrayUtilTest
testLastIndexOfMatching(org.eclipse.handly.util.ArrayUtilTest)  Time elapsed: 0.001 s
testOnlyElementsOfType(org.eclipse.handly.util.ArrayUtilTest)  Time elapsed: 0 s
testContainsMatching(org.eclipse.handly.util.ArrayUtilTest)  Time elapsed: 0.001 s
testUnion(org.eclipse.handly.util.ArrayUtilTest)  Time elapsed: 0 s
testLastIndexOf(org.eclipse.handly.util.ArrayUtilTest)  Time elapsed: 0 s
testHasElementsNotOfType(org.eclipse.handly.util.ArrayUtilTest)  Time elapsed: 0 s
testCollectMatching(org.eclipse.handly.util.ArrayUtilTest)  Time elapsed: 0.001 s
testContains(org.eclipse.handly.util.ArrayUtilTest)  Time elapsed: 0 s
testConcat(org.eclipse.handly.util.ArrayUtilTest)  Time elapsed: 0 s
testElementsOfType(org.eclipse.handly.util.ArrayUtilTest)  Time elapsed: 0 s
testIndexOf(org.eclipse.handly.util.ArrayUtilTest)  Time elapsed: 0 s
testIndexOfMatching(org.eclipse.handly.util.ArrayUtilTest)  Time elapsed: 0.001 s
testHasElementsOfType(org.eclipse.handly.util.ArrayUtilTest)  Time elapsed: 0 s
testSetMinus(org.eclipse.handly.util.ArrayUtilTest)  Time elapsed: 0 s
Running org.eclipse.handly.refactoring.SourceFileChangeTest
Tests run: 10, Failures: 0, Errors: 0, Skipped: 0, Time elapsed: 0.173 s - in org.eclipse.handly.refactoring.SourceFileChangeTest
test01(org.eclipse.handly.refactoring.SourceFileChangeTest)  Time elapsed: 0.01 s
test02(org.eclipse.handly.refactoring.SourceFileChangeTest)  Time elapsed: 0.005 s
test03(org.eclipse.handly.refactoring.SourceFileChangeTest)  Time elapsed: 0.043 s
test04(org.eclipse.handly.refactoring.SourceFileChangeTest)  Time elapsed: 0.007 s
test05(org.eclipse.handly.refactoring.SourceFileChangeTest)  Time elapsed: 0.007 s
test06(org.eclipse.handly.refactoring.SourceFileChangeTest)  Time elapsed: 0.021 s
test07(org.eclipse.handly.refactoring.SourceFileChangeTest)  Time elapsed: 0.061 s
test08(org.eclipse.handly.refactoring.SourceFileChangeTest)  Time elapsed: 0.006 s
test09(org.eclipse.handly.refactoring.SourceFileChangeTest)  Time elapsed: 0.005 s
test10(org.eclipse.handly.refactoring.SourceFileChangeTest)  Time elapsed: 0.006 s
Running org.eclipse.handly.internal.DisplaySynchronizerTest

(SWT:398): Gdk-CRITICAL **: 18:27:17.657: gdk_threads_set_lock_functions: assertion 'gdk_threads_lock == NULL && gdk_threads_unlock == NULL' failed

(SWT:398): Gdk-CRITICAL **: 18:27:17.716: gdk_threads_set_lock_functions: assertion 'gdk_threads_lock == NULL && gdk_threads_unlock == NULL' failed

(SWT:398): Gdk-CRITICAL **: 18:27:17.762: gdk_threads_set_lock_functions: assertion 'gdk_threads_lock == NULL && gdk_threads_unlock == NULL' failed

(SWT:398): Gdk-CRITICAL **: 18:27:17.800: gdk_threads_set_lock_functions: assertion 'gdk_threads_lock == NULL && gdk_threads_unlock == NULL' failed
Tests run: 4, Failures: 0, Errors: 0, Skipped: 0, Time elapsed: 0.181 s - in org.eclipse.handly.internal.DisplaySynchronizerTest
test1(org.eclipse.handly.internal.DisplaySynchronizerTest)  Time elapsed: 0.059 s
test2(org.eclipse.handly.internal.DisplaySynchronizerTest)  Time elapsed: 0.046 s
test3(org.eclipse.handly.internal.DisplaySynchronizerTest)  Time elapsed: 0.038 s
test4(org.eclipse.handly.internal.DisplaySynchronizerTest)  Time elapsed: 0.037 s

Results:

Tests run: 317, Failures: 0, Errors: 0, Skipped: 0

[INFO] All tests passed!
[INFO] 
[INFO] --- eclipse-jarsigner-plugin:1.3.1:sign (sign) @ org.eclipse.handly.tests ---
[INFO] Signing jar: /home/jenkins/agent/workspace/1.7.x/org.eclipse.handly.tests/target/org.eclipse.handly.tests-1.7.0-SNAPSHOT.jar
[INFO] Signing jar: /home/jenkins/agent/workspace/1.7.x/org.eclipse.handly.tests/target/org.eclipse.handly.tests-1.7.0-SNAPSHOT-sources.jar
[INFO] 
[INFO] ----------< org.eclipse.handly.bundles:org.eclipse.handly.ui >----------
[INFO] Building org.eclipse.handly.ui 1.7.0-SNAPSHOT                     [5/26]
[INFO] ---------------------------[ eclipse-plugin ]---------------------------
[INFO] 
[INFO] --- maven-clean-plugin:2.5:clean (default-clean) @ org.eclipse.handly.ui ---
[INFO] 
[INFO] --- tycho-packaging-plugin:2.5.0:build-qualifier (default-build-qualifier) @ org.eclipse.handly.ui ---
[INFO] The project's OSGi version is 1.7.0.v20220614-1826
[INFO] 
[INFO] --- tycho-packaging-plugin:2.5.0:validate-id (default-validate-id) @ org.eclipse.handly.ui ---
[INFO] 
[INFO] --- tycho-packaging-plugin:2.5.0:validate-version (default-validate-version) @ org.eclipse.handly.ui ---
[INFO] 
[INFO] --- target-platform-configuration:2.5.0:target-platform (default-target-platform) @ org.eclipse.handly.ui ---
[INFO] 
[INFO] --- maven-resources-plugin:2.4.3:resources (default-resources) @ org.eclipse.handly.ui ---
[INFO] Using 'UTF-8' encoding to copy filtered resources.
[INFO] skip non existing resourceDirectory /home/jenkins/agent/workspace/1.7.x/org.eclipse.handly.ui/src/main/resources
[INFO] 
[INFO] --- tycho-compiler-plugin:2.5.0:compile (default-compile) @ org.eclipse.handly.ui ---
[INFO] Compiling 138 source files to /home/jenkins/agent/workspace/1.7.x/org.eclipse.handly.ui/target/classes
[INFO] 
[INFO] --- maven-resources-plugin:2.4.3:testResources (default-testResources) @ org.eclipse.handly.ui ---
[INFO] Using 'UTF-8' encoding to copy filtered resources.
[INFO] skip non existing resourceDirectory /home/jenkins/agent/workspace/1.7.x/org.eclipse.handly.ui/src/test/resources
[INFO] 
[INFO] --- tycho-compiler-plugin:2.5.0:testCompile (default-testCompile) @ org.eclipse.handly.ui ---
[INFO] 
[INFO] --- maven-surefire-plugin:2.22.2:test (default-test) @ org.eclipse.handly.ui ---
[INFO] No tests to run.
[INFO] 
[INFO] --- tycho-source-plugin:2.5.0:plugin-source (plugin-source) @ org.eclipse.handly.ui ---
[INFO] Building jar: /home/jenkins/agent/workspace/1.7.x/org.eclipse.handly.ui/target/org.eclipse.handly.ui-1.7.0-SNAPSHOT-sources.jar
[INFO] 
[INFO] --- tycho-packaging-plugin:2.5.0:package-plugin (default-package-plugin) @ org.eclipse.handly.ui ---
[INFO] Building jar: /home/jenkins/agent/workspace/1.7.x/org.eclipse.handly.ui/target/org.eclipse.handly.ui-1.7.0-SNAPSHOT.jar
[INFO] 
[INFO] --- tycho-p2-plugin:2.5.0:p2-metadata-default (default-p2-metadata-default) @ org.eclipse.handly.ui ---
[INFO] 
[INFO] --- tycho-source-plugin:2.5.0:feature-source (feature-source) @ org.eclipse.handly.ui ---
[INFO] 
[INFO] --- tycho-surefire-plugin:2.5.0:integration-test (default-integration-test) @ org.eclipse.handly.ui ---
[INFO] 
[INFO] --- maven-failsafe-plugin:2.22.2:verify (default-verify) @ org.eclipse.handly.ui ---
[INFO] No tests to run.
[INFO] 
[INFO] --- eclipse-jarsigner-plugin:1.3.1:sign (sign) @ org.eclipse.handly.ui ---
[INFO] Signing jar: /home/jenkins/agent/workspace/1.7.x/org.eclipse.handly.ui/target/org.eclipse.handly.ui-1.7.0-SNAPSHOT.jar
[INFO] Signing jar: /home/jenkins/agent/workspace/1.7.x/org.eclipse.handly.ui/target/org.eclipse.handly.ui-1.7.0-SNAPSHOT-sources.jar
[INFO] 
[INFO] --------< org.eclipse.handly.bundles:org.eclipse.handly.xtext >---------
[INFO] Building org.eclipse.handly.xtext 1.7.0-SNAPSHOT                  [6/26]
[INFO] ---------------------------[ eclipse-plugin ]---------------------------
[INFO] 
[INFO] --- maven-clean-plugin:2.5:clean (default-clean) @ org.eclipse.handly.xtext ---
[INFO] 
[INFO] --- tycho-packaging-plugin:2.5.0:build-qualifier (default-build-qualifier) @ org.eclipse.handly.xtext ---
[INFO] The project's OSGi version is 1.7.0.v20220614-1826
[INFO] 
[INFO] --- tycho-packaging-plugin:2.5.0:validate-id (default-validate-id) @ org.eclipse.handly.xtext ---
[INFO] 
[INFO] --- tycho-packaging-plugin:2.5.0:validate-version (default-validate-version) @ org.eclipse.handly.xtext ---
[INFO] 
[INFO] --- target-platform-configuration:2.5.0:target-platform (default-target-platform) @ org.eclipse.handly.xtext ---
[INFO] 
[INFO] --- maven-resources-plugin:2.4.3:resources (default-resources) @ org.eclipse.handly.xtext ---
[INFO] Using 'UTF-8' encoding to copy filtered resources.
[INFO] skip non existing resourceDirectory /home/jenkins/agent/workspace/1.7.x/org.eclipse.handly.xtext/src/main/resources
[INFO] 
[INFO] --- tycho-compiler-plugin:2.5.0:compile (default-compile) @ org.eclipse.handly.xtext ---
[INFO] Nothing to compile - all classes are up to date
[INFO] 
[INFO] --- maven-resources-plugin:2.4.3:testResources (default-testResources) @ org.eclipse.handly.xtext ---
[INFO] Using 'UTF-8' encoding to copy filtered resources.
[INFO] skip non existing resourceDirectory /home/jenkins/agent/workspace/1.7.x/org.eclipse.handly.xtext/src/test/resources
[INFO] 
[INFO] --- tycho-compiler-plugin:2.5.0:testCompile (default-testCompile) @ org.eclipse.handly.xtext ---
[INFO] 
[INFO] --- maven-surefire-plugin:2.22.2:test (default-test) @ org.eclipse.handly.xtext ---
[INFO] No tests to run.
[INFO] 
[INFO] --- tycho-source-plugin:2.5.0:plugin-source (plugin-source) @ org.eclipse.handly.xtext ---
[INFO] Building jar: /home/jenkins/agent/workspace/1.7.x/org.eclipse.handly.xtext/target/org.eclipse.handly.xtext-1.7.0-SNAPSHOT-sources.jar
[INFO] 
[INFO] --- tycho-packaging-plugin:2.5.0:package-plugin (default-package-plugin) @ org.eclipse.handly.xtext ---
[INFO] Building jar: /home/jenkins/agent/workspace/1.7.x/org.eclipse.handly.xtext/target/org.eclipse.handly.xtext-1.7.0-SNAPSHOT.jar
[INFO] 
[INFO] --- tycho-p2-plugin:2.5.0:p2-metadata-default (default-p2-metadata-default) @ org.eclipse.handly.xtext ---
[INFO] 
[INFO] --- tycho-source-plugin:2.5.0:feature-source (feature-source) @ org.eclipse.handly.xtext ---
[INFO] 
[INFO] --- tycho-surefire-plugin:2.5.0:integration-test (default-integration-test) @ org.eclipse.handly.xtext ---
[INFO] 
[INFO] --- maven-failsafe-plugin:2.22.2:verify (default-verify) @ org.eclipse.handly.xtext ---
[INFO] No tests to run.
[INFO] 
[INFO] --- eclipse-jarsigner-plugin:1.3.1:sign (sign) @ org.eclipse.handly.xtext ---
[INFO] Signing jar: /home/jenkins/agent/workspace/1.7.x/org.eclipse.handly.xtext/target/org.eclipse.handly.xtext-1.7.0-SNAPSHOT.jar
[INFO] Signing jar: /home/jenkins/agent/workspace/1.7.x/org.eclipse.handly.xtext/target/org.eclipse.handly.xtext-1.7.0-SNAPSHOT-sources.jar
[INFO] 
[INFO] -------< org.eclipse.handly.bundles:org.eclipse.handly.xtext.ui >-------
[INFO] Building org.eclipse.handly.xtext.ui 1.7.0-SNAPSHOT               [7/26]
[INFO] ---------------------------[ eclipse-plugin ]---------------------------
[INFO] 
[INFO] --- maven-clean-plugin:2.5:clean (default-clean) @ org.eclipse.handly.xtext.ui ---
[INFO] 
[INFO] --- tycho-packaging-plugin:2.5.0:build-qualifier (default-build-qualifier) @ org.eclipse.handly.xtext.ui ---
[INFO] The project's OSGi version is 1.7.0.v20220614-1826
[INFO] 
[INFO] --- tycho-packaging-plugin:2.5.0:validate-id (default-validate-id) @ org.eclipse.handly.xtext.ui ---
[INFO] 
[INFO] --- tycho-packaging-plugin:2.5.0:validate-version (default-validate-version) @ org.eclipse.handly.xtext.ui ---
[INFO] 
[INFO] --- target-platform-configuration:2.5.0:target-platform (default-target-platform) @ org.eclipse.handly.xtext.ui ---
[INFO] 
[INFO] --- maven-resources-plugin:2.4.3:resources (default-resources) @ org.eclipse.handly.xtext.ui ---
[INFO] Using 'UTF-8' encoding to copy filtered resources.
[INFO] skip non existing resourceDirectory /home/jenkins/agent/workspace/1.7.x/org.eclipse.handly.xtext.ui/src/main/resources
[INFO] 
[INFO] --- tycho-compiler-plugin:2.5.0:compile (default-compile) @ org.eclipse.handly.xtext.ui ---
[INFO] Compiling 20 source files to /home/jenkins/agent/workspace/1.7.x/org.eclipse.handly.xtext.ui/target/classes
[INFO] 
[INFO] --- maven-resources-plugin:2.4.3:testResources (default-testResources) @ org.eclipse.handly.xtext.ui ---
[INFO] Using 'UTF-8' encoding to copy filtered resources.
[INFO] skip non existing resourceDirectory /home/jenkins/agent/workspace/1.7.x/org.eclipse.handly.xtext.ui/src/test/resources
[INFO] 
[INFO] --- tycho-compiler-plugin:2.5.0:testCompile (default-testCompile) @ org.eclipse.handly.xtext.ui ---
[INFO] 
[INFO] --- maven-surefire-plugin:2.22.2:test (default-test) @ org.eclipse.handly.xtext.ui ---
[INFO] No tests to run.
[INFO] 
[INFO] --- tycho-source-plugin:2.5.0:plugin-source (plugin-source) @ org.eclipse.handly.xtext.ui ---
[INFO] Building jar: /home/jenkins/agent/workspace/1.7.x/org.eclipse.handly.xtext.ui/target/org.eclipse.handly.xtext.ui-1.7.0-SNAPSHOT-sources.jar
[INFO] 
[INFO] --- tycho-packaging-plugin:2.5.0:package-plugin (default-package-plugin) @ org.eclipse.handly.xtext.ui ---
[INFO] Building jar: /home/jenkins/agent/workspace/1.7.x/org.eclipse.handly.xtext.ui/target/org.eclipse.handly.xtext.ui-1.7.0-SNAPSHOT.jar
[INFO] 
[INFO] --- tycho-p2-plugin:2.5.0:p2-metadata-default (default-p2-metadata-default) @ org.eclipse.handly.xtext.ui ---
[INFO] 
[INFO] --- tycho-source-plugin:2.5.0:feature-source (feature-source) @ org.eclipse.handly.xtext.ui ---
[INFO] 
[INFO] --- tycho-surefire-plugin:2.5.0:integration-test (default-integration-test) @ org.eclipse.handly.xtext.ui ---
[INFO] 
[INFO] --- maven-failsafe-plugin:2.22.2:verify (default-verify) @ org.eclipse.handly.xtext.ui ---
[INFO] No tests to run.
[INFO] 
[INFO] --- eclipse-jarsigner-plugin:1.3.1:sign (sign) @ org.eclipse.handly.xtext.ui ---
[INFO] Signing jar: /home/jenkins/agent/workspace/1.7.x/org.eclipse.handly.xtext.ui/target/org.eclipse.handly.xtext.ui-1.7.0-SNAPSHOT.jar
[INFO] Signing jar: /home/jenkins/agent/workspace/1.7.x/org.eclipse.handly.xtext.ui/target/org.eclipse.handly.xtext.ui-1.7.0-SNAPSHOT-sources.jar
[INFO] 
[INFO] -------< org.eclipse.handly.bundles:org.eclipse.handly.examples >-------
[INFO] Building org.eclipse.handly.examples 1.7.0-SNAPSHOT               [8/26]
[INFO] ---------------------------[ eclipse-plugin ]---------------------------
[INFO] 
[INFO] --- maven-clean-plugin:2.5:clean (default-clean) @ org.eclipse.handly.examples ---
[INFO] 
[INFO] --- maven-antrun-plugin:1.8:run (clean-examples) @ org.eclipse.handly.examples ---
[INFO] Executing tasks

main:

clean_all_examples:
[INFO] Executed tasks
[INFO] 
[INFO] --- tycho-packaging-plugin:2.5.0:build-qualifier (default-build-qualifier) @ org.eclipse.handly.examples ---
[INFO] The project's OSGi version is 1.7.0.v20220614-1826
[INFO] 
[INFO] --- tycho-packaging-plugin:2.5.0:validate-id (default-validate-id) @ org.eclipse.handly.examples ---
[INFO] 
[INFO] --- tycho-packaging-plugin:2.5.0:validate-version (default-validate-version) @ org.eclipse.handly.examples ---
[INFO] 
[INFO] --- target-platform-configuration:2.5.0:target-platform (default-target-platform) @ org.eclipse.handly.examples ---
[INFO] 
[INFO] --- maven-resources-plugin:2.4.3:resources (default-resources) @ org.eclipse.handly.examples ---
[INFO] Using 'UTF-8' encoding to copy filtered resources.
[INFO] skip non existing resourceDirectory /home/jenkins/agent/workspace/1.7.x/org.eclipse.handly.examples/src/main/resources
[INFO] 
[INFO] --- tycho-compiler-plugin:2.5.0:compile (default-compile) @ org.eclipse.handly.examples ---
[INFO] 
[INFO] --- maven-resources-plugin:2.4.3:testResources (default-testResources) @ org.eclipse.handly.examples ---
[INFO] Using 'UTF-8' encoding to copy filtered resources.
[INFO] skip non existing resourceDirectory /home/jenkins/agent/workspace/1.7.x/org.eclipse.handly.examples/src/test/resources
[INFO] 
[INFO] --- tycho-compiler-plugin:2.5.0:testCompile (default-testCompile) @ org.eclipse.handly.examples ---
[INFO] 
[INFO] --- maven-surefire-plugin:2.22.2:test (default-test) @ org.eclipse.handly.examples ---
[INFO] No tests to run.
[INFO] 
[INFO] --- tycho-source-plugin:2.5.0:plugin-source (plugin-source) @ org.eclipse.handly.examples ---
[INFO] Building jar: /home/jenkins/agent/workspace/1.7.x/org.eclipse.handly.examples/target/org.eclipse.handly.examples-1.7.0-SNAPSHOT-sources.jar
[INFO] 
[INFO] --- maven-antrun-plugin:1.8:run (package-examples) @ org.eclipse.handly.examples ---
[INFO] Executing tasks

main:

zip_all_examples:
      [zip] Building zip: /home/jenkins/agent/workspace/1.7.x/org.eclipse.handly.examples/contents/org.eclipse.handly.examples.adapter.zip
      [zip] Building zip: /home/jenkins/agent/workspace/1.7.x/org.eclipse.handly.examples/contents/org.eclipse.handly.examples.adapter.ui.zip
      [zip] Building zip: /home/jenkins/agent/workspace/1.7.x/org.eclipse.handly.examples/contents/org.eclipse.handly.examples.basic.zip
      [zip] Building zip: /home/jenkins/agent/workspace/1.7.x/org.eclipse.handly.examples/contents/org.eclipse.handly.examples.basic.ide.zip
      [zip] Building zip: /home/jenkins/agent/workspace/1.7.x/org.eclipse.handly.examples/contents/org.eclipse.handly.examples.basic.ui.zip
      [zip] Building zip: /home/jenkins/agent/workspace/1.7.x/org.eclipse.handly.examples/contents/org.eclipse.handly.examples.basic.ui.tests.zip
      [zip] Building zip: /home/jenkins/agent/workspace/1.7.x/org.eclipse.handly.examples/contents/org.eclipse.handly.examples.jmodel.zip
      [zip] Building zip: /home/jenkins/agent/workspace/1.7.x/org.eclipse.handly.examples/contents/org.eclipse.handly.examples.jmodel.tests.zip
      [zip] Building zip: /home/jenkins/agent/workspace/1.7.x/org.eclipse.handly.examples/contents/org.eclipse.handly.examples.jmodel.ui.zip
      [zip] Building zip: /home/jenkins/agent/workspace/1.7.x/org.eclipse.handly.examples/contents/org.eclipse.handly.examples.xtext.xtext.ui.zip
[INFO] Executed tasks
[INFO] 
[INFO] --- tycho-packaging-plugin:2.5.0:package-plugin (default-package-plugin) @ org.eclipse.handly.examples ---
[INFO] Building jar: /home/jenkins/agent/workspace/1.7.x/org.eclipse.handly.examples/target/org.eclipse.handly.examples-1.7.0-SNAPSHOT.jar
[INFO] 
[INFO] --- tycho-p2-plugin:2.5.0:p2-metadata-default (default-p2-metadata-default) @ org.eclipse.handly.examples ---
[INFO] 
[INFO] --- tycho-source-plugin:2.5.0:feature-source (feature-source) @ org.eclipse.handly.examples ---
[INFO] 
[INFO] --- tycho-surefire-plugin:2.5.0:integration-test (default-integration-test) @ org.eclipse.handly.examples ---
[INFO] 
[INFO] --- maven-failsafe-plugin:2.22.2:verify (default-verify) @ org.eclipse.handly.examples ---
[INFO] No tests to run.
[INFO] 
[INFO] --- eclipse-jarsigner-plugin:1.3.1:sign (sign) @ org.eclipse.handly.examples ---
[INFO] Signing jar: /home/jenkins/agent/workspace/1.7.x/org.eclipse.handly.examples/target/org.eclipse.handly.examples-1.7.0-SNAPSHOT.jar
[INFO] Signing jar: /home/jenkins/agent/workspace/1.7.x/org.eclipse.handly.examples/target/org.eclipse.handly.examples-1.7.0-SNAPSHOT-sources.jar
[INFO] 
[INFO] ---< org.eclipse.handly.bundles:org.eclipse.handly.examples.adapter >---
[INFO] Building org.eclipse.handly.examples.adapter 1.7.0-SNAPSHOT       [9/26]
[INFO] ---------------------------[ eclipse-plugin ]---------------------------
[INFO] 
[INFO] --- maven-clean-plugin:2.5:clean (default-clean) @ org.eclipse.handly.examples.adapter ---
[INFO] 
[INFO] --- tycho-packaging-plugin:2.5.0:build-qualifier (default-build-qualifier) @ org.eclipse.handly.examples.adapter ---
[INFO] The project's OSGi version is 1.7.0.v20220614-1826
[INFO] 
[INFO] --- tycho-packaging-plugin:2.5.0:validate-id (default-validate-id) @ org.eclipse.handly.examples.adapter ---
[INFO] 
[INFO] --- tycho-packaging-plugin:2.5.0:validate-version (default-validate-version) @ org.eclipse.handly.examples.adapter ---
[INFO] 
[INFO] --- target-platform-configuration:2.5.0:target-platform (default-target-platform) @ org.eclipse.handly.examples.adapter ---
[INFO] 
[INFO] --- maven-resources-plugin:2.4.3:resources (default-resources) @ org.eclipse.handly.examples.adapter ---
[INFO] Using 'UTF-8' encoding to copy filtered resources.
[INFO] skip non existing resourceDirectory /home/jenkins/agent/workspace/1.7.x/org.eclipse.handly.examples.adapter/src/main/resources
[INFO] 
[INFO] --- tycho-compiler-plugin:2.5.0:compile (default-compile) @ org.eclipse.handly.examples.adapter ---
[INFO] Compiling 9 source files to /home/jenkins/agent/workspace/1.7.x/org.eclipse.handly.examples.adapter/target/classes
[INFO] 
[INFO] --- maven-resources-plugin:2.4.3:testResources (default-testResources) @ org.eclipse.handly.examples.adapter ---
[INFO] Using 'UTF-8' encoding to copy filtered resources.
[INFO] skip non existing resourceDirectory /home/jenkins/agent/workspace/1.7.x/org.eclipse.handly.examples.adapter/src/test/resources
[INFO] 
[INFO] --- tycho-compiler-plugin:2.5.0:testCompile (default-testCompile) @ org.eclipse.handly.examples.adapter ---
[INFO] 
[INFO] --- maven-surefire-plugin:2.22.2:test (default-test) @ org.eclipse.handly.examples.adapter ---
[INFO] No tests to run.
[INFO] 
[INFO] --- tycho-source-plugin:2.5.0:plugin-source (plugin-source) @ org.eclipse.handly.examples.adapter ---
[INFO] Building jar: /home/jenkins/agent/workspace/1.7.x/org.eclipse.handly.examples.adapter/target/org.eclipse.handly.examples.adapter-1.7.0-SNAPSHOT-sources.jar
[INFO] 
[INFO] --- tycho-packaging-plugin:2.5.0:package-plugin (default-package-plugin) @ org.eclipse.handly.examples.adapter ---
[INFO] Building jar: /home/jenkins/agent/workspace/1.7.x/org.eclipse.handly.examples.adapter/target/org.eclipse.handly.examples.adapter-1.7.0-SNAPSHOT.jar
[INFO] 
[INFO] --- tycho-p2-plugin:2.5.0:p2-metadata-default (default-p2-metadata-default) @ org.eclipse.handly.examples.adapter ---
[INFO] 
[INFO] --- tycho-source-plugin:2.5.0:feature-source (feature-source) @ org.eclipse.handly.examples.adapter ---
[INFO] 
[INFO] --- tycho-surefire-plugin:2.5.0:integration-test (default-integration-test) @ org.eclipse.handly.examples.adapter ---
[INFO] 
[INFO] --- maven-failsafe-plugin:2.22.2:verify (default-verify) @ org.eclipse.handly.examples.adapter ---
[INFO] No tests to run.
[INFO] 
[INFO] --- eclipse-jarsigner-plugin:1.3.1:sign (sign) @ org.eclipse.handly.examples.adapter ---
[INFO] Signing jar: /home/jenkins/agent/workspace/1.7.x/org.eclipse.handly.examples.adapter/target/org.eclipse.handly.examples.adapter-1.7.0-SNAPSHOT.jar
[INFO] Signing jar: /home/jenkins/agent/workspace/1.7.x/org.eclipse.handly.examples.adapter/target/org.eclipse.handly.examples.adapter-1.7.0-SNAPSHOT-sources.jar
[INFO] 
[INFO] --< org.eclipse.handly.bundles:org.eclipse.handly.examples.adapter.ui >--
[INFO] Building org.eclipse.handly.examples.adapter.ui 1.7.0-SNAPSHOT   [10/26]
[INFO] ---------------------------[ eclipse-plugin ]---------------------------
[INFO] 
[INFO] --- maven-clean-plugin:2.5:clean (default-clean) @ org.eclipse.handly.examples.adapter.ui ---
[INFO] 
[INFO] --- tycho-packaging-plugin:2.5.0:build-qualifier (default-build-qualifier) @ org.eclipse.handly.examples.adapter.ui ---
[INFO] The project's OSGi version is 1.7.0.v20220614-1826
[INFO] 
[INFO] --- tycho-packaging-plugin:2.5.0:validate-id (default-validate-id) @ org.eclipse.handly.examples.adapter.ui ---
[INFO] 
[INFO] --- tycho-packaging-plugin:2.5.0:validate-version (default-validate-version) @ org.eclipse.handly.examples.adapter.ui ---
[INFO] 
[INFO] --- target-platform-configuration:2.5.0:target-platform (default-target-platform) @ org.eclipse.handly.examples.adapter.ui ---
[INFO] 
[INFO] --- maven-resources-plugin:2.4.3:resources (default-resources) @ org.eclipse.handly.examples.adapter.ui ---
[INFO] Using 'UTF-8' encoding to copy filtered resources.
[INFO] skip non existing resourceDirectory /home/jenkins/agent/workspace/1.7.x/org.eclipse.handly.examples.adapter.ui/src/main/resources
[INFO] 
[INFO] --- tycho-compiler-plugin:2.5.0:compile (default-compile) @ org.eclipse.handly.examples.adapter.ui ---
[INFO] Compiling 23 source files to /home/jenkins/agent/workspace/1.7.x/org.eclipse.handly.examples.adapter.ui/target/classes
[INFO] 
[INFO] --- maven-resources-plugin:2.4.3:testResources (default-testResources) @ org.eclipse.handly.examples.adapter.ui ---
[INFO] Using 'UTF-8' encoding to copy filtered resources.
[INFO] skip non existing resourceDirectory /home/jenkins/agent/workspace/1.7.x/org.eclipse.handly.examples.adapter.ui/src/test/resources
[INFO] 
[INFO] --- tycho-compiler-plugin:2.5.0:testCompile (default-testCompile) @ org.eclipse.handly.examples.adapter.ui ---
[INFO] 
[INFO] --- maven-surefire-plugin:2.22.2:test (default-test) @ org.eclipse.handly.examples.adapter.ui ---
[INFO] No tests to run.
[INFO] 
[INFO] --- tycho-source-plugin:2.5.0:plugin-source (plugin-source) @ org.eclipse.handly.examples.adapter.ui ---
[INFO] Building jar: /home/jenkins/agent/workspace/1.7.x/org.eclipse.handly.examples.adapter.ui/target/org.eclipse.handly.examples.adapter.ui-1.7.0-SNAPSHOT-sources.jar
[INFO] 
[INFO] --- tycho-packaging-plugin:2.5.0:package-plugin (default-package-plugin) @ org.eclipse.handly.examples.adapter.ui ---
[INFO] Building jar: /home/jenkins/agent/workspace/1.7.x/org.eclipse.handly.examples.adapter.ui/target/org.eclipse.handly.examples.adapter.ui-1.7.0-SNAPSHOT.jar
[INFO] 
[INFO] --- tycho-p2-plugin:2.5.0:p2-metadata-default (default-p2-metadata-default) @ org.eclipse.handly.examples.adapter.ui ---
[INFO] 
[INFO] --- tycho-source-plugin:2.5.0:feature-source (feature-source) @ org.eclipse.handly.examples.adapter.ui ---
[INFO] 
[INFO] --- tycho-surefire-plugin:2.5.0:integration-test (default-integration-test) @ org.eclipse.handly.examples.adapter.ui ---
[INFO] 
[INFO] --- maven-failsafe-plugin:2.22.2:verify (default-verify) @ org.eclipse.handly.examples.adapter.ui ---
[INFO] No tests to run.
[INFO] 
[INFO] --- eclipse-jarsigner-plugin:1.3.1:sign (sign) @ org.eclipse.handly.examples.adapter.ui ---
[INFO] Signing jar: /home/jenkins/agent/workspace/1.7.x/org.eclipse.handly.examples.adapter.ui/target/org.eclipse.handly.examples.adapter.ui-1.7.0-SNAPSHOT.jar
[INFO] Signing jar: /home/jenkins/agent/workspace/1.7.x/org.eclipse.handly.examples.adapter.ui/target/org.eclipse.handly.examples.adapter.ui-1.7.0-SNAPSHOT-sources.jar
[INFO] 
[INFO] ----< org.eclipse.handly.bundles:org.eclipse.handly.examples.basic >----
[INFO] Building org.eclipse.handly.examples.basic 1.7.0-SNAPSHOT        [11/26]
[INFO] ---------------------------[ eclipse-plugin ]---------------------------
[INFO] 
[INFO] --- maven-clean-plugin:2.5:clean (default-clean) @ org.eclipse.handly.examples.basic ---
[INFO] 
[INFO] --- tycho-packaging-plugin:2.5.0:build-qualifier (default-build-qualifier) @ org.eclipse.handly.examples.basic ---
[INFO] The project's OSGi version is 1.7.0.v20220614-1826
[INFO] 
[INFO] --- tycho-packaging-plugin:2.5.0:validate-id (default-validate-id) @ org.eclipse.handly.examples.basic ---
[INFO] 
[INFO] --- tycho-packaging-plugin:2.5.0:validate-version (default-validate-version) @ org.eclipse.handly.examples.basic ---
[INFO] 
[INFO] --- target-platform-configuration:2.5.0:target-platform (default-target-platform) @ org.eclipse.handly.examples.basic ---
[INFO] 
[INFO] --- maven-resources-plugin:2.4.3:resources (default-resources) @ org.eclipse.handly.examples.basic ---
[INFO] Using 'UTF-8' encoding to copy filtered resources.
[INFO] skip non existing resourceDirectory /home/jenkins/agent/workspace/1.7.x/org.eclipse.handly.examples.basic/src/main/resources
[INFO] 
[INFO] --- tycho-compiler-plugin:2.5.0:compile (default-compile) @ org.eclipse.handly.examples.basic ---
[INFO] Compiling 23 source files to /home/jenkins/agent/workspace/1.7.x/org.eclipse.handly.examples.basic/target/classes
[INFO] 
[INFO] --- maven-resources-plugin:2.4.3:testResources (default-testResources) @ org.eclipse.handly.examples.basic ---
[INFO] Using 'UTF-8' encoding to copy filtered resources.
[INFO] skip non existing resourceDirectory /home/jenkins/agent/workspace/1.7.x/org.eclipse.handly.examples.basic/src/test/resources
[INFO] 
[INFO] --- tycho-compiler-plugin:2.5.0:testCompile (default-testCompile) @ org.eclipse.handly.examples.basic ---
[INFO] 
[INFO] --- maven-surefire-plugin:2.22.2:test (default-test) @ org.eclipse.handly.examples.basic ---
[INFO] No tests to run.
[INFO] 
[INFO] --- tycho-source-plugin:2.5.0:plugin-source (plugin-source) @ org.eclipse.handly.examples.basic ---
[INFO] Building jar: /home/jenkins/agent/workspace/1.7.x/org.eclipse.handly.examples.basic/target/org.eclipse.handly.examples.basic-1.7.0-SNAPSHOT-sources.jar
[INFO] 
[INFO] --- tycho-packaging-plugin:2.5.0:package-plugin (default-package-plugin) @ org.eclipse.handly.examples.basic ---
[INFO] Building jar: /home/jenkins/agent/workspace/1.7.x/org.eclipse.handly.examples.basic/target/org.eclipse.handly.examples.basic-1.7.0-SNAPSHOT.jar
[INFO] 
[INFO] --- tycho-p2-plugin:2.5.0:p2-metadata-default (default-p2-metadata-default) @ org.eclipse.handly.examples.basic ---
[INFO] 
[INFO] --- tycho-source-plugin:2.5.0:feature-source (feature-source) @ org.eclipse.handly.examples.basic ---
[INFO] 
[INFO] --- tycho-surefire-plugin:2.5.0:integration-test (default-integration-test) @ org.eclipse.handly.examples.basic ---
[INFO] 
[INFO] --- maven-failsafe-plugin:2.22.2:verify (default-verify) @ org.eclipse.handly.examples.basic ---
[INFO] No tests to run.
[INFO] 
[INFO] --- eclipse-jarsigner-plugin:1.3.1:sign (sign) @ org.eclipse.handly.examples.basic ---
[INFO] Signing jar: /home/jenkins/agent/workspace/1.7.x/org.eclipse.handly.examples.basic/target/org.eclipse.handly.examples.basic-1.7.0-SNAPSHOT.jar
[INFO] Signing jar: /home/jenkins/agent/workspace/1.7.x/org.eclipse.handly.examples.basic/target/org.eclipse.handly.examples.basic-1.7.0-SNAPSHOT-sources.jar
[INFO] 
[INFO] --< org.eclipse.handly.bundles:org.eclipse.handly.examples.basic.ide >--
[INFO] Building org.eclipse.handly.examples.basic.ide 1.7.0-SNAPSHOT    [12/26]
[INFO] ---------------------------[ eclipse-plugin ]---------------------------
[INFO] 
[INFO] --- maven-clean-plugin:2.5:clean (default-clean) @ org.eclipse.handly.examples.basic.ide ---
[INFO] 
[INFO] --- tycho-packaging-plugin:2.5.0:build-qualifier (default-build-qualifier) @ org.eclipse.handly.examples.basic.ide ---
[INFO] The project's OSGi version is 1.7.0.v20220614-1826
[INFO] 
[INFO] --- tycho-packaging-plugin:2.5.0:validate-id (default-validate-id) @ org.eclipse.handly.examples.basic.ide ---
[INFO] 
[INFO] --- tycho-packaging-plugin:2.5.0:validate-version (default-validate-version) @ org.eclipse.handly.examples.basic.ide ---
[INFO] 
[INFO] --- target-platform-configuration:2.5.0:target-platform (default-target-platform) @ org.eclipse.handly.examples.basic.ide ---
[INFO] 
[INFO] --- maven-resources-plugin:2.4.3:resources (default-resources) @ org.eclipse.handly.examples.basic.ide ---
[INFO] Using 'UTF-8' encoding to copy filtered resources.
[INFO] skip non existing resourceDirectory /home/jenkins/agent/workspace/1.7.x/org.eclipse.handly.examples.basic.ide/src/main/resources
[INFO] 
[INFO] --- tycho-compiler-plugin:2.5.0:compile (default-compile) @ org.eclipse.handly.examples.basic.ide ---
[INFO] Compiling 6 source files to /home/jenkins/agent/workspace/1.7.x/org.eclipse.handly.examples.basic.ide/target/classes
[INFO] 
[INFO] --- maven-resources-plugin:2.4.3:testResources (default-testResources) @ org.eclipse.handly.examples.basic.ide ---
[INFO] Using 'UTF-8' encoding to copy filtered resources.
[INFO] skip non existing resourceDirectory /home/jenkins/agent/workspace/1.7.x/org.eclipse.handly.examples.basic.ide/src/test/resources
[INFO] 
[INFO] --- tycho-compiler-plugin:2.5.0:testCompile (default-testCompile) @ org.eclipse.handly.examples.basic.ide ---
[INFO] 
[INFO] --- maven-surefire-plugin:2.22.2:test (default-test) @ org.eclipse.handly.examples.basic.ide ---
[INFO] No tests to run.
[INFO] 
[INFO] --- tycho-source-plugin:2.5.0:plugin-source (plugin-source) @ org.eclipse.handly.examples.basic.ide ---
[INFO] Building jar: /home/jenkins/agent/workspace/1.7.x/org.eclipse.handly.examples.basic.ide/target/org.eclipse.handly.examples.basic.ide-1.7.0-SNAPSHOT-sources.jar
[INFO] 
[INFO] --- tycho-packaging-plugin:2.5.0:package-plugin (default-package-plugin) @ org.eclipse.handly.examples.basic.ide ---
[INFO] Building jar: /home/jenkins/agent/workspace/1.7.x/org.eclipse.handly.examples.basic.ide/target/org.eclipse.handly.examples.basic.ide-1.7.0-SNAPSHOT.jar
[INFO] 
[INFO] --- tycho-p2-plugin:2.5.0:p2-metadata-default (default-p2-metadata-default) @ org.eclipse.handly.examples.basic.ide ---
[INFO] 
[INFO] --- tycho-source-plugin:2.5.0:feature-source (feature-source) @ org.eclipse.handly.examples.basic.ide ---
[INFO] 
[INFO] --- tycho-surefire-plugin:2.5.0:integration-test (default-integration-test) @ org.eclipse.handly.examples.basic.ide ---
[INFO] 
[INFO] --- maven-failsafe-plugin:2.22.2:verify (default-verify) @ org.eclipse.handly.examples.basic.ide ---
[INFO] No tests to run.
[INFO] 
[INFO] --- eclipse-jarsigner-plugin:1.3.1:sign (sign) @ org.eclipse.handly.examples.basic.ide ---
[INFO] Signing jar: /home/jenkins/agent/workspace/1.7.x/org.eclipse.handly.examples.basic.ide/target/org.eclipse.handly.examples.basic.ide-1.7.0-SNAPSHOT.jar
[INFO] Signing jar: /home/jenkins/agent/workspace/1.7.x/org.eclipse.handly.examples.basic.ide/target/org.eclipse.handly.examples.basic.ide-1.7.0-SNAPSHOT-sources.jar
[INFO] 
[INFO] --< org.eclipse.handly.bundles:org.eclipse.handly.examples.basic.ui >---
[INFO] Building org.eclipse.handly.examples.basic.ui 1.7.0-SNAPSHOT     [13/26]
[INFO] ---------------------------[ eclipse-plugin ]---------------------------
[INFO] 
[INFO] --- maven-clean-plugin:2.5:clean (default-clean) @ org.eclipse.handly.examples.basic.ui ---
[INFO] 
[INFO] --- tycho-packaging-plugin:2.5.0:build-qualifier (default-build-qualifier) @ org.eclipse.handly.examples.basic.ui ---
[INFO] The project's OSGi version is 1.7.0.v20220614-1826
[INFO] 
[INFO] --- tycho-packaging-plugin:2.5.0:validate-id (default-validate-id) @ org.eclipse.handly.examples.basic.ui ---
[INFO] 
[INFO] --- tycho-packaging-plugin:2.5.0:validate-version (default-validate-version) @ org.eclipse.handly.examples.basic.ui ---
[INFO] 
[INFO] --- target-platform-configuration:2.5.0:target-platform (default-target-platform) @ org.eclipse.handly.examples.basic.ui ---
[INFO] 
[INFO] --- maven-resources-plugin:2.4.3:resources (default-resources) @ org.eclipse.handly.examples.basic.ui ---
[INFO] Using 'UTF-8' encoding to copy filtered resources.
[INFO] skip non existing resourceDirectory /home/jenkins/agent/workspace/1.7.x/org.eclipse.handly.examples.basic.ui/src/main/resources
[INFO] 
[INFO] --- tycho-compiler-plugin:2.5.0:compile (default-compile) @ org.eclipse.handly.examples.basic.ui ---
[INFO] Compiling 42 source files to /home/jenkins/agent/workspace/1.7.x/org.eclipse.handly.examples.basic.ui/target/classes
[INFO] 
[INFO] --- maven-resources-plugin:2.4.3:testResources (default-testResources) @ org.eclipse.handly.examples.basic.ui ---
[INFO] Using 'UTF-8' encoding to copy filtered resources.
[INFO] skip non existing resourceDirectory /home/jenkins/agent/workspace/1.7.x/org.eclipse.handly.examples.basic.ui/src/test/resources
[INFO] 
[INFO] --- tycho-compiler-plugin:2.5.0:testCompile (default-testCompile) @ org.eclipse.handly.examples.basic.ui ---
[INFO] 
[INFO] --- maven-surefire-plugin:2.22.2:test (default-test) @ org.eclipse.handly.examples.basic.ui ---
[INFO] No tests to run.
[INFO] 
[INFO] --- tycho-source-plugin:2.5.0:plugin-source (plugin-source) @ org.eclipse.handly.examples.basic.ui ---
[INFO] Building jar: /home/jenkins/agent/workspace/1.7.x/org.eclipse.handly.examples.basic.ui/target/org.eclipse.handly.examples.basic.ui-1.7.0-SNAPSHOT-sources.jar
[INFO] 
[INFO] --- tycho-packaging-plugin:2.5.0:package-plugin (default-package-plugin) @ org.eclipse.handly.examples.basic.ui ---
[INFO] Building jar: /home/jenkins/agent/workspace/1.7.x/org.eclipse.handly.examples.basic.ui/target/org.eclipse.handly.examples.basic.ui-1.7.0-SNAPSHOT.jar
[INFO] 
[INFO] --- tycho-p2-plugin:2.5.0:p2-metadata-default (default-p2-metadata-default) @ org.eclipse.handly.examples.basic.ui ---
[INFO] 
[INFO] --- tycho-source-plugin:2.5.0:feature-source (feature-source) @ org.eclipse.handly.examples.basic.ui ---
[INFO] 
[INFO] --- tycho-surefire-plugin:2.5.0:integration-test (default-integration-test) @ org.eclipse.handly.examples.basic.ui ---
[INFO] 
[INFO] --- maven-failsafe-plugin:2.22.2:verify (default-verify) @ org.eclipse.handly.examples.basic.ui ---
[INFO] No tests to run.
[INFO] 
[INFO] --- eclipse-jarsigner-plugin:1.3.1:sign (sign) @ org.eclipse.handly.examples.basic.ui ---
[INFO] Signing jar: /home/jenkins/agent/workspace/1.7.x/org.eclipse.handly.examples.basic.ui/target/org.eclipse.handly.examples.basic.ui-1.7.0-SNAPSHOT.jar
[INFO] Signing jar: /home/jenkins/agent/workspace/1.7.x/org.eclipse.handly.examples.basic.ui/target/org.eclipse.handly.examples.basic.ui-1.7.0-SNAPSHOT-sources.jar
[INFO] 
[INFO] --< org.eclipse.handly.bundles:org.eclipse.handly.examples.basic.ui.tests >--
[INFO] Building org.eclipse.handly.examples.basic.ui.tests 1.7.0-SNAPSHOT [14/26]
[INFO] ------------------------[ eclipse-test-plugin ]-------------------------
[INFO] 
[INFO] --- maven-clean-plugin:2.5:clean (default-clean) @ org.eclipse.handly.examples.basic.ui.tests ---
[INFO] 
[INFO] --- tycho-packaging-plugin:2.5.0:build-qualifier (default-build-qualifier) @ org.eclipse.handly.examples.basic.ui.tests ---
[INFO] The project's OSGi version is 1.7.0.v20220614-1826
[INFO] 
[INFO] --- tycho-packaging-plugin:2.5.0:validate-id (default-validate-id) @ org.eclipse.handly.examples.basic.ui.tests ---
[INFO] 
[INFO] --- tycho-packaging-plugin:2.5.0:validate-version (default-validate-version) @ org.eclipse.handly.examples.basic.ui.tests ---
[INFO] 
[INFO] --- target-platform-configuration:2.5.0:target-platform (default-target-platform) @ org.eclipse.handly.examples.basic.ui.tests ---
[INFO] 
[INFO] --- maven-resources-plugin:2.4.3:resources (default-resources) @ org.eclipse.handly.examples.basic.ui.tests ---
[INFO] Using 'UTF-8' encoding to copy filtered resources.
[INFO] skip non existing resourceDirectory /home/jenkins/agent/workspace/1.7.x/org.eclipse.handly.examples.basic.ui.tests/src/main/resources
[INFO] 
[INFO] --- tycho-compiler-plugin:2.5.0:compile (default-compile) @ org.eclipse.handly.examples.basic.ui.tests ---
[INFO] Compiling 6 source files to /home/jenkins/agent/workspace/1.7.x/org.eclipse.handly.examples.basic.ui.tests/target/classes
[INFO] 
[INFO] --- maven-resources-plugin:2.4.3:testResources (default-testResources) @ org.eclipse.handly.examples.basic.ui.tests ---
[INFO] Using 'UTF-8' encoding to copy filtered resources.
[INFO] skip non existing resourceDirectory /home/jenkins/agent/workspace/1.7.x/org.eclipse.handly.examples.basic.ui.tests/src/test/resources
[INFO] 
[INFO] --- tycho-source-plugin:2.5.0:plugin-source (plugin-source) @ org.eclipse.handly.examples.basic.ui.tests ---
[INFO] Building jar: /home/jenkins/agent/workspace/1.7.x/org.eclipse.handly.examples.basic.ui.tests/target/org.eclipse.handly.examples.basic.ui.tests-1.7.0-SNAPSHOT-sources.jar
[INFO] 
[INFO] --- tycho-packaging-plugin:2.5.0:package-plugin (default-package-plugin) @ org.eclipse.handly.examples.basic.ui.tests ---
[INFO] Building jar: /home/jenkins/agent/workspace/1.7.x/org.eclipse.handly.examples.basic.ui.tests/target/org.eclipse.handly.examples.basic.ui.tests-1.7.0-SNAPSHOT.jar
[INFO] 
[INFO] --- tycho-p2-plugin:2.5.0:p2-metadata-default (default-p2-metadata-default) @ org.eclipse.handly.examples.basic.ui.tests ---
[INFO] 
[INFO] --- tycho-source-plugin:2.5.0:feature-source (feature-source) @ org.eclipse.handly.examples.basic.ui.tests ---
[INFO] 
[INFO] --- tycho-surefire-plugin:2.5.0:test (default-test) @ org.eclipse.handly.examples.basic.ui.tests ---
[INFO] Executing Test Runtime with timeout 0, logs (if any) will be placed at: /home/jenkins/agent/workspace/1.7.x/org.eclipse.handly.examples.basic.ui.tests/target/work/data/.metadata/.log
[INFO] Command line:
	[/opt/tools/java/openjdk/jdk-11/11.0.2+9/bin/java, -Dosgi.noShutdown=false, -Dosgi.os=linux, -Dosgi.ws=gtk, -Dosgi.arch=x86_64, -Dosgi.clean=true, -jar, /home/jenkins/agent/workspace/1.7.x/.maven/repo/p2/osgi/bundle/org.eclipse.equinox.launcher/1.6.400.v20210924-0641/org.eclipse.equinox.launcher-1.6.400.v20210924-0641.jar, -data, /home/jenkins/agent/workspace/1.7.x/org.eclipse.handly.examples.basic.ui.tests/target/work/data, -install, /home/jenkins/agent/workspace/1.7.x/org.eclipse.handly.examples.basic.ui.tests/target/work, -configuration, /home/jenkins/agent/workspace/1.7.x/org.eclipse.handly.examples.basic.ui.tests/target/work/configuration, -application, org.eclipse.tycho.surefire.osgibooter.headlesstest, -testproperties, /home/jenkins/agent/workspace/1.7.x/org.eclipse.handly.examples.basic.ui.tests/target/surefire.properties]
Running org.eclipse.handly.internal.examples.basic.ui.model.FooWorkingCopyTest
log4j:WARN No appenders could be found for logger (org.eclipse.xtext.ui.internal.Activator).
log4j:WARN Please initialize the log4j system properly.
log4j:WARN See http://logging.apache.org/log4j/1.2/faq.html#noconfig for more info.
Tests run: 5, Failures: 0, Errors: 0, Skipped: 0, Time elapsed: 2.359 s - in org.eclipse.handly.internal.examples.basic.ui.model.FooWorkingCopyTest
test1(org.eclipse.handly.internal.examples.basic.ui.model.FooWorkingCopyTest)  Time elapsed: 2.204 s
test2(org.eclipse.handly.internal.examples.basic.ui.model.FooWorkingCopyTest)  Time elapsed: 0.024 s
testBug480397_1(org.eclipse.handly.internal.examples.basic.ui.model.FooWorkingCopyTest)  Time elapsed: 0.034 s
testBug480397_2(org.eclipse.handly.internal.examples.basic.ui.model.FooWorkingCopyTest)  Time elapsed: 0.041 s
testBug480397_3(org.eclipse.handly.internal.examples.basic.ui.model.FooWorkingCopyTest)  Time elapsed: 0.018 s
Running org.eclipse.handly.internal.examples.basic.ui.model.FooModelTest
Tests run: 1, Failures: 0, Errors: 0, Skipped: 0, Time elapsed: 0.111 s - in org.eclipse.handly.internal.examples.basic.ui.model.FooModelTest
testFooModel(org.eclipse.handly.internal.examples.basic.ui.model.FooModelTest)  Time elapsed: 0.11 s
Running org.eclipse.handly.internal.examples.basic.ui.model.FooFileTest
Tests run: 1, Failures: 0, Errors: 0, Skipped: 0, Time elapsed: 0.034 s - in org.eclipse.handly.internal.examples.basic.ui.model.FooFileTest
testFooFile(org.eclipse.handly.internal.examples.basic.ui.model.FooFileTest)  Time elapsed: 0.033 s
Running org.eclipse.handly.internal.examples.basic.ui.model.FooModelNotificationTest
Tests run: 1, Failures: 0, Errors: 0, Skipped: 0, Time elapsed: 0.053 s - in org.eclipse.handly.internal.examples.basic.ui.model.FooModelNotificationTest
testFooModelNotification(org.eclipse.handly.internal.examples.basic.ui.model.FooModelNotificationTest)  Time elapsed: 0.052 s
Running org.eclipse.handly.internal.examples.basic.ui.model.FooProjectTest
Tests run: 2, Failures: 0, Errors: 0, Skipped: 0, Time elapsed: 0.047 s - in org.eclipse.handly.internal.examples.basic.ui.model.FooProjectTest
testProjectCreation(org.eclipse.handly.internal.examples.basic.ui.model.FooProjectTest)  Time elapsed: 0.043 s
testHandleOnly(org.eclipse.handly.internal.examples.basic.ui.model.FooProjectTest)  Time elapsed: 0.002 s
Running org.eclipse.handly.internal.examples.basic.ui.model.FooWorkingCopyNotificationTest
Tests run: 4, Failures: 0, Errors: 0, Skipped: 0, Time elapsed: 0.087 s - in org.eclipse.handly.internal.examples.basic.ui.model.FooWorkingCopyNotificationTest
test1(org.eclipse.handly.internal.examples.basic.ui.model.FooWorkingCopyNotificationTest)  Time elapsed: 0.015 s
test2(org.eclipse.handly.internal.examples.basic.ui.model.FooWorkingCopyNotificationTest)  Time elapsed: 0.013 s
test3(org.eclipse.handly.internal.examples.basic.ui.model.FooWorkingCopyNotificationTest)  Time elapsed: 0.013 s
test4(org.eclipse.handly.internal.examples.basic.ui.model.FooWorkingCopyNotificationTest)  Time elapsed: 0.045 s

Results:

Tests run: 14, Failures: 0, Errors: 0, Skipped: 0

[INFO] All tests passed!
[INFO] 
[INFO] --- eclipse-jarsigner-plugin:1.3.1:sign (sign) @ org.eclipse.handly.examples.basic.ui.tests ---
[INFO] Signing jar: /home/jenkins/agent/workspace/1.7.x/org.eclipse.handly.examples.basic.ui.tests/target/org.eclipse.handly.examples.basic.ui.tests-1.7.0-SNAPSHOT.jar
[INFO] Signing jar: /home/jenkins/agent/workspace/1.7.x/org.eclipse.handly.examples.basic.ui.tests/target/org.eclipse.handly.examples.basic.ui.tests-1.7.0-SNAPSHOT-sources.jar
[INFO] 
[INFO] ---< org.eclipse.handly.bundles:org.eclipse.handly.examples.jmodel >----
[INFO] Building org.eclipse.handly.examples.jmodel 1.7.0-SNAPSHOT       [15/26]
[INFO] ---------------------------[ eclipse-plugin ]---------------------------
[INFO] 
[INFO] --- maven-clean-plugin:2.5:clean (default-clean) @ org.eclipse.handly.examples.jmodel ---
[INFO] 
[INFO] --- tycho-packaging-plugin:2.5.0:build-qualifier (default-build-qualifier) @ org.eclipse.handly.examples.jmodel ---
[INFO] The project's OSGi version is 1.7.0.v20220614-1826
[INFO] 
[INFO] --- tycho-packaging-plugin:2.5.0:validate-id (default-validate-id) @ org.eclipse.handly.examples.jmodel ---
[INFO] 
[INFO] --- tycho-packaging-plugin:2.5.0:validate-version (default-validate-version) @ org.eclipse.handly.examples.jmodel ---
[INFO] 
[INFO] --- target-platform-configuration:2.5.0:target-platform (default-target-platform) @ org.eclipse.handly.examples.jmodel ---
[INFO] 
[INFO] --- maven-resources-plugin:2.4.3:resources (default-resources) @ org.eclipse.handly.examples.jmodel ---
[INFO] Using 'UTF-8' encoding to copy filtered resources.
[INFO] skip non existing resourceDirectory /home/jenkins/agent/workspace/1.7.x/org.eclipse.handly.examples.jmodel/src/main/resources
[INFO] 
[INFO] --- tycho-compiler-plugin:2.5.0:compile (default-compile) @ org.eclipse.handly.examples.jmodel ---
[INFO] Compiling 47 source files to /home/jenkins/agent/workspace/1.7.x/org.eclipse.handly.examples.jmodel/target/classes
[WARNING] /home/jenkins/agent/workspace/1.7.x/org.eclipse.handly.examples.jmodel/src/org/eclipse/handly/internal/examples/jmodel/CompilationUnit.java:[245] 
	Integer.class).withDefault(AST.JLS11);
	                               ^^^^^
The field AST.JLS11 is deprecated
1 problem (1 warning)
[INFO] 
[INFO] --- maven-resources-plugin:2.4.3:testResources (default-testResources) @ org.eclipse.handly.examples.jmodel ---
[INFO] Using 'UTF-8' encoding to copy filtered resources.
[INFO] skip non existing resourceDirectory /home/jenkins/agent/workspace/1.7.x/org.eclipse.handly.examples.jmodel/src/test/resources
[INFO] 
[INFO] --- tycho-compiler-plugin:2.5.0:testCompile (default-testCompile) @ org.eclipse.handly.examples.jmodel ---
[INFO] 
[INFO] --- maven-surefire-plugin:2.22.2:test (default-test) @ org.eclipse.handly.examples.jmodel ---
[INFO] No tests to run.
[INFO] 
[INFO] --- tycho-source-plugin:2.5.0:plugin-source (plugin-source) @ org.eclipse.handly.examples.jmodel ---
[INFO] Building jar: /home/jenkins/agent/workspace/1.7.x/org.eclipse.handly.examples.jmodel/target/org.eclipse.handly.examples.jmodel-1.7.0-SNAPSHOT-sources.jar
[INFO] 
[INFO] --- tycho-packaging-plugin:2.5.0:package-plugin (default-package-plugin) @ org.eclipse.handly.examples.jmodel ---
[INFO] Building jar: /home/jenkins/agent/workspace/1.7.x/org.eclipse.handly.examples.jmodel/target/org.eclipse.handly.examples.jmodel-1.7.0-SNAPSHOT.jar
[INFO] 
[INFO] --- tycho-p2-plugin:2.5.0:p2-metadata-default (default-p2-metadata-default) @ org.eclipse.handly.examples.jmodel ---
[INFO] 
[INFO] --- tycho-source-plugin:2.5.0:feature-source (feature-source) @ org.eclipse.handly.examples.jmodel ---
[INFO] 
[INFO] --- tycho-surefire-plugin:2.5.0:integration-test (default-integration-test) @ org.eclipse.handly.examples.jmodel ---
[INFO] 
[INFO] --- maven-failsafe-plugin:2.22.2:verify (default-verify) @ org.eclipse.handly.examples.jmodel ---
[INFO] No tests to run.
[INFO] 
[INFO] --- eclipse-jarsigner-plugin:1.3.1:sign (sign) @ org.eclipse.handly.examples.jmodel ---
[INFO] Signing jar: /home/jenkins/agent/workspace/1.7.x/org.eclipse.handly.examples.jmodel/target/org.eclipse.handly.examples.jmodel-1.7.0-SNAPSHOT.jar
[INFO] Signing jar: /home/jenkins/agent/workspace/1.7.x/org.eclipse.handly.examples.jmodel/target/org.eclipse.handly.examples.jmodel-1.7.0-SNAPSHOT-sources.jar
[INFO] 
[INFO] --< org.eclipse.handly.bundles:org.eclipse.handly.examples.jmodel.tests >--
[INFO] Building org.eclipse.handly.examples.jmodel.tests 1.7.0-SNAPSHOT [16/26]
[INFO] ------------------------[ eclipse-test-plugin ]-------------------------
[INFO] 
[INFO] --- maven-clean-plugin:2.5:clean (default-clean) @ org.eclipse.handly.examples.jmodel.tests ---
[INFO] 
[INFO] --- tycho-packaging-plugin:2.5.0:build-qualifier (default-build-qualifier) @ org.eclipse.handly.examples.jmodel.tests ---
[INFO] The project's OSGi version is 1.7.0.v20220614-1826
[INFO] 
[INFO] --- tycho-packaging-plugin:2.5.0:validate-id (default-validate-id) @ org.eclipse.handly.examples.jmodel.tests ---
[INFO] 
[INFO] --- tycho-packaging-plugin:2.5.0:validate-version (default-validate-version) @ org.eclipse.handly.examples.jmodel.tests ---
[INFO] 
[INFO] --- target-platform-configuration:2.5.0:target-platform (default-target-platform) @ org.eclipse.handly.examples.jmodel.tests ---
[INFO] 
[INFO] --- maven-resources-plugin:2.4.3:resources (default-resources) @ org.eclipse.handly.examples.jmodel.tests ---
[INFO] Using 'UTF-8' encoding to copy filtered resources.
[INFO] skip non existing resourceDirectory /home/jenkins/agent/workspace/1.7.x/org.eclipse.handly.examples.jmodel.tests/src/main/resources
[INFO] 
[INFO] --- tycho-compiler-plugin:2.5.0:compile (default-compile) @ org.eclipse.handly.examples.jmodel.tests ---
[INFO] Compiling 16 source files to /home/jenkins/agent/workspace/1.7.x/org.eclipse.handly.examples.jmodel.tests/target/classes
[WARNING] /home/jenkins/agent/workspace/1.7.x/org.eclipse.handly.examples.jmodel.tests/src/org/eclipse/handly/internal/examples/jmodel/WorkingCopyTest.java:[54] 
	private static final int AST_LEVEL = AST.JLS11;
	                                         ^^^^^
The field AST.JLS11 is deprecated
1 problem (1 warning)
[INFO] 
[INFO] --- maven-resources-plugin:2.4.3:testResources (default-testResources) @ org.eclipse.handly.examples.jmodel.tests ---
[INFO] Using 'UTF-8' encoding to copy filtered resources.
[INFO] skip non existing resourceDirectory /home/jenkins/agent/workspace/1.7.x/org.eclipse.handly.examples.jmodel.tests/src/test/resources
[INFO] 
[INFO] --- tycho-source-plugin:2.5.0:plugin-source (plugin-source) @ org.eclipse.handly.examples.jmodel.tests ---
[INFO] Building jar: /home/jenkins/agent/workspace/1.7.x/org.eclipse.handly.examples.jmodel.tests/target/org.eclipse.handly.examples.jmodel.tests-1.7.0-SNAPSHOT-sources.jar
[INFO] 
[INFO] --- tycho-packaging-plugin:2.5.0:package-plugin (default-package-plugin) @ org.eclipse.handly.examples.jmodel.tests ---
[INFO] Building jar: /home/jenkins/agent/workspace/1.7.x/org.eclipse.handly.examples.jmodel.tests/target/org.eclipse.handly.examples.jmodel.tests-1.7.0-SNAPSHOT.jar
[INFO] 
[INFO] --- tycho-p2-plugin:2.5.0:p2-metadata-default (default-p2-metadata-default) @ org.eclipse.handly.examples.jmodel.tests ---
[INFO] 
[INFO] --- tycho-source-plugin:2.5.0:feature-source (feature-source) @ org.eclipse.handly.examples.jmodel.tests ---
[INFO] 
[INFO] --- tycho-surefire-plugin:2.5.0:test (default-test) @ org.eclipse.handly.examples.jmodel.tests ---
[INFO] Executing Test Runtime with timeout 0, logs (if any) will be placed at: /home/jenkins/agent/workspace/1.7.x/org.eclipse.handly.examples.jmodel.tests/target/work/data/.metadata/.log
[INFO] Command line:
	[/opt/tools/java/openjdk/jdk-11/11.0.2+9/bin/java, -Dosgi.noShutdown=false, -Dosgi.os=linux, -Dosgi.ws=gtk, -Dosgi.arch=x86_64, -Dosgi.clean=true, -jar, /home/jenkins/agent/workspace/1.7.x/.maven/repo/p2/osgi/bundle/org.eclipse.equinox.launcher/1.6.400.v20210924-0641/org.eclipse.equinox.launcher-1.6.400.v20210924-0641.jar, -data, /home/jenkins/agent/workspace/1.7.x/org.eclipse.handly.examples.jmodel.tests/target/work/data, -install, /home/jenkins/agent/workspace/1.7.x/org.eclipse.handly.examples.jmodel.tests/target/work, -configuration, /home/jenkins/agent/workspace/1.7.x/org.eclipse.handly.examples.jmodel.tests/target/work/configuration, -application, org.eclipse.tycho.surefire.osgibooter.headlesstest, -testproperties, /home/jenkins/agent/workspace/1.7.x/org.eclipse.handly.examples.jmodel.tests/target/surefire.properties]
Running org.eclipse.handly.internal.examples.jmodel.JavaProjectNotificationTest
Tests run: 5, Failures: 0, Errors: 0, Skipped: 0, Time elapsed: 0.64 s - in org.eclipse.handly.internal.examples.jmodel.JavaProjectNotificationTest
test001(org.eclipse.handly.internal.examples.jmodel.JavaProjectNotificationTest)  Time elapsed: 0.404 s
test002(org.eclipse.handly.internal.examples.jmodel.JavaProjectNotificationTest)  Time elapsed: 0.085 s
test003(org.eclipse.handly.internal.examples.jmodel.JavaProjectNotificationTest)  Time elapsed: 0.033 s
test004(org.eclipse.handly.internal.examples.jmodel.JavaProjectNotificationTest)  Time elapsed: 0.058 s
test005(org.eclipse.handly.internal.examples.jmodel.JavaProjectNotificationTest)  Time elapsed: 0.036 s
Running org.eclipse.handly.internal.examples.jmodel.JavaProjectTest
Tests run: 4, Failures: 0, Errors: 0, Skipped: 0, Time elapsed: 0.155 s - in org.eclipse.handly.internal.examples.jmodel.JavaProjectTest
test001(org.eclipse.handly.internal.examples.jmodel.JavaProjectTest)  Time elapsed: 0.023 s
test002(org.eclipse.handly.internal.examples.jmodel.JavaProjectTest)  Time elapsed: 0.015 s
test003(org.eclipse.handly.internal.examples.jmodel.JavaProjectTest)  Time elapsed: 0.047 s
test004(org.eclipse.handly.internal.examples.jmodel.JavaProjectTest)  Time elapsed: 0.067 s
Running org.eclipse.handly.internal.examples.jmodel.JavaModelCoreTest
Tests run: 5, Failures: 0, Errors: 0, Skipped: 0, Time elapsed: 0.216 s - in org.eclipse.handly.internal.examples.jmodel.JavaModelCoreTest
test001(org.eclipse.handly.internal.examples.jmodel.JavaModelCoreTest)  Time elapsed: 0.02 s
test002(org.eclipse.handly.internal.examples.jmodel.JavaModelCoreTest)  Time elapsed: 0.049 s
test003(org.eclipse.handly.internal.examples.jmodel.JavaModelCoreTest)  Time elapsed: 0.036 s
test004(org.eclipse.handly.internal.examples.jmodel.JavaModelCoreTest)  Time elapsed: 0.073 s
test005(org.eclipse.handly.internal.examples.jmodel.JavaModelCoreTest)  Time elapsed: 0.034 s
Running org.eclipse.handly.internal.examples.jmodel.WorkingCopyTest
Tests run: 10, Failures: 0, Errors: 0, Skipped: 0, Time elapsed: 0.759 s - in org.eclipse.handly.internal.examples.jmodel.WorkingCopyTest
test001(org.eclipse.handly.internal.examples.jmodel.WorkingCopyTest)  Time elapsed: 0.351 s
test002(org.eclipse.handly.internal.examples.jmodel.WorkingCopyTest)  Time elapsed: 0.028 s
test003(org.eclipse.handly.internal.examples.jmodel.WorkingCopyTest)  Time elapsed: 0.051 s
test004(org.eclipse.handly.internal.examples.jmodel.WorkingCopyTest)  Time elapsed: 0.024 s
test005(org.eclipse.handly.internal.examples.jmodel.WorkingCopyTest)  Time elapsed: 0.139 s
test006(org.eclipse.handly.internal.examples.jmodel.WorkingCopyTest)  Time elapsed: 0.026 s
test007(org.eclipse.handly.internal.examples.jmodel.WorkingCopyTest)  Time elapsed: 0.024 s
test008(org.eclipse.handly.internal.examples.jmodel.WorkingCopyTest)  Time elapsed: 0.023 s
test009(org.eclipse.handly.internal.examples.jmodel.WorkingCopyTest)  Time elapsed: 0.057 s
test010(org.eclipse.handly.internal.examples.jmodel.WorkingCopyTest)  Time elapsed: 0.031 s
Running org.eclipse.handly.internal.examples.jmodel.JavaElementDeltaTest
Tests run: 1, Failures: 0, Errors: 0, Skipped: 0, Time elapsed: 0.002 s - in org.eclipse.handly.internal.examples.jmodel.JavaElementDeltaTest
test1(org.eclipse.handly.internal.examples.jmodel.JavaElementDeltaTest)  Time elapsed: 0 s
Running org.eclipse.handly.internal.examples.jmodel.PackageFragmentTest
Tests run: 4, Failures: 0, Errors: 0, Skipped: 0, Time elapsed: 0.12 s - in org.eclipse.handly.internal.examples.jmodel.PackageFragmentTest
test001(org.eclipse.handly.internal.examples.jmodel.PackageFragmentTest)  Time elapsed: 0.063 s
test002(org.eclipse.handly.internal.examples.jmodel.PackageFragmentTest)  Time elapsed: 0.016 s
test003(org.eclipse.handly.internal.examples.jmodel.PackageFragmentTest)  Time elapsed: 0.023 s
test004(org.eclipse.handly.internal.examples.jmodel.PackageFragmentTest)  Time elapsed: 0.016 s
Running org.eclipse.handly.internal.examples.jmodel.PackageFragmentRootNotificationTest
Tests run: 5, Failures: 0, Errors: 0, Skipped: 0, Time elapsed: 0.142 s - in org.eclipse.handly.internal.examples.jmodel.PackageFragmentRootNotificationTest
test001(org.eclipse.handly.internal.examples.jmodel.PackageFragmentRootNotificationTest)  Time elapsed: 0.049 s
test002(org.eclipse.handly.internal.examples.jmodel.PackageFragmentRootNotificationTest)  Time elapsed: 0.019 s
test003(org.eclipse.handly.internal.examples.jmodel.PackageFragmentRootNotificationTest)  Time elapsed: 0.017 s
test004(org.eclipse.handly.internal.examples.jmodel.PackageFragmentRootNotificationTest)  Time elapsed: 0.038 s
test005(org.eclipse.handly.internal.examples.jmodel.PackageFragmentRootNotificationTest)  Time elapsed: 0.017 s
Running org.eclipse.handly.internal.examples.jmodel.MementoTests
Tests run: 16, Failures: 0, Errors: 0, Skipped: 0, Time elapsed: 0.019 s - in org.eclipse.handly.internal.examples.jmodel.MementoTests
testImportContainerMemento(org.eclipse.handly.internal.examples.jmodel.MementoTests)  Time elapsed: 0.003 s
testImportDeclarationMemento(org.eclipse.handly.internal.examples.jmodel.MementoTests)  Time elapsed: 0.002 s
testRestoreBogusMemento(org.eclipse.handly.internal.examples.jmodel.MementoTests)  Time elapsed: 0 s
testProjectMemento2(org.eclipse.handly.internal.examples.jmodel.MementoTests)  Time elapsed: 0.001 s
testSourceFieldMemento(org.eclipse.handly.internal.examples.jmodel.MementoTests)  Time elapsed: 0 s
testCompilationUnitMemento1(org.eclipse.handly.internal.examples.jmodel.MementoTests)  Time elapsed: 0.001 s
testPackageFragmentMemento(org.eclipse.handly.internal.examples.jmodel.MementoTests)  Time elapsed: 0.001 s
testSourceMethodMemento1(org.eclipse.handly.internal.examples.jmodel.MementoTests)  Time elapsed: 0.001 s
testSourceMethodMemento2(org.eclipse.handly.internal.examples.jmodel.MementoTests)  Time elapsed: 0.001 s
testSourceMethodMemento3(org.eclipse.handly.internal.examples.jmodel.MementoTests)  Time elapsed: 0.001 s
testProjectMemento(org.eclipse.handly.internal.examples.jmodel.MementoTests)  Time elapsed: 0 s
testPackageFragmentRootMemento1(org.eclipse.handly.internal.examples.jmodel.MementoTests)  Time elapsed: 0.001 s
testPackageFragmentRootMemento2(org.eclipse.handly.internal.examples.jmodel.MementoTests)  Time elapsed: 0 s
testSourceTypeMemento(org.eclipse.handly.internal.examples.jmodel.MementoTests)  Time elapsed: 0 s
testPackageDeclarationMemento(org.eclipse.handly.internal.examples.jmodel.MementoTests)  Time elapsed: 0.002 s
testSourceInnerTypeMemento(org.eclipse.handly.internal.examples.jmodel.MementoTests)  Time elapsed: 0 s
Running org.eclipse.handly.internal.examples.jmodel.CompilationUnitTest
Tests run: 5, Failures: 0, Errors: 0, Skipped: 0, Time elapsed: 0.104 s - in org.eclipse.handly.internal.examples.jmodel.CompilationUnitTest
test001(org.eclipse.handly.internal.examples.jmodel.CompilationUnitTest)  Time elapsed: 0.016 s
test002(org.eclipse.handly.internal.examples.jmodel.CompilationUnitTest)  Time elapsed: 0.041 s
test003(org.eclipse.handly.internal.examples.jmodel.CompilationUnitTest)  Time elapsed: 0.017 s
test004(org.eclipse.handly.internal.examples.jmodel.CompilationUnitTest)  Time elapsed: 0.016 s
test005(org.eclipse.handly.internal.examples.jmodel.CompilationUnitTest)  Time elapsed: 0.012 s
Running org.eclipse.handly.internal.examples.jmodel.JavaModelTest
Tests run: 5, Failures: 2, Errors: 0, Skipped: 0, Time elapsed: 0.174 s <<< FAILURE! - in org.eclipse.handly.internal.examples.jmodel.JavaModelTest
test001(org.eclipse.handly.internal.examples.jmodel.JavaModelTest)  Time elapsed: 0.064 s  <<< FAILURE!
junit.framework.AssertionFailedError: expected:<0> but was:<1>
	at org.eclipse.handly.internal.examples.jmodel.JavaModelTest.test001(JavaModelTest.java:85)

test002(org.eclipse.handly.internal.examples.jmodel.JavaModelTest)  Time elapsed: 0.024 s
test003(org.eclipse.handly.internal.examples.jmodel.JavaModelTest)  Time elapsed: 0.017 s
test004(org.eclipse.handly.internal.examples.jmodel.JavaModelTest)  Time elapsed: 0.047 s
test005(org.eclipse.handly.internal.examples.jmodel.JavaModelTest)  Time elapsed: 0.019 s  <<< FAILURE!
junit.framework.AssertionFailedError: expected:<P/SimpleProject2> but was:<P/SimpleProject>
	at org.eclipse.handly.internal.examples.jmodel.JavaModelTest.test005(JavaModelTest.java:252)

Running org.eclipse.handly.internal.examples.jmodel.MemberTest
Tests run: 6, Failures: 0, Errors: 0, Skipped: 0, Time elapsed: 0.118 s - in org.eclipse.handly.internal.examples.jmodel.MemberTest
test001(org.eclipse.handly.internal.examples.jmodel.MemberTest)  Time elapsed: 0.028 s
test002(org.eclipse.handly.internal.examples.jmodel.MemberTest)  Time elapsed: 0.04 s
test003(org.eclipse.handly.internal.examples.jmodel.MemberTest)  Time elapsed: 0.014 s
test004(org.eclipse.handly.internal.examples.jmodel.MemberTest)  Time elapsed: 0.014 s
test005(org.eclipse.handly.internal.examples.jmodel.MemberTest)  Time elapsed: 0.011 s
test006(org.eclipse.handly.internal.examples.jmodel.MemberTest)  Time elapsed: 0.01 s
Running org.eclipse.handly.internal.examples.jmodel.PackageFragmentRootTest
Tests run: 4, Failures: 0, Errors: 0, Skipped: 0, Time elapsed: 0.103 s - in org.eclipse.handly.internal.examples.jmodel.PackageFragmentRootTest
test001(org.eclipse.handly.internal.examples.jmodel.PackageFragmentRootTest)  Time elapsed: 0.061 s
test002(org.eclipse.handly.internal.examples.jmodel.PackageFragmentRootTest)  Time elapsed: 0.012 s
test003(org.eclipse.handly.internal.examples.jmodel.PackageFragmentRootTest)  Time elapsed: 0.015 s
test004(org.eclipse.handly.internal.examples.jmodel.PackageFragmentRootTest)  Time elapsed: 0.014 s
Running org.eclipse.handly.internal.examples.jmodel.PackageFragmentNotificationTest
Tests run: 5, Failures: 0, Errors: 0, Skipped: 0, Time elapsed: 0.1 s - in org.eclipse.handly.internal.examples.jmodel.PackageFragmentNotificationTest
test001(org.eclipse.handly.internal.examples.jmodel.PackageFragmentNotificationTest)  Time elapsed: 0.046 s
test002(org.eclipse.handly.internal.examples.jmodel.PackageFragmentNotificationTest)  Time elapsed: 0.014 s
test003(org.eclipse.handly.internal.examples.jmodel.PackageFragmentNotificationTest)  Time elapsed: 0.013 s
test004(org.eclipse.handly.internal.examples.jmodel.PackageFragmentNotificationTest)  Time elapsed: 0.012 s
test005(org.eclipse.handly.internal.examples.jmodel.PackageFragmentNotificationTest)  Time elapsed: 0.014 s
Running org.eclipse.handly.internal.examples.jmodel.JavaModelNotificationTest
Tests run: 8, Failures: 2, Errors: 0, Skipped: 0, Time elapsed: 0.17 s <<< FAILURE! - in org.eclipse.handly.internal.examples.jmodel.JavaModelNotificationTest
test001(org.eclipse.handly.internal.examples.jmodel.JavaModelNotificationTest)  Time elapsed: 0.045 s  <<< FAILURE!
junit.framework.ComparisonFailure: 
expected:<... Model[*]: {CHILDREN[}
  Test001[-]: {}]> but was:<... Model[*]: {CHILDREN[ | CONTENT}
  Test001[-]: {}
  ResourceDelta(/SimpleProject)[*]]>
	at org.eclipse.handly.internal.examples.jmodel.JavaModelNotificationTest.test001(JavaModelNotificationTest.java:56)

test002(org.eclipse.handly.internal.examples.jmodel.JavaModelNotificationTest)  Time elapsed: 0.012 s
test003(org.eclipse.handly.internal.examples.jmodel.JavaModelNotificationTest)  Time elapsed: 0.011 s  <<< FAILURE!
junit.framework.ComparisonFailure: 
expected:<[Java Model[*]: {CHILDREN | CONTENT}
  Test001[*]: {OPEN}
  ResourceDelta(/Test001)[*]]> but was:<[<null>]>
	at org.eclipse.handly.internal.examples.jmodel.JavaModelNotificationTest.test003(JavaModelNotificationTest.java:102)

test004(org.eclipse.handly.internal.examples.jmodel.JavaModelNotificationTest)  Time elapsed: 0.02 s
test005(org.eclipse.handly.internal.examples.jmodel.JavaModelNotificationTest)  Time elapsed: 0.01 s
test006(org.eclipse.handly.internal.examples.jmodel.JavaModelNotificationTest)  Time elapsed: 0.04 s
test007(org.eclipse.handly.internal.examples.jmodel.JavaModelNotificationTest)  Time elapsed: 0.014 s
test008(org.eclipse.handly.internal.examples.jmodel.JavaModelNotificationTest)  Time elapsed: 0.015 s
Running org.eclipse.handly.internal.examples.jmodel.WorkingCopyNotificationTest
Tests run: 8, Failures: 0, Errors: 0, Skipped: 0, Time elapsed: 0.187 s - in org.eclipse.handly.internal.examples.jmodel.WorkingCopyNotificationTest
test001(org.eclipse.handly.internal.examples.jmodel.WorkingCopyNotificationTest)  Time elapsed: 0.017 s
test002(org.eclipse.handly.internal.examples.jmodel.WorkingCopyNotificationTest)  Time elapsed: 0.014 s
test003(org.eclipse.handly.internal.examples.jmodel.WorkingCopyNotificationTest)  Time elapsed: 0.049 s
test004(org.eclipse.handly.internal.examples.jmodel.WorkingCopyNotificationTest)  Time elapsed: 0.016 s
test005(org.eclipse.handly.internal.examples.jmodel.WorkingCopyNotificationTest)  Time elapsed: 0.016 s
test006(org.eclipse.handly.internal.examples.jmodel.WorkingCopyNotificationTest)  Time elapsed: 0.05 s
test007(org.eclipse.handly.internal.examples.jmodel.WorkingCopyNotificationTest)  Time elapsed: 0.012 s
test008(org.eclipse.handly.internal.examples.jmodel.WorkingCopyNotificationTest)  Time elapsed: 0.011 s

Results:

Failures: 
  JavaModelNotificationTest.test001:56 expected:<... Model[*]: {CHILDREN[}
  Test001[-]: {}]> but was:<... Model[*]: {CHILDREN[ | CONTENT}
  Test001[-]: {}
  ResourceDelta(/SimpleProject)[*]]>
  JavaModelNotificationTest.test003:102 expected:<[Java Model[*]: {CHILDREN | CONTENT}
  Test001[*]: {OPEN}
  ResourceDelta(/Test001)[*]]> but was:<[<null>]>
  JavaModelTest.test001:85 expected:<0> but was:<1>
  JavaModelTest.test005:252 expected:<P/SimpleProject2> but was:<P/SimpleProject>

Tests run: 91, Failures: 4, Errors: 0, Skipped: 0

[INFO] ------------------------------------------------------------------------
[INFO] Reactor Summary for releng 1.7.0-SNAPSHOT:
[INFO] 
[INFO] releng ............................................. SUCCESS [  1.402 s]
[INFO] org.eclipse.handly ................................. SUCCESS [ 11.447 s]
[INFO] org.eclipse.handly.junit ........................... SUCCESS [  2.040 s]
[INFO] org.eclipse.handly.tests ........................... SUCCESS [ 11.913 s]
[INFO] org.eclipse.handly.ui .............................. SUCCESS [  3.258 s]
[INFO] org.eclipse.handly.xtext ........................... SUCCESS [  1.910 s]
[INFO] org.eclipse.handly.xtext.ui ........................ SUCCESS [  2.418 s]
[INFO] org.eclipse.handly.examples ........................ SUCCESS [  2.734 s]
[INFO] org.eclipse.handly.examples.adapter ................ SUCCESS [  2.283 s]
[INFO] org.eclipse.handly.examples.adapter.ui ............. SUCCESS [  2.345 s]
[INFO] org.eclipse.handly.examples.basic .................. SUCCESS [  2.487 s]
[INFO] org.eclipse.handly.examples.basic.ide .............. SUCCESS [  2.160 s]
[INFO] org.eclipse.handly.examples.basic.ui ............... SUCCESS [  2.676 s]
[INFO] org.eclipse.handly.examples.basic.ui.tests ......... SUCCESS [  8.572 s]
[INFO] org.eclipse.handly.examples.jmodel ................. SUCCESS [  2.395 s]
[INFO] org.eclipse.handly.examples.jmodel.tests ........... FAILURE [  6.975 s]
[INFO] org.eclipse.handly.examples.jmodel.ui .............. SKIPPED
[INFO] org.eclipse.handly.examples.xtext.xtext.ui ......... SKIPPED
[INFO] org.eclipse.handly-feature ......................... SKIPPED
[INFO] org.eclipse.handly.xtext-feature ................... SKIPPED
[INFO] org.eclipse.handly.examples-feature ................ SKIPPED
[INFO] org.eclipse.handly.tests-feature ................... SKIPPED
[INFO] repository ......................................... SKIPPED
[INFO] targets ............................................ SKIPPED
[INFO] base.target ........................................ SKIPPED
[INFO] latest.target ...................................... SKIPPED
[INFO] ------------------------------------------------------------------------
[INFO] BUILD FAILURE
[INFO] ------------------------------------------------------------------------
[INFO] Total time:  01:51 min
[INFO] Finished at: 2022-06-14T18:28:00Z
[INFO] ------------------------------------------------------------------------
[ERROR] Failed to execute goal org.eclipse.tycho:tycho-surefire-plugin:2.5.0:test (default-test) on project org.eclipse.handly.examples.jmodel.tests: There are test failures.
[ERROR] 
[ERROR] Please refer to /home/jenkins/agent/workspace/1.7.x/org.eclipse.handly.examples.jmodel.tests/target/surefire-reports for the individual test results.
[ERROR] -> [Help 1]
[ERROR] 
[ERROR] To see the full stack trace of the errors, re-run Maven with the -e switch.
[ERROR] Re-run Maven using the -X switch to enable full debug logging.
[ERROR] 
[ERROR] For more information about the errors and possible solutions, please read the following articles:
[ERROR] [Help 1] http://cwiki.apache.org/confluence/display/MAVEN/MojoFailureException
[ERROR] 
[ERROR] After correcting the problems, you can resume the build with the command
[ERROR]   mvn <args> -rf :org.eclipse.handly.examples.jmodel.tests
Build step 'Invoke top-level Maven targets' marked build as failure
Terminating xvnc.
Sending e-mails to: pisv@1c.ru suag@1c.ru
Recording test results
[Checks API] No suitable checks publisher found.
Publishing Javadoc
Archiving artifacts
Finished: FAILURE