Console Output

Skipping 65 KB.. Full Log
[INFO] No tests to run.
[INFO] 
[INFO] --- eclipse-jarsigner-plugin:1.3.1:sign (sign) @ org.eclipse.handly ---
[INFO] Signing jar: /home/jenkins/agent/workspace/1.7.x/org.eclipse.handly/target/org.eclipse.handly-1.7.0-SNAPSHOT.jar
[INFO] Signing jar: /home/jenkins/agent/workspace/1.7.x/org.eclipse.handly/target/org.eclipse.handly-1.7.0-SNAPSHOT-sources.jar
[INFO] 
[INFO] --------< org.eclipse.handly.bundles:org.eclipse.handly.junit >---------
[INFO] Building org.eclipse.handly.junit 1.7.0-SNAPSHOT                  [3/26]
[INFO] ---------------------------[ eclipse-plugin ]---------------------------
[INFO] 
[INFO] --- maven-clean-plugin:2.5:clean (default-clean) @ org.eclipse.handly.junit ---
[INFO] 
[INFO] --- tycho-packaging-plugin:2.5.0:build-qualifier (default-build-qualifier) @ org.eclipse.handly.junit ---
[INFO] The project's OSGi version is 1.7.0.v20220614-1826
[INFO] 
[INFO] --- tycho-packaging-plugin:2.5.0:validate-id (default-validate-id) @ org.eclipse.handly.junit ---
[INFO] 
[INFO] --- tycho-packaging-plugin:2.5.0:validate-version (default-validate-version) @ org.eclipse.handly.junit ---
[INFO] 
[INFO] --- target-platform-configuration:2.5.0:target-platform (default-target-platform) @ org.eclipse.handly.junit ---
[INFO] 
[INFO] --- maven-resources-plugin:2.4.3:resources (default-resources) @ org.eclipse.handly.junit ---
[INFO] Using 'UTF-8' encoding to copy filtered resources.
[INFO] skip non existing resourceDirectory /home/jenkins/agent/workspace/1.7.x/org.eclipse.handly.junit/src/main/resources
[INFO] 
[INFO] --- tycho-compiler-plugin:2.5.0:compile (default-compile) @ org.eclipse.handly.junit ---
[INFO] Compiling 2 source files to /home/jenkins/agent/workspace/1.7.x/org.eclipse.handly.junit/target/classes
[INFO] 
[INFO] --- maven-resources-plugin:2.4.3:testResources (default-testResources) @ org.eclipse.handly.junit ---
[INFO] Using 'UTF-8' encoding to copy filtered resources.
[INFO] skip non existing resourceDirectory /home/jenkins/agent/workspace/1.7.x/org.eclipse.handly.junit/src/test/resources
[INFO] 
[INFO] --- tycho-compiler-plugin:2.5.0:testCompile (default-testCompile) @ org.eclipse.handly.junit ---
[INFO] 
[INFO] --- maven-surefire-plugin:2.22.2:test (default-test) @ org.eclipse.handly.junit ---
[INFO] No tests to run.
[INFO] 
[INFO] --- tycho-source-plugin:2.5.0:plugin-source (plugin-source) @ org.eclipse.handly.junit ---
[INFO] Building jar: /home/jenkins/agent/workspace/1.7.x/org.eclipse.handly.junit/target/org.eclipse.handly.junit-1.7.0-SNAPSHOT-sources.jar
[INFO] 
[INFO] --- tycho-packaging-plugin:2.5.0:package-plugin (default-package-plugin) @ org.eclipse.handly.junit ---
[INFO] Building jar: /home/jenkins/agent/workspace/1.7.x/org.eclipse.handly.junit/target/org.eclipse.handly.junit-1.7.0-SNAPSHOT.jar
[INFO] 
[INFO] --- tycho-p2-plugin:2.5.0:p2-metadata-default (default-p2-metadata-default) @ org.eclipse.handly.junit ---
[INFO] 
[INFO] --- tycho-source-plugin:2.5.0:feature-source (feature-source) @ org.eclipse.handly.junit ---
[INFO] 
[INFO] --- tycho-surefire-plugin:2.5.0:integration-test (default-integration-test) @ org.eclipse.handly.junit ---
[INFO] 
[INFO] --- maven-failsafe-plugin:2.22.2:verify (default-verify) @ org.eclipse.handly.junit ---
[INFO] No tests to run.
[INFO] 
[INFO] --- eclipse-jarsigner-plugin:1.3.1:sign (sign) @ org.eclipse.handly.junit ---
[INFO] Signing jar: /home/jenkins/agent/workspace/1.7.x/org.eclipse.handly.junit/target/org.eclipse.handly.junit-1.7.0-SNAPSHOT.jar
[INFO] Signing jar: /home/jenkins/agent/workspace/1.7.x/org.eclipse.handly.junit/target/org.eclipse.handly.junit-1.7.0-SNAPSHOT-sources.jar
[INFO] 
[INFO] --------< org.eclipse.handly.bundles:org.eclipse.handly.tests >---------
[INFO] Building org.eclipse.handly.tests 1.7.0-SNAPSHOT                  [4/26]
[INFO] ------------------------[ eclipse-test-plugin ]-------------------------
[INFO] 
[INFO] --- maven-clean-plugin:2.5:clean (default-clean) @ org.eclipse.handly.tests ---
[INFO] 
[INFO] --- tycho-packaging-plugin:2.5.0:build-qualifier (default-build-qualifier) @ org.eclipse.handly.tests ---
[INFO] The project's OSGi version is 1.7.0.v20220614-1826
[INFO] 
[INFO] --- tycho-packaging-plugin:2.5.0:validate-id (default-validate-id) @ org.eclipse.handly.tests ---
[INFO] 
[INFO] --- tycho-packaging-plugin:2.5.0:validate-version (default-validate-version) @ org.eclipse.handly.tests ---
[INFO] 
[INFO] --- target-platform-configuration:2.5.0:target-platform (default-target-platform) @ org.eclipse.handly.tests ---
[INFO] 
[INFO] --- maven-resources-plugin:2.4.3:resources (default-resources) @ org.eclipse.handly.tests ---
[INFO] Using 'UTF-8' encoding to copy filtered resources.
[INFO] skip non existing resourceDirectory /home/jenkins/agent/workspace/1.7.x/org.eclipse.handly.tests/src/main/resources
[INFO] 
[INFO] --- tycho-compiler-plugin:2.5.0:compile (default-compile) @ org.eclipse.handly.tests ---
[INFO] Compiling 51 source files to /home/jenkins/agent/workspace/1.7.x/org.eclipse.handly.tests/target/classes
[INFO] 
[INFO] --- maven-resources-plugin:2.4.3:testResources (default-testResources) @ org.eclipse.handly.tests ---
[INFO] Using 'UTF-8' encoding to copy filtered resources.
[INFO] skip non existing resourceDirectory /home/jenkins/agent/workspace/1.7.x/org.eclipse.handly.tests/src/test/resources
[INFO] 
[INFO] --- tycho-source-plugin:2.5.0:plugin-source (plugin-source) @ org.eclipse.handly.tests ---
[INFO] Building jar: /home/jenkins/agent/workspace/1.7.x/org.eclipse.handly.tests/target/org.eclipse.handly.tests-1.7.0-SNAPSHOT-sources.jar
[INFO] 
[INFO] --- tycho-packaging-plugin:2.5.0:package-plugin (default-package-plugin) @ org.eclipse.handly.tests ---
[INFO] Building jar: /home/jenkins/agent/workspace/1.7.x/org.eclipse.handly.tests/target/org.eclipse.handly.tests-1.7.0-SNAPSHOT.jar
[INFO] 
[INFO] --- tycho-p2-plugin:2.5.0:p2-metadata-default (default-p2-metadata-default) @ org.eclipse.handly.tests ---
[INFO] 
[INFO] --- tycho-source-plugin:2.5.0:feature-source (feature-source) @ org.eclipse.handly.tests ---
[INFO] 
[INFO] --- tycho-surefire-plugin:2.5.0:test (default-test) @ org.eclipse.handly.tests ---
[INFO] Executing Test Runtime with timeout 0, logs (if any) will be placed at: /home/jenkins/agent/workspace/1.7.x/org.eclipse.handly.tests/target/work/data/.metadata/.log
[INFO] Command line:
	[/opt/tools/java/openjdk/jdk-11/11.0.2+9/bin/java, -Dosgi.noShutdown=false, -Dosgi.os=linux, -Dosgi.ws=gtk, -Dosgi.arch=x86_64, -Dosgi.clean=true, -jar, /home/jenkins/agent/workspace/1.7.x/.maven/repo/p2/osgi/bundle/org.eclipse.equinox.launcher/1.6.400.v20210924-0641/org.eclipse.equinox.launcher-1.6.400.v20210924-0641.jar, -data, /home/jenkins/agent/workspace/1.7.x/org.eclipse.handly.tests/target/work/data, -install, /home/jenkins/agent/workspace/1.7.x/org.eclipse.handly.tests/target/work, -configuration, /home/jenkins/agent/workspace/1.7.x/org.eclipse.handly.tests/target/work/configuration, -application, org.eclipse.tycho.surefire.osgibooter.headlesstest, -testproperties, /home/jenkins/agent/workspace/1.7.x/org.eclipse.handly.tests/target/surefire.properties]
Running org.eclipse.handly.model.impl.support.BodyTest
Tests run: 3, Failures: 0, Errors: 0, Skipped: 0, Time elapsed: 0.178 s - in org.eclipse.handly.model.impl.support.BodyTest
test1(org.eclipse.handly.model.impl.support.BodyTest)  Time elapsed: 0.151 s
test2(org.eclipse.handly.model.impl.support.BodyTest)  Time elapsed: 0.001 s
test3(org.eclipse.handly.model.impl.support.BodyTest)  Time elapsed: 0 s
Running org.eclipse.handly.model.impl.support.ElementDeltaTest
Tests run: 37, Failures: 0, Errors: 0, Skipped: 0, Time elapsed: 0.035 s - in org.eclipse.handly.model.impl.support.ElementDeltaTest
test00(org.eclipse.handly.model.impl.support.ElementDeltaTest)  Time elapsed: 0.006 s
test01(org.eclipse.handly.model.impl.support.ElementDeltaTest)  Time elapsed: 0 s
test02(org.eclipse.handly.model.impl.support.ElementDeltaTest)  Time elapsed: 0 s
test03(org.eclipse.handly.model.impl.support.ElementDeltaTest)  Time elapsed: 0 s
test04(org.eclipse.handly.model.impl.support.ElementDeltaTest)  Time elapsed: 0.001 s
test05(org.eclipse.handly.model.impl.support.ElementDeltaTest)  Time elapsed: 0 s
test06(org.eclipse.handly.model.impl.support.ElementDeltaTest)  Time elapsed: 0 s
test07(org.eclipse.handly.model.impl.support.ElementDeltaTest)  Time elapsed: 0 s
test08(org.eclipse.handly.model.impl.support.ElementDeltaTest)  Time elapsed: 0 s
test09(org.eclipse.handly.model.impl.support.ElementDeltaTest)  Time elapsed: 0 s
test10(org.eclipse.handly.model.impl.support.ElementDeltaTest)  Time elapsed: 0 s
test11(org.eclipse.handly.model.impl.support.ElementDeltaTest)  Time elapsed: 0 s
test12(org.eclipse.handly.model.impl.support.ElementDeltaTest)  Time elapsed: 0 s
test13(org.eclipse.handly.model.impl.support.ElementDeltaTest)  Time elapsed: 0 s
test14(org.eclipse.handly.model.impl.support.ElementDeltaTest)  Time elapsed: 0 s
test15(org.eclipse.handly.model.impl.support.ElementDeltaTest)  Time elapsed: 0 s
test16(org.eclipse.handly.model.impl.support.ElementDeltaTest)  Time elapsed: 0 s
test17(org.eclipse.handly.model.impl.support.ElementDeltaTest)  Time elapsed: 0.001 s
test18(org.eclipse.handly.model.impl.support.ElementDeltaTest)  Time elapsed: 0 s
test19(org.eclipse.handly.model.impl.support.ElementDeltaTest)  Time elapsed: 0 s
test20(org.eclipse.handly.model.impl.support.ElementDeltaTest)  Time elapsed: 0 s
test21(org.eclipse.handly.model.impl.support.ElementDeltaTest)  Time elapsed: 0 s
test22(org.eclipse.handly.model.impl.support.ElementDeltaTest)  Time elapsed: 0 s
test23(org.eclipse.handly.model.impl.support.ElementDeltaTest)  Time elapsed: 0 s
test24(org.eclipse.handly.model.impl.support.ElementDeltaTest)  Time elapsed: 0 s
test25(org.eclipse.handly.model.impl.support.ElementDeltaTest)  Time elapsed: 0.001 s
test26(org.eclipse.handly.model.impl.support.ElementDeltaTest)  Time elapsed: 0 s
test27(org.eclipse.handly.model.impl.support.ElementDeltaTest)  Time elapsed: 0 s
test28(org.eclipse.handly.model.impl.support.ElementDeltaTest)  Time elapsed: 0 s
test29(org.eclipse.handly.model.impl.support.ElementDeltaTest)  Time elapsed: 0 s
test30(org.eclipse.handly.model.impl.support.ElementDeltaTest)  Time elapsed: 0 s
test31(org.eclipse.handly.model.impl.support.ElementDeltaTest)  Time elapsed: 0 s
test32(org.eclipse.handly.model.impl.support.ElementDeltaTest)  Time elapsed: 0.005 s
test33(org.eclipse.handly.model.impl.support.ElementDeltaTest)  Time elapsed: 0.007 s
testMalformedDeltaTree(org.eclipse.handly.model.impl.support.ElementDeltaTest)  Time elapsed: 0.002 s
testBug456060(org.eclipse.handly.model.impl.support.ElementDeltaTest)  Time elapsed: 0 s
testDefaultFindDelta(org.eclipse.handly.model.impl.support.ElementDeltaTest)  Time elapsed: 0.002 s
Running org.eclipse.handly.model.impl.support.SourceElementBodyTest
Tests run: 1, Failures: 0, Errors: 0, Skipped: 0, Time elapsed: 0.029 s - in org.eclipse.handly.model.impl.support.SourceElementBodyTest
test1(org.eclipse.handly.model.impl.support.SourceElementBodyTest)  Time elapsed: 0.028 s
Running org.eclipse.handly.model.impl.support.SourceFileTest
Tests run: 9, Failures: 0, Errors: 0, Skipped: 0, Time elapsed: 0.235 s - in org.eclipse.handly.model.impl.support.SourceFileTest
test01(org.eclipse.handly.model.impl.support.SourceFileTest)  Time elapsed: 0.131 s
test02(org.eclipse.handly.model.impl.support.SourceFileTest)  Time elapsed: 0.01 s
test03(org.eclipse.handly.model.impl.support.SourceFileTest)  Time elapsed: 0.029 s
test04(org.eclipse.handly.model.impl.support.SourceFileTest)  Time elapsed: 0.008 s
test05(org.eclipse.handly.model.impl.support.SourceFileTest)  Time elapsed: 0.013 s
test06(org.eclipse.handly.model.impl.support.SourceFileTest)  Time elapsed: 0.009 s
test07(org.eclipse.handly.model.impl.support.SourceFileTest)  Time elapsed: 0.013 s
test08(org.eclipse.handly.model.impl.support.SourceFileTest)  Time elapsed: 0.008 s
test09(org.eclipse.handly.model.impl.support.SourceFileTest)  Time elapsed: 0.009 s
Running org.eclipse.handly.model.impl.support.ElementChangeListenerListTest
Tests run: 3, Failures: 0, Errors: 0, Skipped: 0, Time elapsed: 0.004 s - in org.eclipse.handly.model.impl.support.ElementChangeListenerListTest
test1(org.eclipse.handly.model.impl.support.ElementChangeListenerListTest)  Time elapsed: 0.001 s
test2(org.eclipse.handly.model.impl.support.ElementChangeListenerListTest)  Time elapsed: 0 s
test3(org.eclipse.handly.model.impl.support.ElementChangeListenerListTest)  Time elapsed: 0 s
Running org.eclipse.handly.model.impl.support.OutOfSyncSourceFileTest
Tests run: 2, Failures: 0, Errors: 0, Skipped: 0, Time elapsed: 0.048 s - in org.eclipse.handly.model.impl.support.OutOfSyncSourceFileTest
testInSync(org.eclipse.handly.model.impl.support.OutOfSyncSourceFileTest)  Time elapsed: 0.036 s
testOutOfSync(org.eclipse.handly.model.impl.support.OutOfSyncSourceFileTest)  Time elapsed: 0.011 s
Running org.eclipse.handly.model.impl.support.ElementManagerTest
Tests run: 2, Failures: 0, Errors: 0, Skipped: 0, Time elapsed: 0.004 s - in org.eclipse.handly.model.impl.support.ElementManagerTest
test1(org.eclipse.handly.model.impl.support.ElementManagerTest)  Time elapsed: 0.001 s
test2(org.eclipse.handly.model.impl.support.ElementManagerTest)  Time elapsed: 0.002 s
Running org.eclipse.handly.model.impl.support.ElementDeltaPerformanceTest
Tests run: 1, Failures: 0, Errors: 0, Skipped: 0, Time elapsed: 0.134 s - in org.eclipse.handly.model.impl.support.ElementDeltaPerformanceTest
testFindDeltaPerformance(org.eclipse.handly.model.impl.support.ElementDeltaPerformanceTest)  Time elapsed: 0.134 s
Running org.eclipse.handly.model.impl.support.ElementCacheTest
Tests run: 5, Failures: 0, Errors: 0, Skipped: 0, Time elapsed: 0.005 s - in org.eclipse.handly.model.impl.support.ElementCacheTest
test1(org.eclipse.handly.model.impl.support.ElementCacheTest)  Time elapsed: 0 s
test2(org.eclipse.handly.model.impl.support.ElementCacheTest)  Time elapsed: 0.001 s
test3(org.eclipse.handly.model.impl.support.ElementCacheTest)  Time elapsed: 0 s
test4(org.eclipse.handly.model.impl.support.ElementCacheTest)  Time elapsed: 0.002 s
test5(org.eclipse.handly.model.impl.support.ElementCacheTest)  Time elapsed: 0 s
Running org.eclipse.handly.model.impl.support.ElementChangeRecorderTest
Tests run: 35, Failures: 0, Errors: 0, Skipped: 0, Time elapsed: 0.012 s - in org.eclipse.handly.model.impl.support.ElementChangeRecorderTest
test01(org.eclipse.handly.model.impl.support.ElementChangeRecorderTest)  Time elapsed: 0.001 s
test02(org.eclipse.handly.model.impl.support.ElementChangeRecorderTest)  Time elapsed: 0.001 s
test03(org.eclipse.handly.model.impl.support.ElementChangeRecorderTest)  Time elapsed: 0 s
test04(org.eclipse.handly.model.impl.support.ElementChangeRecorderTest)  Time elapsed: 0 s
test05(org.eclipse.handly.model.impl.support.ElementChangeRecorderTest)  Time elapsed: 0 s
test06(org.eclipse.handly.model.impl.support.ElementChangeRecorderTest)  Time elapsed: 0.001 s
test07(org.eclipse.handly.model.impl.support.ElementChangeRecorderTest)  Time elapsed: 0 s
test08(org.eclipse.handly.model.impl.support.ElementChangeRecorderTest)  Time elapsed: 0 s
test09(org.eclipse.handly.model.impl.support.ElementChangeRecorderTest)  Time elapsed: 0 s
test10(org.eclipse.handly.model.impl.support.ElementChangeRecorderTest)  Time elapsed: 0 s
test11(org.eclipse.handly.model.impl.support.ElementChangeRecorderTest)  Time elapsed: 0 s
test12(org.eclipse.handly.model.impl.support.ElementChangeRecorderTest)  Time elapsed: 0 s
test13(org.eclipse.handly.model.impl.support.ElementChangeRecorderTest)  Time elapsed: 0 s
test14(org.eclipse.handly.model.impl.support.ElementChangeRecorderTest)  Time elapsed: 0 s
test15(org.eclipse.handly.model.impl.support.ElementChangeRecorderTest)  Time elapsed: 0 s
test16(org.eclipse.handly.model.impl.support.ElementChangeRecorderTest)  Time elapsed: 0 s
test17(org.eclipse.handly.model.impl.support.ElementChangeRecorderTest)  Time elapsed: 0 s
test18(org.eclipse.handly.model.impl.support.ElementChangeRecorderTest)  Time elapsed: 0.001 s
test19(org.eclipse.handly.model.impl.support.ElementChangeRecorderTest)  Time elapsed: 0 s
test20(org.eclipse.handly.model.impl.support.ElementChangeRecorderTest)  Time elapsed: 0 s
test21(org.eclipse.handly.model.impl.support.ElementChangeRecorderTest)  Time elapsed: 0 s
test22(org.eclipse.handly.model.impl.support.ElementChangeRecorderTest)  Time elapsed: 0 s
test23(org.eclipse.handly.model.impl.support.ElementChangeRecorderTest)  Time elapsed: 0 s
test24(org.eclipse.handly.model.impl.support.ElementChangeRecorderTest)  Time elapsed: 0 s
test25(org.eclipse.handly.model.impl.support.ElementChangeRecorderTest)  Time elapsed: 0.001 s
test26(org.eclipse.handly.model.impl.support.ElementChangeRecorderTest)  Time elapsed: 0 s
test27(org.eclipse.handly.model.impl.support.ElementChangeRecorderTest)  Time elapsed: 0 s
test28(org.eclipse.handly.model.impl.support.ElementChangeRecorderTest)  Time elapsed: 0 s
test29(org.eclipse.handly.model.impl.support.ElementChangeRecorderTest)  Time elapsed: 0 s
test30(org.eclipse.handly.model.impl.support.ElementChangeRecorderTest)  Time elapsed: 0 s
test31(org.eclipse.handly.model.impl.support.ElementChangeRecorderTest)  Time elapsed: 0.001 s
test32(org.eclipse.handly.model.impl.support.ElementChangeRecorderTest)  Time elapsed: 0 s
test33(org.eclipse.handly.model.impl.support.ElementChangeRecorderTest)  Time elapsed: 0 s
test34(org.eclipse.handly.model.impl.support.ElementChangeRecorderTest)  Time elapsed: 0 s
test35(org.eclipse.handly.model.impl.support.ElementChangeRecorderTest)  Time elapsed: 0 s
Running org.eclipse.handly.model.impl.support.WorkingCopyNotificationTest
Tests run: 4, Failures: 0, Errors: 0, Skipped: 0, Time elapsed: 0.053 s - in org.eclipse.handly.model.impl.support.WorkingCopyNotificationTest
test1(org.eclipse.handly.model.impl.support.WorkingCopyNotificationTest)  Time elapsed: 0.008 s
test2(org.eclipse.handly.model.impl.support.WorkingCopyNotificationTest)  Time elapsed: 0.012 s
test3(org.eclipse.handly.model.impl.support.WorkingCopyNotificationTest)  Time elapsed: 0.006 s
test4(org.eclipse.handly.model.impl.support.WorkingCopyNotificationTest)  Time elapsed: 0.01 s
Running org.eclipse.handly.model.impl.support.WorkingCopyTest
Tests run: 2, Failures: 0, Errors: 0, Skipped: 0, Time elapsed: 0.003 s - in org.eclipse.handly.model.impl.support.WorkingCopyTest
testCallbackLifecycle(org.eclipse.handly.model.impl.support.WorkingCopyTest)  Time elapsed: 0.001 s
testBug479623(org.eclipse.handly.model.impl.support.WorkingCopyTest)  Time elapsed: 0.001 s
Running org.eclipse.handly.model.impl.support.NotificationManagerTest
Tests run: 3, Failures: 0, Errors: 0, Skipped: 0, Time elapsed: 0.002 s - in org.eclipse.handly.model.impl.support.NotificationManagerTest
test1(org.eclipse.handly.model.impl.support.NotificationManagerTest)  Time elapsed: 0.001 s
test2(org.eclipse.handly.model.impl.support.NotificationManagerTest)  Time elapsed: 0 s
test3(org.eclipse.handly.model.impl.support.NotificationManagerTest)  Time elapsed: 0.001 s
Running org.eclipse.handly.model.impl.support.SourceElementTest
Tests run: 2, Failures: 0, Errors: 0, Skipped: 0, Time elapsed: 0.004 s - in org.eclipse.handly.model.impl.support.SourceElementTest
test1(org.eclipse.handly.model.impl.support.SourceElementTest)  Time elapsed: 0 s
test2(org.eclipse.handly.model.impl.support.SourceElementTest)  Time elapsed: 0.001 s
Running org.eclipse.handly.model.impl.support.ElementTest
Tests run: 15, Failures: 0, Errors: 0, Skipped: 0, Time elapsed: 0.041 s - in org.eclipse.handly.model.impl.support.ElementTest
test01(org.eclipse.handly.model.impl.support.ElementTest)  Time elapsed: 0.001 s
test02(org.eclipse.handly.model.impl.support.ElementTest)  Time elapsed: 0 s
test03(org.eclipse.handly.model.impl.support.ElementTest)  Time elapsed: 0 s
test04(org.eclipse.handly.model.impl.support.ElementTest)  Time elapsed: 0.001 s
test05(org.eclipse.handly.model.impl.support.ElementTest)  Time elapsed: 0 s
test06(org.eclipse.handly.model.impl.support.ElementTest)  Time elapsed: 0.001 s
test07(org.eclipse.handly.model.impl.support.ElementTest)  Time elapsed: 0 s
test08(org.eclipse.handly.model.impl.support.ElementTest)  Time elapsed: 0 s
test09(org.eclipse.handly.model.impl.support.ElementTest)  Time elapsed: 0.001 s
test10(org.eclipse.handly.model.impl.support.ElementTest)  Time elapsed: 0 s
test11(org.eclipse.handly.model.impl.support.ElementTest)  Time elapsed: 0 s
test12(org.eclipse.handly.model.impl.support.ElementTest)  Time elapsed: 0 s
test13(org.eclipse.handly.model.impl.support.ElementTest)  Time elapsed: 0 s
test14(org.eclipse.handly.model.impl.support.ElementTest)  Time elapsed: 0 s
testBug530821(org.eclipse.handly.model.impl.support.ElementTest)  Time elapsed: 0.034 s
Running org.eclipse.handly.model.impl.support.StructureHelperTest
Tests run: 1, Failures: 0, Errors: 0, Skipped: 0, Time elapsed: 0.003 s - in org.eclipse.handly.model.impl.support.StructureHelperTest
test1(org.eclipse.handly.model.impl.support.StructureHelperTest)  Time elapsed: 0.002 s
Running org.eclipse.handly.model.adapter.NullContentAdapterTest
Tests run: 2, Failures: 0, Errors: 0, Skipped: 0, Time elapsed: 0.001 s - in org.eclipse.handly.model.adapter.NullContentAdapterTest
test1(org.eclipse.handly.model.adapter.NullContentAdapterTest)  Time elapsed: 0 s
test2(org.eclipse.handly.model.adapter.NullContentAdapterTest)  Time elapsed: 0 s
Running org.eclipse.handly.model.adapter.DefaultContentAdapterTest
Tests run: 2, Failures: 0, Errors: 0, Skipped: 0, Time elapsed: 0.008 s - in org.eclipse.handly.model.adapter.DefaultContentAdapterTest
test1(org.eclipse.handly.model.adapter.DefaultContentAdapterTest)  Time elapsed: 0.007 s
test2(org.eclipse.handly.model.adapter.DefaultContentAdapterTest)  Time elapsed: 0 s
Running org.eclipse.handly.model.ElementsTest
Tests run: 30, Failures: 0, Errors: 0, Skipped: 0, Time elapsed: 0.024 s - in org.eclipse.handly.model.ElementsTest
testEnsureReconciled(org.eclipse.handly.model.ElementsTest)  Time elapsed: 0.002 s
testNoSourceElementInfo(org.eclipse.handly.model.ElementsTest)  Time elapsed: 0 s
testFindLastMatchingAncestorUntil(org.eclipse.handly.model.ElementsTest)  Time elapsed: 0.002 s
testFindCommonAncestor(org.eclipse.handly.model.ElementsTest)  Time elapsed: 0 s
testFindAncestorOfType(org.eclipse.handly.model.ElementsTest)  Time elapsed: 0 s
testIsOfModel(org.eclipse.handly.model.ElementsTest)  Time elapsed: 0 s
testCollectParentChainUntil(org.eclipse.handly.model.ElementsTest)  Time elapsed: 0 s
testSplitIntoElementsAndResources(org.eclipse.handly.model.ElementsTest)  Time elapsed: 0.001 s
testGetParentChain(org.eclipse.handly.model.ElementsTest)  Time elapsed: 0.005 s
testGetSourceElementInfo2(org.eclipse.handly.model.ElementsTest)  Time elapsed: 0.002 s
testIsAncestorOf(org.eclipse.handly.model.ElementsTest)  Time elapsed: 0 s
testRemoveDescendants(org.eclipse.handly.model.ElementsTest)  Time elapsed: 0 s
testGetName(org.eclipse.handly.model.ElementsTest)  Time elapsed: 0 s
testGetRoot(org.eclipse.handly.model.ElementsTest)  Time elapsed: 0 s
testFindAncestorOfTypeUntil(org.eclipse.handly.model.ElementsTest)  Time elapsed: 0 s
testFindLastAncestorOfTypeUntil(org.eclipse.handly.model.ElementsTest)  Time elapsed: 0 s
testFindMatchingAncestorUntil(org.eclipse.handly.model.ElementsTest)  Time elapsed: 0.002 s
testGetSourceFile(org.eclipse.handly.model.ElementsTest)  Time elapsed: 0 s
testCollectParentChain(org.eclipse.handly.model.ElementsTest)  Time elapsed: 0 s
testFindLastMatchingAncestor(org.eclipse.handly.model.ElementsTest)  Time elapsed: 0.001 s
testFindCommonAncestor2(org.eclipse.handly.model.ElementsTest)  Time elapsed: 0 s
testFindLastAncestorOfType(org.eclipse.handly.model.ElementsTest)  Time elapsed: 0.001 s
testStreamParentChainUntil(org.eclipse.handly.model.ElementsTest)  Time elapsed: 0.001 s
testFindCommonAncestorUntil(org.eclipse.handly.model.ElementsTest)  Time elapsed: 0 s
testGetSourceElementAt2(org.eclipse.handly.model.ElementsTest)  Time elapsed: 0.001 s
testStreamParentChain(org.eclipse.handly.model.ElementsTest)  Time elapsed: 0.001 s
testGetParent(org.eclipse.handly.model.ElementsTest)  Time elapsed: 0 s
testFindMatchingAncestor(org.eclipse.handly.model.ElementsTest)  Time elapsed: 0.001 s
testGetParentChainUntil(org.eclipse.handly.model.ElementsTest)  Time elapsed: 0 s
testFindCommonAncestorUntil2(org.eclipse.handly.model.ElementsTest)  Time elapsed: 0 s
Running org.eclipse.handly.model.ElementDeltasTest
Tests run: 8, Failures: 0, Errors: 0, Skipped: 0, Time elapsed: 0.002 s - in org.eclipse.handly.model.ElementDeltasTest
test01(org.eclipse.handly.model.ElementDeltasTest)  Time elapsed: 0 s
test02(org.eclipse.handly.model.ElementDeltasTest)  Time elapsed: 0 s
test03(org.eclipse.handly.model.ElementDeltasTest)  Time elapsed: 0 s
test04(org.eclipse.handly.model.ElementDeltasTest)  Time elapsed: 0 s
test05(org.eclipse.handly.model.ElementDeltasTest)  Time elapsed: 0 s
test06(org.eclipse.handly.model.ElementDeltasTest)  Time elapsed: 0 s
test07(org.eclipse.handly.model.ElementDeltasTest)  Time elapsed: 0.001 s
test08(org.eclipse.handly.model.ElementDeltasTest)  Time elapsed: 0 s
Running org.eclipse.handly.context.ContextsTest
Tests run: 13, Failures: 0, Errors: 0, Skipped: 0, Time elapsed: 0.003 s - in org.eclipse.handly.context.ContextsTest
testCompositeContext1(org.eclipse.handly.context.ContextsTest)  Time elapsed: 0.001 s
testCompositeContext2(org.eclipse.handly.context.ContextsTest)  Time elapsed: 0 s
testCompositeContext3(org.eclipse.handly.context.ContextsTest)  Time elapsed: 0 s
testCompositeContext4(org.eclipse.handly.context.ContextsTest)  Time elapsed: 0 s
testCompositeContext5(org.eclipse.handly.context.ContextsTest)  Time elapsed: 0 s
testCompositeContext6(org.eclipse.handly.context.ContextsTest)  Time elapsed: 0 s
testCompositeContext7(org.eclipse.handly.context.ContextsTest)  Time elapsed: 0 s
testCompositeContext8(org.eclipse.handly.context.ContextsTest)  Time elapsed: 0 s
testSingletonContext1(org.eclipse.handly.context.ContextsTest)  Time elapsed: 0 s
testSingletonContext2(org.eclipse.handly.context.ContextsTest)  Time elapsed: 0 s
testSingletonContext3(org.eclipse.handly.context.ContextsTest)  Time elapsed: 0 s
testSingletonContext4(org.eclipse.handly.context.ContextsTest)  Time elapsed: 0 s
testEmptyContext(org.eclipse.handly.context.ContextsTest)  Time elapsed: 0 s
Running org.eclipse.handly.context.GuiceContextTest
Tests run: 8, Failures: 0, Errors: 0, Skipped: 0, Time elapsed: 0.228 s - in org.eclipse.handly.context.GuiceContextTest
test01(org.eclipse.handly.context.GuiceContextTest)  Time elapsed: 0.001 s
test02(org.eclipse.handly.context.GuiceContextTest)  Time elapsed: 0.001 s
test03(org.eclipse.handly.context.GuiceContextTest)  Time elapsed: 0.001 s
test04(org.eclipse.handly.context.GuiceContextTest)  Time elapsed: 0.007 s
test05(org.eclipse.handly.context.GuiceContextTest)  Time elapsed: 0 s
test06(org.eclipse.handly.context.GuiceContextTest)  Time elapsed: 0 s
test07(org.eclipse.handly.context.GuiceContextTest)  Time elapsed: 0 s
test08(org.eclipse.handly.context.GuiceContextTest)  Time elapsed: 0.002 s
Running org.eclipse.handly.context.ContextTest
Tests run: 16, Failures: 0, Errors: 0, Skipped: 0, Time elapsed: 0.011 s - in org.eclipse.handly.context.ContextTest
test01(org.eclipse.handly.context.ContextTest)  Time elapsed: 0 s
test02(org.eclipse.handly.context.ContextTest)  Time elapsed: 0 s
test03(org.eclipse.handly.context.ContextTest)  Time elapsed: 0 s
test04(org.eclipse.handly.context.ContextTest)  Time elapsed: 0.001 s
test05(org.eclipse.handly.context.ContextTest)  Time elapsed: 0 s
test06(org.eclipse.handly.context.ContextTest)  Time elapsed: 0 s
test07(org.eclipse.handly.context.ContextTest)  Time elapsed: 0 s
test08(org.eclipse.handly.context.ContextTest)  Time elapsed: 0 s
test09(org.eclipse.handly.context.ContextTest)  Time elapsed: 0 s
test10(org.eclipse.handly.context.ContextTest)  Time elapsed: 0 s
test11(org.eclipse.handly.context.ContextTest)  Time elapsed: 0 s
test12(org.eclipse.handly.context.ContextTest)  Time elapsed: 0 s
test13(org.eclipse.handly.context.ContextTest)  Time elapsed: 0 s
test14(org.eclipse.handly.context.ContextTest)  Time elapsed: 0 s
test15(org.eclipse.handly.context.ContextTest)  Time elapsed: 0.006 s
test16(org.eclipse.handly.context.ContextTest)  Time elapsed: 0 s
Running org.eclipse.handly.buffer.ChildBufferTest
Tests run: 5, Failures: 0, Errors: 0, Skipped: 0, Time elapsed: 0.003 s - in org.eclipse.handly.buffer.ChildBufferTest
test1(org.eclipse.handly.buffer.ChildBufferTest)  Time elapsed: 0.001 s
test2(org.eclipse.handly.buffer.ChildBufferTest)  Time elapsed: 0 s
test3(org.eclipse.handly.buffer.ChildBufferTest)  Time elapsed: 0 s
test4(org.eclipse.handly.buffer.ChildBufferTest)  Time elapsed: 0.001 s
test5(org.eclipse.handly.buffer.ChildBufferTest)  Time elapsed: 0 s
Running org.eclipse.handly.buffer.UiBufferChangeRunnerTest
Tests run: 3, Failures: 0, Errors: 0, Skipped: 0, Time elapsed: 0.008 s - in org.eclipse.handly.buffer.UiBufferChangeRunnerTest
test1(org.eclipse.handly.buffer.UiBufferChangeRunnerTest)  Time elapsed: 0.003 s
test2(org.eclipse.handly.buffer.UiBufferChangeRunnerTest)  Time elapsed: 0.002 s
test3(org.eclipse.handly.buffer.UiBufferChangeRunnerTest)  Time elapsed: 0.001 s
Running org.eclipse.handly.buffer.CoreTextFileBufferProviderTest
Tests run: 3, Failures: 0, Errors: 0, Skipped: 0, Time elapsed: 0.02 s - in org.eclipse.handly.buffer.CoreTextFileBufferProviderTest
test1(org.eclipse.handly.buffer.CoreTextFileBufferProviderTest)  Time elapsed: 0.017 s
test2(org.eclipse.handly.buffer.CoreTextFileBufferProviderTest)  Time elapsed: 0.002 s
test3(org.eclipse.handly.buffer.CoreTextFileBufferProviderTest)  Time elapsed: 0 s
Running org.eclipse.handly.buffer.TextFileBufferTest
Tests run: 2, Failures: 0, Errors: 0, Skipped: 0, Time elapsed: 3.875 s - in org.eclipse.handly.buffer.TextFileBufferTest
testSaveListener(org.eclipse.handly.buffer.TextFileBufferTest)  Time elapsed: 2.028 s
testBug496840(org.eclipse.handly.buffer.TextFileBufferTest)  Time elapsed: 1.786 s
Running org.eclipse.handly.buffer.BufferChangeOperationTest
Tests run: 4, Failures: 0, Errors: 0, Skipped: 0, Time elapsed: 0.015 s - in org.eclipse.handly.buffer.BufferChangeOperationTest
test1(org.eclipse.handly.buffer.BufferChangeOperationTest)  Time elapsed: 0 s
test2(org.eclipse.handly.buffer.BufferChangeOperationTest)  Time elapsed: 0.014 s
test3(org.eclipse.handly.buffer.BufferChangeOperationTest)  Time elapsed: 0 s
test4(org.eclipse.handly.buffer.BufferChangeOperationTest)  Time elapsed: 0 s
Running org.eclipse.handly.snapshot.ResourceTextFileBufferSnapshotTest
Tests run: 6, Failures: 0, Errors: 0, Skipped: 0, Time elapsed: 0.167 s - in org.eclipse.handly.snapshot.ResourceTextFileBufferSnapshotTest
test1(org.eclipse.handly.snapshot.ResourceTextFileBufferSnapshotTest)  Time elapsed: 0.078 s
test2(org.eclipse.handly.snapshot.ResourceTextFileBufferSnapshotTest)  Time elapsed: 0.009 s
test3(org.eclipse.handly.snapshot.ResourceTextFileBufferSnapshotTest)  Time elapsed: 0.008 s
test4(org.eclipse.handly.snapshot.ResourceTextFileBufferSnapshotTest)  Time elapsed: 0.01 s
test5(org.eclipse.handly.snapshot.ResourceTextFileBufferSnapshotTest)  Time elapsed: 0.008 s
test6(org.eclipse.handly.snapshot.ResourceTextFileBufferSnapshotTest)  Time elapsed: 0.054 s
Running org.eclipse.handly.snapshot.TextFileSnapshotTest
Tests run: 15, Failures: 0, Errors: 0, Skipped: 0, Time elapsed: 0.133 s - in org.eclipse.handly.snapshot.TextFileSnapshotTest
test01(org.eclipse.handly.snapshot.TextFileSnapshotTest)  Time elapsed: 0.008 s
test02(org.eclipse.handly.snapshot.TextFileSnapshotTest)  Time elapsed: 0.006 s
test03(org.eclipse.handly.snapshot.TextFileSnapshotTest)  Time elapsed: 0.007 s
test04(org.eclipse.handly.snapshot.TextFileSnapshotTest)  Time elapsed: 0.007 s
test05(org.eclipse.handly.snapshot.TextFileSnapshotTest)  Time elapsed: 0.007 s
test06(org.eclipse.handly.snapshot.TextFileSnapshotTest)  Time elapsed: 0.007 s
test07(org.eclipse.handly.snapshot.TextFileSnapshotTest)  Time elapsed: 0.006 s
test08(org.eclipse.handly.snapshot.TextFileSnapshotTest)  Time elapsed: 0.036 s
test09(org.eclipse.handly.snapshot.TextFileSnapshotTest)  Time elapsed: 0.007 s
test10(org.eclipse.handly.snapshot.TextFileSnapshotTest)  Time elapsed: 0.007 s
test11(org.eclipse.handly.snapshot.TextFileSnapshotTest)  Time elapsed: 0.006 s
test12(org.eclipse.handly.snapshot.TextFileSnapshotTest)  Time elapsed: 0.006 s
test13(org.eclipse.handly.snapshot.TextFileSnapshotTest)  Time elapsed: 0.006 s
test14(org.eclipse.handly.snapshot.TextFileSnapshotTest)  Time elapsed: 0.006 s
test15(org.eclipse.handly.snapshot.TextFileSnapshotTest)  Time elapsed: 0.01 s
Running org.eclipse.handly.snapshot.TextFileSnapshotWsTest
Tests run: 5, Failures: 0, Errors: 0, Skipped: 0, Time elapsed: 0.106 s - in org.eclipse.handly.snapshot.TextFileSnapshotWsTest
test1(org.eclipse.handly.snapshot.TextFileSnapshotWsTest)  Time elapsed: 0.075 s
test2(org.eclipse.handly.snapshot.TextFileSnapshotWsTest)  Time elapsed: 0.013 s
test3(org.eclipse.handly.snapshot.TextFileSnapshotWsTest)  Time elapsed: 0.006 s
test4(org.eclipse.handly.snapshot.TextFileSnapshotWsTest)  Time elapsed: 0.006 s
test5(org.eclipse.handly.snapshot.TextFileSnapshotWsTest)  Time elapsed: 0.005 s
Running org.eclipse.handly.snapshot.FileStoreTextFileBufferSnapshotTest
Tests run: 5, Failures: 0, Errors: 0, Skipped: 0, Time elapsed: 0.028 s - in org.eclipse.handly.snapshot.FileStoreTextFileBufferSnapshotTest
test1(org.eclipse.handly.snapshot.FileStoreTextFileBufferSnapshotTest)  Time elapsed: 0.005 s
test2(org.eclipse.handly.snapshot.FileStoreTextFileBufferSnapshotTest)  Time elapsed: 0.006 s
test3(org.eclipse.handly.snapshot.FileStoreTextFileBufferSnapshotTest)  Time elapsed: 0.005 s
test4(org.eclipse.handly.snapshot.FileStoreTextFileBufferSnapshotTest)  Time elapsed: 0.006 s
test5(org.eclipse.handly.snapshot.FileStoreTextFileBufferSnapshotTest)  Time elapsed: 0.005 s
Running org.eclipse.handly.snapshot.TextFileStoreSnapshotTest
Tests run: 1, Failures: 0, Errors: 0, Skipped: 0, Time elapsed: 0.006 s - in org.eclipse.handly.snapshot.TextFileStoreSnapshotTest
test1(org.eclipse.handly.snapshot.TextFileStoreSnapshotTest)  Time elapsed: 0.006 s
Running org.eclipse.handly.snapshot.EqualityPredictionTest
Tests run: 10, Failures: 0, Errors: 0, Skipped: 0, Time elapsed: 0.066 s - in org.eclipse.handly.snapshot.EqualityPredictionTest
test01(org.eclipse.handly.snapshot.EqualityPredictionTest)  Time elapsed: 0.007 s
test02(org.eclipse.handly.snapshot.EqualityPredictionTest)  Time elapsed: 0.006 s
test03(org.eclipse.handly.snapshot.EqualityPredictionTest)  Time elapsed: 0.005 s
test04(org.eclipse.handly.snapshot.EqualityPredictionTest)  Time elapsed: 0.006 s
test05(org.eclipse.handly.snapshot.EqualityPredictionTest)  Time elapsed: 0.005 s
test06(org.eclipse.handly.snapshot.EqualityPredictionTest)  Time elapsed: 0.006 s
test07(org.eclipse.handly.snapshot.EqualityPredictionTest)  Time elapsed: 0.005 s
test08(org.eclipse.handly.snapshot.EqualityPredictionTest)  Time elapsed: 0.007 s
test09(org.eclipse.handly.snapshot.EqualityPredictionTest)  Time elapsed: 0.006 s
test10(org.eclipse.handly.snapshot.EqualityPredictionTest)  Time elapsed: 0.012 s
Running org.eclipse.handly.text.DocumentChangeOperationTest
Tests run: 4, Failures: 0, Errors: 0, Skipped: 0, Time elapsed: 0.003 s - in org.eclipse.handly.text.DocumentChangeOperationTest
test1(org.eclipse.handly.text.DocumentChangeOperationTest)  Time elapsed: 0.001 s
test2(org.eclipse.handly.text.DocumentChangeOperationTest)  Time elapsed: 0 s
test3(org.eclipse.handly.text.DocumentChangeOperationTest)  Time elapsed: 0 s
test4(org.eclipse.handly.text.DocumentChangeOperationTest)  Time elapsed: 0.001 s
Running org.eclipse.handly.text.UiDocumentChangeRunnerTest
Tests run: 3, Failures: 0, Errors: 0, Skipped: 0, Time elapsed: 0.004 s - in org.eclipse.handly.text.UiDocumentChangeRunnerTest
test1(org.eclipse.handly.text.UiDocumentChangeRunnerTest)  Time elapsed: 0.001 s
test2(org.eclipse.handly.text.UiDocumentChangeRunnerTest)  Time elapsed: 0.001 s
test3(org.eclipse.handly.text.UiDocumentChangeRunnerTest)  Time elapsed: 0.001 s
Running org.eclipse.handly.util.PropertyTest
Tests run: 6, Failures: 0, Errors: 0, Skipped: 0, Time elapsed: 0.003 s - in org.eclipse.handly.util.PropertyTest
test1(org.eclipse.handly.util.PropertyTest)  Time elapsed: 0 s
test2(org.eclipse.handly.util.PropertyTest)  Time elapsed: 0 s
test3(org.eclipse.handly.util.PropertyTest)  Time elapsed: 0.001 s
test4(org.eclipse.handly.util.PropertyTest)  Time elapsed: 0 s
test5(org.eclipse.handly.util.PropertyTest)  Time elapsed: 0 s
test6(org.eclipse.handly.util.PropertyTest)  Time elapsed: 0.001 s
Running org.eclipse.handly.util.SimpleSynchronizerTest
Tests run: 1, Failures: 0, Errors: 0, Skipped: 0, Time elapsed: 0.001 s - in org.eclipse.handly.util.SimpleSynchronizerTest
test1(org.eclipse.handly.util.SimpleSynchronizerTest)  Time elapsed: 0.001 s
Running org.eclipse.handly.util.TextRangeTest
Tests run: 6, Failures: 0, Errors: 0, Skipped: 0, Time elapsed: 0.001 s - in org.eclipse.handly.util.TextRangeTest
test1(org.eclipse.handly.util.TextRangeTest)  Time elapsed: 0 s
test2(org.eclipse.handly.util.TextRangeTest)  Time elapsed: 0 s
test3(org.eclipse.handly.util.TextRangeTest)  Time elapsed: 0 s
test4(org.eclipse.handly.util.TextRangeTest)  Time elapsed: 0 s
test5(org.eclipse.handly.util.TextRangeTest)  Time elapsed: 0 s
test6(org.eclipse.handly.util.TextRangeTest)  Time elapsed: 0 s
Running org.eclipse.handly.util.LruCacheTest
Tests run: 3, Failures: 0, Errors: 0, Skipped: 0, Time elapsed: 0.001 s - in org.eclipse.handly.util.LruCacheTest
test1(org.eclipse.handly.util.LruCacheTest)  Time elapsed: 0 s
test2(org.eclipse.handly.util.LruCacheTest)  Time elapsed: 0 s
test3(org.eclipse.handly.util.LruCacheTest)  Time elapsed: 0 s
Running org.eclipse.handly.util.BoundedLruCacheTest
Tests run: 3, Failures: 0, Errors: 0, Skipped: 0, Time elapsed: 0.001 s - in org.eclipse.handly.util.BoundedLruCacheTest
test1(org.eclipse.handly.util.BoundedLruCacheTest)  Time elapsed: 0 s
test2(org.eclipse.handly.util.BoundedLruCacheTest)  Time elapsed: 0 s
test3(org.eclipse.handly.util.BoundedLruCacheTest)  Time elapsed: 0 s
Running org.eclipse.handly.util.ArrayUtilTest
Tests run: 14, Failures: 0, Errors: 0, Skipped: 0, Time elapsed: 0.005 s - in org.eclipse.handly.util.ArrayUtilTest
testLastIndexOfMatching(org.eclipse.handly.util.ArrayUtilTest)  Time elapsed: 0.001 s
testOnlyElementsOfType(org.eclipse.handly.util.ArrayUtilTest)  Time elapsed: 0 s
testContainsMatching(org.eclipse.handly.util.ArrayUtilTest)  Time elapsed: 0.001 s
testUnion(org.eclipse.handly.util.ArrayUtilTest)  Time elapsed: 0 s
testLastIndexOf(org.eclipse.handly.util.ArrayUtilTest)  Time elapsed: 0 s
testHasElementsNotOfType(org.eclipse.handly.util.ArrayUtilTest)  Time elapsed: 0 s
testCollectMatching(org.eclipse.handly.util.ArrayUtilTest)  Time elapsed: 0.001 s
testContains(org.eclipse.handly.util.ArrayUtilTest)  Time elapsed: 0 s
testConcat(org.eclipse.handly.util.ArrayUtilTest)  Time elapsed: 0 s
testElementsOfType(org.eclipse.handly.util.ArrayUtilTest)  Time elapsed: 0 s
testIndexOf(org.eclipse.handly.util.ArrayUtilTest)  Time elapsed: 0 s
testIndexOfMatching(org.eclipse.handly.util.ArrayUtilTest)  Time elapsed: 0.001 s
testHasElementsOfType(org.eclipse.handly.util.ArrayUtilTest)  Time elapsed: 0 s
testSetMinus(org.eclipse.handly.util.ArrayUtilTest)  Time elapsed: 0 s
Running org.eclipse.handly.refactoring.SourceFileChangeTest
Tests run: 10, Failures: 0, Errors: 0, Skipped: 0, Time elapsed: 0.173 s - in org.eclipse.handly.refactoring.SourceFileChangeTest
test01(org.eclipse.handly.refactoring.SourceFileChangeTest)  Time elapsed: 0.01 s
test02(org.eclipse.handly.refactoring.SourceFileChangeTest)  Time elapsed: 0.005 s
test03(org.eclipse.handly.refactoring.SourceFileChangeTest)  Time elapsed: 0.043 s
test04(org.eclipse.handly.refactoring.SourceFileChangeTest)  Time elapsed: 0.007 s
test05(org.eclipse.handly.refactoring.SourceFileChangeTest)  Time elapsed: 0.007 s
test06(org.eclipse.handly.refactoring.SourceFileChangeTest)  Time elapsed: 0.021 s
test07(org.eclipse.handly.refactoring.SourceFileChangeTest)  Time elapsed: 0.061 s
test08(org.eclipse.handly.refactoring.SourceFileChangeTest)  Time elapsed: 0.006 s
test09(org.eclipse.handly.refactoring.SourceFileChangeTest)  Time elapsed: 0.005 s
test10(org.eclipse.handly.refactoring.SourceFileChangeTest)  Time elapsed: 0.006 s
Running org.eclipse.handly.internal.DisplaySynchronizerTest

(SWT:398): Gdk-CRITICAL **: 18:27:17.657: gdk_threads_set_lock_functions: assertion 'gdk_threads_lock == NULL && gdk_threads_unlock == NULL' failed

(SWT:398): Gdk-CRITICAL **: 18:27:17.716: gdk_threads_set_lock_functions: assertion 'gdk_threads_lock == NULL && gdk_threads_unlock == NULL' failed

(SWT:398): Gdk-CRITICAL **: 18:27:17.762: gdk_threads_set_lock_functions: assertion 'gdk_threads_lock == NULL && gdk_threads_unlock == NULL' failed

(SWT:398): Gdk-CRITICAL **: 18:27:17.800: gdk_threads_set_lock_functions: assertion 'gdk_threads_lock == NULL && gdk_threads_unlock == NULL' failed
Tests run: 4, Failures: 0, Errors: 0, Skipped: 0, Time elapsed: 0.181 s - in org.eclipse.handly.internal.DisplaySynchronizerTest
test1(org.eclipse.handly.internal.DisplaySynchronizerTest)  Time elapsed: 0.059 s
test2(org.eclipse.handly.internal.DisplaySynchronizerTest)  Time elapsed: 0.046 s
test3(org.eclipse.handly.internal.DisplaySynchronizerTest)  Time elapsed: 0.038 s
test4(org.eclipse.handly.internal.DisplaySynchronizerTest)  Time elapsed: 0.037 s

Results:

Tests run: 317, Failures: 0, Errors: 0, Skipped: 0

[INFO] All tests passed!
[INFO] 
[INFO] --- eclipse-jarsigner-plugin:1.3.1:sign (sign) @ org.eclipse.handly.tests ---
[INFO] Signing jar: /home/jenkins/agent/workspace/1.7.x/org.eclipse.handly.tests/target/org.eclipse.handly.tests-1.7.0-SNAPSHOT.jar
[INFO] Signing jar: /home/jenkins/agent/workspace/1.7.x/org.eclipse.handly.tests/target/org.eclipse.handly.tests-1.7.0-SNAPSHOT-sources.jar
[INFO] 
[INFO] ----------< org.eclipse.handly.bundles:org.eclipse.handly.ui >----------
[INFO] Building org.eclipse.handly.ui 1.7.0-SNAPSHOT                     [5/26]
[INFO] ---------------------------[ eclipse-plugin ]---------------------------
[INFO] 
[INFO] --- maven-clean-plugin:2.5:clean (default-clean) @ org.eclipse.handly.ui ---
[INFO] 
[INFO] --- tycho-packaging-plugin:2.5.0:build-qualifier (default-build-qualifier) @ org.eclipse.handly.ui ---
[INFO] The project's OSGi version is 1.7.0.v20220614-1826
[INFO] 
[INFO] --- tycho-packaging-plugin:2.5.0:validate-id (default-validate-id) @ org.eclipse.handly.ui ---
[INFO] 
[INFO] --- tycho-packaging-plugin:2.5.0:validate-version (default-validate-version) @ org.eclipse.handly.ui ---
[INFO] 
[INFO] --- target-platform-configuration:2.5.0:target-platform (default-target-platform) @ org.eclipse.handly.ui ---
[INFO] 
[INFO] --- maven-resources-plugin:2.4.3:resources (default-resources) @ org.eclipse.handly.ui ---
[INFO] Using 'UTF-8' encoding to copy filtered resources.
[INFO] skip non existing resourceDirectory /home/jenkins/agent/workspace/1.7.x/org.eclipse.handly.ui/src/main/resources
[INFO] 
[INFO] --- tycho-compiler-plugin:2.5.0:compile (default-compile) @ org.eclipse.handly.ui ---
[INFO] Compiling 138 source files to /home/jenkins/agent/workspace/1.7.x/org.eclipse.handly.ui/target/classes
[INFO] 
[INFO] --- maven-resources-plugin:2.4.3:testResources (default-testResources) @ org.eclipse.handly.ui ---
[INFO] Using 'UTF-8' encoding to copy filtered resources.
[INFO] skip non existing resourceDirectory /home/jenkins/agent/workspace/1.7.x/org.eclipse.handly.ui/src/test/resources
[INFO] 
[INFO] --- tycho-compiler-plugin:2.5.0:testCompile (default-testCompile) @ org.eclipse.handly.ui ---
[INFO] 
[INFO] --- maven-surefire-plugin:2.22.2:test (default-test) @ org.eclipse.handly.ui ---
[INFO] No tests to run.
[INFO] 
[INFO] --- tycho-source-plugin:2.5.0:plugin-source (plugin-source) @ org.eclipse.handly.ui ---
[INFO] Building jar: /home/jenkins/agent/workspace/1.7.x/org.eclipse.handly.ui/target/org.eclipse.handly.ui-1.7.0-SNAPSHOT-sources.jar
[INFO] 
[INFO] --- tycho-packaging-plugin:2.5.0:package-plugin (default-package-plugin) @ org.eclipse.handly.ui ---
[INFO] Building jar: /home/jenkins/agent/workspace/1.7.x/org.eclipse.handly.ui/target/org.eclipse.handly.ui-1.7.0-SNAPSHOT.jar
[INFO] 
[INFO] --- tycho-p2-plugin:2.5.0:p2-metadata-default (default-p2-metadata-default) @ org.eclipse.handly.ui ---
[INFO] 
[INFO] --- tycho-source-plugin:2.5.0:feature-source (feature-source) @ org.eclipse.handly.ui ---
[INFO] 
[INFO] --- tycho-surefire-plugin:2.5.0:integration-test (default-integration-test) @ org.eclipse.handly.ui ---
[INFO] 
[INFO] --- maven-failsafe-plugin:2.22.2:verify (default-verify) @ org.eclipse.handly.ui ---
[INFO] No tests to run.
[INFO] 
[INFO] --- eclipse-jarsigner-plugin:1.3.1:sign (sign) @ org.eclipse.handly.ui ---
[INFO] Signing jar: /home/jenkins/agent/workspace/1.7.x/org.eclipse.handly.ui/target/org.eclipse.handly.ui-1.7.0-SNAPSHOT.jar
[INFO] Signing jar: /home/jenkins/agent/workspace/1.7.x/org.eclipse.handly.ui/target/org.eclipse.handly.ui-1.7.0-SNAPSHOT-sources.jar
[INFO] 
[INFO] --------< org.eclipse.handly.bundles:org.eclipse.handly.xtext >---------
[INFO] Building org.eclipse.handly.xtext 1.7.0-SNAPSHOT                  [6/26]
[INFO] ---------------------------[ eclipse-plugin ]---------------------------
[INFO] 
[INFO] --- maven-clean-plugin:2.5:clean (default-clean) @ org.eclipse.handly.xtext ---
[INFO] 
[INFO] --- tycho-packaging-plugin:2.5.0:build-qualifier (default-build-qualifier) @ org.eclipse.handly.xtext ---
[INFO] The project's OSGi version is 1.7.0.v20220614-1826
[INFO] 
[INFO] --- tycho-packaging-plugin:2.5.0:validate-id (default-validate-id) @ org.eclipse.handly.xtext ---
[INFO] 
[INFO] --- tycho-packaging-plugin:2.5.0:validate-version (default-validate-version) @ org.eclipse.handly.xtext ---
[INFO] 
[INFO] --- target-platform-configuration:2.5.0:target-platform (default-target-platform) @ org.eclipse.handly.xtext ---
[INFO] 
[INFO] --- maven-resources-plugin:2.4.3:resources (default-resources) @ org.eclipse.handly.xtext ---
[INFO] Using 'UTF-8' encoding to copy filtered resources.
[INFO] skip non existing resourceDirectory /home/jenkins/agent/workspace/1.7.x/org.eclipse.handly.xtext/src/main/resources
[INFO] 
[INFO] --- tycho-compiler-plugin:2.5.0:compile (default-compile) @ org.eclipse.handly.xtext ---
[INFO] Nothing to compile - all classes are up to date
[INFO] 
[INFO] --- maven-resources-plugin:2.4.3:testResources (default-testResources) @ org.eclipse.handly.xtext ---
[INFO] Using 'UTF-8' encoding to copy filtered resources.
[INFO] skip non existing resourceDirectory /home/jenkins/agent/workspace/1.7.x/org.eclipse.handly.xtext/src/test/resources
[INFO] 
[INFO] --- tycho-compiler-plugin:2.5.0:testCompile (default-testCompile) @ org.eclipse.handly.xtext ---
[INFO] 
[INFO] --- maven-surefire-plugin:2.22.2:test (default-test) @ org.eclipse.handly.xtext ---
[INFO] No tests to run.
[INFO] 
[INFO] --- tycho-source-plugin:2.5.0:plugin-source (plugin-source) @ org.eclipse.handly.xtext ---
[INFO] Building jar: /home/jenkins/agent/workspace/1.7.x/org.eclipse.handly.xtext/target/org.eclipse.handly.xtext-1.7.0-SNAPSHOT-sources.jar
[INFO] 
[INFO] --- tycho-packaging-plugin:2.5.0:package-plugin (default-package-plugin) @ org.eclipse.handly.xtext ---
[INFO] Building jar: /home/jenkins/agent/workspace/1.7.x/org.eclipse.handly.xtext/target/org.eclipse.handly.xtext-1.7.0-SNAPSHOT.jar
[INFO] 
[INFO] --- tycho-p2-plugin:2.5.0:p2-metadata-default (default-p2-metadata-default) @ org.eclipse.handly.xtext ---
[INFO] 
[INFO] --- tycho-source-plugin:2.5.0:feature-source (feature-source) @ org.eclipse.handly.xtext ---
[INFO] 
[INFO] --- tycho-surefire-plugin:2.5.0:integration-test (default-integration-test) @ org.eclipse.handly.xtext ---
[INFO] 
[INFO] --- maven-failsafe-plugin:2.22.2:verify (default-verify) @ org.eclipse.handly.xtext ---
[INFO] No tests to run.
[INFO] 
[INFO] --- eclipse-jarsigner-plugin:1.3.1:sign (sign) @ org.eclipse.handly.xtext ---
[INFO] Signing jar: /home/jenkins/agent/workspace/1.7.x/org.eclipse.handly.xtext/target/org.eclipse.handly.xtext-1.7.0-SNAPSHOT.jar
[INFO] Signing jar: /home/jenkins/agent/workspace/1.7.x/org.eclipse.handly.xtext/target/org.eclipse.handly.xtext-1.7.0-SNAPSHOT-sources.jar
[INFO] 
[INFO] -------< org.eclipse.handly.bundles:org.eclipse.handly.xtext.ui >-------
[INFO] Building org.eclipse.handly.xtext.ui 1.7.0-SNAPSHOT               [7/26]
[INFO] ---------------------------[ eclipse-plugin ]---------------------------
[INFO] 
[INFO] --- maven-clean-plugin:2.5:clean (default-clean) @ org.eclipse.handly.xtext.ui ---
[INFO] 
[INFO] --- tycho-packaging-plugin:2.5.0:build-qualifier (default-build-qualifier) @ org.eclipse.handly.xtext.ui ---
[INFO] The project's OSGi version is 1.7.0.v20220614-1826
[INFO] 
[INFO] --- tycho-packaging-plugin:2.5.0:validate-id (default-validate-id) @ org.eclipse.handly.xtext.ui ---
[INFO] 
[INFO] --- tycho-packaging-plugin:2.5.0:validate-version (default-validate-version) @ org.eclipse.handly.xtext.ui ---
[INFO] 
[INFO] --- target-platform-configuration:2.5.0:target-platform (default-target-platform) @ org.eclipse.handly.xtext.ui ---
[INFO] 
[INFO] --- maven-resources-plugin:2.4.3:resources (default-resources) @ org.eclipse.handly.xtext.ui ---
[INFO] Using 'UTF-8' encoding to copy filtered resources.
[INFO] skip non existing resourceDirectory /home/jenkins/agent/workspace/1.7.x/org.eclipse.handly.xtext.ui/src/main/resources
[INFO] 
[INFO] --- tycho-compiler-plugin:2.5.0:compile (default-compile) @ org.eclipse.handly.xtext.ui ---
[INFO] Compiling 20 source files to /home/jenkins/agent/workspace/1.7.x/org.eclipse.handly.xtext.ui/target/classes
[INFO] 
[INFO] --- maven-resources-plugin:2.4.3:testResources (default-testResources) @ org.eclipse.handly.xtext.ui ---
[INFO] Using 'UTF-8' encoding to copy filtered resources.
[INFO] skip non existing resourceDirectory /home/jenkins/agent/workspace/1.7.x/org.eclipse.handly.xtext.ui/src/test/resources
[INFO] 
[INFO] --- tycho-compiler-plugin:2.5.0:testCompile (default-testCompile) @ org.eclipse.handly.xtext.ui ---
[INFO] 
[INFO] --- maven-surefire-plugin:2.22.2:test (default-test) @ org.eclipse.handly.xtext.ui ---
[INFO] No tests to run.
[INFO] 
[INFO] --- tycho-source-plugin:2.5.0:plugin-source (plugin-source) @ org.eclipse.handly.xtext.ui ---
[INFO] Building jar: /home/jenkins/agent/workspace/1.7.x/org.eclipse.handly.xtext.ui/target/org.eclipse.handly.xtext.ui-1.7.0-SNAPSHOT-sources.jar
[INFO] 
[INFO] --- tycho-packaging-plugin:2.5.0:package-plugin (default-package-plugin) @ org.eclipse.handly.xtext.ui ---
[INFO] Building jar: /home/jenkins/agent/workspace/1.7.x/org.eclipse.handly.xtext.ui/target/org.eclipse.handly.xtext.ui-1.7.0-SNAPSHOT.jar
[INFO] 
[INFO] --- tycho-p2-plugin:2.5.0:p2-metadata-default (default-p2-metadata-default) @ org.eclipse.handly.xtext.ui ---
[INFO] 
[INFO] --- tycho-source-plugin:2.5.0:feature-source (feature-source) @ org.eclipse.handly.xtext.ui ---
[INFO] 
[INFO] --- tycho-surefire-plugin:2.5.0:integration-test (default-integration-test) @ org.eclipse.handly.xtext.ui ---
[INFO] 
[INFO] --- maven-failsafe-plugin:2.22.2:verify (default-verify) @ org.eclipse.handly.xtext.ui ---
[INFO] No tests to run.
[INFO] 
[INFO] --- eclipse-jarsigner-plugin:1.3.1:sign (sign) @ org.eclipse.handly.xtext.ui ---
[INFO] Signing jar: /home/jenkins/agent/workspace/1.7.x/org.eclipse.handly.xtext.ui/target/org.eclipse.handly.xtext.ui-1.7.0-SNAPSHOT.jar
[INFO] Signing jar: /home/jenkins/agent/workspace/1.7.x/org.eclipse.handly.xtext.ui/target/org.eclipse.handly.xtext.ui-1.7.0-SNAPSHOT-sources.jar
[INFO] 
[INFO] -------< org.eclipse.handly.bundles:org.eclipse.handly.examples >-------
[INFO] Building org.eclipse.handly.examples 1.7.0-SNAPSHOT               [8/26]
[INFO] ---------------------------[ eclipse-plugin ]---------------------------
[INFO] 
[INFO] --- maven-clean-plugin:2.5:clean (default-clean) @ org.eclipse.handly.examples ---
[INFO] 
[INFO] --- maven-antrun-plugin:1.8:run (clean-examples) @ org.eclipse.handly.examples ---
[INFO] Executing tasks

main:

clean_all_examples:
[INFO] Executed tasks
[INFO] 
[INFO] --- tycho-packaging-plugin:2.5.0:build-qualifier (default-build-qualifier) @ org.eclipse.handly.examples ---
[INFO] The project's OSGi version is 1.7.0.v20220614-1826
[INFO] 
[INFO] --- tycho-packaging-plugin:2.5.0:validate-id (default-validate-id) @ org.eclipse.handly.examples ---
[INFO] 
[INFO] --- tycho-packaging-plugin:2.5.0:validate-version (default-validate-version) @ org.eclipse.handly.examples ---
[INFO] 
[INFO] --- target-platform-configuration:2.5.0:target-platform (default-target-platform) @ org.eclipse.handly.examples ---
[INFO] 
[INFO] --- maven-resources-plugin:2.4.3:resources (default-resources) @ org.eclipse.handly.examples ---
[INFO] Using 'UTF-8' encoding to copy filtered resources.
[INFO] skip non existing resourceDirectory /home/jenkins/agent/workspace/1.7.x/org.eclipse.handly.examples/src/main/resources
[INFO] 
[INFO] --- tycho-compiler-plugin:2.5.0:compile (default-compile) @ org.eclipse.handly.examples ---
[INFO] 
[INFO] --- maven-resources-plugin:2.4.3:testResources (default-testResources) @ org.eclipse.handly.examples ---
[INFO] Using 'UTF-8' encoding to copy filtered resources.
[INFO] skip non existing resourceDirectory /home/jenkins/agent/workspace/1.7.x/org.eclipse.handly.examples/src/test/resources
[INFO] 
[INFO] --- tycho-compiler-plugin:2.5.0:testCompile (default-testCompile) @ org.eclipse.handly.examples ---
[INFO] 
[INFO] --- maven-surefire-plugin:2.22.2:test (default-test) @ org.eclipse.handly.examples ---
[INFO] No tests to run.
[INFO] 
[INFO] --- tycho-source-plugin:2.5.0:plugin-source (plugin-source) @ org.eclipse.handly.examples ---
[INFO] Building jar: /home/jenkins/agent/workspace/1.7.x/org.eclipse.handly.examples/target/org.eclipse.handly.examples-1.7.0-SNAPSHOT-sources.jar
[INFO] 
[INFO] --- maven-antrun-plugin:1.8:run (package-examples) @ org.eclipse.handly.examples ---
[INFO] Executing tasks

main:

zip_all_examples:
      [zip] Building zip: /home/jenkins/agent/workspace/1.7.x/org.eclipse.handly.examples/contents/org.eclipse.handly.examples.adapter.zip
      [zip] Building zip: /home/jenkins/agent/workspace/1.7.x/org.eclipse.handly.examples/contents/org.eclipse.handly.examples.adapter.ui.zip
      [zip] Building zip: /home/jenkins/agent/workspace/1.7.x/org.eclipse.handly.examples/contents/org.eclipse.handly.examples.basic.zip
      [zip] Building zip: /home/jenkins/agent/workspace/1.7.x/org.eclipse.handly.examples/contents/org.eclipse.handly.examples.basic.ide.zip
      [zip] Building zip: /home/jenkins/agent/workspace/1.7.x/org.eclipse.handly.examples/contents/org.eclipse.handly.examples.basic.ui.zip
      [zip] Building zip: /home/jenkins/agent/workspace/1.7.x/org.eclipse.handly.examples/contents/org.eclipse.handly.examples.basic.ui.tests.zip
      [zip] Building zip: /home/jenkins/agent/workspace/1.7.x/org.eclipse.handly.examples/contents/org.eclipse.handly.examples.jmodel.zip
      [zip] Building zip: /home/jenkins/agent/workspace/1.7.x/org.eclipse.handly.examples/contents/org.eclipse.handly.examples.jmodel.tests.zip
      [zip] Building zip: /home/jenkins/agent/workspace/1.7.x/org.eclipse.handly.examples/contents/org.eclipse.handly.examples.jmodel.ui.zip
      [zip] Building zip: /home/jenkins/agent/workspace/1.7.x/org.eclipse.handly.examples/contents/org.eclipse.handly.examples.xtext.xtext.ui.zip
[INFO] Executed tasks
[INFO] 
[INFO] --- tycho-packaging-plugin:2.5.0:package-plugin (default-package-plugin) @ org.eclipse.handly.examples ---
[INFO] Building jar: /home/jenkins/agent/workspace/1.7.x/org.eclipse.handly.examples/target/org.eclipse.handly.examples-1.7.0-SNAPSHOT.jar
[INFO] 
[INFO] --- tycho-p2-plugin:2.5.0:p2-metadata-default (default-p2-metadata-default) @ org.eclipse.handly.examples ---
[INFO] 
[INFO] --- tycho-source-plugin:2.5.0:feature-source (feature-source) @ org.eclipse.handly.examples ---
[INFO] 
[INFO] --- tycho-surefire-plugin:2.5.0:integration-test (default-integration-test) @ org.eclipse.handly.examples ---
[INFO] 
[INFO] --- maven-failsafe-plugin:2.22.2:verify (default-verify) @ org.eclipse.handly.examples ---
[INFO] No tests to run.
[INFO] 
[INFO] --- eclipse-jarsigner-plugin:1.3.1:sign (sign) @ org.eclipse.handly.examples ---
[INFO] Signing jar: /home/jenkins/agent/workspace/1.7.x/org.eclipse.handly.examples/target/org.eclipse.handly.examples-1.7.0-SNAPSHOT.jar
[INFO] Signing jar: /home/jenkins/agent/workspace/1.7.x/org.eclipse.handly.examples/target/org.eclipse.handly.examples-1.7.0-SNAPSHOT-sources.jar
[INFO] 
[INFO] ---< org.eclipse.handly.bundles:org.eclipse.handly.examples.adapter >---
[INFO] Building org.eclipse.handly.examples.adapter 1.7.0-SNAPSHOT       [9/26]
[INFO] ---------------------------[ eclipse-plugin ]---------------------------
[INFO] 
[INFO] --- maven-clean-plugin:2.5:clean (default-clean) @ org.eclipse.handly.examples.adapter ---
[INFO] 
[INFO] --- tycho-packaging-plugin:2.5.0:build-qualifier (default-build-qualifier) @ org.eclipse.handly.examples.adapter ---
[INFO] The project's OSGi version is 1.7.0.v20220614-1826
[INFO] 
[INFO] --- tycho-packaging-plugin:2.5.0:validate-id (default-validate-id) @ org.eclipse.handly.examples.adapter ---
[INFO] 
[INFO] --- tycho-packaging-plugin:2.5.0:validate-version (default-validate-version) @ org.eclipse.handly.examples.adapter ---
[INFO] 
[INFO] --- target-platform-configuration:2.5.0:target-platform (default-target-platform) @ org.eclipse.handly.examples.adapter ---
[INFO] 
[INFO] --- maven-resources-plugin:2.4.3:resources (default-resources) @ org.eclipse.handly.examples.adapter ---
[INFO] Using 'UTF-8' encoding to copy filtered resources.
[INFO] skip non existing resourceDirectory /home/jenkins/agent/workspace/1.7.x/org.eclipse.handly.examples.adapter/src/main/resources
[INFO] 
[INFO] --- tycho-compiler-plugin:2.5.0:compile (default-compile) @ org.eclipse.handly.examples.adapter ---
[INFO] Compiling 9 source files to /home/jenkins/agent/workspace/1.7.x/org.eclipse.handly.examples.adapter/target/classes
[INFO] 
[INFO] --- maven-resources-plugin:2.4.3:testResources (default-testResources) @ org.eclipse.handly.examples.adapter ---
[INFO] Using 'UTF-8' encoding to copy filtered resources.
[INFO] skip non existing resourceDirectory /home/jenkins/agent/workspace/1.7.x/org.eclipse.handly.examples.adapter/src/test/resources
[INFO] 
[INFO] --- tycho-compiler-plugin:2.5.0:testCompile (default-testCompile) @ org.eclipse.handly.examples.adapter ---
[INFO] 
[INFO] --- maven-surefire-plugin:2.22.2:test (default-test) @ org.eclipse.handly.examples.adapter ---
[INFO] No tests to run.
[INFO] 
[INFO] --- tycho-source-plugin:2.5.0:plugin-source (plugin-source) @ org.eclipse.handly.examples.adapter ---
[INFO] Building jar: /home/jenkins/agent/workspace/1.7.x/org.eclipse.handly.examples.adapter/target/org.eclipse.handly.examples.adapter-1.7.0-SNAPSHOT-sources.jar
[INFO] 
[INFO] --- tycho-packaging-plugin:2.5.0:package-plugin (default-package-plugin) @ org.eclipse.handly.examples.adapter ---
[INFO] Building jar: /home/jenkins/agent/workspace/1.7.x/org.eclipse.handly.examples.adapter/target/org.eclipse.handly.examples.adapter-1.7.0-SNAPSHOT.jar
[INFO] 
[INFO] --- tycho-p2-plugin:2.5.0:p2-metadata-default (default-p2-metadata-default) @ org.eclipse.handly.examples.adapter ---
[INFO] 
[INFO] --- tycho-source-plugin:2.5.0:feature-source (feature-source) @ org.eclipse.handly.examples.adapter ---
[INFO] 
[INFO] --- tycho-surefire-plugin:2.5.0:integration-test (default-integration-test) @ org.eclipse.handly.examples.adapter ---
[INFO] 
[INFO] --- maven-failsafe-plugin:2.22.2:verify (default-verify) @ org.eclipse.handly.examples.adapter ---
[INFO] No tests to run.
[INFO] 
[INFO] --- eclipse-jarsigner-plugin:1.3.1:sign (sign) @ org.eclipse.handly.examples.adapter ---
[INFO] Signing jar: /home/jenkins/agent/workspace/1.7.x/org.eclipse.handly.examples.adapter/target/org.eclipse.handly.examples.adapter-1.7.0-SNAPSHOT.jar
[INFO] Signing jar: /home/jenkins/agent/workspace/1.7.x/org.eclipse.handly.examples.adapter/target/org.eclipse.handly.examples.adapter-1.7.0-SNAPSHOT-sources.jar
[INFO] 
[INFO] --< org.eclipse.handly.bundles:org.eclipse.handly.examples.adapter.ui >--
[INFO] Building org.eclipse.handly.examples.adapter.ui 1.7.0-SNAPSHOT   [10/26]
[INFO] ---------------------------[ eclipse-plugin ]---------------------------
[INFO] 
[INFO] --- maven-clean-plugin:2.5:clean (default-clean) @ org.eclipse.handly.examples.adapter.ui ---
[INFO] 
[INFO] --- tycho-packaging-plugin:2.5.0:build-qualifier (default-build-qualifier) @ org.eclipse.handly.examples.adapter.ui ---
[INFO] The project's OSGi version is 1.7.0.v20220614-1826
[INFO] 
[INFO] --- tycho-packaging-plugin:2.5.0:validate-id (default-validate-id) @ org.eclipse.handly.examples.adapter.ui ---
[INFO] 
[INFO] --- tycho-packaging-plugin:2.5.0:validate-version (default-validate-version) @ org.eclipse.handly.examples.adapter.ui ---
[INFO] 
[INFO] --- target-platform-configuration:2.5.0:target-platform (default-target-platform) @ org.eclipse.handly.examples.adapter.ui ---
[INFO] 
[INFO] --- maven-resources-plugin:2.4.3:resources (default-resources) @ org.eclipse.handly.examples.adapter.ui ---
[INFO] Using 'UTF-8' encoding to copy filtered resources.
[INFO] skip non existing resourceDirectory /home/jenkins/agent/workspace/1.7.x/org.eclipse.handly.examples.adapter.ui/src/main/resources
[INFO] 
[INFO] --- tycho-compiler-plugin:2.5.0:compile (default-compile) @ org.eclipse.handly.examples.adapter.ui ---
[INFO] Compiling 23 source files to /home/jenkins/agent/workspace/1.7.x/org.eclipse.handly.examples.adapter.ui/target/classes
[INFO] 
[INFO] --- maven-resources-plugin:2.4.3:testResources (default-testResources) @ org.eclipse.handly.examples.adapter.ui ---
[INFO] Using 'UTF-8' encoding to copy filtered resources.
[INFO] skip non existing resourceDirectory /home/jenkins/agent/workspace/1.7.x/org.eclipse.handly.examples.adapter.ui/src/test/resources
[INFO] 
[INFO] --- tycho-compiler-plugin:2.5.0:testCompile (default-testCompile) @ org.eclipse.handly.examples.adapter.ui ---
[INFO] 
[INFO] --- maven-surefire-plugin:2.22.2:test (default-test) @ org.eclipse.handly.examples.adapter.ui ---
[INFO] No tests to run.
[INFO] 
[INFO] --- tycho-source-plugin:2.5.0:plugin-source (plugin-source) @ org.eclipse.handly.examples.adapter.ui ---
[INFO] Building jar: /home/jenkins/agent/workspace/1.7.x/org.eclipse.handly.examples.adapter.ui/target/org.eclipse.handly.examples.adapter.ui-1.7.0-SNAPSHOT-sources.jar
[INFO] 
[INFO] --- tycho-packaging-plugin:2.5.0:package-plugin (default-package-plugin) @ org.eclipse.handly.examples.adapter.ui ---
[INFO] Building jar: /home/jenkins/agent/workspace/1.7.x/org.eclipse.handly.examples.adapter.ui/target/org.eclipse.handly.examples.adapter.ui-1.7.0-SNAPSHOT.jar
[INFO] 
[INFO] --- tycho-p2-plugin:2.5.0:p2-metadata-default (default-p2-metadata-default) @ org.eclipse.handly.examples.adapter.ui ---
[INFO] 
[INFO] --- tycho-source-plugin:2.5.0:feature-source (feature-source) @ org.eclipse.handly.examples.adapter.ui ---
[INFO] 
[INFO] --- tycho-surefire-plugin:2.5.0:integration-test (default-integration-test) @ org.eclipse.handly.examples.adapter.ui ---
[INFO] 
[INFO] --- maven-failsafe-plugin:2.22.2:verify (default-verify) @ org.eclipse.handly.examples.adapter.ui ---
[INFO] No tests to run.
[INFO] 
[INFO] --- eclipse-jarsigner-plugin:1.3.1:sign (sign) @ org.eclipse.handly.examples.adapter.ui ---
[INFO] Signing jar: /home/jenkins/agent/workspace/1.7.x/org.eclipse.handly.examples.adapter.ui/target/org.eclipse.handly.examples.adapter.ui-1.7.0-SNAPSHOT.jar
[INFO] Signing jar: /home/jenkins/agent/workspace/1.7.x/org.eclipse.handly.examples.adapter.ui/target/org.eclipse.handly.examples.adapter.ui-1.7.0-SNAPSHOT-sources.jar
[INFO] 
[INFO] ----< org.eclipse.handly.bundles:org.eclipse.handly.examples.basic >----
[INFO] Building org.eclipse.handly.examples.basic 1.7.0-SNAPSHOT        [11/26]
[INFO] ---------------------------[ eclipse-plugin ]---------------------------
[INFO] 
[INFO] --- maven-clean-plugin:2.5:clean (default-clean) @ org.eclipse.handly.examples.basic ---
[INFO] 
[INFO] --- tycho-packaging-plugin:2.5.0:build-qualifier (default-build-qualifier) @ org.eclipse.handly.examples.basic ---
[INFO] The project's OSGi version is 1.7.0.v20220614-1826
[INFO] 
[INFO] --- tycho-packaging-plugin:2.5.0:validate-id (default-validate-id) @ org.eclipse.handly.examples.basic ---
[INFO] 
[INFO] --- tycho-packaging-plugin:2.5.0:validate-version (default-validate-version) @ org.eclipse.handly.examples.basic ---
[INFO] 
[INFO] --- target-platform-configuration:2.5.0:target-platform (default-target-platform) @ org.eclipse.handly.examples.basic ---
[INFO] 
[INFO] --- maven-resources-plugin:2.4.3:resources (default-resources) @ org.eclipse.handly.examples.basic ---
[INFO] Using 'UTF-8' encoding to copy filtered resources.
[INFO] skip non existing resourceDirectory /home/jenkins/agent/workspace/1.7.x/org.eclipse.handly.examples.basic/src/main/resources
[INFO] 
[INFO] --- tycho-compiler-plugin:2.5.0:compile (default-compile) @ org.eclipse.handly.examples.basic ---
[INFO] Compiling 23 source files to /home/jenkins/agent/workspace/1.7.x/org.eclipse.handly.examples.basic/target/classes
[INFO] 
[INFO] --- maven-resources-plugin:2.4.3:testResources (default-testResources) @ org.eclipse.handly.examples.basic ---
[INFO] Using 'UTF-8' encoding to copy filtered resources.
[INFO] skip non existing resourceDirectory /home/jenkins/agent/workspace/1.7.x/org.eclipse.handly.examples.basic/src/test/resources
[INFO] 
[INFO] --- tycho-compiler-plugin:2.5.0:testCompile (default-testCompile) @ org.eclipse.handly.examples.basic ---
[INFO] 
[INFO] --- maven-surefire-plugin:2.22.2:test (default-test) @ org.eclipse.handly.examples.basic ---
[INFO] No tests to run.
[INFO] 
[INFO] --- tycho-source-plugin:2.5.0:plugin-source (plugin-source) @ org.eclipse.handly.examples.basic ---
[INFO] Building jar: /home/jenkins/agent/workspace/1.7.x/org.eclipse.handly.examples.basic/target/org.eclipse.handly.examples.basic-1.7.0-SNAPSHOT-sources.jar
[INFO] 
[INFO] --- tycho-packaging-plugin:2.5.0:package-plugin (default-package-plugin) @ org.eclipse.handly.examples.basic ---
[INFO] Building jar: /home/jenkins/agent/workspace/1.7.x/org.eclipse.handly.examples.basic/target/org.eclipse.handly.examples.basic-1.7.0-SNAPSHOT.jar
[INFO] 
[INFO] --- tycho-p2-plugin:2.5.0:p2-metadata-default (default-p2-metadata-default) @ org.eclipse.handly.examples.basic ---
[INFO] 
[INFO] --- tycho-source-plugin:2.5.0:feature-source (feature-source) @ org.eclipse.handly.examples.basic ---
[INFO] 
[INFO] --- tycho-surefire-plugin:2.5.0:integration-test (default-integration-test) @ org.eclipse.handly.examples.basic ---
[INFO] 
[INFO] --- maven-failsafe-plugin:2.22.2:verify (default-verify) @ org.eclipse.handly.examples.basic ---
[INFO] No tests to run.
[INFO] 
[INFO] --- eclipse-jarsigner-plugin:1.3.1:sign (sign) @ org.eclipse.handly.examples.basic ---
[INFO] Signing jar: /home/jenkins/agent/workspace/1.7.x/org.eclipse.handly.examples.basic/target/org.eclipse.handly.examples.basic-1.7.0-SNAPSHOT.jar
[INFO] Signing jar: /home/jenkins/agent/workspace/1.7.x/org.eclipse.handly.examples.basic/target/org.eclipse.handly.examples.basic-1.7.0-SNAPSHOT-sources.jar
[INFO] 
[INFO] --< org.eclipse.handly.bundles:org.eclipse.handly.examples.basic.ide >--
[INFO] Building org.eclipse.handly.examples.basic.ide 1.7.0-SNAPSHOT    [12/26]
[INFO] ---------------------------[ eclipse-plugin ]---------------------------
[INFO] 
[INFO] --- maven-clean-plugin:2.5:clean (default-clean) @ org.eclipse.handly.examples.basic.ide ---
[INFO] 
[INFO] --- tycho-packaging-plugin:2.5.0:build-qualifier (default-build-qualifier) @ org.eclipse.handly.examples.basic.ide ---
[INFO] The project's OSGi version is 1.7.0.v20220614-1826
[INFO] 
[INFO] --- tycho-packaging-plugin:2.5.0:validate-id (default-validate-id) @ org.eclipse.handly.examples.basic.ide ---
[INFO] 
[INFO] --- tycho-packaging-plugin:2.5.0:validate-version (default-validate-version) @ org.eclipse.handly.examples.basic.ide ---
[INFO] 
[INFO] --- target-platform-configuration:2.5.0:target-platform (default-target-platform) @ org.eclipse.handly.examples.basic.ide ---
[INFO] 
[INFO] --- maven-resources-plugin:2.4.3:resources (default-resources) @ org.eclipse.handly.examples.basic.ide ---
[INFO] Using 'UTF-8' encoding to copy filtered resources.
[INFO] skip non existing resourceDirectory /home/jenkins/agent/workspace/1.7.x/org.eclipse.handly.examples.basic.ide/src/main/resources
[INFO] 
[INFO] --- tycho-compiler-plugin:2.5.0:compile (default-compile) @ org.eclipse.handly.examples.basic.ide ---
[INFO] Compiling 6 source files to /home/jenkins/agent/workspace/1.7.x/org.eclipse.handly.examples.basic.ide/target/classes
[INFO] 
[INFO] --- maven-resources-plugin:2.4.3:testResources (default-testResources) @ org.eclipse.handly.examples.basic.ide ---
[INFO] Using 'UTF-8' encoding to copy filtered resources.
[INFO] skip non existing resourceDirectory /home/jenkins/agent/workspace/1.7.x/org.eclipse.handly.examples.basic.ide/src/test/resources
[INFO] 
[INFO] --- tycho-compiler-plugin:2.5.0:testCompile (default-testCompile) @ org.eclipse.handly.examples.basic.ide ---
[INFO] 
[INFO] --- maven-surefire-plugin:2.22.2:test (default-test) @ org.eclipse.handly.examples.basic.ide ---
[INFO] No tests to run.
[INFO] 
[INFO] --- tycho-source-plugin:2.5.0:plugin-source (plugin-source) @ org.eclipse.handly.examples.basic.ide ---
[INFO] Building jar: /home/jenkins/agent/workspace/1.7.x/org.eclipse.handly.examples.basic.ide/target/org.eclipse.handly.examples.basic.ide-1.7.0-SNAPSHOT-sources.jar
[INFO] 
[INFO] --- tycho-packaging-plugin:2.5.0:package-plugin (default-package-plugin) @ org.eclipse.handly.examples.basic.ide ---
[INFO] Building jar: /home/jenkins/agent/workspace/1.7.x/org.eclipse.handly.examples.basic.ide/target/org.eclipse.handly.examples.basic.ide-1.7.0-SNAPSHOT.jar
[INFO] 
[INFO] --- tycho-p2-plugin:2.5.0:p2-metadata-default (default-p2-metadata-default) @ org.eclipse.handly.examples.basic.ide ---
[INFO] 
[INFO] --- tycho-source-plugin:2.5.0:feature-source (feature-source) @ org.eclipse.handly.examples.basic.ide ---
[INFO] 
[INFO] --- tycho-surefire-plugin:2.5.0:integration-test (default-integration-test) @ org.eclipse.handly.examples.basic.ide ---
[INFO] 
[INFO] --- maven-failsafe-plugin:2.22.2:verify (default-verify) @ org.eclipse.handly.examples.basic.ide ---
[INFO] No tests to run.
[INFO] 
[INFO] --- eclipse-jarsigner-plugin:1.3.1:sign (sign) @ org.eclipse.handly.examples.basic.ide ---
[INFO] Signing jar: /home/jenkins/agent/workspace/1.7.x/org.eclipse.handly.examples.basic.ide/target/org.eclipse.handly.examples.basic.ide-1.7.0-SNAPSHOT.jar
[INFO] Signing jar: /home/jenkins/agent/workspace/1.7.x/org.eclipse.handly.examples.basic.ide/target/org.eclipse.handly.examples.basic.ide-1.7.0-SNAPSHOT-sources.jar
[INFO] 
[INFO] --< org.eclipse.handly.bundles:org.eclipse.handly.examples.basic.ui >---
[INFO] Building org.eclipse.handly.examples.basic.ui 1.7.0-SNAPSHOT     [13/26]
[INFO] ---------------------------[ eclipse-plugin ]---------------------------
[INFO] 
[INFO] --- maven-clean-plugin:2.5:clean (default-clean) @ org.eclipse.handly.examples.basic.ui ---
[INFO] 
[INFO] --- tycho-packaging-plugin:2.5.0:build-qualifier (default-build-qualifier) @ org.eclipse.handly.examples.basic.ui ---
[INFO] The project's OSGi version is 1.7.0.v20220614-1826
[INFO] 
[INFO] --- tycho-packaging-plugin:2.5.0:validate-id (default-validate-id) @ org.eclipse.handly.examples.basic.ui ---
[INFO] 
[INFO] --- tycho-packaging-plugin:2.5.0:validate-version (default-validate-version) @ org.eclipse.handly.examples.basic.ui ---
[INFO] 
[INFO] --- target-platform-configuration:2.5.0:target-platform (default-target-platform) @ org.eclipse.handly.examples.basic.ui ---
[INFO] 
[INFO] --- maven-resources-plugin:2.4.3:resources (default-resources) @ org.eclipse.handly.examples.basic.ui ---
[INFO] Using 'UTF-8' encoding to copy filtered resources.
[INFO] skip non existing resourceDirectory /home/jenkins/agent/workspace/1.7.x/org.eclipse.handly.examples.basic.ui/src/main/resources
[INFO] 
[INFO] --- tycho-compiler-plugin:2.5.0:compile (default-compile) @ org.eclipse.handly.examples.basic.ui ---
[INFO] Compiling 42 source files to /home/jenkins/agent/workspace/1.7.x/org.eclipse.handly.examples.basic.ui/target/classes
[INFO] 
[INFO] --- maven-resources-plugin:2.4.3:testResources (default-testResources) @ org.eclipse.handly.examples.basic.ui ---
[INFO] Using 'UTF-8' encoding to copy filtered resources.
[INFO] skip non existing resourceDirectory /home/jenkins/agent/workspace/1.7.x/org.eclipse.handly.examples.basic.ui/src/test/resources
[INFO] 
[INFO] --- tycho-compiler-plugin:2.5.0:testCompile (default-testCompile) @ org.eclipse.handly.examples.basic.ui ---
[INFO] 
[INFO] --- maven-surefire-plugin:2.22.2:test (default-test) @ org.eclipse.handly.examples.basic.ui ---
[INFO] No tests to run.
[INFO] 
[INFO] --- tycho-source-plugin:2.5.0:plugin-source (plugin-source) @ org.eclipse.handly.examples.basic.ui ---
[INFO] Building jar: /home/jenkins/agent/workspace/1.7.x/org.eclipse.handly.examples.basic.ui/target/org.eclipse.handly.examples.basic.ui-1.7.0-SNAPSHOT-sources.jar
[INFO] 
[INFO] --- tycho-packaging-plugin:2.5.0:package-plugin (default-package-plugin) @ org.eclipse.handly.examples.basic.ui ---
[INFO] Building jar: /home/jenkins/agent/workspace/1.7.x/org.eclipse.handly.examples.basic.ui/target/org.eclipse.handly.examples.basic.ui-1.7.0-SNAPSHOT.jar
[INFO] 
[INFO] --- tycho-p2-plugin:2.5.0:p2-metadata-default (default-p2-metadata-default) @ org.eclipse.handly.examples.basic.ui ---
[INFO] 
[INFO] --- tycho-source-plugin:2.5.0:feature-source (feature-source) @ org.eclipse.handly.examples.basic.ui ---
[INFO] 
[INFO] --- tycho-surefire-plugin:2.5.0:integration-test (default-integration-test) @ org.eclipse.handly.examples.basic.ui ---
[INFO] 
[INFO] --- maven-failsafe-plugin:2.22.2:verify (default-verify) @ org.eclipse.handly.examples.basic.ui ---
[INFO] No tests to run.
[INFO] 
[INFO] --- eclipse-jarsigner-plugin:1.3.1:sign (sign) @ org.eclipse.handly.examples.basic.ui ---
[INFO] Signing jar: /home/jenkins/agent/workspace/1.7.x/org.eclipse.handly.examples.basic.ui/target/org.eclipse.handly.examples.basic.ui-1.7.0-SNAPSHOT.jar
[INFO] Signing jar: /home/jenkins/agent/workspace/1.7.x/org.eclipse.handly.examples.basic.ui/target/org.eclipse.handly.examples.basic.ui-1.7.0-SNAPSHOT-sources.jar
[INFO] 
[INFO] --< org.eclipse.handly.bundles:org.eclipse.handly.examples.basic.ui.tests >--
[INFO] Building org.eclipse.handly.examples.basic.ui.tests 1.7.0-SNAPSHOT [14/26]
[INFO] ------------------------[ eclipse-test-plugin ]-------------------------
[INFO] 
[INFO] --- maven-clean-plugin:2.5:clean (default-clean) @ org.eclipse.handly.examples.basic.ui.tests ---
[INFO] 
[INFO] --- tycho-packaging-plugin:2.5.0:build-qualifier (default-build-qualifier) @ org.eclipse.handly.examples.basic.ui.tests ---
[INFO] The project's OSGi version is 1.7.0.v20220614-1826
[INFO] 
[INFO] --- tycho-packaging-plugin:2.5.0:validate-id (default-validate-id) @ org.eclipse.handly.examples.basic.ui.tests ---
[INFO] 
[INFO] --- tycho-packaging-plugin:2.5.0:validate-version (default-validate-version) @ org.eclipse.handly.examples.basic.ui.tests ---
[INFO] 
[INFO] --- target-platform-configuration:2.5.0:target-platform (default-target-platform) @ org.eclipse.handly.examples.basic.ui.tests ---
[INFO] 
[INFO] --- maven-resources-plugin:2.4.3:resources (default-resources) @ org.eclipse.handly.examples.basic.ui.tests ---
[INFO] Using 'UTF-8' encoding to copy filtered resources.
[INFO] skip non existing resourceDirectory /home/jenkins/agent/workspace/1.7.x/org.eclipse.handly.examples.basic.ui.tests/src/main/resources
[INFO] 
[INFO] --- tycho-compiler-plugin:2.5.0:compile (default-compile) @ org.eclipse.handly.examples.basic.ui.tests ---
[INFO] Compiling 6 source files to /home/jenkins/agent/workspace/1.7.x/org.eclipse.handly.examples.basic.ui.tests/target/classes
[INFO] 
[INFO] --- maven-resources-plugin:2.4.3:testResources (default-testResources) @ org.eclipse.handly.examples.basic.ui.tests ---
[INFO] Using 'UTF-8' encoding to copy filtered resources.
[INFO] skip non existing resourceDirectory /home/jenkins/agent/workspace/1.7.x/org.eclipse.handly.examples.basic.ui.tests/src/test/resources
[INFO] 
[INFO] --- tycho-source-plugin:2.5.0:plugin-source (plugin-source) @ org.eclipse.handly.examples.basic.ui.tests ---
[INFO] Building jar: /home/jenkins/agent/workspace/1.7.x/org.eclipse.handly.examples.basic.ui.tests/target/org.eclipse.handly.examples.basic.ui.tests-1.7.0-SNAPSHOT-sources.jar
[INFO] 
[INFO] --- tycho-packaging-plugin:2.5.0:package-plugin (default-package-plugin) @ org.eclipse.handly.examples.basic.ui.tests ---
[INFO] Building jar: /home/jenkins/agent/workspace/1.7.x/org.eclipse.handly.examples.basic.ui.tests/target/org.eclipse.handly.examples.basic.ui.tests-1.7.0-SNAPSHOT.jar
[INFO] 
[INFO] --- tycho-p2-plugin:2.5.0:p2-metadata-default (default-p2-metadata-default) @ org.eclipse.handly.examples.basic.ui.tests ---
[INFO] 
[INFO] --- tycho-source-plugin:2.5.0:feature-source (feature-source) @ org.eclipse.handly.examples.basic.ui.tests ---
[INFO] 
[INFO] --- tycho-surefire-plugin:2.5.0:test (default-test) @ org.eclipse.handly.examples.basic.ui.tests ---
[INFO] Executing Test Runtime with timeout 0, logs (if any) will be placed at: /home/jenkins/agent/workspace/1.7.x/org.eclipse.handly.examples.basic.ui.tests/target/work/data/.metadata/.log
[INFO] Command line:
	[/opt/tools/java/openjdk/jdk-11/11.0.2+9/bin/java, -Dosgi.noShutdown=false, -Dosgi.os=linux, -Dosgi.ws=gtk, -Dosgi.arch=x86_64, -Dosgi.clean=true, -jar, /home/jenkins/agent/workspace/1.7.x/.maven/repo/p2/osgi/bundle/org.eclipse.equinox.launcher/1.6.400.v20210924-0641/org.eclipse.equinox.launcher-1.6.400.v20210924-0641.jar, -data, /home/jenkins/agent/workspace/1.7.x/org.eclipse.handly.examples.basic.ui.tests/target/work/data, -install, /home/jenkins/agent/workspace/1.7.x/org.eclipse.handly.examples.basic.ui.tests/target/work, -configuration, /home/jenkins/agent/workspace/1.7.x/org.eclipse.handly.examples.basic.ui.tests/target/work/configuration, -application, org.eclipse.tycho.surefire.osgibooter.headlesstest, -testproperties, /home/jenkins/agent/workspace/1.7.x/org.eclipse.handly.examples.basic.ui.tests/target/surefire.properties]
Running org.eclipse.handly.internal.examples.basic.ui.model.FooWorkingCopyTest
log4j:WARN No appenders could be found for logger (org.eclipse.xtext.ui.internal.Activator).
log4j:WARN Please initialize the log4j system properly.
log4j:WARN See http://logging.apache.org/log4j/1.2/faq.html#noconfig for more info.
Tests run: 5, Failures: 0, Errors: 0, Skipped: 0, Time elapsed: 2.359 s - in org.eclipse.handly.internal.examples.basic.ui.model.FooWorkingCopyTest
test1(org.eclipse.handly.internal.examples.basic.ui.model.FooWorkingCopyTest)  Time elapsed: 2.204 s
test2(org.eclipse.handly.internal.examples.basic.ui.model.FooWorkingCopyTest)  Time elapsed: 0.024 s
testBug480397_1(org.eclipse.handly.internal.examples.basic.ui.model.FooWorkingCopyTest)  Time elapsed: 0.034 s
testBug480397_2(org.eclipse.handly.internal.examples.basic.ui.model.FooWorkingCopyTest)  Time elapsed: 0.041 s
testBug480397_3(org.eclipse.handly.internal.examples.basic.ui.model.FooWorkingCopyTest)  Time elapsed: 0.018 s
Running org.eclipse.handly.internal.examples.basic.ui.model.FooModelTest
Tests run: 1, Failures: 0, Errors: 0, Skipped: 0, Time elapsed: 0.111 s - in org.eclipse.handly.internal.examples.basic.ui.model.FooModelTest
testFooModel(org.eclipse.handly.internal.examples.basic.ui.model.FooModelTest)  Time elapsed: 0.11 s
Running org.eclipse.handly.internal.examples.basic.ui.model.FooFileTest
Tests run: 1, Failures: 0, Errors: 0, Skipped: 0, Time elapsed: 0.034 s - in org.eclipse.handly.internal.examples.basic.ui.model.FooFileTest
testFooFile(org.eclipse.handly.internal.examples.basic.ui.model.FooFileTest)  Time elapsed: 0.033 s
Running org.eclipse.handly.internal.examples.basic.ui.model.FooModelNotificationTest
Tests run: 1, Failures: 0, Errors: 0, Skipped: 0, Time elapsed: 0.053 s - in org.eclipse.handly.internal.examples.basic.ui.model.FooModelNotificationTest
testFooModelNotification(org.eclipse.handly.internal.examples.basic.ui.model.FooModelNotificationTest)  Time elapsed: 0.052 s
Running org.eclipse.handly.internal.examples.basic.ui.model.FooProjectTest
Tests run: 2, Failures: 0, Errors: 0, Skipped: 0, Time elapsed: 0.047 s - in org.eclipse.handly.internal.examples.basic.ui.model.FooProjectTest
testProjectCreation(org.eclipse.handly.internal.examples.basic.ui.model.FooProjectTest)  Time elapsed: 0.043 s
testHandleOnly(org.eclipse.handly.internal.examples.basic.ui.model.FooProjectTest)  Time elapsed: 0.002 s
Running org.eclipse.handly.internal.examples.basic.ui.model.FooWorkingCopyNotificationTest
Tests run: 4, Failures: 0, Errors: 0, Skipped: 0, Time elapsed: 0.087 s - in org.eclipse.handly.internal.examples.basic.ui.model.FooWorkingCopyNotificationTest
test1(org.eclipse.handly.internal.examples.basic.ui.model.FooWorkingCopyNotificationTest)  Time elapsed: 0.015 s
test2(org.eclipse.handly.internal.examples.basic.ui.model.FooWorkingCopyNotificationTest)  Time elapsed: 0.013 s
test3(org.eclipse.handly.internal.examples.basic.ui.model.FooWorkingCopyNotificationTest)  Time elapsed: 0.013 s
test4(org.eclipse.handly.internal.examples.basic.ui.model.FooWorkingCopyNotificationTest)  Time elapsed: 0.045 s

Results:

Tests run: 14, Failures: 0, Errors: 0, Skipped: 0

[INFO] All tests passed!
[INFO] 
[INFO] --- eclipse-jarsigner-plugin:1.3.1:sign (sign) @ org.eclipse.handly.examples.basic.ui.tests ---
[INFO] Signing jar: /home/jenkins/agent/workspace/1.7.x/org.eclipse.handly.examples.basic.ui.tests/target/org.eclipse.handly.examples.basic.ui.tests-1.7.0-SNAPSHOT.jar
[INFO] Signing jar: /home/jenkins/agent/workspace/1.7.x/org.eclipse.handly.examples.basic.ui.tests/target/org.eclipse.handly.examples.basic.ui.tests-1.7.0-SNAPSHOT-sources.jar
[INFO] 
[INFO] ---< org.eclipse.handly.bundles:org.eclipse.handly.examples.jmodel >----
[INFO] Building org.eclipse.handly.examples.jmodel 1.7.0-SNAPSHOT       [15/26]
[INFO] ---------------------------[ eclipse-plugin ]---------------------------
[INFO] 
[INFO] --- maven-clean-plugin:2.5:clean (default-clean) @ org.eclipse.handly.examples.jmodel ---
[INFO] 
[INFO] --- tycho-packaging-plugin:2.5.0:build-qualifier (default-build-qualifier) @ org.eclipse.handly.examples.jmodel ---
[INFO] The project's OSGi version is 1.7.0.v20220614-1826
[INFO] 
[INFO] --- tycho-packaging-plugin:2.5.0:validate-id (default-validate-id) @ org.eclipse.handly.examples.jmodel ---
[INFO] 
[INFO] --- tycho-packaging-plugin:2.5.0:validate-version (default-validate-version) @ org.eclipse.handly.examples.jmodel ---
[INFO] 
[INFO] --- target-platform-configuration:2.5.0:target-platform (default-target-platform) @ org.eclipse.handly.examples.jmodel ---
[INFO] 
[INFO] --- maven-resources-plugin:2.4.3:resources (default-resources) @ org.eclipse.handly.examples.jmodel ---
[INFO] Using 'UTF-8' encoding to copy filtered resources.
[INFO] skip non existing resourceDirectory /home/jenkins/agent/workspace/1.7.x/org.eclipse.handly.examples.jmodel/src/main/resources
[INFO] 
[INFO] --- tycho-compiler-plugin:2.5.0:compile (default-compile) @ org.eclipse.handly.examples.jmodel ---
[INFO] Compiling 47 source files to /home/jenkins/agent/workspace/1.7.x/org.eclipse.handly.examples.jmodel/target/classes
[WARNING] /home/jenkins/agent/workspace/1.7.x/org.eclipse.handly.examples.jmodel/src/org/eclipse/handly/internal/examples/jmodel/CompilationUnit.java:[245] 
	Integer.class).withDefault(AST.JLS11);
	                               ^^^^^
The field AST.JLS11 is deprecated
1 problem (1 warning)
[INFO] 
[INFO] --- maven-resources-plugin:2.4.3:testResources (default-testResources) @ org.eclipse.handly.examples.jmodel ---
[INFO] Using 'UTF-8' encoding to copy filtered resources.
[INFO] skip non existing resourceDirectory /home/jenkins/agent/workspace/1.7.x/org.eclipse.handly.examples.jmodel/src/test/resources
[INFO] 
[INFO] --- tycho-compiler-plugin:2.5.0:testCompile (default-testCompile) @ org.eclipse.handly.examples.jmodel ---
[INFO] 
[INFO] --- maven-surefire-plugin:2.22.2:test (default-test) @ org.eclipse.handly.examples.jmodel ---
[INFO] No tests to run.
[INFO] 
[INFO] --- tycho-source-plugin:2.5.0:plugin-source (plugin-source) @ org.eclipse.handly.examples.jmodel ---
[INFO] Building jar: /home/jenkins/agent/workspace/1.7.x/org.eclipse.handly.examples.jmodel/target/org.eclipse.handly.examples.jmodel-1.7.0-SNAPSHOT-sources.jar
[INFO] 
[INFO] --- tycho-packaging-plugin:2.5.0:package-plugin (default-package-plugin) @ org.eclipse.handly.examples.jmodel ---
[INFO] Building jar: /home/jenkins/agent/workspace/1.7.x/org.eclipse.handly.examples.jmodel/target/org.eclipse.handly.examples.jmodel-1.7.0-SNAPSHOT.jar
[INFO] 
[INFO] --- tycho-p2-plugin:2.5.0:p2-metadata-default (default-p2-metadata-default) @ org.eclipse.handly.examples.jmodel ---
[INFO] 
[INFO] --- tycho-source-plugin:2.5.0:feature-source (feature-source) @ org.eclipse.handly.examples.jmodel ---
[INFO] 
[INFO] --- tycho-surefire-plugin:2.5.0:integration-test (default-integration-test) @ org.eclipse.handly.examples.jmodel ---
[INFO] 
[INFO] --- maven-failsafe-plugin:2.22.2:verify (default-verify) @ org.eclipse.handly.examples.jmodel ---
[INFO] No tests to run.
[INFO] 
[INFO] --- eclipse-jarsigner-plugin:1.3.1:sign (sign) @ org.eclipse.handly.examples.jmodel ---
[INFO] Signing jar: /home/jenkins/agent/workspace/1.7.x/org.eclipse.handly.examples.jmodel/target/org.eclipse.handly.examples.jmodel-1.7.0-SNAPSHOT.jar
[INFO] Signing jar: /home/jenkins/agent/workspace/1.7.x/org.eclipse.handly.examples.jmodel/target/org.eclipse.handly.examples.jmodel-1.7.0-SNAPSHOT-sources.jar
[INFO] 
[INFO] --< org.eclipse.handly.bundles:org.eclipse.handly.examples.jmodel.tests >--
[INFO] Building org.eclipse.handly.examples.jmodel.tests 1.7.0-SNAPSHOT [16/26]
[INFO] ------------------------[ eclipse-test-plugin ]-------------------------
[INFO] 
[INFO] --- maven-clean-plugin:2.5:clean (default-clean) @ org.eclipse.handly.examples.jmodel.tests ---
[INFO] 
[INFO] --- tycho-packaging-plugin:2.5.0:build-qualifier (default-build-qualifier) @ org.eclipse.handly.examples.jmodel.tests ---
[INFO] The project's OSGi version is 1.7.0.v20220614-1826
[INFO] 
[INFO] --- tycho-packaging-plugin:2.5.0:validate-id (default-validate-id) @ org.eclipse.handly.examples.jmodel.tests ---
[INFO] 
[INFO] --- tycho-packaging-plugin:2.5.0:validate-version (default-validate-version) @ org.eclipse.handly.examples.jmodel.tests ---
[INFO] 
[INFO] --- target-platform-configuration:2.5.0:target-platform (default-target-platform) @ org.eclipse.handly.examples.jmodel.tests ---
[INFO] 
[INFO] --- maven-resources-plugin:2.4.3:resources (default-resources) @ org.eclipse.handly.examples.jmodel.tests ---
[INFO] Using 'UTF-8' encoding to copy filtered resources.
[INFO] skip non existing resourceDirectory /home/jenkins/agent/workspace/1.7.x/org.eclipse.handly.examples.jmodel.tests/src/main/resources
[INFO] 
[INFO] --- tycho-compiler-plugin:2.5.0:compile (default-compile) @ org.eclipse.handly.examples.jmodel.tests ---
[INFO] Compiling 16 source files to /home/jenkins/agent/workspace/1.7.x/org.eclipse.handly.examples.jmodel.tests/target/classes
[WARNING] /home/jenkins/agent/workspace/1.7.x/org.eclipse.handly.examples.jmodel.tests/src/org/eclipse/handly/internal/examples/jmodel/WorkingCopyTest.java:[54] 
	private static final int AST_LEVEL = AST.JLS11;
	                                         ^^^^^
The field AST.JLS11 is deprecated
1 problem (1 warning)
[INFO] 
[INFO] --- maven-resources-plugin:2.4.3:testResources (default-testResources) @ org.eclipse.handly.examples.jmodel.tests ---
[INFO] Using 'UTF-8' encoding to copy filtered resources.
[INFO] skip non existing resourceDirectory /home/jenkins/agent/workspace/1.7.x/org.eclipse.handly.examples.jmodel.tests/src/test/resources
[INFO] 
[INFO] --- tycho-source-plugin:2.5.0:plugin-source (plugin-source) @ org.eclipse.handly.examples.jmodel.tests ---
[INFO] Building jar: /home/jenkins/agent/workspace/1.7.x/org.eclipse.handly.examples.jmodel.tests/target/org.eclipse.handly.examples.jmodel.tests-1.7.0-SNAPSHOT-sources.jar
[INFO] 
[INFO] --- tycho-packaging-plugin:2.5.0:package-plugin (default-package-plugin) @ org.eclipse.handly.examples.jmodel.tests ---
[INFO] Building jar: /home/jenkins/agent/workspace/1.7.x/org.eclipse.handly.examples.jmodel.tests/target/org.eclipse.handly.examples.jmodel.tests-1.7.0-SNAPSHOT.jar
[INFO] 
[INFO] --- tycho-p2-plugin:2.5.0:p2-metadata-default (default-p2-metadata-default) @ org.eclipse.handly.examples.jmodel.tests ---
[INFO] 
[INFO] --- tycho-source-plugin:2.5.0:feature-source (feature-source) @ org.eclipse.handly.examples.jmodel.tests ---
[INFO] 
[INFO] --- tycho-surefire-plugin:2.5.0:test (default-test) @ org.eclipse.handly.examples.jmodel.tests ---
[INFO] Executing Test Runtime with timeout 0, logs (if any) will be placed at: /home/jenkins/agent/workspace/1.7.x/org.eclipse.handly.examples.jmodel.tests/target/work/data/.metadata/.log
[INFO] Command line:
	[/opt/tools/java/openjdk/jdk-11/11.0.2+9/bin/java, -Dosgi.noShutdown=false, -Dosgi.os=linux, -Dosgi.ws=gtk, -Dosgi.arch=x86_64, -Dosgi.clean=true, -jar, /home/jenkins/agent/workspace/1.7.x/.maven/repo/p2/osgi/bundle/org.eclipse.equinox.launcher/1.6.400.v20210924-0641/org.eclipse.equinox.launcher-1.6.400.v20210924-0641.jar, -data, /home/jenkins/agent/workspace/1.7.x/org.eclipse.handly.examples.jmodel.tests/target/work/data, -install, /home/jenkins/agent/workspace/1.7.x/org.eclipse.handly.examples.jmodel.tests/target/work, -configuration, /home/jenkins/agent/workspace/1.7.x/org.eclipse.handly.examples.jmodel.tests/target/work/configuration, -application, org.eclipse.tycho.surefire.osgibooter.headlesstest, -testproperties, /home/jenkins/agent/workspace/1.7.x/org.eclipse.handly.examples.jmodel.tests/target/surefire.properties]
Running org.eclipse.handly.internal.examples.jmodel.JavaProjectNotificationTest
Tests run: 5, Failures: 0, Errors: 0, Skipped: 0, Time elapsed: 0.64 s - in org.eclipse.handly.internal.examples.jmodel.JavaProjectNotificationTest
test001(org.eclipse.handly.internal.examples.jmodel.JavaProjectNotificationTest)  Time elapsed: 0.404 s
test002(org.eclipse.handly.internal.examples.jmodel.JavaProjectNotificationTest)  Time elapsed: 0.085 s
test003(org.eclipse.handly.internal.examples.jmodel.JavaProjectNotificationTest)  Time elapsed: 0.033 s
test004(org.eclipse.handly.internal.examples.jmodel.JavaProjectNotificationTest)  Time elapsed: 0.058 s
test005(org.eclipse.handly.internal.examples.jmodel.JavaProjectNotificationTest)  Time elapsed: 0.036 s
Running org.eclipse.handly.internal.examples.jmodel.JavaProjectTest
Tests run: 4, Failures: 0, Errors: 0, Skipped: 0, Time elapsed: 0.155 s - in org.eclipse.handly.internal.examples.jmodel.JavaProjectTest
test001(org.eclipse.handly.internal.examples.jmodel.JavaProjectTest)  Time elapsed: 0.023 s
test002(org.eclipse.handly.internal.examples.jmodel.JavaProjectTest)  Time elapsed: 0.015 s
test003(org.eclipse.handly.internal.examples.jmodel.JavaProjectTest)  Time elapsed: 0.047 s
test004(org.eclipse.handly.internal.examples.jmodel.JavaProjectTest)  Time elapsed: 0.067 s
Running org.eclipse.handly.internal.examples.jmodel.JavaModelCoreTest
Tests run: 5, Failures: 0, Errors: 0, Skipped: 0, Time elapsed: 0.216 s - in org.eclipse.handly.internal.examples.jmodel.JavaModelCoreTest
test001(org.eclipse.handly.internal.examples.jmodel.JavaModelCoreTest)  Time elapsed: 0.02 s
test002(org.eclipse.handly.internal.examples.jmodel.JavaModelCoreTest)  Time elapsed: 0.049 s
test003(org.eclipse.handly.internal.examples.jmodel.JavaModelCoreTest)  Time elapsed: 0.036 s
test004(org.eclipse.handly.internal.examples.jmodel.JavaModelCoreTest)  Time elapsed: 0.073 s
test005(org.eclipse.handly.internal.examples.jmodel.JavaModelCoreTest)  Time elapsed: 0.034 s
Running org.eclipse.handly.internal.examples.jmodel.WorkingCopyTest
Tests run: 10, Failures: 0, Errors: 0, Skipped: 0, Time elapsed: 0.759 s - in org.eclipse.handly.internal.examples.jmodel.WorkingCopyTest
test001(org.eclipse.handly.internal.examples.jmodel.WorkingCopyTest)  Time elapsed: 0.351 s
test002(org.eclipse.handly.internal.examples.jmodel.WorkingCopyTest)  Time elapsed: 0.028 s
test003(org.eclipse.handly.internal.examples.jmodel.WorkingCopyTest)  Time elapsed: 0.051 s
test004(org.eclipse.handly.internal.examples.jmodel.WorkingCopyTest)  Time elapsed: 0.024 s
test005(org.eclipse.handly.internal.examples.jmodel.WorkingCopyTest)  Time elapsed: 0.139 s
test006(org.eclipse.handly.internal.examples.jmodel.WorkingCopyTest)  Time elapsed: 0.026 s
test007(org.eclipse.handly.internal.examples.jmodel.WorkingCopyTest)  Time elapsed: 0.024 s
test008(org.eclipse.handly.internal.examples.jmodel.WorkingCopyTest)  Time elapsed: 0.023 s
test009(org.eclipse.handly.internal.examples.jmodel.WorkingCopyTest)  Time elapsed: 0.057 s
test010(org.eclipse.handly.internal.examples.jmodel.WorkingCopyTest)  Time elapsed: 0.031 s
Running org.eclipse.handly.internal.examples.jmodel.JavaElementDeltaTest
Tests run: 1, Failures: 0, Errors: 0, Skipped: 0, Time elapsed: 0.002 s - in org.eclipse.handly.internal.examples.jmodel.JavaElementDeltaTest
test1(org.eclipse.handly.internal.examples.jmodel.JavaElementDeltaTest)  Time elapsed: 0 s
Running org.eclipse.handly.internal.examples.jmodel.PackageFragmentTest
Tests run: 4, Failures: 0, Errors: 0, Skipped: 0, Time elapsed: 0.12 s - in org.eclipse.handly.internal.examples.jmodel.PackageFragmentTest
test001(org.eclipse.handly.internal.examples.jmodel.PackageFragmentTest)  Time elapsed: 0.063 s
test002(org.eclipse.handly.internal.examples.jmodel.PackageFragmentTest)  Time elapsed: 0.016 s
test003(org.eclipse.handly.internal.examples.jmodel.PackageFragmentTest)  Time elapsed: 0.023 s
test004(org.eclipse.handly.internal.examples.jmodel.PackageFragmentTest)  Time elapsed: 0.016 s
Running org.eclipse.handly.internal.examples.jmodel.PackageFragmentRootNotificationTest
Tests run: 5, Failures: 0, Errors: 0, Skipped: 0, Time elapsed: 0.142 s - in org.eclipse.handly.internal.examples.jmodel.PackageFragmentRootNotificationTest
test001(org.eclipse.handly.internal.examples.jmodel.PackageFragmentRootNotificationTest)  Time elapsed: 0.049 s
test002(org.eclipse.handly.internal.examples.jmodel.PackageFragmentRootNotificationTest)  Time elapsed: 0.019 s
test003(org.eclipse.handly.internal.examples.jmodel.PackageFragmentRootNotificationTest)  Time elapsed: 0.017 s
test004(org.eclipse.handly.internal.examples.jmodel.PackageFragmentRootNotificationTest)  Time elapsed: 0.038 s
test005(org.eclipse.handly.internal.examples.jmodel.PackageFragmentRootNotificationTest)  Time elapsed: 0.017 s
Running org.eclipse.handly.internal.examples.jmodel.MementoTests
Tests run: 16, Failures: 0, Errors: 0, Skipped: 0, Time elapsed: 0.019 s - in org.eclipse.handly.internal.examples.jmodel.MementoTests
testImportContainerMemento(org.eclipse.handly.internal.examples.jmodel.MementoTests)  Time elapsed: 0.003 s
testImportDeclarationMemento(org.eclipse.handly.internal.examples.jmodel.MementoTests)  Time elapsed: 0.002 s
testRestoreBogusMemento(org.eclipse.handly.internal.examples.jmodel.MementoTests)  Time elapsed: 0 s
testProjectMemento2(org.eclipse.handly.internal.examples.jmodel.MementoTests)  Time elapsed: 0.001 s
testSourceFieldMemento(org.eclipse.handly.internal.examples.jmodel.MementoTests)  Time elapsed: 0 s
testCompilationUnitMemento1(org.eclipse.handly.internal.examples.jmodel.MementoTests)  Time elapsed: 0.001 s
testPackageFragmentMemento(org.eclipse.handly.internal.examples.jmodel.MementoTests)  Time elapsed: 0.001 s
testSourceMethodMemento1(org.eclipse.handly.internal.examples.jmodel.MementoTests)  Time elapsed: 0.001 s
testSourceMethodMemento2(org.eclipse.handly.internal.examples.jmodel.MementoTests)  Time elapsed: 0.001 s
testSourceMethodMemento3(org.eclipse.handly.internal.examples.jmodel.MementoTests)  Time elapsed: 0.001 s
testProjectMemento(org.eclipse.handly.internal.examples.jmodel.MementoTests)  Time elapsed: 0 s
testPackageFragmentRootMemento1(org.eclipse.handly.internal.examples.jmodel.MementoTests)  Time elapsed: 0.001 s
testPackageFragmentRootMemento2(org.eclipse.handly.internal.examples.jmodel.MementoTests)  Time elapsed: 0 s
testSourceTypeMemento(org.eclipse.handly.internal.examples.jmodel.MementoTests)  Time elapsed: 0 s
testPackageDeclarationMemento(org.eclipse.handly.internal.examples.jmodel.MementoTests)  Time elapsed: 0.002 s
testSourceInnerTypeMemento(org.eclipse.handly.internal.examples.jmodel.MementoTests)  Time elapsed: 0 s
Running org.eclipse.handly.internal.examples.jmodel.CompilationUnitTest
Tests run: 5, Failures: 0, Errors: 0, Skipped: 0, Time elapsed: 0.104 s - in org.eclipse.handly.internal.examples.jmodel.CompilationUnitTest
test001(org.eclipse.handly.internal.examples.jmodel.CompilationUnitTest)  Time elapsed: 0.016 s
test002(org.eclipse.handly.internal.examples.jmodel.CompilationUnitTest)  Time elapsed: 0.041 s
test003(org.eclipse.handly.internal.examples.jmodel.CompilationUnitTest)  Time elapsed: 0.017 s
test004(org.eclipse.handly.internal.examples.jmodel.CompilationUnitTest)  Time elapsed: 0.016 s
test005(org.eclipse.handly.internal.examples.jmodel.CompilationUnitTest)  Time elapsed: 0.012 s
Running org.eclipse.handly.internal.examples.jmodel.JavaModelTest
Tests run: 5, Failures: 2, Errors: 0, Skipped: 0, Time elapsed: 0.174 s <<< FAILURE! - in org.eclipse.handly.internal.examples.jmodel.JavaModelTest
test001(org.eclipse.handly.internal.examples.jmodel.JavaModelTest)  Time elapsed: 0.064 s  <<< FAILURE!
junit.framework.AssertionFailedError: expected:<0> but was:<1>
	at org.eclipse.handly.internal.examples.jmodel.JavaModelTest.test001(JavaModelTest.java:85)

test002(org.eclipse.handly.internal.examples.jmodel.JavaModelTest)  Time elapsed: 0.024 s
test003(org.eclipse.handly.internal.examples.jmodel.JavaModelTest)  Time elapsed: 0.017 s
test004(org.eclipse.handly.internal.examples.jmodel.JavaModelTest)  Time elapsed: 0.047 s
test005(org.eclipse.handly.internal.examples.jmodel.JavaModelTest)  Time elapsed: 0.019 s  <<< FAILURE!
junit.framework.AssertionFailedError: expected:<P/SimpleProject2> but was:<P/SimpleProject>
	at org.eclipse.handly.internal.examples.jmodel.JavaModelTest.test005(JavaModelTest.java:252)

Running org.eclipse.handly.internal.examples.jmodel.MemberTest
Tests run: 6, Failures: 0, Errors: 0, Skipped: 0, Time elapsed: 0.118 s - in org.eclipse.handly.internal.examples.jmodel.MemberTest
test001(org.eclipse.handly.internal.examples.jmodel.MemberTest)  Time elapsed: 0.028 s
test002(org.eclipse.handly.internal.examples.jmodel.MemberTest)  Time elapsed: 0.04 s
test003(org.eclipse.handly.internal.examples.jmodel.MemberTest)  Time elapsed: 0.014 s
test004(org.eclipse.handly.internal.examples.jmodel.MemberTest)  Time elapsed: 0.014 s
test005(org.eclipse.handly.internal.examples.jmodel.MemberTest)  Time elapsed: 0.011 s
test006(org.eclipse.handly.internal.examples.jmodel.MemberTest)  Time elapsed: 0.01 s
Running org.eclipse.handly.internal.examples.jmodel.PackageFragmentRootTest
Tests run: 4, Failures: 0, Errors: 0, Skipped: 0, Time elapsed: 0.103 s - in org.eclipse.handly.internal.examples.jmodel.PackageFragmentRootTest
test001(org.eclipse.handly.internal.examples.jmodel.PackageFragmentRootTest)  Time elapsed: 0.061 s
test002(org.eclipse.handly.internal.examples.jmodel.PackageFragmentRootTest)  Time elapsed: 0.012 s
test003(org.eclipse.handly.internal.examples.jmodel.PackageFragmentRootTest)  Time elapsed: 0.015 s
test004(org.eclipse.handly.internal.examples.jmodel.PackageFragmentRootTest)  Time elapsed: 0.014 s
Running org.eclipse.handly.internal.examples.jmodel.PackageFragmentNotificationTest
Tests run: 5, Failures: 0, Errors: 0, Skipped: 0, Time elapsed: 0.1 s - in org.eclipse.handly.internal.examples.jmodel.PackageFragmentNotificationTest
test001(org.eclipse.handly.internal.examples.jmodel.PackageFragmentNotificationTest)  Time elapsed: 0.046 s
test002(org.eclipse.handly.internal.examples.jmodel.PackageFragmentNotificationTest)  Time elapsed: 0.014 s
test003(org.eclipse.handly.internal.examples.jmodel.PackageFragmentNotificationTest)  Time elapsed: 0.013 s
test004(org.eclipse.handly.internal.examples.jmodel.PackageFragmentNotificationTest)  Time elapsed: 0.012 s
test005(org.eclipse.handly.internal.examples.jmodel.PackageFragmentNotificationTest)  Time elapsed: 0.014 s
Running org.eclipse.handly.internal.examples.jmodel.JavaModelNotificationTest
Tests run: 8, Failures: 2, Errors: 0, Skipped: 0, Time elapsed: 0.17 s <<< FAILURE! - in org.eclipse.handly.internal.examples.jmodel.JavaModelNotificationTest
test001(org.eclipse.handly.internal.examples.jmodel.JavaModelNotificationTest)  Time elapsed: 0.045 s  <<< FAILURE!
junit.framework.ComparisonFailure: 
expected:<... Model[*]: {CHILDREN[}
  Test001[-]: {}]> but was:<... Model[*]: {CHILDREN[ | CONTENT}
  Test001[-]: {}
  ResourceDelta(/SimpleProject)[*]]>
	at org.eclipse.handly.internal.examples.jmodel.JavaModelNotificationTest.test001(JavaModelNotificationTest.java:56)

test002(org.eclipse.handly.internal.examples.jmodel.JavaModelNotificationTest)  Time elapsed: 0.012 s
test003(org.eclipse.handly.internal.examples.jmodel.JavaModelNotificationTest)  Time elapsed: 0.011 s  <<< FAILURE!
junit.framework.ComparisonFailure: 
expected:<[Java Model[*]: {CHILDREN | CONTENT}
  Test001[*]: {OPEN}
  ResourceDelta(/Test001)[*]]> but was:<[<null>]>
	at org.eclipse.handly.internal.examples.jmodel.JavaModelNotificationTest.test003(JavaModelNotificationTest.java:102)

test004(org.eclipse.handly.internal.examples.jmodel.JavaModelNotificationTest)  Time elapsed: 0.02 s
test005(org.eclipse.handly.internal.examples.jmodel.JavaModelNotificationTest)  Time elapsed: 0.01 s
test006(org.eclipse.handly.internal.examples.jmodel.JavaModelNotificationTest)  Time elapsed: 0.04 s
test007(org.eclipse.handly.internal.examples.jmodel.JavaModelNotificationTest)  Time elapsed: 0.014 s
test008(org.eclipse.handly.internal.examples.jmodel.JavaModelNotificationTest)  Time elapsed: 0.015 s
Running org.eclipse.handly.internal.examples.jmodel.WorkingCopyNotificationTest
Tests run: 8, Failures: 0, Errors: 0, Skipped: 0, Time elapsed: 0.187 s - in org.eclipse.handly.internal.examples.jmodel.WorkingCopyNotificationTest
test001(org.eclipse.handly.internal.examples.jmodel.WorkingCopyNotificationTest)  Time elapsed: 0.017 s
test002(org.eclipse.handly.internal.examples.jmodel.WorkingCopyNotificationTest)  Time elapsed: 0.014 s
test003(org.eclipse.handly.internal.examples.jmodel.WorkingCopyNotificationTest)  Time elapsed: 0.049 s
test004(org.eclipse.handly.internal.examples.jmodel.WorkingCopyNotificationTest)  Time elapsed: 0.016 s
test005(org.eclipse.handly.internal.examples.jmodel.WorkingCopyNotificationTest)  Time elapsed: 0.016 s
test006(org.eclipse.handly.internal.examples.jmodel.WorkingCopyNotificationTest)  Time elapsed: 0.05 s
test007(org.eclipse.handly.internal.examples.jmodel.WorkingCopyNotificationTest)  Time elapsed: 0.012 s
test008(org.eclipse.handly.internal.examples.jmodel.WorkingCopyNotificationTest)  Time elapsed: 0.011 s

Results:

Failures: 
  JavaModelNotificationTest.test001:56 expected:<... Model[*]: {CHILDREN[}
  Test001[-]: {}]> but was:<... Model[*]: {CHILDREN[ | CONTENT}
  Test001[-]: {}
  ResourceDelta(/SimpleProject)[*]]>
  JavaModelNotificationTest.test003:102 expected:<[Java Model[*]: {CHILDREN | CONTENT}
  Test001[*]: {OPEN}
  ResourceDelta(/Test001)[*]]> but was:<[<null>]>
  JavaModelTest.test001:85 expected:<0> but was:<1>
  JavaModelTest.test005:252 expected:<P/SimpleProject2> but was:<P/SimpleProject>

Tests run: 91, Failures: 4, Errors: 0, Skipped: 0

[INFO] ------------------------------------------------------------------------
[INFO] Reactor Summary for releng 1.7.0-SNAPSHOT:
[INFO] 
[INFO] releng ............................................. SUCCESS [  1.402 s]
[INFO] org.eclipse.handly ................................. SUCCESS [ 11.447 s]
[INFO] org.eclipse.handly.junit ........................... SUCCESS [  2.040 s]
[INFO] org.eclipse.handly.tests ........................... SUCCESS [ 11.913 s]
[INFO] org.eclipse.handly.ui .............................. SUCCESS [  3.258 s]
[INFO] org.eclipse.handly.xtext ........................... SUCCESS [  1.910 s]
[INFO] org.eclipse.handly.xtext.ui ........................ SUCCESS [  2.418 s]
[INFO] org.eclipse.handly.examples ........................ SUCCESS [  2.734 s]
[INFO] org.eclipse.handly.examples.adapter ................ SUCCESS [  2.283 s]
[INFO] org.eclipse.handly.examples.adapter.ui ............. SUCCESS [  2.345 s]
[INFO] org.eclipse.handly.examples.basic .................. SUCCESS [  2.487 s]
[INFO] org.eclipse.handly.examples.basic.ide .............. SUCCESS [  2.160 s]
[INFO] org.eclipse.handly.examples.basic.ui ............... SUCCESS [  2.676 s]
[INFO] org.eclipse.handly.examples.basic.ui.tests ......... SUCCESS [  8.572 s]
[INFO] org.eclipse.handly.examples.jmodel ................. SUCCESS [  2.395 s]
[INFO] org.eclipse.handly.examples.jmodel.tests ........... FAILURE [  6.975 s]
[INFO] org.eclipse.handly.examples.jmodel.ui .............. SKIPPED
[INFO] org.eclipse.handly.examples.xtext.xtext.ui ......... SKIPPED
[INFO] org.eclipse.handly-feature ......................... SKIPPED
[INFO] org.eclipse.handly.xtext-feature ................... SKIPPED
[INFO] org.eclipse.handly.examples-feature ................ SKIPPED
[INFO] org.eclipse.handly.tests-feature ................... SKIPPED
[INFO] repository ......................................... SKIPPED
[INFO] targets ............................................ SKIPPED
[INFO] base.target ........................................ SKIPPED
[INFO] latest.target ...................................... SKIPPED
[INFO] ------------------------------------------------------------------------
[INFO] BUILD FAILURE
[INFO] ------------------------------------------------------------------------
[INFO] Total time:  01:51 min
[INFO] Finished at: 2022-06-14T18:28:00Z
[INFO] ------------------------------------------------------------------------
[ERROR] Failed to execute goal org.eclipse.tycho:tycho-surefire-plugin:2.5.0:test (default-test) on project org.eclipse.handly.examples.jmodel.tests: There are test failures.
[ERROR] 
[ERROR] Please refer to /home/jenkins/agent/workspace/1.7.x/org.eclipse.handly.examples.jmodel.tests/target/surefire-reports for the individual test results.
[ERROR] -> [Help 1]
[ERROR] 
[ERROR] To see the full stack trace of the errors, re-run Maven with the -e switch.
[ERROR] Re-run Maven using the -X switch to enable full debug logging.
[ERROR] 
[ERROR] For more information about the errors and possible solutions, please read the following articles:
[ERROR] [Help 1] http://cwiki.apache.org/confluence/display/MAVEN/MojoFailureException
[ERROR] 
[ERROR] After correcting the problems, you can resume the build with the command
[ERROR]   mvn <args> -rf :org.eclipse.handly.examples.jmodel.tests
Build step 'Invoke top-level Maven targets' marked build as failure
Terminating xvnc.
Sending e-mails to: pisv@1c.ru suag@1c.ru
Recording test results
[Checks API] No suitable checks publisher found.
Publishing Javadoc
Archiving artifacts
Finished: FAILURE