Not builtConsole Output

Started calculate disk usage of build
Finished Calculation of disk usage of build in 0 seconds
Started calculate disk usage of workspace
Finished Calculation of disk usage of workspace in 0 seconds
[INFO] ------------------------------------------------------------------------
[INFO] Reactor Summary for grizzly-npn 1.9-SNAPSHOT:
[INFO] 
[INFO] grizzly-npn ........................................ SUCCESS [  1.600 s]
[INFO] grizzly-npn-api .................................... SUCCESS [  4.371 s]
[INFO] grizzly-npn-bootstrap .............................. FAILURE [  2.200 s]
[INFO] grizzly-npn-osgi ................................... SKIPPED
[INFO] ------------------------------------------------------------------------
[INFO] BUILD FAILURE
[INFO] ------------------------------------------------------------------------
[INFO] Total time:  01:51 min
[INFO] Finished at: 2019-11-10T00:03:14-05:00
[INFO] ------------------------------------------------------------------------
Waiting for Jenkins to finish collecting data
[ERROR] Failed to execute goal org.apache.maven.plugins:maven-compiler-plugin:3.1:compile (default-compile) on project grizzly-npn-bootstrap: Compilation failure: Compilation failure:
[ERROR] /home/hudson/genie.grizzly/.jenkins/jobs/Grizzly-NPN-master_nightly/workspace/bootstrap/src/main/java/sun/security/ssl/Handshaker.java:[392,24] cannot find symbol
[ERROR] symbol:   method receivedChangeCipherSpec()
[ERROR] location: variable conn of type sun.security.ssl.SSLSocketImpl
[ERROR] /home/hudson/genie.grizzly/.jenkins/jobs/Grizzly-NPN-master_nightly/workspace/bootstrap/src/main/java/sun/security/ssl/ServerHandshaker.java:[835,23] no suitable constructor found for SSLSessionImpl(sun.security.ssl.ProtocolVersion,sun.security.ssl.CipherSuite,java.util.Collection<sun.security.ssl.SignatureAndHashAlgorithm>,java.security.SecureRandom,java.lang.String,int,boolean)
[ERROR] constructor sun.security.ssl.SSLSessionImpl.SSLSessionImpl() is not applicable
[ERROR] (actual and formal argument lists differ in length)
[ERROR] constructor sun.security.ssl.SSLSessionImpl.SSLSessionImpl(sun.security.ssl.ProtocolVersion,sun.security.ssl.CipherSuite,java.util.Collection<sun.security.ssl.SignatureAndHashAlgorithm>,java.security.SecureRandom,java.lang.String,int,boolean,java.lang.String) is not applicable
[ERROR] (actual and formal argument lists differ in length)
[ERROR] constructor sun.security.ssl.SSLSessionImpl.SSLSessionImpl(sun.security.ssl.ProtocolVersion,sun.security.ssl.CipherSuite,java.util.Collection<sun.security.ssl.SignatureAndHashAlgorithm>,sun.security.ssl.SessionId,java.lang.String,int,boolean,java.lang.String) is not applicable
[ERROR] (actual and formal argument lists differ in length)
[ERROR] /home/hudson/genie.grizzly/.jenkins/jobs/Grizzly-NPN-master_nightly/workspace/bootstrap/src/main/java/sun/security/ssl/ClientHandshaker.java:[750,19] no suitable constructor found for SSLSessionImpl(sun.security.ssl.ProtocolVersion,sun.security.ssl.CipherSuite,java.util.Collection<sun.security.ssl.SignatureAndHashAlgorithm>,sun.security.ssl.SessionId,java.lang.String,int,boolean)
[ERROR] constructor sun.security.ssl.SSLSessionImpl.SSLSessionImpl() is not applicable
[ERROR] (actual and formal argument lists differ in length)
[ERROR] constructor sun.security.ssl.SSLSessionImpl.SSLSessionImpl(sun.security.ssl.ProtocolVersion,sun.security.ssl.CipherSuite,java.util.Collection<sun.security.ssl.SignatureAndHashAlgorithm>,java.security.SecureRandom,java.lang.String,int,boolean,java.lang.String) is not applicable
[ERROR] (actual and formal argument lists differ in length)
[ERROR] constructor sun.security.ssl.SSLSessionImpl.SSLSessionImpl(sun.security.ssl.ProtocolVersion,sun.security.ssl.CipherSuite,java.util.Collection<sun.security.ssl.SignatureAndHashAlgorithm>,sun.security.ssl.SessionId,java.lang.String,int,boolean,java.lang.String) is not applicable
[ERROR] (actual and formal argument lists differ in length)
[ERROR] -> [Help 1]
[ERROR] 
[ERROR] To see the full stack trace of the errors, re-run Maven with the -e switch.
[ERROR] Re-run Maven using the -X switch to enable full debug logging.
[ERROR] 
[ERROR] For more information about the errors and possible solutions, please read the following articles:
[ERROR] [Help 1] http://cwiki.apache.org/confluence/display/MAVEN/MojoFailureException
[ERROR] 
[ERROR] After correcting the problems, you can resume the build with the command
[ERROR]   mvn <goals> -rf :grizzly-npn-bootstrap
Started
Build failed before it gets to this module
Started calculate disk usage of build
Finished Calculation of disk usage of build in 0 seconds
Started calculate disk usage of workspace
Finished Calculation of disk usage of workspace in 0 seconds
Finished: NOT_BUILT