FailedConsole Output

Started by user julien.ponge@insa-lyon.fr
Checkout:workspace / /home/hudson/genie.golo/.hudson/jobs/golo-deploy-releases/workspace - hudson.remoting.LocalChannel@1534642f
Using strategy: Default
Git Exe: git
Last Built Revision: Revision af9769f86c94dfc2ef876350910ac8155ecf507f (origin/tags/milestone/3.0.0-incubation-M2)
Checkout:workspace / /home/hudson/genie.golo/.hudson/jobs/golo-deploy-releases/workspace - hudson.remoting.LocalChannel@1534642f
Fetching changes from the remote Git repository
Fetching upstream changes from https://github.com/eclipse/golo-lang.git
Commencing build of Revision af9769f86c94dfc2ef876350910ac8155ecf507f (origin/tags/milestone/3.0.0-incubation-M2)
Checking out Revision af9769f86c94dfc2ef876350910ac8155ecf507f (origin/tags/milestone/3.0.0-incubation-M2)
[Gradle] - Launching build.
[workspace] $ /home/hudson/genie.golo/.hudson/jobs/golo-deploy-releases/workspace/gradlew -DRELEASE_TAG=milestone/3.0.0-incubation-M2 clean assemble check publishGoloPublicationToMavenLocal publish
:clean
:asciidoctor
:compileJjtree
Java Compiler Compiler Version 6.1_2 (Tree Builder)
(type "jjtree" with no arguments for help)
Reading from file /jobs/genie.golo/golo-deploy-releases/workspace/src/main/jjtree/fr/insalyon/citi/golo/compiler/parser/Golo.jjt . . .
Warning: Output directory "/jobs/genie.golo/golo-deploy-releases/workspace/build/generated/jjtree/tmp/fr/insalyon/citi/golo/compiler/parser" does not exist. Creating the directory.
opt:java
File "Node.java" does not exist.  Will create one.
File "SimpleNode.java" does not exist.  Will create one.
File "ASTerror.java" does not exist.  Will create one.
File "ASTCompilationUnit.java" does not exist.  Will create one.
File "ASTModuleDeclaration.java" does not exist.  Will create one.
File "ASTImportDeclaration.java" does not exist.  Will create one.
File "ASTToplevelDeclaration.java" does not exist.  Will create one.
File "ASTStructDeclaration.java" does not exist.  Will create one.
File "ASTUnionValue.java" does not exist.  Will create one.
File "ASTUnionDeclaration.java" does not exist.  Will create one.
File "ASTNamedAugmentationDeclaration.java" does not exist.  Will create one.
File "ASTAugmentDeclaration.java" does not exist.  Will create one.
File "ASTFunctionDeclaration.java" does not exist.  Will create one.
File "ASTDecoratorDeclaration.java" does not exist.  Will create one.
File "ASTContinue.java" does not exist.  Will create one.
File "ASTBreak.java" does not exist.  Will create one.
File "ASTThrow.java" does not exist.  Will create one.
File "ASTWhileLoop.java" does not exist.  Will create one.
File "ASTForLoop.java" does not exist.  Will create one.
File "ASTForEachLoop.java" does not exist.  Will create one.
File "ASTTryCatchFinally.java" does not exist.  Will create one.
File "ASTExpressionStatement.java" does not exist.  Will create one.
File "ASTUnaryExpression.java" does not exist.  Will create one.
File "ASTInvocationExpression.java" does not exist.  Will create one.
File "ASTMultiplicativeExpression.java" does not exist.  Will create one.
File "ASTAdditiveExpression.java" does not exist.  Will create one.
File "ASTRelationalExpression.java" does not exist.  Will create one.
File "ASTEqualityExpression.java" does not exist.  Will create one.
File "ASTAndExpression.java" does not exist.  Will create one.
File "ASTOrExpression.java" does not exist.  Will create one.
File "ASTOrIfNullExpression.java" does not exist.  Will create one.
File "ASTMethodInvocation.java" does not exist.  Will create one.
File "ASTBlock.java" does not exist.  Will create one.
File "ASTFunction.java" does not exist.  Will create one.
File "ASTLiteral.java" does not exist.  Will create one.
File "ASTCollectionLiteral.java" does not exist.  Will create one.
File "ASTReference.java" does not exist.  Will create one.
File "ASTDestructuringAssignment.java" does not exist.  Will create one.
File "ASTLetOrVar.java" does not exist.  Will create one.
File "ASTAssignment.java" does not exist.  Will create one.
File "ASTReturn.java" does not exist.  Will create one.
File "ASTArgument.java" does not exist.  Will create one.
File "ASTAnonymousFunctionInvocation.java" does not exist.  Will create one.
File "ASTFunctionInvocation.java" does not exist.  Will create one.
File "ASTConditionalBranching.java" does not exist.  Will create one.
File "ASTCase.java" does not exist.  Will create one.
File "ASTMatch.java" does not exist.  Will create one.
File "GoloParserTreeConstants.java" does not exist.  Will create one.
File "GoloParserVisitor.java" does not exist.  Will create one.
File "GoloParserDefaultVisitor.java" does not exist.  Will create one.
File "JJTGoloParserState.java" does not exist.  Will create one.
Annotated grammar generated successfully in /jobs/genie.golo/golo-deploy-releases/workspace/build/generated/jjtree/tmp/fr/insalyon/citi/golo/compiler/parser/Golo.jj
:compileJavacc
Java Compiler Compiler Version 6.1_2 (Parser Generator)
(type "javacc" with no arguments for help)
Reading from file /jobs/genie.golo/golo-deploy-releases/workspace/build/generated/jjtree/fr/insalyon/citi/golo/compiler/parser/Golo.jj . . .
Warning: Output directory "/jobs/genie.golo/golo-deploy-releases/workspace/build/generated/javacc/tmp/fr/insalyon/citi/golo/compiler/parser" does not exist. Creating the directory.
Note: UNICODE_INPUT option is specified. Please make sure you create the parser/lexer using a Reader with the correct character encoding.
File "TokenMgrError.java" does not exist.  Will create one.
File "ParseException.java" does not exist.  Will create one.
File "Token.java" does not exist.  Will create one.
File "JavaCharStream.java" does not exist.  Will create one.
Parser generated with 0 errors and 1 warnings.
:compileJava
:processResources
:goloc
:classes
:golodoc
:jar
:vanillaScripts
:startScripts
:distTar
:distZip
:assemble
:compileTestJava
:processTestResources
:testClasses
:test
:check
:generatePomFileForGoloPublication
:javadoc
:javadocJar
:sourceJar
:publishGoloPublicationToMavenLocal
:publishGoloPublicationToEclipseRepository
Upload https://repo.eclipse.org/content/repositories/golo-releases/org/eclipse/golo/golo/3.0.0-incubation-M2/golo-3.0.0-incubation-M2.jar
Could not transfer artifact org.eclipse.golo:golo:jar:3.0.0-incubation-M2 from/to remote (https://repo.eclipse.org/content/repositories/golo-releases/): Could not write to resource 'org/eclipse/golo/golo/3.0.0-incubation-M2/golo-3.0.0-incubation-M2.jar'
Upload https://repo.eclipse.org/content/repositories/golo-releases/org/eclipse/golo/golo/3.0.0-incubation-M2/golo-3.0.0-incubation-M2.pom
Could not transfer artifact org.eclipse.golo:golo:pom:3.0.0-incubation-M2 from/to remote (https://repo.eclipse.org/content/repositories/golo-releases/): Could not write to resource 'org/eclipse/golo/golo/3.0.0-incubation-M2/golo-3.0.0-incubation-M2.pom'
Upload https://repo.eclipse.org/content/repositories/golo-releases/org/eclipse/golo/golo/3.0.0-incubation-M2/golo-3.0.0-incubation-M2-sources.jar
Could not transfer artifact org.eclipse.golo:golo:jar:sources:3.0.0-incubation-M2 from/to remote (https://repo.eclipse.org/content/repositories/golo-releases/): Could not write to resource 'org/eclipse/golo/golo/3.0.0-incubation-M2/golo-3.0.0-incubation-M2-sources.jar'
Upload https://repo.eclipse.org/content/repositories/golo-releases/org/eclipse/golo/golo/3.0.0-incubation-M2/golo-3.0.0-incubation-M2-javadoc.jar
Could not transfer artifact org.eclipse.golo:golo:jar:javadoc:3.0.0-incubation-M2 from/to remote (https://repo.eclipse.org/content/repositories/golo-releases/): Could not write to resource 'org/eclipse/golo/golo/3.0.0-incubation-M2/golo-3.0.0-incubation-M2-javadoc.jar'
:publishGoloPublicationToEclipseRepository FAILED

FAILURE: Build failed with an exception.

* What went wrong:
Execution failed for task ':publishGoloPublicationToEclipseRepository'.
> Failed to publish publication 'golo' to repository 'eclipse'
   > Failed to deploy artifacts: Could not transfer artifact org.eclipse.golo:golo:jar:3.0.0-incubation-M2 from/to remote (https://repo.eclipse.org/content/repositories/golo-releases/): Could not write to resource 'org/eclipse/golo/golo/3.0.0-incubation-M2/golo-3.0.0-incubation-M2.jar'

* Try:
Run with --stacktrace option to get the stack trace. Run with --info or --debug option to get more log output.

BUILD FAILED

Total time: 33.373 secs
Finished: FAILURE