FailedConsole Output

Started by user julien.ponge@insa-lyon.fr
Checkout:workspace / /home/hudson/genie.golo/.hudson/jobs/golo-deploy-releases/workspace - hudson.remoting.LocalChannel@1534642f
Using strategy: Default
Git Exe: git
Last Built Revision: Revision 1cd9e64cc4a5553f39497b1f53ec4f7270b4bbf4 (origin/tags/milestone/3.0.0-incubation-M1)
Checkout:workspace / /home/hudson/genie.golo/.hudson/jobs/golo-deploy-releases/workspace - hudson.remoting.LocalChannel@1534642f
Fetching changes from the remote Git repository
Fetching upstream changes from https://github.com/eclipse/golo-lang.git
Commencing build of Revision af9769f86c94dfc2ef876350910ac8155ecf507f (origin/tags/milestone/3.0.0-incubation-M2)
Checking out Revision af9769f86c94dfc2ef876350910ac8155ecf507f (origin/tags/milestone/3.0.0-incubation-M2)
No change to record in branch origin/tags/milestone/3.0.0-incubation-M2
[Gradle] - Launching build.
[workspace] $ /home/hudson/genie.golo/.hudson/jobs/golo-deploy-releases/workspace/gradlew -DRELEASE_TAG=milestone/3.0.0-incubation-M2 clean assemble check publish
:clean UP-TO-DATE
:asciidoctor
:compileJjtree
Java Compiler Compiler Version 6.1_2 (Tree Builder)
(type "jjtree" with no arguments for help)
Reading from file /jobs/genie.golo/golo-deploy-releases/workspace/src/main/jjtree/fr/insalyon/citi/golo/compiler/parser/Golo.jjt . . .
Warning: Output directory "/jobs/genie.golo/golo-deploy-releases/workspace/build/generated/jjtree/tmp/fr/insalyon/citi/golo/compiler/parser" does not exist. Creating the directory.
opt:java
File "Node.java" does not exist.  Will create one.
File "SimpleNode.java" does not exist.  Will create one.
File "ASTerror.java" does not exist.  Will create one.
File "ASTCompilationUnit.java" does not exist.  Will create one.
File "ASTModuleDeclaration.java" does not exist.  Will create one.
File "ASTImportDeclaration.java" does not exist.  Will create one.
File "ASTToplevelDeclaration.java" does not exist.  Will create one.
File "ASTStructDeclaration.java" does not exist.  Will create one.
File "ASTUnionValue.java" does not exist.  Will create one.
File "ASTUnionDeclaration.java" does not exist.  Will create one.
File "ASTNamedAugmentationDeclaration.java" does not exist.  Will create one.
File "ASTAugmentDeclaration.java" does not exist.  Will create one.
File "ASTFunctionDeclaration.java" does not exist.  Will create one.
File "ASTDecoratorDeclaration.java" does not exist.  Will create one.
File "ASTContinue.java" does not exist.  Will create one.
File "ASTBreak.java" does not exist.  Will create one.
File "ASTThrow.java" does not exist.  Will create one.
File "ASTWhileLoop.java" does not exist.  Will create one.
File "ASTForLoop.java" does not exist.  Will create one.
File "ASTForEachLoop.java" does not exist.  Will create one.
File "ASTTryCatchFinally.java" does not exist.  Will create one.
File "ASTExpressionStatement.java" does not exist.  Will create one.
File "ASTUnaryExpression.java" does not exist.  Will create one.
File "ASTInvocationExpression.java" does not exist.  Will create one.
File "ASTMultiplicativeExpression.java" does not exist.  Will create one.
File "ASTAdditiveExpression.java" does not exist.  Will create one.
File "ASTRelationalExpression.java" does not exist.  Will create one.
File "ASTEqualityExpression.java" does not exist.  Will create one.
File "ASTAndExpression.java" does not exist.  Will create one.
File "ASTOrExpression.java" does not exist.  Will create one.
File "ASTOrIfNullExpression.java" does not exist.  Will create one.
File "ASTMethodInvocation.java" does not exist.  Will create one.
File "ASTBlock.java" does not exist.  Will create one.
File "ASTFunction.java" does not exist.  Will create one.
File "ASTLiteral.java" does not exist.  Will create one.
File "ASTCollectionLiteral.java" does not exist.  Will create one.
File "ASTReference.java" does not exist.  Will create one.
File "ASTDestructuringAssignment.java" does not exist.  Will create one.
File "ASTLetOrVar.java" does not exist.  Will create one.
File "ASTAssignment.java" does not exist.  Will create one.
File "ASTReturn.java" does not exist.  Will create one.
File "ASTArgument.java" does not exist.  Will create one.
File "ASTAnonymousFunctionInvocation.java" does not exist.  Will create one.
File "ASTFunctionInvocation.java" does not exist.  Will create one.
File "ASTConditionalBranching.java" does not exist.  Will create one.
File "ASTCase.java" does not exist.  Will create one.
File "ASTMatch.java" does not exist.  Will create one.
File "GoloParserTreeConstants.java" does not exist.  Will create one.
File "GoloParserVisitor.java" does not exist.  Will create one.
File "GoloParserDefaultVisitor.java" does not exist.  Will create one.
File "JJTGoloParserState.java" does not exist.  Will create one.
Annotated grammar generated successfully in /jobs/genie.golo/golo-deploy-releases/workspace/build/generated/jjtree/tmp/fr/insalyon/citi/golo/compiler/parser/Golo.jj
:compileJavacc
Java Compiler Compiler Version 6.1_2 (Parser Generator)
(type "javacc" with no arguments for help)
Reading from file /jobs/genie.golo/golo-deploy-releases/workspace/build/generated/jjtree/fr/insalyon/citi/golo/compiler/parser/Golo.jj . . .
Warning: Output directory "/jobs/genie.golo/golo-deploy-releases/workspace/build/generated/javacc/tmp/fr/insalyon/citi/golo/compiler/parser" does not exist. Creating the directory.
Note: UNICODE_INPUT option is specified. Please make sure you create the parser/lexer using a Reader with the correct character encoding.
File "TokenMgrError.java" does not exist.  Will create one.
File "ParseException.java" does not exist.  Will create one.
File "Token.java" does not exist.  Will create one.
File "JavaCharStream.java" does not exist.  Will create one.
Parser generated with 0 errors and 1 warnings.
:compileJava
:processResources
:goloc
:classes
:golodoc
:jar
:vanillaScripts
:startScripts
:distTar
:distZip
:assemble
:compileTestJava
:processTestResources
:testClasses
:test
:check
:generatePomFileForGoloPublication
:javadoc
:javadocJar
:sourceJar
:publishGoloPublicationToEclipseRepository
Upload https://repo.eclipse.org/content/repositories/golo-releases/org/eclipse/golo/golo/3.0.0-incubation-M2/golo-3.0.0-incubation-M2.jar
Upload https://repo.eclipse.org/content/repositories/golo-releases/org/eclipse/golo/golo/3.0.0-incubation-M2/golo-3.0.0-incubation-M2.jar.sha1
Upload https://repo.eclipse.org/content/repositories/golo-releases/org/eclipse/golo/golo/3.0.0-incubation-M2/golo-3.0.0-incubation-M2.jar.md5
Upload https://repo.eclipse.org/content/repositories/golo-releases/org/eclipse/golo/golo/3.0.0-incubation-M2/golo-3.0.0-incubation-M2.pom
Upload https://repo.eclipse.org/content/repositories/golo-releases/org/eclipse/golo/golo/3.0.0-incubation-M2/golo-3.0.0-incubation-M2.pom.sha1
Upload https://repo.eclipse.org/content/repositories/golo-releases/org/eclipse/golo/golo/3.0.0-incubation-M2/golo-3.0.0-incubation-M2.pom.md5
Upload https://repo.eclipse.org/content/repositories/golo-releases/org/eclipse/golo/golo/3.0.0-incubation-M2/golo-3.0.0-incubation-M2-sources.jar
Upload https://repo.eclipse.org/content/repositories/golo-releases/org/eclipse/golo/golo/3.0.0-incubation-M2/golo-3.0.0-incubation-M2-sources.jar.sha1
Upload https://repo.eclipse.org/content/repositories/golo-releases/org/eclipse/golo/golo/3.0.0-incubation-M2/golo-3.0.0-incubation-M2-sources.jar.md5
Upload https://repo.eclipse.org/content/repositories/golo-releases/org/eclipse/golo/golo/3.0.0-incubation-M2/golo-3.0.0-incubation-M2-javadoc.jar
Upload https://repo.eclipse.org/content/repositories/golo-releases/org/eclipse/golo/golo/3.0.0-incubation-M2/golo-3.0.0-incubation-M2-javadoc.jar.sha1
Upload https://repo.eclipse.org/content/repositories/golo-releases/org/eclipse/golo/golo/3.0.0-incubation-M2/golo-3.0.0-incubation-M2-javadoc.jar.md5
Upload https://repo.eclipse.org/content/repositories/golo-releases/org/eclipse/golo/golo/maven-metadata.xml
Upload https://repo.eclipse.org/content/repositories/golo-releases/org/eclipse/golo/golo/maven-metadata.xml.sha1
Upload https://repo.eclipse.org/content/repositories/golo-releases/org/eclipse/golo/golo/maven-metadata.xml.md5
:publishGoloPublicationToProjectRepositoryCould not find metadata org.eclipse.golo:golo/maven-metadata.xml in remote (file:/jobs/genie.golo/golo-deploy-releases/workspace/build/maven-repo)

:publish

BUILD SUCCESSFUL

Total time: 36.109 secs

This build could be faster, please consider using the Gradle Daemon: https://docs.gradle.org/2.6/userguide/gradle_daemon.html
[INFO] Using Maven 3 installation: apache-maven-latest
[INFO] Checking Maven 3 installation environment
[workspace] $ /shared/common/apache-maven-latest/bin/mvn --help
[INFO] Checking Maven 3 installation version
[INFO] Detected Maven 3 installation version: 3.3.1
[workspace] $ /shared/common/apache-maven-latest/bin/mvn clean install deploy -V -B -DRELEASE_TAG=milestone/3.0.0-incubation-M2 -Dmaven.ext.class.path=/home/hudson/genie.golo/.hudson/maven/slavebundle/resources:/home/hudson/genie.golo/.hudson/maven/slavebundle/lib/maven3-eventspy-3.1.jar:/home/hudson/genie.golo/.hudson/war/webapp/WEB-INF/lib/hudson-remoting-3.0.3.jar -Dhudson.eventspy.port=43177 -f golo-maven-plugin/pom.xml -P release
[DEBUG] Waiting for connection on port: 43177
Apache Maven 3.3.1 (cab6659f9874fa96462afef40fcf6bc033d58c1c; 2015-03-13T16:10:27-04:00)
Maven home: /shared/common/apache-maven-latest
Java version: 1.8.0_51, vendor: Oracle Corporation
Java home: /opt/public/common/jdk1.8.0_51.x64/jre
Default locale: en_US, platform encoding: UTF-8
OS name: "linux", version: "3.0.101-0.46-default", arch: "amd64", family: "unix"
SLF4J: Class path contains multiple SLF4J bindings.
SLF4J: Found binding in [jar:file:/home/hudson/genie.golo/.hudson/maven/slavebundle/lib/maven3-eventspy-runtime.jar!/org/slf4j/impl/StaticLoggerBinder.class]
SLF4J: Found binding in [jar:file:/shared/common/apache-maven-latest/lib/slf4j-simple-1.7.5.jar!/org/slf4j/impl/StaticLoggerBinder.class]
SLF4J: See http://www.slf4j.org/codes.html#multiple_bindings for an explanation.
[DEBUG] Connected to remote
[INFO] o.h.m.e.h.SettingsBuildingRequestHandler - Using settings document ID: e23a0b6a-ab36-4ea3-8d97-c6ce7ba3db90
[INFO] o.h.m.e.h.SettingsBuildingRequestHandler - Using global settings document ID: e23a0b6a-ab36-4ea3-8d97-c6ce7ba3db90
[WARN] o.h.m.e.EventSpyProcessor - Unhandled event: org.apache.maven.toolchain.building.DefaultToolchainsBuildingRequest@6ceb7b5e (org.apache.maven.toolchain.building.DefaultToolchainsBuildingRequest)
[WARN] o.h.m.e.EventSpyProcessor - Unhandled event: org.apache.maven.toolchain.building.DefaultToolchainsBuildingRequest@6ceb7b5e (org.apache.maven.toolchain.building.DefaultToolchainsBuildingRequest)
[INFO] Scanning for projects...
[INFO]                                                                         
[INFO] ------------------------------------------------------------------------
[INFO] Building Golo Maven Plugin (Incubation) 3.0.0-incubation-M2
[INFO] ------------------------------------------------------------------------
Downloading: https://repo.maven.apache.org/maven2/org/eclipse/golo/golo/3.0.0-incubation-M2/golo-3.0.0-incubation-M2.pom
[WARNING] The POM for org.eclipse.golo:golo:jar:3.0.0-incubation-M2 is missing, no dependency information available
Downloading: https://repo.maven.apache.org/maven2/org/eclipse/golo/golo/3.0.0-incubation-M2/golo-3.0.0-incubation-M2.jar
[INFO] ------------------------------------------------------------------------
[INFO] BUILD FAILURE
[INFO] ------------------------------------------------------------------------
[INFO] Total time: 1.723 s
[INFO] Finished at: 2015-09-07T05:55:43-04:00
[INFO] Final Memory: 26M/1540M
[INFO] ------------------------------------------------------------------------
[INFO] o.h.m.e.h.MavenExecutionResultHandler - Build failed with exception(s)
[INFO] o.h.m.e.h.MavenExecutionResultHandler - [1] org.apache.maven.lifecycle.LifecycleExecutionException: Failed to execute goal on project golo-maven-plugin: Could not resolve dependencies for project org.eclipse.golo:golo-maven-plugin:maven-plugin:3.0.0-incubation-M2: Could not find artifact org.eclipse.golo:golo:jar:3.0.0-incubation-M2 in central (https://repo.maven.apache.org/maven2)
[DEBUG] Closing connection to remote
[ERROR] Failed to execute goal on project golo-maven-plugin: Could not resolve dependencies for project org.eclipse.golo:golo-maven-plugin:maven-plugin:3.0.0-incubation-M2: Could not find artifact org.eclipse.golo:golo:jar:3.0.0-incubation-M2 in central (https://repo.maven.apache.org/maven2) -> [Help 1]
[ERROR] 
[ERROR] To see the full stack trace of the errors, re-run Maven with the -e switch.
[ERROR] Re-run Maven using the -X switch to enable full debug logging.
[ERROR] 
[ERROR] For more information about the errors and possible solutions, please read the following articles:
[ERROR] [Help 1] http://cwiki.apache.org/confluence/display/MAVEN/DependencyResolutionException
[DEBUG] Waiting for process to finish
[DEBUG] Result: 1
Finished: FAILURE