FailedConsole Output

Started by user Danny Ju
Running as Danny Ju
Agent default-agent-zp336 is provisioned from template Kubernetes Pod Template
---
apiVersion: "v1"
kind: "Pod"
metadata:
  annotations: {}
  labels:
    jenkins: "slave"
  name: "default-agent-zp336"
spec:
  containers:
  - env:
    - name: "JENKINS_SECRET"
      value: "b3994b49015eac6fd9b55200f61e0d02c71277116a3b4b9c4d73f3b16fe6c3d6"
    - name: "JENKINS_TUNNEL"
      value: "jenkins-discovery.glassfish-tools.svc.cluster.local:50000"
    - name: "JENKINS_AGENT_NAME"
      value: "default-agent-zp336"
    - name: "JENKINS_NAME"
      value: "default-agent-zp336"
    - name: "JENKINS_URL"
      value: "http://jenkins-ui.glassfish-tools.svc.cluster.local/glassfish-tools/"
    - name: "HOME"
      value: "/home/jenkins"
    image: "eclipsecbijenkins/jenkins-agent:3.29@sha256:5e2449faafc9c1662697946057b511572fa666289255069526c1d5057be0c0f3"
    imagePullPolicy: "IfNotPresent"
    name: "jnlp"
    resources:
      limits:
        memory: "4096Mi"
        cpu: "2000m"
      requests:
        memory: "4096Mi"
        cpu: "1000m"
    securityContext:
      privileged: false
    tty: true
    volumeMounts:
    - mountPath: "/home/jenkins/.m2/toolchains.xml"
      name: "toolchains-xml"
      readOnly: true
      subPath: "toolchains.xml"
    - mountPath: "/opt/tools"
      name: "volume-0"
      readOnly: false
    - mountPath: "/home/jenkins/.m2/repository"
      name: "volume-2"
      readOnly: false
    - mountPath: "/home/jenkins"
      name: "workspace-volume"
      readOnly: false
    - mountPath: "/home/jenkins/.m2/settings.xml"
      name: "settings-xml"
      readOnly: true
      subPath: "settings.xml"
    - mountPath: "/home/jenkins/.ssh"
      name: "volume-1"
      readOnly: false
    workingDir: "/home/jenkins"
  nodeSelector: {}
  restartPolicy: "Never"
  volumes:
  - name: "volume-0"
    persistentVolumeClaim:
      claimName: "tools-claim-jiro-glassfish-tools"
      readOnly: true
  - configMap:
      items:
      - key: "toolchains.xml"
        path: "toolchains.xml"
      name: "m2-dir"
    name: "toolchains-xml"
  - emptyDir:
      medium: ""
    name: "volume-2"
  - configMap:
      name: "known-hosts"
    name: "volume-1"
  - configMap:
      items:
      - key: "settings.xml"
        path: "settings.xml"
      name: "m2-dir"
    name: "settings-xml"
  - emptyDir:
      medium: ""
    name: "workspace-volume"

Building remotely on default-agent-zp336 in workspace /home/jenkins/workspace/glassfish-tools-1.0.0
No credentials specified
Cloning the remote Git repository
Cloning repository https://git.eclipse.org/r/glassfish-tools/glassfish-tools.git
 > /usr/bin/git init /home/jenkins/workspace/glassfish-tools-1.0.0 # timeout=10
Fetching upstream changes from https://git.eclipse.org/r/glassfish-tools/glassfish-tools.git
 > /usr/bin/git --version # timeout=10
 > /usr/bin/git fetch --tags --force --progress https://git.eclipse.org/r/glassfish-tools/glassfish-tools.git +refs/heads/*:refs/remotes/origin/*
 > /usr/bin/git config remote.origin.url https://git.eclipse.org/r/glassfish-tools/glassfish-tools.git # timeout=10
 > /usr/bin/git config --add remote.origin.fetch +refs/heads/*:refs/remotes/origin/* # timeout=10
 > /usr/bin/git config remote.origin.url https://git.eclipse.org/r/glassfish-tools/glassfish-tools.git # timeout=10
Fetching upstream changes from https://git.eclipse.org/r/glassfish-tools/glassfish-tools.git
 > /usr/bin/git fetch --tags --force --progress https://git.eclipse.org/r/glassfish-tools/glassfish-tools.git +refs/heads/*:refs/remotes/origin/*
 > /usr/bin/git rev-parse refs/remotes/origin/master^{commit} # timeout=10
 > /usr/bin/git rev-parse refs/remotes/origin/origin/master^{commit} # timeout=10
Checking out Revision ec52938efe309e2da575d1ed2544a32be6068029 (refs/remotes/origin/master)
 > /usr/bin/git config core.sparsecheckout # timeout=10
 > /usr/bin/git checkout -f ec52938efe309e2da575d1ed2544a32be6068029
Commit message: "Fix incomplete GF5.1 system classpath container"
 > /usr/bin/git rev-list --no-walk ec52938efe309e2da575d1ed2544a32be6068029 # timeout=10
Unpacking https://archive.apache.org/dist/ant/binaries/apache-ant-1.10.5-bin.zip to /home/jenkins/tools/hudson.tasks.Ant_AntInstallation/apache-ant-latest on default-agent-zp336
[glassfish-tools-1.0.0] $ /bin/sh -xe /tmp/jenkins4133201925939560375.sh
+ export 'JDK_8_HOME=/opt/tools/java/oracle/jdk-8/latest'
+ export 'JDK_4_HOME=/opt/tools/java/oracle/jdk-1.4/latest'
+ echo /home/jenkins/tools/hudson.tasks.Ant_AntInstallation/apache-ant-latest
/home/jenkins/tools/hudson.tasks.Ant_AntInstallation/apache-ant-latest
+ export 'PATH=/opt/tools/java/oracle/jdk-8/latest/bin:/opt/tools/java/oracle/jdk-8/latest/bin:/home/jenkins/tools/hudson.tasks.Ant_AntInstallation/apache-ant-latest/bin:/opt/tools/java/oracle/jdk-8/latest/bin:/opt/java/openjdk/bin:/usr/local/sbin:/usr/local/bin:/usr/sbin:/usr/bin:/sbin:/bin:/home/jenkins/tools/hudson.tasks.Ant_AntInstallation/apache-ant-latest/bin'
+ env
JENKINS_DISCOVERY_PORT=tcp://172.30.40.147:50000
JENKINS_HOME=/var/jenkins_home
JENKINS_DISCOVERY_SERVICE_PORT=50000
JENKINS_UI_SERVICE_HOST=172.30.40.150
JENKINS_SECRET=b3994b49015eac6fd9b55200f61e0d02c71277116a3b4b9c4d73f3b16fe6c3d6
KUBERNETES_PORT=tcp://172.30.40.1:443
GIT_PREVIOUS_SUCCESSFUL_COMMIT=ec52938efe309e2da575d1ed2544a32be6068029
KUBERNETES_SERVICE_PORT=443
LANGUAGE=en_US:en
IBM_JAVA_OPTIONS=-XX:+IgnoreUnrecognizedVMOptions -XX:+UseContainerSupport -XX:+IdleTuningCompactOnIdle -XX:+IdleTuningGcOnIdle -XX:MaxRAMPercentage=64
JENKINS_DISCOVERY_PORT_50000_TCP=tcp://172.30.40.147:50000
JAVA_TOOL_OPTIONS=-XX:+IgnoreUnrecognizedVMOptions -XX:+UseContainerSupport -XX:+UnlockExperimentalVMOptions -XX:+UseCGroupMemoryLimitForHeap
RUN_CHANGES_DISPLAY_URL=https://ci-staging.eclipse.org/glassfish-tools/job/glassfish-tools-1.0.0/15/display/redirect?page=changes
HOSTNAME=default-agent-zp336
LD_LIBRARY_PATH=/usr/lib
SHLVL=3
NODE_LABELS=default-agent-zp336
HUDSON_URL=https://ci-staging.eclipse.org/glassfish-tools/
GIT_COMMIT=ec52938efe309e2da575d1ed2544a32be6068029
HOME=/home/jenkins
OPENJ9_JAVA_OPTIONS=-XX:+IgnoreUnrecognizedVMOptions -XX:+UseContainerSupport -XX:+IdleTuningCompactOnIdle -XX:+IdleTuningGcOnIdle -XX:MaxRAMPercentage=64
KUBERNETES_PORT_53_TCP_ADDR=172.30.40.1
BUILD_URL=https://ci-staging.eclipse.org/glassfish-tools/job/glassfish-tools-1.0.0/15/
JENKINS_UI_SERVICE_PORT=80
JENKINS_UI_PORT=tcp://172.30.40.150:80
KUBERNETES_PORT_53_UDP_ADDR=172.30.40.1
HUDSON_COOKIE=122f884b-1e4f-4d47-8641-572c483b34f7
JENKINS_SERVER_COOKIE=6b577fd774f0a242
JENKINS_AGENT_WORKDIR=/home/jenkins/agent
KUBERNETES_PORT_53_TCP_PORT=53
KUBERNETES_PORT_53_TCP_PROTO=tcp
KUBERNETES_PORT_53_UDP_PORT=53
WORKSPACE=/home/jenkins/workspace/glassfish-tools-1.0.0
KUBERNETES_PORT_53_UDP_PROTO=udp
JENKINS_DISCOVERY_SERVICE_PORT_JNLP=50000
KUBERNETES_SERVICE_PORT_DNS=53
JAVA_VERSION=jdk8u212-b04_openj9-0.14.2
JENKINS_UI_PORT_80_TCP_ADDR=172.30.40.150
NODE_NAME=default-agent-zp336
GIT_BRANCH=origin/master
JENKINS_TUNNEL=jenkins-discovery.glassfish-tools.svc.cluster.local:50000
EXECUTOR_NUMBER=0
JENKINS_UI_PORT_80_TCP_PORT=80
TERM=xterm
JENKINS_UI_PORT_80_TCP_PROTO=tcp
BUILD_DISPLAY_NAME=#15
KUBERNETES_PORT_53_TCP=tcp://172.30.40.1:53
KUBERNETES_PORT_443_TCP_ADDR=172.30.40.1
HUDSON_HOME=/var/jenkins_home
JOB_BASE_NAME=glassfish-tools-1.0.0
PATH=/opt/tools/java/oracle/jdk-8/latest/bin:/opt/tools/java/oracle/jdk-8/latest/bin:/home/jenkins/tools/hudson.tasks.Ant_AntInstallation/apache-ant-latest/bin:/opt/tools/java/oracle/jdk-8/latest/bin:/opt/java/openjdk/bin:/usr/local/sbin:/usr/local/bin:/usr/sbin:/usr/bin:/sbin:/bin:/home/jenkins/tools/hudson.tasks.Ant_AntInstallation/apache-ant-latest/bin
_JAVA_OPTIONS=-XX:MaxRAMPercentage=64.0
ANT_HOME=/home/jenkins/tools/hudson.tasks.Ant_AntInstallation/apache-ant-latest
KUBERNETES_PORT_53_UDP=udp://172.30.40.1:53
JNLP_PROTOCOL_OPTS=-XshowSettings:vm -Xmx256m -Djdk.nativeCrypto=false -Dsun.zip.disableMemoryMapping=true -Dorg.jenkinsci.remoting.engine.JnlpProtocol3.disabled=true
BUILD_ID=15
KUBERNETES_PORT_443_TCP_PORT=443
BUILD_TAG=jenkins-glassfish-tools-1.0.0-15
KUBERNETES_PORT_443_TCP_PROTO=tcp
JENKINS_URL=https://ci-staging.eclipse.org/glassfish-tools/
LANG=en_US.UTF-8
JOB_URL=https://ci-staging.eclipse.org/glassfish-tools/job/glassfish-tools-1.0.0/
JENKINS_AGENT_NAME=default-agent-zp336
GIT_URL=https://git.eclipse.org/r/glassfish-tools/glassfish-tools.git
JENKINS_UI_PORT_80_TCP=tcp://172.30.40.150:80
BUILD_NUMBER=15
KUBERNETES_SERVICE_PORT_DNS_TCP=53
RUN_DISPLAY_URL=https://ci-staging.eclipse.org/glassfish-tools/job/glassfish-tools-1.0.0/15/display/redirect
HUDSON_SERVER_COOKIE=6b577fd774f0a242
JDK_4_HOME=/opt/tools/java/oracle/jdk-1.4/latest
JENKINS_DISCOVERY_PORT_50000_TCP_ADDR=172.30.40.147
JOB_DISPLAY_URL=https://ci-staging.eclipse.org/glassfish-tools/job/glassfish-tools-1.0.0/display/redirect
KUBERNETES_PORT_443_TCP=tcp://172.30.40.1:443
KUBERNETES_SERVICE_PORT_HTTPS=443
JENKINS_NAME=default-agent-zp336
JENKINS_DISCOVERY_SERVICE_HOST=172.30.40.147
JOB_NAME=glassfish-tools-1.0.0
LC_ALL=en_US.UTF-8
PWD=/home/jenkins/workspace/glassfish-tools-1.0.0
JENKINS_DISCOVERY_PORT_50000_TCP_PORT=50000
JAVA_HOME=/opt/tools/java/oracle/jdk-8/latest
KUBERNETES_SERVICE_HOST=172.30.40.1
JENKINS_UI_SERVICE_PORT_HTTP=80
JDK_8_HOME=/opt/tools/java/oracle/jdk-8/latest
JENKINS_DISCOVERY_PORT_50000_TCP_PROTO=tcp
GIT_PREVIOUS_COMMIT=ec52938efe309e2da575d1ed2544a32be6068029
+ ant -file build.xml '-Dsign=true' '-Dwarnings=true' '-Dfindbugs.location=/shared/common/findbugs-3.0.0/' hudson-build
Picked up JAVA_TOOL_OPTIONS: -XX:+IgnoreUnrecognizedVMOptions -XX:+UseContainerSupport -XX:+UnlockExperimentalVMOptions -XX:+UseCGroupMemoryLimitForHeap
Picked up _JAVA_OPTIONS: -XX:MaxRAMPercentage=64.0
Buildfile: /home/jenkins/workspace/glassfish-tools-1.0.0/build.xml
      [get] Getting: https://hudson.eclipse.org/sapphire/job/Corundum/lastSuccessfulBuild/artifact/corundum.zip
      [get] To: /home/jenkins/workspace/glassfish-tools-1.0.0/releng/corundum.zip
      [get] https://hudson.eclipse.org/sapphire/job/Corundum/lastSuccessfulBuild/artifact/corundum.zip moved to https://eclipse.org/errors/404.html
      [get] https://eclipse.org/errors/404.html moved to https://www.eclipse.org/errors/404.html
    [unzip] Expanding: /home/jenkins/workspace/glassfish-tools-1.0.0/releng/corundum.zip into /home/jenkins/workspace/glassfish-tools-1.0.0/releng/corundum

BUILD FAILED
/home/jenkins/workspace/glassfish-tools-1.0.0/build.xml:10: Error while expanding /home/jenkins/workspace/glassfish-tools-1.0.0/releng/corundum.zip
java.util.zip.ZipException: archive is not a ZIP archive
	at org.apache.tools.zip.ZipFile.positionAtEndOfCentralDirectoryRecord(ZipFile.java:775)
	at org.apache.tools.zip.ZipFile.positionAtCentralDirectory(ZipFile.java:711)
	at org.apache.tools.zip.ZipFile.populateFromCentralDirectory(ZipFile.java:456)
	at org.apache.tools.zip.ZipFile.<init>(ZipFile.java:216)
	at org.apache.tools.ant.taskdefs.Expand.expandFile(Expand.java:190)
	at org.apache.tools.ant.taskdefs.Expand.execute(Expand.java:157)
	at org.apache.tools.ant.UnknownElement.execute(UnknownElement.java:292)
	at sun.reflect.NativeMethodAccessorImpl.invoke0(Native Method)
	at sun.reflect.NativeMethodAccessorImpl.invoke(NativeMethodAccessorImpl.java:62)
	at sun.reflect.DelegatingMethodAccessorImpl.invoke(DelegatingMethodAccessorImpl.java:43)
	at java.lang.reflect.Method.invoke(Method.java:498)
	at org.apache.tools.ant.dispatch.DispatchUtils.execute(DispatchUtils.java:99)
	at org.apache.tools.ant.Task.perform(Task.java:350)
	at org.apache.tools.ant.Target.execute(Target.java:449)
	at org.apache.tools.ant.helper.ProjectHelper2.parse(ProjectHelper2.java:184)
	at org.apache.tools.ant.ProjectHelper.configureProject(ProjectHelper.java:93)
	at org.apache.tools.ant.Main.runBuild(Main.java:809)
	at org.apache.tools.ant.Main.startAnt(Main.java:223)
	at org.apache.tools.ant.launch.Launcher.run(Launcher.java:284)
	at org.apache.tools.ant.launch.Launcher.main(Launcher.java:101)

Total time: 0 seconds
Build step 'Execute shell' marked build as failure
Archiving artifacts
Sending e-mails to: danny.ju@oracle.com
Finished: FAILURE