SuccessConsole Output

Started calculate disk usage of build
Finished Calculation of disk usage of build in 0 seconds
Started calculate disk usage of workspace
Finished Calculation of disk usage of workspace in 0 seconds
[INFO]                                                                         
[INFO] ------------------------------------------------------------------------
[INFO] Building GeoGig Core 1.0-RC4
[INFO] ------------------------------------------------------------------------
[INFO] Downloading: https://repo.boundlessgeo.com/main/org/rocksdb/rocksdbjni/4.13.4/rocksdbjni-4.13.4.pom
[INFO] Downloading: http://download.osgeo.org/webdav/geotools/org/rocksdb/rocksdbjni/4.13.4/rocksdbjni-4.13.4.pom
[INFO] Downloading: http://dev.mapfish.org/maven/repository/org/rocksdb/rocksdbjni/4.13.4/rocksdbjni-4.13.4.pom
[INFO] Downloading: https://repo.eclipse.org/content/repositories/maven_central/org/rocksdb/rocksdbjni/4.13.4/rocksdbjni-4.13.4.pom
[INFO] Downloaded: https://repo.eclipse.org/content/repositories/maven_central/org/rocksdb/rocksdbjni/4.13.4/rocksdbjni-4.13.4.pom (7 KB at 72.2 KB/sec)
[INFO] Downloading: https://repo.boundlessgeo.com/main/org/geotools/gt-epsg-hsql/15.1/gt-epsg-hsql-15.1.pom
[INFO] Downloaded: https://repo.boundlessgeo.com/main/org/geotools/gt-epsg-hsql/15.1/gt-epsg-hsql-15.1.pom (6 KB at 39.9 KB/sec)
[INFO] Downloading: https://repo.boundlessgeo.com/main/org/geotools/plugin/15.1/plugin-15.1.pom
[INFO] Downloaded: https://repo.boundlessgeo.com/main/org/geotools/plugin/15.1/plugin-15.1.pom (3 KB at 36.4 KB/sec)
[INFO] Downloading: https://repo.boundlessgeo.com/main/jgridshift/jgridshift/1.0/jgridshift-1.0.pom
[INFO] Downloading: http://download.osgeo.org/webdav/geotools/jgridshift/jgridshift/1.0/jgridshift-1.0.pom
[INFO] Downloaded: http://download.osgeo.org/webdav/geotools/jgridshift/jgridshift/1.0/jgridshift-1.0.pom (391 B at 1.1 KB/sec)
[INFO] Downloading: https://repo.boundlessgeo.com/main/org/hsqldb/hsqldb/2.3.0/hsqldb-2.3.0.pom
[INFO] Downloading: http://download.osgeo.org/webdav/geotools/org/hsqldb/hsqldb/2.3.0/hsqldb-2.3.0.pom
[INFO] Downloading: http://dev.mapfish.org/maven/repository/org/hsqldb/hsqldb/2.3.0/hsqldb-2.3.0.pom
[INFO] Downloading: https://repo.eclipse.org/content/repositories/maven_central/org/hsqldb/hsqldb/2.3.0/hsqldb-2.3.0.pom
[INFO] Downloaded: https://repo.eclipse.org/content/repositories/maven_central/org/hsqldb/hsqldb/2.3.0/hsqldb-2.3.0.pom (2 KB at 25.3 KB/sec)
[INFO] Downloading: https://repo.boundlessgeo.com/main/org/geotools/gt-cql/15.1/gt-cql-15.1.pom
[INFO] Downloaded: https://repo.boundlessgeo.com/main/org/geotools/gt-cql/15.1/gt-cql-15.1.pom (5 KB at 32.4 KB/sec)
[INFO] Downloading: https://repo.boundlessgeo.com/main/com/google/inject/guice/4.0/guice-4.0.pom
[INFO] Downloading: http://download.osgeo.org/webdav/geotools/com/google/inject/guice/4.0/guice-4.0.pom
[INFO] Downloading: http://dev.mapfish.org/maven/repository/com/google/inject/guice/4.0/guice-4.0.pom
[INFO] Downloading: https://repo.eclipse.org/content/repositories/maven_central/com/google/inject/guice/4.0/guice-4.0.pom
[INFO] Downloaded: https://repo.eclipse.org/content/repositories/maven_central/com/google/inject/guice/4.0/guice-4.0.pom (11 KB at 236.0 KB/sec)
[INFO] Downloading: https://repo.boundlessgeo.com/main/com/google/inject/guice-parent/4.0/guice-parent-4.0.pom
[INFO] Downloading: http://download.osgeo.org/webdav/geotools/com/google/inject/guice-parent/4.0/guice-parent-4.0.pom
[INFO] Downloading: http://dev.mapfish.org/maven/repository/com/google/inject/guice-parent/4.0/guice-parent-4.0.pom
[INFO] Downloading: https://repo.eclipse.org/content/repositories/maven_central/com/google/inject/guice-parent/4.0/guice-parent-4.0.pom
[INFO] Downloaded: https://repo.eclipse.org/content/repositories/maven_central/com/google/inject/guice-parent/4.0/guice-parent-4.0.pom (16 KB at 336.2 KB/sec)
[INFO] Downloading: https://repo.boundlessgeo.com/main/com/google/google/5/google-5.pom
[INFO] Downloading: http://download.osgeo.org/webdav/geotools/com/google/google/5/google-5.pom
[INFO] Downloading: http://dev.mapfish.org/maven/repository/com/google/google/5/google-5.pom
[INFO] Downloading: https://repo.eclipse.org/content/repositories/maven_central/com/google/google/5/google-5.pom
[INFO] Downloaded: https://repo.eclipse.org/content/repositories/maven_central/com/google/google/5/google-5.pom (3 KB at 68.6 KB/sec)
[INFO] Downloading: https://repo.boundlessgeo.com/main/javax/inject/javax.inject/1/javax.inject-1.pom
[INFO] Downloading: http://download.osgeo.org/webdav/geotools/javax/inject/javax.inject/1/javax.inject-1.pom
[INFO] Downloading: http://dev.mapfish.org/maven/repository/javax/inject/javax.inject/1/javax.inject-1.pom
[INFO] Downloading: https://repo.eclipse.org/content/repositories/maven_central/javax/inject/javax.inject/1/javax.inject-1.pom
[INFO] Downloaded: https://repo.eclipse.org/content/repositories/maven_central/javax/inject/javax.inject/1/javax.inject-1.pom (612 B at 26.0 KB/sec)
[INFO] Downloading: https://repo.boundlessgeo.com/main/com/google/inject/extensions/guice-multibindings/4.0/guice-multibindings-4.0.pom
[INFO] Downloading: http://download.osgeo.org/webdav/geotools/com/google/inject/extensions/guice-multibindings/4.0/guice-multibindings-4.0.pom
[INFO] Downloading: http://dev.mapfish.org/maven/repository/com/google/inject/extensions/guice-multibindings/4.0/guice-multibindings-4.0.pom
[INFO] Downloading: https://repo.eclipse.org/content/repositories/maven_central/com/google/inject/extensions/guice-multibindings/4.0/guice-multibindings-4.0.pom
[INFO] Downloaded: https://repo.eclipse.org/content/repositories/maven_central/com/google/inject/extensions/guice-multibindings/4.0/guice-multibindings-4.0.pom (547 B at 11.4 KB/sec)
[INFO] Downloading: https://repo.boundlessgeo.com/main/com/google/inject/extensions/extensions-parent/4.0/extensions-parent-4.0.pom
[INFO] Downloading: http://download.osgeo.org/webdav/geotools/com/google/inject/extensions/extensions-parent/4.0/extensions-parent-4.0.pom
[INFO] Downloading: http://dev.mapfish.org/maven/repository/com/google/inject/extensions/extensions-parent/4.0/extensions-parent-4.0.pom
[INFO] Downloading: https://repo.eclipse.org/content/repositories/maven_central/com/google/inject/extensions/extensions-parent/4.0/extensions-parent-4.0.pom
[INFO] Downloaded: https://repo.eclipse.org/content/repositories/maven_central/com/google/inject/extensions/extensions-parent/4.0/extensions-parent-4.0.pom (4 KB at 86.6 KB/sec)
[INFO] Downloading: https://repo.boundlessgeo.com/main/com/google/code/gson/gson/2.4/gson-2.4.pom
[INFO] Downloading: http://download.osgeo.org/webdav/geotools/com/google/code/gson/gson/2.4/gson-2.4.pom
[INFO] Downloading: http://dev.mapfish.org/maven/repository/com/google/code/gson/gson/2.4/gson-2.4.pom
[INFO] Downloading: https://repo.eclipse.org/content/repositories/maven_central/com/google/code/gson/gson/2.4/gson-2.4.pom
[INFO] Downloaded: https://repo.eclipse.org/content/repositories/maven_central/com/google/code/gson/gson/2.4/gson-2.4.pom (9 KB at 234.0 KB/sec)
[INFO] Downloading: https://repo.boundlessgeo.com/main/org/sonatype/oss/oss-parent/9/oss-parent-9.pom
[INFO] Downloading: http://download.osgeo.org/webdav/geotools/org/sonatype/oss/oss-parent/9/oss-parent-9.pom
[INFO] Downloading: http://dev.mapfish.org/maven/repository/org/sonatype/oss/oss-parent/9/oss-parent-9.pom
[INFO] Downloading: https://repo.eclipse.org/content/repositories/maven_central/org/sonatype/oss/oss-parent/9/oss-parent-9.pom
[INFO] Downloaded: https://repo.eclipse.org/content/repositories/maven_central/org/sonatype/oss/oss-parent/9/oss-parent-9.pom (7 KB at 206.9 KB/sec)
[INFO] Downloading: https://repo.boundlessgeo.com/main/com/ning/compress-lzf/1.0.3/compress-lzf-1.0.3.pom
[INFO] Downloading: http://download.osgeo.org/webdav/geotools/com/ning/compress-lzf/1.0.3/compress-lzf-1.0.3.pom
[INFO] Downloading: http://dev.mapfish.org/maven/repository/com/ning/compress-lzf/1.0.3/compress-lzf-1.0.3.pom
[INFO] Downloading: https://repo.eclipse.org/content/repositories/maven_central/com/ning/compress-lzf/1.0.3/compress-lzf-1.0.3.pom
[INFO] Downloaded: https://repo.eclipse.org/content/repositories/maven_central/com/ning/compress-lzf/1.0.3/compress-lzf-1.0.3.pom (8 KB at 213.1 KB/sec)
[INFO] Downloading: https://repo.boundlessgeo.com/main/org/geotools/gt-data/15.1/gt-data-15.1.pom
[INFO] Downloaded: https://repo.boundlessgeo.com/main/org/geotools/gt-data/15.1/gt-data-15.1.pom (4 KB at 23.1 KB/sec)
[INFO] Downloading: https://repo.boundlessgeo.com/main/org/rocksdb/rocksdbjni/4.13.4/rocksdbjni-4.13.4.jar
[INFO] Downloading: https://repo.boundlessgeo.com/main/org/geotools/gt-epsg-hsql/15.1/gt-epsg-hsql-15.1.jar
[INFO] Downloading: https://repo.boundlessgeo.com/main/org/hsqldb/hsqldb/2.3.0/hsqldb-2.3.0.jar
[INFO] Downloading: https://repo.boundlessgeo.com/main/org/geotools/gt-cql/15.1/gt-cql-15.1.jar
[INFO] Downloading: https://repo.boundlessgeo.com/main/com/google/inject/guice/4.0/guice-4.0-no_aop.jar
[INFO] Downloaded: https://repo.boundlessgeo.com/main/org/geotools/gt-cql/15.1/gt-cql-15.1.jar (193 KB at 642.4 KB/sec)
[INFO] Downloading: https://repo.boundlessgeo.com/main/javax/inject/javax.inject/1/javax.inject-1.jar
[INFO] Downloading: https://repo.boundlessgeo.com/main/com/google/inject/extensions/guice-multibindings/4.0/guice-multibindings-4.0.jar
[INFO] Downloaded: https://repo.boundlessgeo.com/main/org/geotools/gt-epsg-hsql/15.1/gt-epsg-hsql-15.1.jar (2276 KB at 4085.5 KB/sec)
[INFO] Downloading: https://repo.boundlessgeo.com/main/com/google/code/gson/gson/2.4/gson-2.4.jar
[INFO] Downloading: https://repo.boundlessgeo.com/main/com/ning/compress-lzf/1.0.3/compress-lzf-1.0.3.jar
[INFO] Downloading: https://repo.boundlessgeo.com/main/org/geotools/gt-data/15.1/gt-data-15.1.jar
[INFO] Downloaded: https://repo.boundlessgeo.com/main/org/geotools/gt-data/15.1/gt-data-15.1.jar (87 KB at 104.3 KB/sec)
[INFO] Downloading: http://download.osgeo.org/webdav/geotools/org/rocksdb/rocksdbjni/4.13.4/rocksdbjni-4.13.4.jar
[INFO] Downloading: http://download.osgeo.org/webdav/geotools/org/hsqldb/hsqldb/2.3.0/hsqldb-2.3.0.jar
[INFO] Downloading: http://download.osgeo.org/webdav/geotools/com/google/inject/guice/4.0/guice-4.0-no_aop.jar
[INFO] Downloading: http://download.osgeo.org/webdav/geotools/javax/inject/javax.inject/1/javax.inject-1.jar
[INFO] Downloading: http://download.osgeo.org/webdav/geotools/com/google/inject/extensions/guice-multibindings/4.0/guice-multibindings-4.0.jar
[INFO] Downloading: http://download.osgeo.org/webdav/geotools/com/google/code/gson/gson/2.4/gson-2.4.jar
[INFO] Downloading: http://download.osgeo.org/webdav/geotools/com/ning/compress-lzf/1.0.3/compress-lzf-1.0.3.jar
[INFO] Downloading: http://dev.mapfish.org/maven/repository/org/rocksdb/rocksdbjni/4.13.4/rocksdbjni-4.13.4.jar
[INFO] Downloading: http://dev.mapfish.org/maven/repository/org/hsqldb/hsqldb/2.3.0/hsqldb-2.3.0.jar
[INFO] Downloading: http://dev.mapfish.org/maven/repository/com/google/inject/guice/4.0/guice-4.0-no_aop.jar
[INFO] Downloading: http://dev.mapfish.org/maven/repository/javax/inject/javax.inject/1/javax.inject-1.jar
[INFO] Downloading: http://dev.mapfish.org/maven/repository/com/google/inject/extensions/guice-multibindings/4.0/guice-multibindings-4.0.jar
[INFO] Downloading: http://dev.mapfish.org/maven/repository/com/google/code/gson/gson/2.4/gson-2.4.jar
[INFO] Downloading: http://dev.mapfish.org/maven/repository/com/ning/compress-lzf/1.0.3/compress-lzf-1.0.3.jar
[INFO] Downloading: https://repo.eclipse.org/content/repositories/maven_central/org/rocksdb/rocksdbjni/4.13.4/rocksdbjni-4.13.4.jar
[INFO] Downloading: https://repo.eclipse.org/content/repositories/maven_central/org/hsqldb/hsqldb/2.3.0/hsqldb-2.3.0.jar
[INFO] Downloading: https://repo.eclipse.org/content/repositories/maven_central/com/google/inject/guice/4.0/guice-4.0-no_aop.jar
[INFO] Downloading: https://repo.eclipse.org/content/repositories/maven_central/javax/inject/javax.inject/1/javax.inject-1.jar
[INFO] Downloading: https://repo.eclipse.org/content/repositories/maven_central/com/google/inject/extensions/guice-multibindings/4.0/guice-multibindings-4.0.jar
[INFO] Downloaded: https://repo.eclipse.org/content/repositories/maven_central/javax/inject/javax.inject/1/javax.inject-1.jar (3 KB at 31.7 KB/sec)
[INFO] Downloading: https://repo.eclipse.org/content/repositories/maven_central/com/google/code/gson/gson/2.4/gson-2.4.jar
[INFO] Downloaded: https://repo.eclipse.org/content/repositories/maven_central/com/google/inject/extensions/guice-multibindings/4.0/guice-multibindings-4.0.jar (80 KB at 827.9 KB/sec)
[INFO] Downloading: https://repo.eclipse.org/content/repositories/maven_central/com/ning/compress-lzf/1.0.3/compress-lzf-1.0.3.jar
[INFO] Downloaded: https://repo.eclipse.org/content/repositories/maven_central/com/google/inject/guice/4.0/guice-4.0-no_aop.jar (414 KB at 2585.2 KB/sec)
[INFO] Downloaded: https://repo.eclipse.org/content/repositories/maven_central/org/hsqldb/hsqldb/2.3.0/hsqldb-2.3.0.jar (1433 KB at 8280.7 KB/sec)
[INFO] Downloaded: https://repo.eclipse.org/content/repositories/maven_central/com/google/code/gson/gson/2.4/gson-2.4.jar (208 KB at 1286.9 KB/sec)
[INFO] Downloaded: https://repo.eclipse.org/content/repositories/maven_central/com/ning/compress-lzf/1.0.3/compress-lzf-1.0.3.jar (78 KB at 387.9 KB/sec)
[INFO] Downloaded: https://repo.eclipse.org/content/repositories/maven_central/org/rocksdb/rocksdbjni/4.13.4/rocksdbjni-4.13.4.jar (7039 KB at 25503.1 KB/sec)
[INFO] 
[INFO] --- maven-clean-plugin:2.5:clean (default-clean) @ geogig-core ---
[INFO] 
[INFO] --- git-commit-id-plugin:2.1.8:revision (default) @ geogig-core ---
[INFO] 
[INFO] --- maven-resources-plugin:2.6:resources (default-resources) @ geogig-core ---
[INFO] Using 'UTF-8' encoding to copy filtered resources.
[INFO] Copying 4 resources
[INFO] 
[INFO] --- maven-compiler-plugin:3.1:compile (default-compile) @ geogig-core ---
[INFO] Changes detected - recompiling the module!
[INFO] Compiling 305 source files to /home/hudson/genie.geogig/.hudson/jobs/geogig-release/workspace/src/core/target/classes
[WARNING] /home/hudson/genie.geogig/.hudson/jobs/geogig-release/workspace/src/core/src/main/java/org/locationtech/geogig/model/impl/RevTreeBuilder.java: Some input files use or override a deprecated API.
[WARNING] /home/hudson/genie.geogig/.hudson/jobs/geogig-release/workspace/src/core/src/main/java/org/locationtech/geogig/model/impl/RevTreeBuilder.java: Recompile with -Xlint:deprecation for details.
[WARNING] /home/hudson/genie.geogig/.hudson/jobs/geogig-release/workspace/src/core/src/main/java/org/locationtech/geogig/data/PrimitiveArrayToStringConverterFactory.java: Some input files use unchecked or unsafe operations.
[WARNING] /home/hudson/genie.geogig/.hudson/jobs/geogig-release/workspace/src/core/src/main/java/org/locationtech/geogig/data/PrimitiveArrayToStringConverterFactory.java: Recompile with -Xlint:unchecked for details.
[INFO] 
[INFO] --- maven-resources-plugin:2.6:testResources (default-testResources) @ geogig-core ---
[INFO] Using 'UTF-8' encoding to copy filtered resources.
[INFO] Copying 3 resources
[INFO] 
[INFO] --- maven-compiler-plugin:3.1:testCompile (default-testCompile) @ geogig-core ---
[INFO] Changes detected - recompiling the module!
[INFO] Compiling 145 source files to /home/hudson/genie.geogig/.hudson/jobs/geogig-release/workspace/src/core/target/test-classes
[WARNING] /home/hudson/genie.geogig/.hudson/jobs/geogig-release/workspace/src/core/src/test/java/org/locationtech/geogig/model/impl/CanonicalTreeBuilderTest.java: Some input files use or override a deprecated API.
[WARNING] /home/hudson/genie.geogig/.hudson/jobs/geogig-release/workspace/src/core/src/test/java/org/locationtech/geogig/model/impl/CanonicalTreeBuilderTest.java: Recompile with -Xlint:deprecation for details.
[WARNING] /home/hudson/genie.geogig/.hudson/jobs/geogig-release/workspace/src/core/src/test/java/org/locationtech/geogig/di/caching/CachingModuleTest.java: /home/hudson/genie.geogig/.hudson/jobs/geogig-release/workspace/src/core/src/test/java/org/locationtech/geogig/di/caching/CachingModuleTest.java uses unchecked or unsafe operations.
[WARNING] /home/hudson/genie.geogig/.hudson/jobs/geogig-release/workspace/src/core/src/test/java/org/locationtech/geogig/di/caching/CachingModuleTest.java: Recompile with -Xlint:unchecked for details.
[INFO] 
[INFO] --- maven-surefire-plugin:2.17:test (default-test) @ geogig-core ---
[INFO] Surefire report directory: /home/hudson/genie.geogig/.hudson/jobs/geogig-release/workspace/src/core/target/surefire-reports

-------------------------------------------------------
 T E S T S
-------------------------------------------------------

-------------------------------------------------------
 T E S T S
-------------------------------------------------------
Running org.locationtech.geogig.plumbing.UpdateIndexTest
Running org.locationtech.geogig.plumbing.ResolveGeogigURITest
Running org.locationtech.geogig.plumbing.diff.DepthTreeIteratorTest
Running org.locationtech.geogig.plumbing.diff.TreeDifferenceTest
Running org.locationtech.geogig.plumbing.diff.GeometryDiffTest
Running org.locationtech.geogig.plumbing.diff.DiffCountConsumerTest
Running org.locationtech.geogig.plumbing.diff.MutableTreeTest
Running org.locationtech.geogig.plumbing.diff.PatchSerializationTest
Running org.locationtech.geogig.plumbing.diff.PreOrderDiffWalkTest
Running org.locationtech.geogig.plumbing.diff.PostOrderDiffWalkTest
Running org.locationtech.geogig.plumbing.diff.AttributeDiffTest
Running org.locationtech.geogig.plumbing.DiffBoundsTest
Running org.locationtech.geogig.plumbing.RevParseTest
Running org.locationtech.geogig.plumbing.RefParseTest
Running org.locationtech.geogig.plumbing.DescribeFeatureTypeTest
Running org.locationtech.geogig.plumbing.DiffTreeTest
Running org.locationtech.geogig.plumbing.WriteTree2Test
Running org.locationtech.geogig.plumbing.merge.MergeStatusBuilderDiffEntrySerializerTest
Running org.locationtech.geogig.plumbing.merge.MergeFeaturesOpTest
Running org.locationtech.geogig.plumbing.ResolveFeatureTypeTest
Running org.locationtech.geogig.plumbing.CheckRefFormatTest
Running org.locationtech.geogig.plumbing.CatObjectTest
Running org.locationtech.geogig.plumbing.UpdateTreeTest
Running org.locationtech.geogig.plumbing.HashObjectTest
Tests run: 4, Failures: 0, Errors: 0, Skipped: 0, Time elapsed: 0.259 sec - in org.locationtech.geogig.plumbing.diff.AttributeDiffTest
Running org.locationtech.geogig.plumbing.ParseTimestampTest
Tests run: 14, Failures: 0, Errors: 0, Skipped: 0, Time elapsed: 1.762 sec - in org.locationtech.geogig.plumbing.diff.GeometryDiffTest
Running org.locationtech.geogig.plumbing.UpdateRefTest
Tests run: 7, Failures: 0, Errors: 0, Skipped: 0, Time elapsed: 1.961 sec - in org.locationtech.geogig.plumbing.diff.MutableTreeTest
Running org.locationtech.geogig.plumbing.DiffFeatureTest
Tests run: 1, Failures: 0, Errors: 0, Skipped: 0, Time elapsed: 2.04 sec - in org.locationtech.geogig.plumbing.ResolveGeogigURITest
Running org.locationtech.geogig.plumbing.WalkGraphOpTest
Tests run: 5, Failures: 0, Errors: 0, Skipped: 0, Time elapsed: 2.107 sec - in org.locationtech.geogig.plumbing.RefParseTest
Tests run: 7, Failures: 0, Errors: 0, Skipped: 0, Time elapsed: 2.193 sec - in org.locationtech.geogig.plumbing.diff.TreeDifferenceTest
Running org.locationtech.geogig.plumbing.ResolveRepositoryNameTest
Running org.locationtech.geogig.plumbing.UpdateSymRefTest
Tests run: 5, Failures: 0, Errors: 0, Skipped: 0, Time elapsed: 3.186 sec - in org.locationtech.geogig.plumbing.merge.MergeStatusBuilderDiffEntrySerializerTest
Running org.locationtech.geogig.test.integration.RebuildGraphOpTest
Tests run: 2, Failures: 0, Errors: 0, Skipped: 0, Time elapsed: 3.24 sec - in org.locationtech.geogig.plumbing.ParseTimestampTest
Running org.locationtech.geogig.test.integration.BlameOpTest
Tests run: 7, Failures: 0, Errors: 0, Skipped: 0, Time elapsed: 4.673 sec - in org.locationtech.geogig.plumbing.UpdateTreeTest
Running org.locationtech.geogig.test.integration.BranchCreateOpTest
Tests run: 1, Failures: 0, Errors: 0, Skipped: 0, Time elapsed: 5.623 sec - in org.locationtech.geogig.plumbing.UpdateIndexTest
Running org.locationtech.geogig.test.integration.StatusOpTest
Tests run: 2, Failures: 0, Errors: 0, Skipped: 0, Time elapsed: 6.292 sec - in org.locationtech.geogig.plumbing.DescribeFeatureTypeTest
Running org.locationtech.geogig.test.integration.repository.WorkingTreeTest

sp	StringProp1_1 -> StringProp1_1a
ip	1000 -> 1001
pp	0 point(s) deleted, 0 new point(s) added, 1 point(s) moved

Tests run: 4, Failures: 0, Errors: 0, Skipped: 0, Time elapsed: 4.857 sec - in org.locationtech.geogig.plumbing.DiffFeatureTest
Running org.locationtech.geogig.test.integration.repository.IndexTest
left : Tree[c932cbd11ec75bcc145e2a362a3199bb85eb3abc; size=7; subtrees=2, buckets=0, features=0]
	[BoundedTreeNode[buildings -> a400000000000000000000000000000000000000], BoundedTreeNode[roads -> ff488999ad51848c7850ffd4d12568a3125172b0]]
	[]
right: Tree[8996d6e4437a8d8ea41ffc1f32cfaab9bf9de384; size=5; subtrees=1, buckets=0, features=0]
	[BoundedTreeNode[roads -> 72e2f547f3adc30edd55733abb885e8e6de1f1a4]]
	[]
Tests run: 2, Failures: 0, Errors: 0, Skipped: 0, Time elapsed: 4.819 sec - in org.locationtech.geogig.plumbing.ResolveRepositoryNameTest
Running org.locationtech.geogig.test.integration.CloneOpTest
Tests run: 4, Failures: 0, Errors: 0, Skipped: 0, Time elapsed: 1.55 sec - in org.locationtech.geogig.test.integration.StatusOpTest
Running org.locationtech.geogig.test.integration.FetchOpTest
Tests run: 5, Failures: 0, Errors: 0, Skipped: 0, Time elapsed: 5.44 sec - in org.locationtech.geogig.plumbing.UpdateRefTest
Running org.locationtech.geogig.test.integration.BranchDeleteOpTest
Tests run: 2, Failures: 0, Errors: 0, Skipped: 0, Time elapsed: 7.115 sec - in org.locationtech.geogig.plumbing.CheckRefFormatTest
Running org.locationtech.geogig.test.integration.ConflictsReadWriteOpTest
Tests run: 1, Failures: 0, Errors: 0, Skipped: 0, Time elapsed: 0.16 sec - in org.locationtech.geogig.test.integration.ConflictsReadWriteOpTest
Running org.locationtech.geogig.test.integration.CommitOpTest
Tests run: 1, Failures: 0, Errors: 0, Skipped: 0, Time elapsed: 7.409 sec - in org.locationtech.geogig.plumbing.merge.MergeFeaturesOpTest
Running org.locationtech.geogig.test.integration.RemoteListOpTest
Tests run: 7, Failures: 0, Errors: 0, Skipped: 0, Time elapsed: 7.708 sec - in org.locationtech.geogig.plumbing.diff.PostOrderDiffWalkTest
Running org.locationtech.geogig.test.integration.PushOpTest
Tests run: 5, Failures: 0, Errors: 0, Skipped: 0, Time elapsed: 5.57 sec - in org.locationtech.geogig.plumbing.UpdateSymRefTest
Running org.locationtech.geogig.test.integration.CheckoutOpTest
Tests run: 8, Failures: 0, Errors: 0, Skipped: 0, Time elapsed: 7.831 sec - in org.locationtech.geogig.plumbing.diff.PatchSerializationTest
Running org.locationtech.geogig.test.integration.CleanRefsOpTest
Tests run: 1, Failures: 0, Errors: 0, Skipped: 0, Time elapsed: 0.152 sec - in org.locationtech.geogig.test.integration.CleanRefsOpTest
Running org.locationtech.geogig.test.integration.LogOpTest
Tests run: 4, Failures: 0, Errors: 0, Skipped: 0, Time elapsed: 0.784 sec - in org.locationtech.geogig.test.integration.RemoteListOpTest
Running org.locationtech.geogig.test.integration.RevertOpTest
Tests run: 5, Failures: 0, Errors: 0, Skipped: 0, Time elapsed: 1.172 sec - in org.locationtech.geogig.test.integration.BranchDeleteOpTest
Running org.locationtech.geogig.test.integration.BranchListOpTest
Tests run: 3, Failures: 0, Errors: 0, Skipped: 0, Time elapsed: 8.307 sec - in org.locationtech.geogig.plumbing.CatObjectTest
Running org.locationtech.geogig.test.integration.GeogigAPITest
Tests run: 5, Failures: 0, Errors: 0, Skipped: 0, Time elapsed: 8.628 sec - in org.locationtech.geogig.plumbing.ResolveFeatureTypeTest
Excaption caught executing task: 
java.lang.IllegalStateException: java.lang.IllegalStateException: Object NodeRef[Points/Points.1 -> a47ca38e5c3e92c94dec9e8ea597c642003ec878] not found.
	at sun.reflect.NativeConstructorAccessorImpl.newInstance0(Native Method)
	at sun.reflect.NativeConstructorAccessorImpl.newInstance(NativeConstructorAccessorImpl.java:62)
	at sun.reflect.DelegatingConstructorAccessorImpl.newInstance(DelegatingConstructorAccessorImpl.java:45)
	at java.lang.reflect.Constructor.newInstance(Constructor.java:423)
	at java.util.concurrent.ForkJoinTask.getThrowableException(ForkJoinTask.java:593)
	at java.util.concurrent.ForkJoinTask.reportException(ForkJoinTask.java:677)
	at java.util.concurrent.ForkJoinTask.join(ForkJoinTask.java:720)
	at java.util.concurrent.ForkJoinPool.invoke(ForkJoinPool.java:2616)
	at org.locationtech.geogig.plumbing.diff.PreOrderDiffWalk.walk(PreOrderDiffWalk.java:304)
	at org.locationtech.geogig.plumbing.WalkGraphOp._call(WalkGraphOp.java:154)
	at org.locationtech.geogig.plumbing.WalkGraphOp._call(WalkGraphOp.java:33)
	at org.locationtech.geogig.repository.AbstractGeoGigOp.call(AbstractGeoGigOp.java:153)
	at org.locationtech.geogig.plumbing.WalkGraphOpTest.testObjectDoesNotExist(WalkGraphOpTest.java:179)
	at sun.reflect.NativeMethodAccessorImpl.invoke0(Native Method)
	at sun.reflect.NativeMethodAccessorImpl.invoke(NativeMethodAccessorImpl.java:62)
	at sun.reflect.DelegatingMethodAccessorImpl.invoke(DelegatingMethodAccessorImpl.java:43)
	at java.lang.reflect.Method.invoke(Method.java:498)
	at org.junit.runners.model.FrameworkMethod$1.runReflectiveCall(FrameworkMethod.java:50)
	at org.junit.internal.runners.model.ReflectiveCallable.run(ReflectiveCallable.java:12)
	at org.junit.runners.model.FrameworkMethod.invokeExplosively(FrameworkMethod.java:47)
	at org.junit.internal.runners.statements.InvokeMethod.evaluate(InvokeMethod.java:17)
	at org.junit.internal.runners.statements.RunBefores.evaluate(RunBefores.java:26)
	at org.junit.internal.runners.statements.RunAfters.evaluate(RunAfters.java:27)
	at org.junit.rules.ExpectedException$ExpectedExceptionStatement.evaluate(ExpectedException.java:239)
	at org.junit.rules.ExternalResource$1.evaluate(ExternalResource.java:48)
	at org.junit.rules.RunRules.evaluate(RunRules.java:20)
	at org.junit.runners.ParentRunner.runLeaf(ParentRunner.java:325)
	at org.junit.runners.BlockJUnit4ClassRunner.runChild(BlockJUnit4ClassRunner.java:78)
	at org.junit.runners.BlockJUnit4ClassRunner.runChild(BlockJUnit4ClassRunner.java:57)
	at org.junit.runners.ParentRunner$3.run(ParentRunner.java:290)
	at org.junit.runners.ParentRunner$1.schedule(ParentRunner.java:71)
	at org.junit.runners.ParentRunner.runChildren(ParentRunner.java:288)
	at org.junit.runners.ParentRunner.access$000(ParentRunner.java:58)
	at org.junit.runners.ParentRunner$2.evaluate(ParentRunner.java:268)
	at org.junit.runners.ParentRunner.run(ParentRunner.java:363)
	at org.apache.maven.surefire.junit4.JUnit4Provider.execute(JUnit4Provider.java:264)
	at org.apache.maven.surefire.junit4.JUnit4Provider.executeTestSet(JUnit4Provider.java:153)
	at org.apache.maven.surefire.junit4.JUnit4Provider.invoke(JUnit4Provider.java:124)
	at org.apache.maven.surefire.booter.ForkedBooter.invokeProviderInSameClassLoader(ForkedBooter.java:200)
	at org.apache.maven.surefire.booter.ForkedBooter.runSuitesInProcess(ForkedBooter.java:153)
	at org.apache.maven.surefire.booter.ForkedBooter.main(ForkedBooter.java:103)
Caused by: java.lang.IllegalStateException: Object NodeRef[Points/Points.1 -> a47ca38e5c3e92c94dec9e8ea597c642003ec878] not found.
	at org.locationtech.geogig.plumbing.WalkGraphOp$1.checkExists(WalkGraphOp.java:149)
	at org.locationtech.geogig.plumbing.WalkGraphOp$1.feature(WalkGraphOp.java:122)
	at org.locationtech.geogig.plumbing.diff.PreOrderDiffWalk$CancellableConsumer.feature(PreOrderDiffWalk.java:1277)
	at org.locationtech.geogig.plumbing.diff.PreOrderDiffWalk$WalkAction.node(PreOrderDiffWalk.java:601)
	at org.locationtech.geogig.plumbing.diff.PreOrderDiffWalk$TraverseLeafLeaf.compute(PreOrderDiffWalk.java:804)
	at org.locationtech.geogig.plumbing.diff.PreOrderDiffWalk$TraverseTreeContents.compute(PreOrderDiffWalk.java:710)
	at org.locationtech.geogig.plumbing.diff.PreOrderDiffWalk$TraverseTree.compute(PreOrderDiffWalk.java:666)
	at java.util.concurrent.RecursiveAction.exec(RecursiveAction.java:189)
	at java.util.concurrent.ForkJoinTask.doExec(ForkJoinTask.java:289)
	at java.util.concurrent.ForkJoinTask.doInvoke(ForkJoinTask.java:401)
	at java.util.concurrent.ForkJoinTask.invokeAll(ForkJoinTask.java:843)
	at org.locationtech.geogig.plumbing.diff.PreOrderDiffWalk$TraverseLeafLeaf.compute(PreOrderDiffWalk.java:811)
	at org.locationtech.geogig.plumbing.diff.PreOrderDiffWalk$TraverseTreeContents.compute(PreOrderDiffWalk.java:710)
	at org.locationtech.geogig.plumbing.diff.PreOrderDiffWalk$TraverseTree.compute(PreOrderDiffWalk.java:666)
	at java.util.concurrent.RecursiveAction.exec(RecursiveAction.java:189)
	at java.util.concurrent.ForkJoinTask.doExec(ForkJoinTask.java:289)
	at java.util.concurrent.ForkJoinPool$WorkQueue.runTask(ForkJoinPool.java:1056)
	at java.util.concurrent.ForkJoinPool.runWorker(ForkJoinPool.java:1692)
	at java.util.concurrent.ForkJoinWorkerThread.run(ForkJoinWorkerThread.java:157)
Running org.locationtech.geogig.test.integration.HooksTest
Tests run: 7, Failures: 0, Errors: 0, Skipped: 0, Time elapsed: 6.849 sec - in org.locationtech.geogig.plumbing.WalkGraphOpTest
Running org.locationtech.geogig.test.integration.CheckSparsePathTest
Tests run: 6, Failures: 0, Errors: 0, Skipped: 0, Time elapsed: 5.463 sec - in org.locationtech.geogig.test.integration.BlameOpTest
Running org.locationtech.geogig.test.integration.CreatePatchOpTest
Tests run: 15, Failures: 0, Errors: 0, Skipped: 0, Time elapsed: 9.08 sec - in org.locationtech.geogig.plumbing.WriteTree2Test
Running org.locationtech.geogig.test.integration.RemoteRemoveOpTest
Tests run: 7, Failures: 0, Errors: 0, Skipped: 0, Time elapsed: 9.026 sec - in org.locationtech.geogig.plumbing.HashObjectTest
Running org.locationtech.geogig.test.integration.SquashOpTest
Tests run: 3, Failures: 0, Errors: 0, Skipped: 0, Time elapsed: 6.442 sec - in org.locationtech.geogig.test.integration.RebuildGraphOpTest
Running org.locationtech.geogig.test.integration.ConfigOpTest
Tests run: 3, Failures: 0, Errors: 0, Skipped: 0, Time elapsed: 1.347 sec - in org.locationtech.geogig.test.integration.GeogigAPITest
Running org.locationtech.geogig.test.integration.RemoteAddOpTest
Tests run: 9, Failures: 0, Errors: 0, Skipped: 0, Time elapsed: 10.03 sec - in org.locationtech.geogig.plumbing.diff.DiffCountConsumerTest
Running org.locationtech.geogig.test.integration.ApplyPatchOpTest
Tests run: 8, Failures: 0, Errors: 0, Skipped: 0, Time elapsed: 1.023 sec - in org.locationtech.geogig.test.integration.RemoteRemoveOpTest
Running org.locationtech.geogig.test.integration.TagTest
Tests run: 20, Failures: 0, Errors: 0, Skipped: 0, Time elapsed: 4.129 sec - in org.locationtech.geogig.test.integration.repository.WorkingTreeTest
Running org.locationtech.geogig.test.integration.RemoveOpTest
Tests run: 9, Failures: 0, Errors: 0, Skipped: 0, Time elapsed: 4.248 sec - in org.locationtech.geogig.test.integration.repository.IndexTest
Running org.locationtech.geogig.test.integration.PullOpTest
Tests run: 10, Failures: 0, Errors: 0, Skipped: 0, Time elapsed: 0.979 sec - in org.locationtech.geogig.test.integration.RemoteAddOpTest
Tests run: 11, Failures: 0, Errors: 0, Skipped: 0, Time elapsed: 6.437 sec - in org.locationtech.geogig.test.integration.BranchCreateOpTest
Tests run: 2, Failures: 0, Errors: 0, Skipped: 0, Time elapsed: 2.402 sec - in org.locationtech.geogig.test.integration.CheckSparsePathTest
Running org.locationtech.geogig.test.integration.CleanOpTest
Running org.locationtech.geogig.test.integration.FindCommonAncestorTest
Tests run: 8, Failures: 0, Errors: 0, Skipped: 0, Time elapsed: 2.621 sec - in org.locationtech.geogig.test.integration.CreatePatchOpTest
Running org.locationtech.geogig.test.integration.RebaseOpTest
Running org.locationtech.geogig.test.integration.MergeOpTest
Tests run: 3, Failures: 0, Errors: 0, Skipped: 0, Time elapsed: 0.57 sec - in org.locationtech.geogig.test.integration.CleanOpTest
Tests run: 2, Failures: 0, Errors: 0, Skipped: 0, Time elapsed: 3.475 sec - in org.locationtech.geogig.test.integration.BranchListOpTest
Running org.locationtech.geogig.test.integration.GeogigTransactionTest
Running org.locationtech.geogig.test.integration.RevParseIntegrationTest
Tests run: 3, Failures: 0, Errors: 0, Skipped: 0, Time elapsed: 1.695 sec - in org.locationtech.geogig.test.integration.TagTest
Running org.locationtech.geogig.test.integration.LsTreeOpTest
Tests run: 8, Failures: 0, Errors: 0, Skipped: 0, Time elapsed: 11.912 sec - in org.locationtech.geogig.plumbing.RevParseTest
testMergeNoCommits
Running org.locationtech.geogig.test.integration.DiffOpTest
testOctopusMerge
[main] INFO org.locationtech.geogig.hooks.Scripting - Running jvm script /mnt/memtmp/geogig/junit9103656168007006837/repo-1925886759/.geogig/hooks/pre_commit.js
[main] INFO org.locationtech.geogig.hooks.Scripting - Running jvm script /mnt/memtmp/geogig/junit9103656168007006837/repo-1925886759/.geogig/hooks/pre_commit.js
Tests run: 7, Failures: 0, Errors: 0, Skipped: 0, Time elapsed: 1.524 sec - in org.locationtech.geogig.test.integration.RevParseIntegrationTest
Running org.locationtech.geogig.test.integration.SparseCloneTest
Tests run: 21, Failures: 0, Errors: 0, Skipped: 0, Time elapsed: 3.746 sec - in org.locationtech.geogig.test.integration.ConfigOpTest
Running org.locationtech.geogig.test.integration.ResetOpTest
Tests run: 15, Failures: 0, Errors: 0, Skipped: 0, Time elapsed: 5.249 sec - in org.locationtech.geogig.test.integration.RevertOpTest
Running org.locationtech.geogig.test.integration.BranchRenameOpTest
testMergeTwice
[main] INFO org.locationtech.geogig.hooks.Scripting - Running jvm script /mnt/memtmp/geogig/junit599264862297299709/repo-1494800030/.geogig/hooks/post_commit.js
[main] WARN org.locationtech.geogig.hooks.CommandHookChain - Post-command hook org.locationtech.geogig.hooks.JVMScriptHook@51b01960 for command org.locationtech.geogig.porcelain.CommitOp threw an exception that will not be propagated
java.lang.NullPointerException
	at org.locationtech.geogig.hooks.Scripting.runJVMScript(Scripting.java:93)
	at org.locationtech.geogig.hooks.JVMScriptHook.post(JVMScriptHook.java:52)
	at org.locationtech.geogig.hooks.CommandHookChain.runPostHooks(CommandHookChain.java:65)
	at org.locationtech.geogig.hooks.CommandHooksDecorator$HooksListener.postCall(CommandHooksDecorator.java:60)
	at org.locationtech.geogig.repository.AbstractGeoGigOp.notifyPost(AbstractGeoGigOp.java:178)
	at org.locationtech.geogig.repository.AbstractGeoGigOp.call(AbstractGeoGigOp.java:154)
	at org.locationtech.geogig.test.integration.HooksTest.testFailingPostPostProcessHook(HooksTest.java:148)
	at sun.reflect.NativeMethodAccessorImpl.invoke0(Native Method)
	at sun.reflect.NativeMethodAccessorImpl.invoke(NativeMethodAccessorImpl.java:62)
	at sun.reflect.DelegatingMethodAccessorImpl.invoke(DelegatingMethodAccessorImpl.java:43)
	at java.lang.reflect.Method.invoke(Method.java:498)
	at org.junit.runners.model.FrameworkMethod$1.runReflectiveCall(FrameworkMethod.java:50)
	at org.junit.internal.runners.model.ReflectiveCallable.run(ReflectiveCallable.java:12)
	at org.junit.runners.model.FrameworkMethod.invokeExplosively(FrameworkMethod.java:47)
	at org.junit.internal.runners.statements.InvokeMethod.evaluate(InvokeMethod.java:17)
	at org.junit.internal.runners.statements.RunBefores.evaluate(RunBefores.java:26)
	at org.junit.internal.runners.statements.RunAfters.evaluate(RunAfters.java:27)
	at org.junit.rules.ExternalResource$1.evaluate(ExternalResource.java:48)
	at org.junit.rules.RunRules.evaluate(RunRules.java:20)
	at org.junit.runners.ParentRunner.runLeaf(ParentRunner.java:325)
	at org.junit.runners.BlockJUnit4ClassRunner.runChild(BlockJUnit4ClassRunner.java:78)
	at org.junit.runners.BlockJUnit4ClassRunner.runChild(BlockJUnit4ClassRunner.java:57)
	at org.junit.runners.ParentRunner$3.run(ParentRunner.java:290)
	at org.junit.runners.ParentRunner$1.schedule(ParentRunner.java:71)
	at org.junit.runners.ParentRunner.runChildren(ParentRunner.java:288)
	at org.junit.runners.ParentRunner.access$000(ParentRunner.java:58)
	at org.junit.runners.ParentRunner$2.evaluate(ParentRunner.java:268)
	at org.junit.runners.ParentRunner.run(ParentRunner.java:363)
	at org.apache.maven.surefire.junit4.JUnit4Provider.execute(JUnit4Provider.java:264)
	at org.apache.maven.surefire.junit4.JUnit4Provider.executeTestSet(JUnit4Provider.java:153)
	at org.apache.maven.surefire.junit4.JUnit4Provider.invoke(JUnit4Provider.java:124)
	at org.apache.maven.surefire.booter.ForkedBooter.invokeProviderInSameClassLoader(ForkedBooter.java:200)
	at org.apache.maven.surefire.booter.ForkedBooter.runSuitesInProcess(ForkedBooter.java:153)
	at org.apache.maven.surefire.booter.ForkedBooter.main(ForkedBooter.java:103)
[main] WARN org.locationtech.geogig.hooks.CommandHookChain - Post-command hook org.locationtech.geogig.test.integration.HooksTest$ClasspathHookTest@6a1ebcff for command org.locationtech.geogig.porcelain.AddOp threw an exception that will not be propagated
java.lang.RuntimeException: expected
	at org.locationtech.geogig.test.integration.HooksTest$ClasspathHookTest.post(HooksTest.java:266)
	at org.locationtech.geogig.hooks.CommandHookChain.runPostHooks(CommandHookChain.java:65)
	at org.locationtech.geogig.hooks.CommandHooksDecorator$HooksListener.postCall(CommandHooksDecorator.java:60)
	at org.locationtech.geogig.repository.AbstractGeoGigOp.notifyPost(AbstractGeoGigOp.java:178)
	at org.locationtech.geogig.repository.AbstractGeoGigOp.call(AbstractGeoGigOp.java:154)
	at org.locationtech.geogig.test.integration.RepositoryTestCase.insertAndAdd(RepositoryTestCase.java:367)
	at org.locationtech.geogig.test.integration.RepositoryTestCase.insertAndAdd(RepositoryTestCase.java:355)
	at org.locationtech.geogig.test.integration.HooksTest.testClasspathHookPostFail(HooksTest.java:191)
	at sun.reflect.NativeMethodAccessorImpl.invoke0(Native Method)
	at sun.reflect.NativeMethodAccessorImpl.invoke(NativeMethodAccessorImpl.java:62)
	at sun.reflect.DelegatingMethodAccessorImpl.invoke(DelegatingMethodAccessorImpl.java:43)
	at java.lang.reflect.Method.invoke(Method.java:498)
	at org.junit.runners.model.FrameworkMethod$1.runReflectiveCall(FrameworkMethod.java:50)
	at org.junit.internal.runners.model.ReflectiveCallable.run(ReflectiveCallable.java:12)
	at org.junit.runners.model.FrameworkMethod.invokeExplosively(FrameworkMethod.java:47)
	at org.junit.internal.runners.statements.InvokeMethod.evaluate(InvokeMethod.java:17)
	at org.junit.internal.runners.statements.RunBefores.evaluate(RunBefores.java:26)
	at org.junit.internal.runners.statements.RunAfters.evaluate(RunAfters.java:27)
	at org.junit.rules.ExternalResource$1.evaluate(ExternalResource.java:48)
	at org.junit.rules.RunRules.evaluate(RunRules.java:20)
	at org.junit.runners.ParentRunner.runLeaf(ParentRunner.java:325)
	at org.junit.runners.BlockJUnit4ClassRunner.runChild(BlockJUnit4ClassRunner.java:78)
	at org.junit.runners.BlockJUnit4ClassRunner.runChild(BlockJUnit4ClassRunner.java:57)
	at org.junit.runners.ParentRunner$3.run(ParentRunner.java:290)
	at org.junit.runners.ParentRunner$1.schedule(ParentRunner.java:71)
	at org.junit.runners.ParentRunner.runChildren(ParentRunner.java:288)
	at org.junit.runners.ParentRunner.access$000(ParentRunner.java:58)
	at org.junit.runners.ParentRunner$2.evaluate(ParentRunner.java:268)
	at org.junit.runners.ParentRunner.run(ParentRunner.java:363)
	at org.apache.maven.surefire.junit4.JUnit4Provider.execute(JUnit4Provider.java:264)
	at org.apache.maven.surefire.junit4.JUnit4Provider.executeTestSet(JUnit4Provider.java:153)
	at org.apache.maven.surefire.junit4.JUnit4Provider.invoke(JUnit4Provider.java:124)
	at org.apache.maven.surefire.booter.ForkedBooter.invokeProviderInSameClassLoader(ForkedBooter.java:200)
	at org.apache.maven.surefire.booter.ForkedBooter.runSuitesInProcess(ForkedBooter.java:153)
	at org.apache.maven.surefire.booter.ForkedBooter.main(ForkedBooter.java:103)
testNoFastForwardSpecifyAuthor
Tests run: 10, Failures: 0, Errors: 0, Skipped: 1, Time elapsed: 4.24 sec - in org.locationtech.geogig.test.integration.RemoveOpTest
Running org.locationtech.geogig.test.integration.ReportCommitConflictsOpTest
Tests run: 17, Failures: 0, Errors: 0, Skipped: 0, Time elapsed: 6.867 sec - in org.locationtech.geogig.test.integration.LogOpTest
Running org.locationtech.geogig.test.integration.AddOpTest
Tests run: 11, Failures: 0, Errors: 0, Skipped: 0, Time elapsed: 15.004 sec - in org.locationtech.geogig.plumbing.DiffTreeTest
Running org.locationtech.geogig.test.integration.ReportMergeConflictsOpTest
[main] INFO org.locationtech.geogig.hooks.Scripting - Running shell script /mnt/memtmp/geogig/junit8332513813199596457/repo1939900567/.geogig/hooks/pre_commit.bat
Tests run: 8, Failures: 0, Errors: 0, Skipped: 0, Time elapsed: 1.538 sec - in org.locationtech.geogig.test.integration.BranchRenameOpTest
Running org.locationtech.geogig.test.integration.CherryPickOpTest
[main] INFO org.locationtech.geogig.hooks.Scripting - Running shell script /mnt/memtmp/geogig/junit8332513813199596457/repo1939900567/.geogig/hooks/pre_commit.bat
testBothBranchesSameGeometryChange
[main] INFO org.locationtech.geogig.plumbing.SendPack - Pushing Ref[refs/heads/master -> a3ad4dd3b550a1215e3001faf8071e3448956105] to refs/remotes/origin/NewRemoteBranch(NewRemoteBranch)
[main] INFO org.locationtech.geogig.plumbing.SendPack - Pushing Ref[refs/heads/Branch1 -> 43a3e480cf2de155a4a8a7b4a9030df9a23ab671] to refs/remotes/origin/NewRemoteBranch2(NewRemoteBranch2)
Tests run: 8, Failures: 0, Errors: 0, Skipped: 0, Time elapsed: 8.468 sec - in org.locationtech.geogig.test.integration.CloneOpTest
Running org.locationtech.geogig.test.performance.HeapGraphDatabaseStressTest
[main] INFO org.locationtech.geogig.test.performance.EnablePerformanceTestRule - org.locationtech.geogig.test.performance.HeapGraphDatabaseStressTest ignored, run with -Dgeogig.runPerformanceTests=true to enable it.
Tests run: 0, Failures: 0, Errors: 0, Skipped: 0, Time elapsed: 0.02 sec - in org.locationtech.geogig.test.performance.HeapGraphDatabaseStressTest
Running org.locationtech.geogig.test.performance.LogOpPerformanceTest
[main] INFO org.locationtech.geogig.test.performance.EnablePerformanceTestRule - org.locationtech.geogig.test.performance.LogOpPerformanceTest ignored, run with -Dgeogig.runPerformanceTests=true to enable it.
Tests run: 0, Failures: 0, Errors: 0, Skipped: 0, Time elapsed: 0 sec - in org.locationtech.geogig.test.performance.LogOpPerformanceTest
Running org.locationtech.geogig.test.performance.RevTreeBuilderPerformanceTest
[main] INFO org.locationtech.geogig.test.performance.EnablePerformanceTestRule - org.locationtech.geogig.test.performance.RevTreeBuilderPerformanceTest ignored, run with -Dgeogig.runPerformanceTests=true to enable it.
Tests run: 0, Failures: 0, Errors: 0, Skipped: 0, Time elapsed: 0.011 sec - in org.locationtech.geogig.test.performance.RevTreeBuilderPerformanceTest
Running org.locationtech.geogig.model.impl.CanonicalTreeBuilderTest
[main] INFO org.locationtech.geogig.hooks.Scripting - Running jvm script /mnt/memtmp/geogig/junit4200435032210093910/repo479027898/.geogig/hooks/pre_commit.js
Tests run: 5, Failures: 0, Errors: 0, Skipped: 0, Time elapsed: 4.522 sec - in org.locationtech.geogig.test.integration.FindCommonAncestorTest
Running org.locationtech.geogig.model.impl.RevFeatureTest
Tests run: 7, Failures: 0, Errors: 0, Skipped: 0, Time elapsed: 7.061 sec - in org.locationtech.geogig.test.integration.HooksTest
Running org.locationtech.geogig.model.impl.RevPersonTest
Tests run: 3, Failures: 0, Errors: 0, Skipped: 0, Time elapsed: 0.003 sec - in org.locationtech.geogig.model.impl.RevPersonTest
Running org.locationtech.geogig.model.impl.RevCommitImplTest
Tests run: 2, Failures: 0, Errors: 0, Skipped: 0, Time elapsed: 0.013 sec - in org.locationtech.geogig.model.impl.RevFeatureTest
Running org.locationtech.geogig.model.impl.CommitBuilderTest
Tests run: 2, Failures: 0, Errors: 0, Skipped: 0, Time elapsed: 0.041 sec - in org.locationtech.geogig.model.impl.RevCommitImplTest
Running org.locationtech.geogig.model.impl.RevFeatureTypeTest
Tests run: 6, Failures: 0, Errors: 0, Skipped: 0, Time elapsed: 0.045 sec - in org.locationtech.geogig.model.impl.CommitBuilderTest
Running org.locationtech.geogig.model.impl.LegacyTreeBuilderTest
testMergeFastForwardSecondCase
Tests run: 21, Failures: 0, Errors: 0, Skipped: 0, Time elapsed: 4.045 sec - in org.locationtech.geogig.test.integration.DiffOpTest
Running org.locationtech.geogig.model.internal.DAGNodeTest
Tests run: 26, Failures: 0, Errors: 0, Skipped: 0, Time elapsed: 8.664 sec - in org.locationtech.geogig.test.integration.CommitOpTest
Running org.locationtech.geogig.model.internal.CanonicalClusteringStrategyHeapStorageTest
testOctopusMergeWithAutomerge
Tests run: 12, Failures: 0, Errors: 0, Skipped: 0, Time elapsed: 4.523 sec - in org.locationtech.geogig.test.integration.RebaseOpTest
[main] INFO org.locationtech.geogig.plumbing.SendPack - Pushing Ref[refs/heads/master -> d13557ae0d974dbbc25eb1e98414ea3a2455cc3c] to refs/remotes/origin/refs/heads/master(refs/heads/master)
Tests run: 2, Failures: 0, Errors: 0, Skipped: 0, Time elapsed: 0.278 sec - in org.locationtech.geogig.model.impl.RevFeatureTypeTest
Running org.locationtech.geogig.model.internal.QuadTreeBuilderTest
Tests run: 1, Failures: 0, Errors: 0, Skipped: 1, Time elapsed: 0 sec - in org.locationtech.geogig.model.internal.QuadTreeBuilderTest
Running org.locationtech.geogig.model.internal.CanonicalClusteringStrategyRocksdbStorageTest
Running org.locationtech.geogig.storage.datastream.DataStreamV2CommitSerializationTest
Tests run: 21, Failures: 0, Errors: 0, Skipped: 0, Time elapsed: 8.499 sec - in org.locationtech.geogig.test.integration.CheckoutOpTest
Running org.locationtech.geogig.storage.datastream.DataStreamFeatureV2_1SerializationTest
Tests run: 8, Failures: 0, Errors: 0, Skipped: 0, Time elapsed: 0.042 sec - in org.locationtech.geogig.storage.datastream.DataStreamV2CommitSerializationTest
Running org.locationtech.geogig.storage.datastream.DataStreamFeatureSerializationTest
Tests run: 10, Failures: 0, Errors: 0, Skipped: 0, Time elapsed: 4.415 sec - in org.locationtech.geogig.test.integration.LsTreeOpTest
Running org.locationtech.geogig.storage.datastream.DataStreamRevTreeSerializationTest
Tests run: 7, Failures: 0, Errors: 0, Skipped: 0, Time elapsed: 0.074 sec - in org.locationtech.geogig.storage.datastream.DataStreamRevTreeSerializationTest
Running org.locationtech.geogig.storage.datastream.VarintTest
Tests run: 4, Failures: 0, Errors: 0, Skipped: 0, Time elapsed: 0.004 sec - in org.locationtech.geogig.storage.datastream.VarintTest
Running org.locationtech.geogig.storage.datastream.DataStreamCommitSerializationTest
Tests run: 8, Failures: 0, Errors: 0, Skipped: 0, Time elapsed: 0.013 sec - in org.locationtech.geogig.storage.datastream.DataStreamCommitSerializationTest
[main] INFO org.locationtech.geogig.plumbing.SendPack - Pushing Ref[refs/heads/master -> a3ad4dd3b550a1215e3001faf8071e3448956105] to refs/remotes/origin/NewRemoteBranch(NewRemoteBranch)
Running org.locationtech.geogig.storage.datastream.DataStreamFeatureV2SerializationTest
Tests run: 15, Failures: 0, Errors: 0, Skipped: 0, Time elapsed: 4.715 sec - in org.locationtech.geogig.test.integration.GeogigTransactionTest
Running org.locationtech.geogig.storage.datastream.DataStreamV2RevTreeSerializationTest
testConflictingMergeInterceptor
Tests run: 10, Failures: 0, Errors: 0, Skipped: 0, Time elapsed: 1.916 sec - in org.locationtech.geogig.test.integration.ReportCommitConflictsOpTest
Running org.locationtech.geogig.storage.impl.INIBlobTest
Tests run: 3, Failures: 0, Errors: 0, Skipped: 0, Time elapsed: 0.385 sec - in org.locationtech.geogig.storage.datastream.DataStreamFeatureV2_1SerializationTest
Tests run: 3, Failures: 0, Errors: 0, Skipped: 0, Time elapsed: 0.136 sec - in org.locationtech.geogig.storage.datastream.DataStreamFeatureV2SerializationTest
Running org.locationtech.geogig.storage.memory.HeapRefDatabaseTest
Tests run: 1, Failures: 0, Errors: 0, Skipped: 0, Time elapsed: 0.031 sec - in org.locationtech.geogig.storage.impl.INIBlobTest
Running org.locationtech.geogig.storage.memory.HeapConflictsDatabaseConformanceTest
Running org.locationtech.geogig.storage.impl.PersistedIterableTest
Tests run: 11, Failures: 0, Errors: 0, Skipped: 0, Time elapsed: 0.059 sec - in org.locationtech.geogig.storage.memory.HeapRefDatabaseTest
Tests run: 7, Failures: 0, Errors: 0, Skipped: 1, Time elapsed: 1.56 sec - in org.locationtech.geogig.test.integration.CherryPickOpTest
Running org.locationtech.geogig.storage.memory.HeapObjectStoreConformanceTest
Running org.locationtech.geogig.storage.memory.HeapBlobStoreTest
Tests run: 7, Failures: 0, Errors: 0, Skipped: 0, Time elapsed: 0.144 sec - in org.locationtech.geogig.storage.datastream.DataStreamV2RevTreeSerializationTest
Running org.locationtech.geogig.storage.memory.HeapGraphDatabaseTest
Tests run: 7, Failures: 0, Errors: 0, Skipped: 0, Time elapsed: 0.008 sec - in org.locationtech.geogig.storage.memory.HeapBlobStoreTest
Running org.locationtech.geogig.storage.text.RevFeatureTypeTextSerializationTest
Tests run: 3, Failures: 0, Errors: 0, Skipped: 0, Time elapsed: 0.485 sec - in org.locationtech.geogig.storage.datastream.DataStreamFeatureSerializationTest
Tests run: 2, Failures: 0, Errors: 0, Skipped: 0, Time elapsed: 0.079 sec - in org.locationtech.geogig.storage.impl.PersistedIterableTest
Tests run: 4, Failures: 0, Errors: 0, Skipped: 0, Time elapsed: 0.77 sec - in org.locationtech.geogig.model.internal.DAGNodeTest
Running org.locationtech.geogig.storage.text.RevTreeTextSerialiationTest
Running org.locationtech.geogig.storage.text.RevFeatureTextSerializationTest
Tests run: 10, Failures: 0, Errors: 0, Skipped: 0, Time elapsed: 0.111 sec - in org.locationtech.geogig.storage.memory.HeapGraphDatabaseTest
Running org.locationtech.geogig.storage.fs.IniFileConfigDatabaseTest
Tests run: 2, Failures: 0, Errors: 0, Skipped: 0, Time elapsed: 0.126 sec - in org.locationtech.geogig.storage.text.RevFeatureTypeTextSerializationTest
Running org.locationtech.geogig.storage.fs.FileRefDatabaseTest
Tests run: 7, Failures: 0, Errors: 0, Skipped: 0, Time elapsed: 0.074 sec - in org.locationtech.geogig.storage.text.RevTreeTextSerialiationTest
Running org.locationtech.geogig.storage.fs.FileBlobStoreTest
Running org.locationtech.geogig.storage.text.RevCommitTextSerializationTest
testMerge
Tests run: 11, Failures: 0, Errors: 0, Skipped: 0, Time elapsed: 0.142 sec - in org.locationtech.geogig.storage.fs.FileRefDatabaseTest
Running org.locationtech.geogig.storage.fs.FileConflictsDatabaseConformanceTest
Tests run: 9, Failures: 0, Errors: 0, Skipped: 0, Time elapsed: 0.077 sec - in org.locationtech.geogig.storage.text.RevCommitTextSerializationTest
Tests run: 12, Failures: 0, Errors: 0, Skipped: 0, Time elapsed: 2.177 sec - in org.locationtech.geogig.test.integration.AddOpTest
Tests run: 7, Failures: 0, Errors: 0, Skipped: 0, Time elapsed: 0.092 sec - in org.locationtech.geogig.storage.fs.FileBlobStoreTest
Running org.locationtech.geogig.repository.impl.RepositoryResolverTest
Tests run: 1, Failures: 0, Errors: 0, Skipped: 0, Time elapsed: 0.002 sec - in org.locationtech.geogig.repository.impl.RepositoryResolverTest
Running org.locationtech.geogig.repository.impl.DepthSearchTest
Tests run: 23, Failures: 0, Errors: 0, Skipped: 0, Time elapsed: 0.321 sec - in org.locationtech.geogig.storage.memory.HeapObjectStoreConformanceTest
Running org.locationtech.geogig.repository.impl.RevFeatureBuilderTest
Running org.locationtech.geogig.di.caching.CachingModuleTest
Running org.locationtech.geogig.porcelain.InitOpTest
Tests run: 14, Failures: 0, Errors: 0, Skipped: 0, Time elapsed: 0.674 sec - in org.locationtech.geogig.storage.memory.HeapConflictsDatabaseConformanceTest
Running org.locationtech.geogig.data.MapToStringConverterFactoryTest
testConflictingOctopusMerge
Tests run: 4, Failures: 0, Errors: 0, Skipped: 0, Time elapsed: 0.332 sec - in org.locationtech.geogig.porcelain.InitOpTest
Tests run: 23, Failures: 0, Errors: 0, Skipped: 0, Time elapsed: 0.554 sec - in org.locationtech.geogig.storage.fs.IniFileConfigDatabaseTest
Running org.locationtech.geogig.data.FeatureBuilderTest
Tests run: 14, Failures: 0, Errors: 0, Skipped: 0, Time elapsed: 8.173 sec - in org.locationtech.geogig.test.integration.SquashOpTest
Running org.locationtech.geogig.data.PrimitiveArrayToStringConverterFactoryTest
Tests run: 5, Failures: 0, Errors: 0, Skipped: 0, Time elapsed: 0.61 sec - in org.locationtech.geogig.storage.text.RevFeatureTextSerializationTest
Tests run: 1, Failures: 0, Errors: 0, Skipped: 0, Time elapsed: 0.113 sec - in org.locationtech.geogig.data.MapToStringConverterFactoryTest
Tests run: 1, Failures: 0, Errors: 0, Skipped: 0, Time elapsed: 0.162 sec - in org.locationtech.geogig.data.FeatureBuilderTest
Tests run: 7, Failures: 0, Errors: 0, Skipped: 0, Time elapsed: 0.222 sec - in org.locationtech.geogig.data.PrimitiveArrayToStringConverterFactoryTest
Tests run: 6, Failures: 0, Errors: 0, Skipped: 0, Time elapsed: 17.757 sec - in org.locationtech.geogig.plumbing.DiffBoundsTest
testFastForwardOnly
Tests run: 8, Failures: 0, Errors: 0, Skipped: 0, Time elapsed: 0.792 sec - in org.locationtech.geogig.repository.impl.RevFeatureBuilderTest
Tests run: 1, Failures: 0, Errors: 0, Skipped: 0, Time elapsed: 0.894 sec - in org.locationtech.geogig.repository.impl.DepthSearchTest
Tests run: 3, Failures: 0, Errors: 0, Skipped: 0, Time elapsed: 0.895 sec - in org.locationtech.geogig.di.caching.CachingModuleTest
testSpecifyAuthor
testOursAndTheirs
Tests run: 13, Failures: 0, Errors: 0, Skipped: 0, Time elapsed: 4.779 sec - in org.locationtech.geogig.test.integration.ResetOpTest
testNoCommitMerge
[main] INFO org.locationtech.geogig.plumbing.SendPack - Pushing Ref[refs/heads/master -> a3ad4dd3b550a1215e3001faf8071e3448956105] to refs/remotes/origin/master(null)
testMergeFastForward
testOctopusMergeSameFeatureChanges
[main] INFO org.locationtech.geogig.plumbing.SendPack - Pushing Ref[refs/heads/master -> b2e392a358773a01efe3ec48a3580362a7fc83d0] to refs/remotes/origin/refs/heads/master(refs/heads/master)
testMergeNullCommit
Removed 32,600 nodes in 763.2 ms
testMergeMultiple
Removed 32,600 nodes in 751.2 ms
[main] INFO org.locationtech.geogig.plumbing.SendPack - Pushing Ref[refs/heads/master -> a3ad4dd3b550a1215e3001faf8071e3448956105] to refs/remotes/origin/master(null)
testMergeConflictingPolygon
[main] INFO org.locationtech.geogig.plumbing.SendPack - Pushing Ref[refs/heads/Branch1 -> e4d10fce0f71850b8e201763343ebde1c71aa5f6] to refs/remotes/origin/Branch1(null)
Added 7,000 nodes in 37.80 ms
testMergeConflictingBranchesTheirs
testMergeWithFeatureMerge
Tests run: 14, Failures: 0, Errors: 0, Skipped: 0, Time elapsed: 2.563 sec - in org.locationtech.geogig.storage.fs.FileConflictsDatabaseConformanceTest
testMergeNoCommitMessage
Tests run: 8, Failures: 0, Errors: 0, Skipped: 0, Time elapsed: 8.432 sec - in org.locationtech.geogig.test.integration.PullOpTest
[main] INFO org.locationtech.geogig.plumbing.SendPack - Pushing Ref[refs/heads/Branch1 -> b9ffcf8d172b8905500e906f2218c55b58cf2c44] to refs/remotes/origin/Branch1(Branch1)
testMergeTwoBranchesWithNewFeatureType
testCancelScenario1
Added 5,000 nodes in 96.37 ms
Added 1,024 nodes in 3.121 ms
Removed 400 nodes in 2.769 ms
Added 7,000 nodes in 304.8 ms
Added 10,000 nodes in 111.9 ms
Tests run: 11, Failures: 0, Errors: 0, Skipped: 0, Time elapsed: 4.301 sec - in org.locationtech.geogig.model.internal.CanonicalClusteringStrategyHeapStorageTest
Tests run: 13, Failures: 0, Errors: 0, Skipped: 0, Time elapsed: 5.377 sec - in org.locationtech.geogig.test.integration.ReportMergeConflictsOpTest
testCancelScenario2
Tests run: 18, Failures: 0, Errors: 0, Skipped: 0, Time elapsed: 10.478 sec - in org.locationtech.geogig.test.integration.ApplyPatchOpTest
testCancelScenario3
testCancelScenario4
Tests run: 15, Failures: 0, Errors: 0, Skipped: 0, Time elapsed: 13.596 sec - in org.locationtech.geogig.test.integration.FetchOpTest
testNoFastForward
[main] INFO org.locationtech.geogig.plumbing.SendPack - Pushing Ref[refs/heads/Branch1 -> b9ffcf8d172b8905500e906f2218c55b58cf2c44] to refs/remotes/origin/Branch1(Branch1)
testMergeConflictingBranches
testMergeConflictingBranchesOurs
Tests run: 30, Failures: 0, Errors: 0, Skipped: 0, Time elapsed: 9.283 sec - in org.locationtech.geogig.test.integration.MergeOpTest
[main] INFO org.locationtech.geogig.plumbing.SendPack - Pushing Ref[refs/heads/master -> a3ad4dd3b550a1215e3001faf8071e3448956105] to refs/remotes/origin/master(null)
[main] INFO org.locationtech.geogig.plumbing.SendPack - Pushing Ref[refs/heads/master -> 32b4e258bf8026e45ba1c2ace4a1f36e15b862a1] to refs/remotes/origin/master(null)
[main] INFO org.locationtech.geogig.plumbing.SendPack - Pushing Ref[refs/heads/master -> a3ad4dd3b550a1215e3001faf8071e3448956105] to refs/remotes/origin/master(null)
Added 5,000 nodes in 59.63 ms
Tests run: 11, Failures: 0, Errors: 0, Skipped: 0, Time elapsed: 13.986 sec - in org.locationtech.geogig.test.integration.PushOpTest
Added 1,024 nodes in 14.70 ms
Removed 400 nodes in 5.411 ms
Tests run: 12, Failures: 0, Errors: 0, Skipped: 0, Time elapsed: 8.378 sec - in org.locationtech.geogig.test.integration.SparseCloneTest
Added 10,000 nodes in 56.08 ms
Tests run: 11, Failures: 0, Errors: 0, Skipped: 0, Time elapsed: 5.853 sec - in org.locationtech.geogig.model.internal.CanonicalClusteringStrategyRocksdbStorageTest
Tests run: 7, Failures: 0, Errors: 0, Skipped: 0, Time elapsed: 27.527 sec - in org.locationtech.geogig.plumbing.diff.DepthTreeIteratorTest
PreOrderDiffWalkTest: walked 524,288 vs 262144 trees in 555.2 ms
PreOrderDiffWalkTest: walked 1,024 vs 512 trees in 60.59 ms
PreOrderDiffWalkTest: walked 16,384 vs 512 trees in 132.4 ms
Tests run: 24, Failures: 0, Errors: 0, Skipped: 0, Time elapsed: 28.92 sec - in org.locationtech.geogig.plumbing.diff.PreOrderDiffWalkTest
Tests run: 13, Failures: 0, Errors: 0, Skipped: 0, Time elapsed: 14.728 sec - in org.locationtech.geogig.model.impl.CanonicalTreeBuilderTest
Tests run: 13, Failures: 0, Errors: 0, Skipped: 0, Time elapsed: 16.202 sec - in org.locationtech.geogig.model.impl.LegacyTreeBuilderTest

Results :

Tests run: 943, Failures: 0, Errors: 0, Skipped: 3

[JENKINS] Recording test results
[INFO] 
[INFO] --- maven-jar-plugin:2.4:jar (default-jar) @ geogig-core ---
[INFO] Building jar: /home/hudson/genie.geogig/.hudson/jobs/geogig-release/workspace/src/core/target/geogig-core-1.0-RC4.jar
[INFO] 
[INFO] --- maven-jar-plugin:2.4:test-jar (default) @ geogig-core ---
[INFO] Building jar: /home/hudson/genie.geogig/.hudson/jobs/geogig-release/workspace/src/core/target/geogig-core-1.0-RC4-tests.jar
[INFO] 
[INFO] >>> maven-source-plugin:2.2.1:jar (attach-sources) > generate-sources @ geogig-core >>>
[INFO] 
[INFO] --- git-commit-id-plugin:2.1.8:revision (default) @ geogig-core ---
[WARNING] Failed to getClass for org.apache.maven.plugin.source.SourceJarMojo
[INFO] 
[INFO] <<< maven-source-plugin:2.2.1:jar (attach-sources) < generate-sources @ geogig-core <<<
[INFO] 
[INFO] --- maven-source-plugin:2.2.1:jar (attach-sources) @ geogig-core ---
[INFO] Building jar: /home/hudson/genie.geogig/.hudson/jobs/geogig-release/workspace/src/core/target/geogig-core-1.0-RC4-sources.jar
[INFO] 
[INFO] >>> maven-source-plugin:2.2.1:test-jar (attach-sources) > generate-sources @ geogig-core >>>
[INFO] 
[INFO] --- git-commit-id-plugin:2.1.8:revision (default) @ geogig-core ---
[WARNING] Failed to getClass for org.apache.maven.plugin.source.TestSourceJarMojo
[INFO] 
[INFO] <<< maven-source-plugin:2.2.1:test-jar (attach-sources) < generate-sources @ geogig-core <<<
[INFO] 
[INFO] --- maven-source-plugin:2.2.1:test-jar (attach-sources) @ geogig-core ---
[INFO] Building jar: /home/hudson/genie.geogig/.hudson/jobs/geogig-release/workspace/src/core/target/geogig-core-1.0-RC4-test-sources.jar
[INFO] 
[INFO] --- maven-install-plugin:2.4:install (default-install) @ geogig-core ---
[INFO] Installing /home/hudson/genie.geogig/.hudson/jobs/geogig-release/workspace/src/core/target/geogig-core-1.0-RC4.jar to /home/hudson/genie.geogig/.hudson/jobs/geogig-release/workspace/.repository/org/locationtech/geogig/geogig-core/1.0-RC4/geogig-core-1.0-RC4.jar
[INFO] Installing /home/hudson/genie.geogig/.hudson/jobs/geogig-release/workspace/src/core/pom.xml to /home/hudson/genie.geogig/.hudson/jobs/geogig-release/workspace/.repository/org/locationtech/geogig/geogig-core/1.0-RC4/geogig-core-1.0-RC4.pom
[INFO] Installing /home/hudson/genie.geogig/.hudson/jobs/geogig-release/workspace/src/core/target/geogig-core-1.0-RC4-tests.jar to /home/hudson/genie.geogig/.hudson/jobs/geogig-release/workspace/.repository/org/locationtech/geogig/geogig-core/1.0-RC4/geogig-core-1.0-RC4-tests.jar
[INFO] Installing /home/hudson/genie.geogig/.hudson/jobs/geogig-release/workspace/src/core/target/geogig-core-1.0-RC4-sources.jar to /home/hudson/genie.geogig/.hudson/jobs/geogig-release/workspace/.repository/org/locationtech/geogig/geogig-core/1.0-RC4/geogig-core-1.0-RC4-sources.jar
[INFO] Installing /home/hudson/genie.geogig/.hudson/jobs/geogig-release/workspace/src/core/target/geogig-core-1.0-RC4-test-sources.jar to /home/hudson/genie.geogig/.hudson/jobs/geogig-release/workspace/.repository/org/locationtech/geogig/geogig-core/1.0-RC4/geogig-core-1.0-RC4-test-sources.jar
[JENKINS] Archiving disabled