AbortedConsole Output

Started calculate disk usage of build
Finished Calculation of disk usage of build in 0 seconds
Started calculate disk usage of workspace
Finished Calculation of disk usage of workspace in 0 seconds
[INFO] 
[INFO] ----------------< org.locationtech.geogig:geogig-core >-----------------
[INFO] Building GeoGig Core 1.4-SNAPSHOT                                 [3/25]
[INFO] --------------------------------[ jar ]---------------------------------
[INFO] 
[INFO] --- maven-clean-plugin:2.5:clean (default-clean) @ geogig-core ---
[INFO] Deleting /home/hudson/genie.geogig/.jenkins/jobs/geogig-master/workspace/src/core/target
[INFO] 
[INFO] --- git-commit-id-plugin:2.2.2:revision (default) @ geogig-core ---
[INFO] 
[INFO] --- maven-resources-plugin:3.0.1:resources (default-resources) @ geogig-core ---
[INFO] Using 'UTF-8' encoding to copy filtered resources.
[INFO] Copying 6 resources
[INFO] 
[INFO] --- maven-compiler-plugin:3.7.0:compile (default-compile) @ geogig-core ---
[INFO] Changes detected - recompiling the module!
[INFO] Compiling 298 source files to /home/hudson/genie.geogig/.jenkins/jobs/geogig-master/workspace/src/core/target/classes
[INFO] /home/hudson/genie.geogig/.jenkins/jobs/geogig-master/workspace/src/core/src/main/java/org/locationtech/geogig/storage/datastream/v2_3/RevTreeFormat.java: Some input files use or override a deprecated API.
[INFO] /home/hudson/genie.geogig/.jenkins/jobs/geogig-master/workspace/src/core/src/main/java/org/locationtech/geogig/storage/datastream/v2_3/RevTreeFormat.java: Recompile with -Xlint:deprecation for details.
[INFO] /home/hudson/genie.geogig/.jenkins/jobs/geogig-master/workspace/src/core/src/main/java/org/locationtech/geogig/di/ConflictInterceptor.java: /home/hudson/genie.geogig/.jenkins/jobs/geogig-master/workspace/src/core/src/main/java/org/locationtech/geogig/di/ConflictInterceptor.java uses unchecked or unsafe operations.
[INFO] /home/hudson/genie.geogig/.jenkins/jobs/geogig-master/workspace/src/core/src/main/java/org/locationtech/geogig/di/ConflictInterceptor.java: Recompile with -Xlint:unchecked for details.
[INFO] 
[INFO] --- maven-resources-plugin:3.0.1:testResources (default-testResources) @ geogig-core ---
[INFO] Using 'UTF-8' encoding to copy filtered resources.
[INFO] Copying 3 resources
[INFO] 
[INFO] --- maven-compiler-plugin:3.7.0:testCompile (default-testCompile) @ geogig-core ---
[INFO] Changes detected - recompiling the module!
[INFO] Compiling 187 source files to /home/hudson/genie.geogig/.jenkins/jobs/geogig-master/workspace/src/core/target/test-classes
[INFO] /home/hudson/genie.geogig/.jenkins/jobs/geogig-master/workspace/src/core/src/test/java/org/locationtech/geogig/model/internal/CanonicalClusteringStrategyTest.java: /home/hudson/genie.geogig/.jenkins/jobs/geogig-master/workspace/src/core/src/test/java/org/locationtech/geogig/model/internal/CanonicalClusteringStrategyTest.java uses or overrides a deprecated API.
[INFO] /home/hudson/genie.geogig/.jenkins/jobs/geogig-master/workspace/src/core/src/test/java/org/locationtech/geogig/model/internal/CanonicalClusteringStrategyTest.java: Recompile with -Xlint:deprecation for details.
[INFO] 
[INFO] --- maven-surefire-plugin:2.17:test (default-test) @ geogig-core ---
[INFO] Surefire report directory: /home/hudson/genie.geogig/.jenkins/jobs/geogig-master/workspace/src/core/target/surefire-reports

-------------------------------------------------------
 T E S T S
-------------------------------------------------------

-------------------------------------------------------
 T E S T S
-------------------------------------------------------
Picked up JAVA_TOOL_OPTIONS: -Xmx2G -Djava.io.tmpdir=/tmp/genie.geogig
Picked up JAVA_TOOL_OPTIONS: -Xmx2G -Djava.io.tmpdir=/tmp/genie.geogig
Picked up JAVA_TOOL_OPTIONS: -Xmx2G -Djava.io.tmpdir=/tmp/genie.geogig
Picked up JAVA_TOOL_OPTIONS: -Xmx2G -Djava.io.tmpdir=/tmp/genie.geogig
Picked up JAVA_TOOL_OPTIONS: -Xmx2G -Djava.io.tmpdir=/tmp/genie.geogig
Picked up JAVA_TOOL_OPTIONS: -Xmx2G -Djava.io.tmpdir=/tmp/genie.geogig
Picked up JAVA_TOOL_OPTIONS: -Xmx2G -Djava.io.tmpdir=/tmp/genie.geogig
Picked up JAVA_TOOL_OPTIONS: -Xmx2G -Djava.io.tmpdir=/tmp/genie.geogig
Picked up JAVA_TOOL_OPTIONS: -Xmx2G -Djava.io.tmpdir=/tmp/genie.geogig
Picked up JAVA_TOOL_OPTIONS: -Xmx2G -Djava.io.tmpdir=/tmp/genie.geogig
Picked up JAVA_TOOL_OPTIONS: -Xmx2G -Djava.io.tmpdir=/tmp/genie.geogig
Picked up JAVA_TOOL_OPTIONS: -Xmx2G -Djava.io.tmpdir=/tmp/genie.geogig
Picked up JAVA_TOOL_OPTIONS: -Xmx2G -Djava.io.tmpdir=/tmp/genie.geogig
Picked up JAVA_TOOL_OPTIONS: -Xmx2G -Djava.io.tmpdir=/tmp/genie.geogig
Picked up JAVA_TOOL_OPTIONS: -Xmx2G -Djava.io.tmpdir=/tmp/genie.geogig
Picked up JAVA_TOOL_OPTIONS: -Xmx2G -Djava.io.tmpdir=/tmp/genie.geogig
Picked up JAVA_TOOL_OPTIONS: -Xmx2G -Djava.io.tmpdir=/tmp/genie.geogig
Picked up JAVA_TOOL_OPTIONS: -Xmx2G -Djava.io.tmpdir=/tmp/genie.geogig
Picked up JAVA_TOOL_OPTIONS: -Xmx2G -Djava.io.tmpdir=/tmp/genie.geogig
Picked up JAVA_TOOL_OPTIONS: -Xmx2G -Djava.io.tmpdir=/tmp/genie.geogig
Picked up JAVA_TOOL_OPTIONS: -Xmx2G -Djava.io.tmpdir=/tmp/genie.geogig
Picked up JAVA_TOOL_OPTIONS: -Xmx2G -Djava.io.tmpdir=/tmp/genie.geogig
Picked up JAVA_TOOL_OPTIONS: -Xmx2G -Djava.io.tmpdir=/tmp/genie.geogig
Picked up JAVA_TOOL_OPTIONS: -Xmx2G -Djava.io.tmpdir=/tmp/genie.geogig
Running org.locationtech.geogig.test.integration.RebaseOpTest
Running org.locationtech.geogig.test.integration.CleanRefsOpTest
Running org.locationtech.geogig.test.integration.ReportCommitConflictsOpTest
Running org.locationtech.geogig.test.integration.BlameOpTest
Running org.locationtech.geogig.test.integration.RevertOpTest
Running org.locationtech.geogig.test.integration.ConfigOpTest
Running org.locationtech.geogig.test.integration.ConflictsReadWriteOpTest
Running org.locationtech.geogig.test.integration.FindCommonAncestorTest
Running org.locationtech.geogig.test.integration.RebuildGraphOpTest
Running org.locationtech.geogig.test.integration.repository.IndexTest
Running org.locationtech.geogig.test.integration.repository.WorkingTreeTest
Running org.locationtech.geogig.test.integration.RevParseIntegrationTest
Running org.locationtech.geogig.test.integration.GeogigAPITest
Running org.locationtech.geogig.test.integration.MergeOpTest
Running org.locationtech.geogig.test.integration.CheckoutOpTest
Running org.locationtech.geogig.test.integration.BranchDeleteOpTest
Running org.locationtech.geogig.test.integration.AddOpTest
Running org.locationtech.geogig.test.integration.ReportMergeConflictsOpTest
Running org.locationtech.geogig.test.integration.CheckSparsePathTest
Running org.locationtech.geogig.test.integration.CleanOpTest
Running org.locationtech.geogig.test.integration.LsTreeOpTest
Running org.locationtech.geogig.test.integration.GeogigTransactionTest
Running org.locationtech.geogig.test.integration.HooksTest
Running org.locationtech.geogig.test.integration.LogOpTest
Tests run: 1, Failures: 0, Errors: 0, Skipped: 0, Time elapsed: 6.445 sec - in org.locationtech.geogig.test.integration.CleanRefsOpTest
Running org.locationtech.geogig.test.integration.TagTest
Tests run: 1, Failures: 0, Errors: 0, Skipped: 0, Time elapsed: 6.739 sec - in org.locationtech.geogig.test.integration.ConflictsReadWriteOpTest
Running org.locationtech.geogig.test.integration.StatusOpTest
[main] INFO org.locationtech.geogig.porcelain.RevertOp - Creating revert state of commit 082d5cec497c32d8d727ace870911f8f971125e3 (commit for Points.1)
[main] INFO org.locationtech.geogig.porcelain.RevertOp - Created revert state of 1 features in 27.53 ms
[main] INFO org.locationtech.geogig.porcelain.RevertOp - Staging 1 changes...
[main] INFO org.locationtech.geogig.porcelain.RevertOp - 1 changes staged in 32.87 ms

[main] INFO org.locationtech.geogig.hooks.Scripting - Running jvm script /opt/public/hipp/ramdisk/geogig/junit490353242857953368/repo507662016/.geogig/hooks/pre_commit.js
[main] INFO org.locationtech.geogig.hooks.Scripting - Running jvm script /opt/public/hipp/ramdisk/geogig/junit490353242857953368/repo507662016/.geogig/hooks/pre_commit.js
[main] INFO org.locationtech.geogig.hooks.Scripting - Running jvm script /opt/public/hipp/ramdisk/geogig/junit434394840438990505/repo-2141464928/.geogig/hooks/post_commit.js
Tests run: 3, Failures: 0, Errors: 0, Skipped: 0, Time elapsed: 9.539 sec - in org.locationtech.geogig.test.integration.CleanOpTest
Running org.locationtech.geogig.test.integration.BranchRenameOpTest
[main] WARN org.locationtech.geogig.hooks.CommandHookChain - Post-command hook org.locationtech.geogig.test.integration.HooksTest$ClasspathHookTest@3abd581e for command org.locationtech.geogig.porcelain.AddOp threw an exception that will not be propagated
java.lang.RuntimeException: expected
	at org.locationtech.geogig.test.integration.HooksTest$ClasspathHookTest.post(HooksTest.java:269)
	at org.locationtech.geogig.hooks.CommandHookChain.runPostHooks(CommandHookChain.java:65)
	at org.locationtech.geogig.hooks.CommandHooksDecorator$HooksListener.postCall(CommandHooksDecorator.java:60)
Tests run: 3, Failures: 0, Errors: 0, Skipped: 0, Time elapsed: 9.638 sec - in org.locationtech.geogig.test.integration.GeogigAPITest
Running org.locationtech.geogig.test.integration.BranchCreateOpTest
	at org.locationtech.geogig.repository.AbstractGeoGigOp.notifyPost(AbstractGeoGigOp.java:194)
	at org.locationtech.geogig.repository.AbstractGeoGigOp.call(AbstractGeoGigOp.java:170)
	at org.locationtech.geogig.test.integration.RepositoryTestCase.insertAndAdd(RepositoryTestCase.java:407)
	at org.locationtech.geogig.test.integration.RepositoryTestCase.insertAndAdd(RepositoryTestCase.java:395)
	at org.locationtech.geogig.test.integration.HooksTest.testClasspathHookPostFail(HooksTest.java:194)
	at sun.reflect.NativeMethodAccessorImpl.invoke0(Native Method)
	at sun.reflect.NativeMethodAccessorImpl.invoke(NativeMethodAccessorImpl.java:62)
	at sun.reflect.DelegatingMethodAccessorImpl.invoke(DelegatingMethodAccessorImpl.java:43)
	at java.lang.reflect.Method.invoke(Method.java:498)
	at org.junit.runners.model.FrameworkMethod$1.runReflectiveCall(FrameworkMethod.java:50)
	at org.junit.internal.runners.model.ReflectiveCallable.run(ReflectiveCallable.java:12)
	at org.junit.runners.model.FrameworkMethod.invokeExplosively(FrameworkMethod.java:47)
	at org.junit.internal.runners.statements.InvokeMethod.evaluate(InvokeMethod.java:17)
	at org.junit.internal.runners.statements.RunBefores.evaluate(RunBefores.java:26)
	at org.junit.internal.runners.statements.RunAfters.evaluate(RunAfters.java:27)
	at org.junit.rules.ExternalResource$1.evaluate(ExternalResource.java:48)
	at org.junit.rules.RunRules.evaluate(RunRules.java:20)
	at org.junit.runners.ParentRunner.runLeaf(ParentRunner.java:325)
	at org.junit.runners.BlockJUnit4ClassRunner.runChild(BlockJUnit4ClassRunner.java:78)
	at org.junit.runners.BlockJUnit4ClassRunner.runChild(BlockJUnit4ClassRunner.java:57)
	at org.junit.runners.ParentRunner$3.run(ParentRunner.java:290)
	at org.junit.runners.ParentRunner$1.schedule(ParentRunner.java:71)
	at org.junit.runners.ParentRunner.runChildren(ParentRunner.java:288)
	at org.junit.runners.ParentRunner.access$000(ParentRunner.java:58)
	at org.junit.runners.ParentRunner$2.evaluate(ParentRunner.java:268)
	at org.junit.runners.ParentRunner.run(ParentRunner.java:363)
	at org.apache.maven.surefire.junit4.JUnit4Provider.execute(JUnit4Provider.java:264)
	at org.apache.maven.surefire.junit4.JUnit4Provider.executeTestSet(JUnit4Provider.java:153)
	at org.apache.maven.surefire.junit4.JUnit4Provider.invoke(JUnit4Provider.java:124)
	at org.apache.maven.surefire.booter.ForkedBooter.invokeProviderInSameClassLoader(ForkedBooter.java:200)
	at org.apache.maven.surefire.booter.ForkedBooter.runSuitesInProcess(ForkedBooter.java:153)
	at org.apache.maven.surefire.booter.ForkedBooter.main(ForkedBooter.java:103)
Tests run: 3, Failures: 0, Errors: 0, Skipped: 0, Time elapsed: 3.709 sec - in org.locationtech.geogig.test.integration.TagTest
Running org.locationtech.geogig.test.integration.ApplyPatchOpTest
[main] INFO org.locationtech.geogig.porcelain.RevertOp - Creating revert state of commit deaa80847374e76caae15df7a9167f09ca44b955 (commit for modified Points.1)
[main] INFO org.locationtech.geogig.porcelain.RevertOp - Created revert state of 1 features in 17.86 ms
[main] INFO org.locationtech.geogig.porcelain.RevertOp - Staging 0 changes...
[main] INFO org.locationtech.geogig.porcelain.RevertOp - 0 changes staged in 5.799 ms

Tests run: 3, Failures: 0, Errors: 0, Skipped: 0, Time elapsed: 10.241 sec - in org.locationtech.geogig.test.integration.RebuildGraphOpTest
Running org.locationtech.geogig.test.integration.ResetOpTest
Tests run: 2, Failures: 0, Errors: 0, Skipped: 0, Time elapsed: 10.313 sec - in org.locationtech.geogig.test.integration.CheckSparsePathTest
Running org.locationtech.geogig.test.integration.CreatePatchOpTest
Tests run: 4, Failures: 0, Errors: 0, Skipped: 0, Time elapsed: 3.823 sec - in org.locationtech.geogig.test.integration.StatusOpTest
Running org.locationtech.geogig.test.integration.SquashOpTest
Tests run: 6, Failures: 0, Errors: 0, Skipped: 0, Time elapsed: 10.965 sec - in org.locationtech.geogig.test.integration.BlameOpTest
Running org.locationtech.geogig.test.integration.CherryPickOpTest
[main] INFO org.locationtech.geogig.hooks.Scripting - Running shell script /opt/public/hipp/ramdisk/geogig/junit8434684475649769293/repo-1123756813/.geogig/hooks/pre_commit.bat
[main] INFO org.locationtech.geogig.hooks.Scripting - Running shell script /opt/public/hipp/ramdisk/geogig/junit8434684475649769293/repo-1123756813/.geogig/hooks/pre_commit.bat
[main] INFO org.locationtech.geogig.porcelain.RevertOp - Creating revert state of commit 14955b361a24a2c5bfa81a5f56564ee32cdef5fd (commit for modified Points.1)
[main] INFO org.locationtech.geogig.porcelain.RevertOp - Created revert state of 1 features in 26.73 ms
[main] INFO org.locationtech.geogig.porcelain.RevertOp - Staging 0 changes...
[main] INFO org.locationtech.geogig.porcelain.RevertOp - 0 changes staged in 4.395 ms

Tests run: 6, Failures: 0, Errors: 0, Skipped: 0, Time elapsed: 11.312 sec - in org.locationtech.geogig.test.integration.BranchDeleteOpTest
Running org.locationtech.geogig.test.integration.CommitOpTest
[main] INFO org.locationtech.geogig.hooks.Scripting - Running jvm script /opt/public/hipp/ramdisk/geogig/junit4469863924709185246/repo755000446/.geogig/hooks/pre_commit.js
Tests run: 7, Failures: 0, Errors: 0, Skipped: 0, Time elapsed: 11.668 sec - in org.locationtech.geogig.test.integration.HooksTest
Running org.locationtech.geogig.test.integration.DiffOpTest
[main] INFO org.locationtech.geogig.porcelain.RevertOp - Creating revert state of commit ef1b3cf3be2024a05111ef96b36dcdc38cf741d3 (commit for Points.1)
[main] INFO org.locationtech.geogig.porcelain.RevertOp - Created revert state of 1 features in 6.248 ms
[main] INFO org.locationtech.geogig.porcelain.RevertOp - Staging 1 changes...
[main] INFO org.locationtech.geogig.porcelain.RevertOp - 1 changes staged in 11.56 ms

Tests run: 7, Failures: 0, Errors: 0, Skipped: 0, Time elapsed: 12.393 sec - in org.locationtech.geogig.test.integration.RevParseIntegrationTest
Running org.locationtech.geogig.test.performance.LogOpPerformanceTest
[main] INFO org.locationtech.geogig.test.performance.EnablePerformanceTestRule - org.locationtech.geogig.test.performance.LogOpPerformanceTest ignored, run with -Dgeogig.runPerformanceTests=true to enable it.
Tests run: 0, Failures: 0, Errors: 0, Skipped: 0, Time elapsed: 0.005 sec - in org.locationtech.geogig.test.performance.LogOpPerformanceTest
Running org.locationtech.geogig.test.performance.HeapGraphDatabaseStressTest
[main] INFO org.locationtech.geogig.test.performance.EnablePerformanceTestRule - org.locationtech.geogig.test.performance.HeapGraphDatabaseStressTest ignored, run with -Dgeogig.runPerformanceTests=true to enable it.
Tests run: 0, Failures: 0, Errors: 0, Skipped: 0, Time elapsed: 0.001 sec - in org.locationtech.geogig.test.performance.HeapGraphDatabaseStressTest
Running org.locationtech.geogig.test.performance.RevTreeBuilderPerformanceTest
[main] INFO org.locationtech.geogig.test.performance.EnablePerformanceTestRule - org.locationtech.geogig.test.performance.RevTreeBuilderPerformanceTest ignored, run with -Dgeogig.runPerformanceTests=true to enable it.
Tests run: 0, Failures: 0, Errors: 0, Skipped: 0, Time elapsed: 0.047 sec - in org.locationtech.geogig.test.performance.RevTreeBuilderPerformanceTest
Running org.locationtech.geogig.test.TestPlatformTest
Tests run: 1, Failures: 0, Errors: 0, Skipped: 0, Time elapsed: 0.233 sec - in org.locationtech.geogig.test.TestPlatformTest
Running org.locationtech.geogig.plumbing.ParseTimestampTest
[main] INFO org.locationtech.geogig.porcelain.RevertOp - Creating revert state of commit 9178f278cc183440991dec219d15e010575e6b59 (commit for modified Points.1)
[main] INFO org.locationtech.geogig.porcelain.RevertOp - Created revert state of 1 features in 75.95 ms
[main] INFO org.locationtech.geogig.porcelain.RevertOp - Staging 0 changes...
[main] INFO org.locationtech.geogig.porcelain.RevertOp - 0 changes staged in 5.551 ms

Tests run: 9, Failures: 0, Errors: 0, Skipped: 0, Time elapsed: 13.006 sec - in org.locationtech.geogig.test.integration.repository.IndexTest
Running org.locationtech.geogig.plumbing.index.BuildIndexOpTest
Tests run: 8, Failures: 0, Errors: 0, Skipped: 0, Time elapsed: 3.511 sec - in org.locationtech.geogig.test.integration.BranchRenameOpTest
Running org.locationtech.geogig.plumbing.index.BuildFullHistoryIndexOpTest
Tests run: 5, Failures: 0, Errors: 0, Skipped: 0, Time elapsed: 13.408 sec - in org.locationtech.geogig.test.integration.FindCommonAncestorTest
Running org.locationtech.geogig.plumbing.DescribeFeatureTypeTest
Tests run: 10, Failures: 0, Errors: 0, Skipped: 0, Time elapsed: 13.561 sec - in org.locationtech.geogig.test.integration.ReportCommitConflictsOpTest
Running org.locationtech.geogig.plumbing.CheckRefFormatTest
[main] INFO org.locationtech.geogig.porcelain.RevertOp - Creating revert state of commit 978414e348a29da181cd04c5327ba9fb5d6c9944 (commit for Points.1)
[main] INFO org.locationtech.geogig.porcelain.RevertOp - Created revert state of 1 features in 3.365 ms
[main] INFO org.locationtech.geogig.porcelain.RevertOp - Staging 1 changes...
[main] INFO org.locationtech.geogig.porcelain.RevertOp - 1 changes staged in 14.65 ms

Tests run: 8, Failures: 0, Errors: 0, Skipped: 0, Time elapsed: 3.107 sec - in org.locationtech.geogig.test.integration.CreatePatchOpTest
Running org.locationtech.geogig.plumbing.diff.DiffCountConsumerTest
Tests run: 12, Failures: 0, Errors: 0, Skipped: 0, Time elapsed: 13.662 sec - in org.locationtech.geogig.test.integration.AddOpTest
Running org.locationtech.geogig.plumbing.diff.DepthTreeIteratorTest
[main] INFO org.locationtech.geogig.porcelain.RevertOp - Creating revert state of commit 6297537de598b4cdba1897a24d0b870d33a7b885 (commit for removing Points.1)
[main] INFO org.locationtech.geogig.porcelain.RevertOp - Created revert state of 1 features in 9.731 ms
[main] INFO org.locationtech.geogig.porcelain.RevertOp - Staging 0 changes...
[main] INFO org.locationtech.geogig.porcelain.RevertOp - 0 changes staged in 9.763 ms

Tests run: 2, Failures: 0, Errors: 0, Skipped: 0, Time elapsed: 1.24 sec - in org.locationtech.geogig.plumbing.DescribeFeatureTypeTest
Running org.locationtech.geogig.plumbing.diff.TreeDifferenceTest
Tests run: 7, Failures: 0, Errors: 0, Skipped: 0, Time elapsed: 0.025 sec - in org.locationtech.geogig.plumbing.diff.TreeDifferenceTest
Running org.locationtech.geogig.plumbing.diff.PreOrderDiffWalkTest
Tests run: 2, Failures: 0, Errors: 0, Skipped: 0, Time elapsed: 1.294 sec - in org.locationtech.geogig.plumbing.CheckRefFormatTest
Running org.locationtech.geogig.plumbing.diff.MutableTreeTest
Tests run: 7, Failures: 0, Errors: 0, Skipped: 0, Time elapsed: 0.02 sec - in org.locationtech.geogig.plumbing.diff.MutableTreeTest
Running org.locationtech.geogig.plumbing.diff.GeometryDiffTest
Tests run: 7, Failures: 0, Errors: 0, Skipped: 1, Time elapsed: 3.967 sec - in org.locationtech.geogig.test.integration.CherryPickOpTest
Running org.locationtech.geogig.plumbing.diff.PreOrderDiffWalkQuadTreeTest
Tests run: 1, Failures: 0, Errors: 0, Skipped: 1, Time elapsed: 0 sec - in org.locationtech.geogig.plumbing.diff.PreOrderDiffWalkQuadTreeTest
Running org.locationtech.geogig.plumbing.diff.PostOrderDiffWalkTest
Tests run: 14, Failures: 0, Errors: 0, Skipped: 0, Time elapsed: 0.165 sec - in org.locationtech.geogig.plumbing.diff.GeometryDiffTest
Running org.locationtech.geogig.plumbing.diff.PatchSerializationTest
Tests run: 21, Failures: 0, Errors: 0, Skipped: 0, Time elapsed: 15.351 sec - in org.locationtech.geogig.test.integration.ConfigOpTest
Running org.locationtech.geogig.plumbing.diff.AttributeDiffTest
Tests run: 4, Failures: 0, Errors: 0, Skipped: 0, Time elapsed: 0.019 sec - in org.locationtech.geogig.plumbing.diff.AttributeDiffTest
Running org.locationtech.geogig.plumbing.remotes.RemoteRemoveOpTest
Tests run: 11, Failures: 0, Errors: 0, Skipped: 0, Time elapsed: 5.696 sec - in org.locationtech.geogig.test.integration.BranchCreateOpTest
Running org.locationtech.geogig.plumbing.remotes.RemoteAddOpTest
[main] INFO org.locationtech.geogig.porcelain.RevertOp - Creating revert state of commit 121003c3ad98823ec9e76257db242fbc2ac3529f (commit for Lines.1)
Tests run: 10, Failures: 0, Errors: 0, Skipped: 0, Time elapsed: 15.541 sec - in org.locationtech.geogig.test.integration.LsTreeOpTest
Running org.locationtech.geogig.plumbing.FindChangedTreesTest
[main] INFO org.locationtech.geogig.porcelain.RevertOp - Created revert state of 1 features in 2.160 ms
[main] INFO org.locationtech.geogig.porcelain.RevertOp - Staging 1 changes...
[main] INFO org.locationtech.geogig.porcelain.RevertOp - 1 changes staged in 44.09 ms

Merge: merging [be4737b43de212e81877bfe12928a390fb64e6f7] onto HEAD -> [refs/heads/intermediate_left -> d1cccd903aa1c722d546e343b073f6bb77b60c37]
Checking for possible conflicts...
Merging commit be4737b4 (right modify 1) onto d1cccd90 (left modify 1)
Conflicts: 0, merged: 0, unconflicted: 1
Staging changes...
Building final tree Points
Tree Points staged in 602.4 μs
Done.
Creating merge commit
Merge: created merge commit RevCommitImpl(e9f6f0e0a1540502)[tree:e952e07a06075992, parents:[d1cccd903aa1c722, be4737b43de212e8], msg:merge 1, author:"Gabriel Roldan" <groldan@boundlessgeo.com>, time: 1544050222440, tz: -18000000, committer:"Gabriel Roldan" <groldan@boundlessgeo.com>, time: 1544050222442, tz: -18000000]
Merge: merging [a9500fc0ad301bceb545576ed49300e9ce01983c] onto HEAD -> [refs/heads/intermediate_left -> e9f6f0e0a1540502841b16a08a13adb10e538c67]
Checking for possible conflicts...
Merging commit a9500fc0 (left modify 2) onto e9f6f0e0 (merge 1)
Conflicts: 0, merged: 0, unconflicted: 1
Staging changes...
Building final tree Points
Tree Points staged in 642.6 μs
Done.
Creating merge commit
Merge: created merge commit RevCommitImpl(b198beee9fa469f1)[tree:2ff0e6d555483949, parents:[e9f6f0e0a1540502, a9500fc0ad301bce], msg:merge 2 left, author:"Gabriel Roldan" <groldan@boundlessgeo.com>, time: 1544050222674, tz: -18000000, committer:"Gabriel Roldan" <groldan@boundlessgeo.com>, time: 1544050222675, tz: -18000000]
Merge: merging [6a1b618e94ca791197ae0e18e7c34e91cbf8f478] onto HEAD -> [refs/heads/intermediate_right -> e9f6f0e0a1540502841b16a08a13adb10e538c67]
Checking for possible conflicts...
Merging commit 6a1b618e (right modify 2) onto e9f6f0e0 (merge 1)
Conflicts: 0, merged: 0, unconflicted: 2
Staging changes...
Building final tree Lines
Tree Lines staged in 682.1 μs
Done.
Creating merge commit
Merge: created merge commit RevCommitImpl(406b510ac9dcde6c)[tree:40ec1223a6191d21, parents:[e9f6f0e0a1540502, 6a1b618e94ca7911], msg:merge 2 right, author:"Gabriel Roldan" <groldan@boundlessgeo.com>, time: 1544050222806, tz: -18000000, committer:"Gabriel Roldan" <groldan@boundlessgeo.com>, time: 1544050222807, tz: -18000000]
Merge: merging [406b510ac9dcde6cad7ec02455a33a31ab3e64a5] onto HEAD -> [refs/heads/master -> b198beee9fa469f12862394239ca3e73f30ef0d3]
Checking for possible conflicts...
Merging commit 406b510a (merge 2 right) onto b198beee (merge 2 left)
Conflicts: 0, merged: 0, unconflicted: 2
Staging changes...
Building final tree Lines
Tree Lines staged in 620.6 μs
Done.
Creating merge commit
Merge: created merge commit RevCommitImpl(65102ab8fbf6d9c2)[tree:f3de1d43217dceb2, parents:[b198beee9fa469f1, 406b510ac9dcde6c], msg:final merge, author:"Gabriel Roldan" <groldan@boundlessgeo.com>, time: 1544050222863, tz: -18000000, committer:"Gabriel Roldan" <groldan@boundlessgeo.com>, time: 1544050222864, tz: -18000000]
Tests run: 20, Failures: 0, Errors: 0, Skipped: 0, Time elapsed: 16.849 sec - in org.locationtech.geogig.test.integration.repository.WorkingTreeTest
Running org.locationtech.geogig.plumbing.merge.MergeFeaturesOpTest
Tests run: 7, Failures: 0, Errors: 0, Skipped: 0, Time elapsed: 2.118 sec - in org.locationtech.geogig.plumbing.diff.PostOrderDiffWalkTest
Running org.locationtech.geogig.plumbing.merge.MergeStatusBuilderDiffEntrySerializerTest
Tests run: 9, Failures: 0, Errors: 0, Skipped: 0, Time elapsed: 3.416 sec - in org.locationtech.geogig.plumbing.diff.DiffCountConsumerTest
Running org.locationtech.geogig.plumbing.ResolveRepositoryNameTest
Tests run: 1, Failures: 0, Errors: 0, Skipped: 0, Time elapsed: 0.766 sec - in org.locationtech.geogig.plumbing.merge.MergeFeaturesOpTest
Running org.locationtech.geogig.plumbing.UpdateRefTest
[main] INFO org.locationtech.geogig.porcelain.RevertOp - Creating revert state of commit 399c47a54296dc4f87042e73aa4532ca2946ed9f (commit for Points.2)
[main] INFO org.locationtech.geogig.porcelain.RevertOp - Created revert state of 1 features in 14.61 ms
[main] INFO org.locationtech.geogig.porcelain.RevertOp - Staging 1 changes...
[main] INFO org.locationtech.geogig.porcelain.RevertOp - 1 changes staged in 19.68 ms

[main] INFO org.locationtech.geogig.porcelain.RevertOp - Creating revert state of commit b5df7c528f4f03370a391f6d41cc1f34d1534913 (commit for modified Points.1)
[main] INFO org.locationtech.geogig.porcelain.RevertOp - Created revert state of 1 features in 21.29 ms
[main] INFO org.locationtech.geogig.porcelain.RevertOp - Staging 1 changes...
[main] INFO org.locationtech.geogig.porcelain.RevertOp - 1 changes staged in 41.70 ms

Tests run: 13, Failures: 0, Errors: 0, Skipped: 0, Time elapsed: 17.775 sec - in org.locationtech.geogig.test.integration.ReportMergeConflictsOpTest
Running org.locationtech.geogig.plumbing.ResolveFeatureTypeTest
[main] INFO org.locationtech.geogig.porcelain.RevertOp - Creating revert state of commit bd462d227ef9466fe682ffd1516d525761d3cfde (commit for deleted Points.3)
[main] INFO org.locationtech.geogig.porcelain.RevertOp - Created revert state of 1 features in 104.9 ms
[main] INFO org.locationtech.geogig.porcelain.RevertOp - Staging 1 changes...
[main] INFO org.locationtech.geogig.porcelain.RevertOp - 1 changes staged in 10.18 ms

Tests run: 2, Failures: 0, Errors: 0, Skipped: 0, Time elapsed: 1.152 sec - in org.locationtech.geogig.plumbing.ResolveRepositoryNameTest
Running org.locationtech.geogig.plumbing.RevParseTest
Tests run: 12, Failures: 0, Errors: 0, Skipped: 0, Time elapsed: 18.667 sec - in org.locationtech.geogig.test.integration.RebaseOpTest
Running org.locationtech.geogig.plumbing.UpdateSymRefTest
Tests run: 5, Failures: 0, Errors: 0, Skipped: 0, Time elapsed: 1.623 sec - in org.locationtech.geogig.plumbing.merge.MergeStatusBuilderDiffEntrySerializerTest
Running org.locationtech.geogig.plumbing.DiffTreeTest
[main] INFO org.locationtech.geogig.porcelain.RevertOp - Creating revert state of commit 91da7a7d426d990e7950f4b7013ee01e9ebf8d88 (commit for Points.2)
[main] INFO org.locationtech.geogig.porcelain.RevertOp - Created revert state of 1 features in 17.05 ms
[main] INFO org.locationtech.geogig.porcelain.RevertOp - Staging 1 changes...
[main] INFO org.locationtech.geogig.porcelain.RevertOp - 1 changes staged in 19.71 ms

[main] INFO org.locationtech.geogig.porcelain.RevertOp - Creating revert state of commit 6ddf7bb423317bd91ec2c268550ac2072b287cc9 (commit for modified Points.1)
[main] INFO org.locationtech.geogig.porcelain.RevertOp - Created revert state of 1 features in 5.169 ms
[main] INFO org.locationtech.geogig.porcelain.RevertOp - Staging 1 changes...
[main] INFO org.locationtech.geogig.porcelain.RevertOp - 1 changes staged in 39.85 ms

[main] INFO org.locationtech.geogig.porcelain.RevertOp - Creating revert state of commit d1b4f8fefcc61fab6cc70f9ca578a5208535e033 (commit for deleted Points.3)
[main] INFO org.locationtech.geogig.porcelain.RevertOp - Created revert state of 1 features in 3.278 ms
[main] INFO org.locationtech.geogig.porcelain.RevertOp - Staging 1 changes...
[main] INFO org.locationtech.geogig.porcelain.RevertOp - 1 changes staged in 8.545 ms

Tests run: 18, Failures: 0, Errors: 0, Skipped: 0, Time elapsed: 9.274 sec - in org.locationtech.geogig.test.integration.ApplyPatchOpTest
Running org.locationtech.geogig.plumbing.WalkGraphOpTest
Tests run: 15, Failures: 0, Errors: 0, Skipped: 0, Time elapsed: 19.435 sec - in org.locationtech.geogig.test.integration.GeogigTransactionTest
Running org.locationtech.geogig.plumbing.RefParseTest
Tests run: 8, Failures: 0, Errors: 0, Skipped: 0, Time elapsed: 4.693 sec - in org.locationtech.geogig.plumbing.diff.PatchSerializationTest
Running org.locationtech.geogig.plumbing.DiffFeatureTest
Tests run: 5, Failures: 0, Errors: 0, Skipped: 0, Time elapsed: 0.241 sec - in org.locationtech.geogig.plumbing.RefParseTest
Running org.locationtech.geogig.plumbing.ResolveGeogigURITest
Tests run: 15, Failures: 0, Errors: 0, Skipped: 0, Time elapsed: 20.053 sec - in org.locationtech.geogig.test.integration.RevertOpTest
Running org.locationtech.geogig.plumbing.DiffBoundsTest
Tests run: 8, Failures: 0, Errors: 0, Skipped: 0, Time elapsed: 4.902 sec - in org.locationtech.geogig.plumbing.remotes.RemoteRemoveOpTest
Running org.locationtech.geogig.plumbing.WriteTree2Test
Tests run: 5, Failures: 0, Errors: 0, Skipped: 0, Time elapsed: 2.551 sec - in org.locationtech.geogig.plumbing.ResolveFeatureTypeTest
Running org.locationtech.geogig.plumbing.UpdateTreeTest

Tests run: 13, Failures: 0, Errors: 0, Skipped: 0, Time elapsed: 10.097 sec - in org.locationtech.geogig.test.integration.ResetOpTest
Running org.locationtech.geogig.plumbing.CatObjectTest
Tests run: 10, Failures: 0, Errors: 0, Skipped: 0, Time elapsed: 5.806 sec - in org.locationtech.geogig.plumbing.remotes.RemoteAddOpTest
Running org.locationtech.geogig.plumbing.HashObjectTest
Tests run: 5, Failures: 0, Errors: 0, Skipped: 0, Time elapsed: 3.846 sec - in org.locationtech.geogig.plumbing.UpdateRefTest
Running org.locationtech.geogig.porcelain.index.DropIndexOpTest
Tests run: 5, Failures: 0, Errors: 0, Skipped: 0, Time elapsed: 3.017 sec - in org.locationtech.geogig.plumbing.UpdateSymRefTest
Running org.locationtech.geogig.porcelain.index.CreateIndexOpTest
sp	StringProp1_1 -> StringProp1_1a
pp	0 point(s) deleted, 0 new point(s) added, 1 point(s) moved
ip	1000 -> 1001

Tests run: 4, Failures: 0, Errors: 0, Skipped: 0, Time elapsed: 2.46 sec - in org.locationtech.geogig.plumbing.DiffFeatureTest
Running org.locationtech.geogig.porcelain.index.UpdateIndexOpTest
[main] ERROR org.locationtech.geogig.plumbing.diff.PreOrderDiffWalk - Exception caught executing task
java.lang.IllegalStateException: java.lang.IllegalStateException: Object NodeRef[Points/Points.1 -> a47ca38e5c3e92c94dec9e8ea597c642003ec878] not found.
	at sun.reflect.NativeConstructorAccessorImpl.newInstance0(Native Method)
	at sun.reflect.NativeConstructorAccessorImpl.newInstance(NativeConstructorAccessorImpl.java:62)
	at sun.reflect.DelegatingConstructorAccessorImpl.newInstance(DelegatingConstructorAccessorImpl.java:45)
	at java.lang.reflect.Constructor.newInstance(Constructor.java:423)
	at java.util.concurrent.ForkJoinTask.getThrowableException(ForkJoinTask.java:593)
	at java.util.concurrent.ForkJoinTask.reportException(ForkJoinTask.java:677)
	at java.util.concurrent.ForkJoinTask.join(ForkJoinTask.java:720)
	at java.util.concurrent.ForkJoinPool.invoke(ForkJoinPool.java:2616)
	at org.locationtech.geogig.plumbing.diff.PreOrderDiffWalk.walk(PreOrderDiffWalk.java:389)
	at org.locationtech.geogig.plumbing.WalkGraphOp._call(WalkGraphOp.java:160)
	at org.locationtech.geogig.plumbing.WalkGraphOp._call(WalkGraphOp.java:32)
	at org.locationtech.geogig.repository.AbstractGeoGigOp.call(AbstractGeoGigOp.java:169)
	at org.locationtech.geogig.plumbing.WalkGraphOpTest.testObjectDoesNotExist(WalkGraphOpTest.java:179)
	at sun.reflect.NativeMethodAccessorImpl.invoke0(Native Method)
	at sun.reflect.NativeMethodAccessorImpl.invoke(NativeMethodAccessorImpl.java:62)
	at sun.reflect.DelegatingMethodAccessorImpl.invoke(DelegatingMethodAccessorImpl.java:43)
	at java.lang.reflect.Method.invoke(Method.java:498)
	at org.junit.runners.model.FrameworkMethod$1.runReflectiveCall(FrameworkMethod.java:50)
	at org.junit.internal.runners.model.ReflectiveCallable.run(ReflectiveCallable.java:12)
	at org.junit.runners.model.FrameworkMethod.invokeExplosively(FrameworkMethod.java:47)
	at org.junit.internal.runners.statements.InvokeMethod.evaluate(InvokeMethod.java:17)
	at org.junit.internal.runners.statements.RunBefores.evaluate(RunBefores.java:26)
	at org.junit.internal.runners.statements.RunAfters.evaluate(RunAfters.java:27)
	at org.junit.rules.ExpectedException$ExpectedExceptionStatement.evaluate(ExpectedException.java:239)
	at org.junit.rules.ExternalResource$1.evaluate(ExternalResource.java:48)
	at org.junit.rules.RunRules.evaluate(RunRules.java:20)
	at org.junit.runners.ParentRunner.runLeaf(ParentRunner.java:325)
	at org.junit.runners.BlockJUnit4ClassRunner.runChild(BlockJUnit4ClassRunner.java:78)
	at org.junit.runners.BlockJUnit4ClassRunner.runChild(BlockJUnit4ClassRunner.java:57)
	at org.junit.runners.ParentRunner$3.run(ParentRunner.java:290)
	at org.junit.runners.ParentRunner$1.schedule(ParentRunner.java:71)
	at org.junit.runners.ParentRunner.runChildren(ParentRunner.java:288)
	at org.junit.runners.ParentRunner.access$000(ParentRunner.java:58)
	at org.junit.runners.ParentRunner$2.evaluate(ParentRunner.java:268)
	at org.junit.runners.ParentRunner.run(ParentRunner.java:363)
	at org.apache.maven.surefire.junit4.JUnit4Provider.execute(JUnit4Provider.java:264)
	at org.apache.maven.surefire.junit4.JUnit4Provider.executeTestSet(JUnit4Provider.java:153)
	at org.apache.maven.surefire.junit4.JUnit4Provider.invoke(JUnit4Provider.java:124)
	at org.apache.maven.surefire.booter.ForkedBooter.invokeProviderInSameClassLoader(ForkedBooter.java:200)
	at org.apache.maven.surefire.booter.ForkedBooter.runSuitesInProcess(ForkedBooter.java:153)
	at org.apache.maven.surefire.booter.ForkedBooter.main(ForkedBooter.java:103)
Caused by: java.lang.IllegalStateException: Object NodeRef[Points/Points.1 -> a47ca38e5c3e92c94dec9e8ea597c642003ec878] not found.
	at org.locationtech.geogig.plumbing.WalkGraphOp$1.checkExists(WalkGraphOp.java:155)
	at org.locationtech.geogig.plumbing.WalkGraphOp$1.feature(WalkGraphOp.java:128)
	at org.locationtech.geogig.plumbing.diff.PreOrderDiffWalk$CancellableConsumer.feature(PreOrderDiffWalk.java:1413)
	at org.locationtech.geogig.plumbing.diff.PreOrderDiffWalk$WalkAction.node(PreOrderDiffWalk.java:718)
	at org.locationtech.geogig.plumbing.diff.PreOrderDiffWalk$TraverseLeafLeaf.compute(PreOrderDiffWalk.java:923)
	at org.locationtech.geogig.plumbing.diff.PreOrderDiffWalk$TraverseTreeContents.compute(PreOrderDiffWalk.java:829)
	at org.locationtech.geogig.plumbing.diff.PreOrderDiffWalk$TraverseTree.compute(PreOrderDiffWalk.java:787)
	at java.util.concurrent.RecursiveAction.exec(RecursiveAction.java:189)
	at java.util.concurrent.ForkJoinTask.doExec(ForkJoinTask.java:289)
	at java.util.concurrent.ForkJoinTask.doInvoke(ForkJoinTask.java:401)
	at java.util.concurrent.ForkJoinTask.invokeAll(ForkJoinTask.java:843)
	at org.locationtech.geogig.plumbing.diff.PreOrderDiffWalk$TraverseLeafLeaf.compute(PreOrderDiffWalk.java:930)
	at org.locationtech.geogig.plumbing.diff.PreOrderDiffWalk$TraverseTreeContents.compute(PreOrderDiffWalk.java:829)
	at org.locationtech.geogig.plumbing.diff.PreOrderDiffWalk$TraverseTree.compute(PreOrderDiffWalk.java:787)
	at java.util.concurrent.RecursiveAction.exec(RecursiveAction.java:189)
	at java.util.concurrent.ForkJoinTask.doExec(ForkJoinTask.java:289)
	at java.util.concurrent.ForkJoinPool$WorkQueue.runTask(ForkJoinPool.java:1056)
	at java.util.concurrent.ForkJoinPool.runWorker(ForkJoinPool.java:1692)
	at java.util.concurrent.ForkJoinWorkerThread.run(ForkJoinWorkerThread.java:157)
Tests run: 3, Failures: 0, Errors: 0, Skipped: 0, Time elapsed: 1.327 sec - in org.locationtech.geogig.plumbing.CatObjectTest
Running org.locationtech.geogig.porcelain.index.UpdateIndexesOpTest
Tests run: 7, Failures: 0, Errors: 0, Skipped: 0, Time elapsed: 3.959 sec - in org.locationtech.geogig.plumbing.WalkGraphOpTest
Tests run: 19, Failures: 0, Errors: 0, Skipped: 0, Time elapsed: 23.015 sec - in org.locationtech.geogig.test.integration.LogOpTest
Running org.locationtech.geogig.porcelain.InitOpTest
Running org.locationtech.geogig.porcelain.RemoveOpTest
Tests run: 7, Failures: 0, Errors: 0, Skipped: 0, Time elapsed: 3.417 sec - in org.locationtech.geogig.plumbing.UpdateTreeTest
Running org.locationtech.geogig.data.EPSGBoundsYXTest
Tests run: 1, Failures: 0, Errors: 0, Skipped: 1, Time elapsed: 0 sec - in org.locationtech.geogig.data.EPSGBoundsYXTest
Running org.locationtech.geogig.data.EPSGBoundsXYTest
Tests run: 1, Failures: 0, Errors: 0, Skipped: 1, Time elapsed: 0 sec - in org.locationtech.geogig.data.EPSGBoundsXYTest
Running org.locationtech.geogig.data.retrieve.IteratorBackedFeatureReaderTest
Tests run: 1, Failures: 0, Errors: 0, Skipped: 0, Time elapsed: 0 sec - in org.locationtech.geogig.data.retrieve.IteratorBackedFeatureReaderTest
Running org.locationtech.geogig.data.retrieve.BulkFeatureRetrieverTest
Tests run: 9, Failures: 0, Errors: 0, Skipped: 0, Time elapsed: 10.861 sec - in org.locationtech.geogig.plumbing.index.BuildIndexOpTest
Running org.locationtech.geogig.data.retrieve.MultiFeatureTypeBuilderTest
Tests run: 1, Failures: 0, Errors: 0, Skipped: 0, Time elapsed: 0.271 sec - in org.locationtech.geogig.data.retrieve.BulkFeatureRetrieverTest
Running org.locationtech.geogig.data.EPSGBoundsCalcTest
left : LeafTree(c932cbd11ec75bcc)[size:7, tree nodes:2, feature nodes:0, subtrees:2, buckets: 0]
	[TreeNode[buildings -> a400000000000000, type: TREE, bounds: Env[0.0 : 1.0, 0.0 : 1.0]], TreeNode[roads -> ff488999ad51848c, type: TREE, bounds: Env[0.0 : 1.0, 0.0 : 1.0]]]
	[]
right: LeafTree(8996d6e4437a8d8e)[size:5, tree nodes:1, feature nodes:0, subtrees:1, buckets: 0]
	[TreeNode[roads -> 72e2f547f3adc30e, type: TREE, bounds: Env[0.0 : 2.0, 0.0 : 2.0]]]
	[]
Tests run: 2, Failures: 0, Errors: 0, Skipped: 0, Time elapsed: 0.393 sec - in org.locationtech.geogig.data.retrieve.MultiFeatureTypeBuilderTest
Running org.locationtech.geogig.data.PrimitiveArrayToStringConverterFactoryTest
Tests run: 8, Failures: 0, Errors: 0, Skipped: 0, Time elapsed: 0.22 sec - in org.locationtech.geogig.data.PrimitiveArrayToStringConverterFactoryTest
Running org.locationtech.geogig.data.FeatureBuilderTest
Tests run: 7, Failures: 0, Errors: 0, Skipped: 0, Time elapsed: 11.791 sec - in org.locationtech.geogig.plumbing.index.BuildFullHistoryIndexOpTest
Running org.locationtech.geogig.data.MapToStringConverterFactoryTest
Tests run: 2, Failures: 0, Errors: 0, Skipped: 0, Time elapsed: 0.098 sec - in org.locationtech.geogig.data.MapToStringConverterFactoryTest
Running org.locationtech.geogig.model.impl.RevCommitImplTest
Tests run: 2, Failures: 0, Errors: 0, Skipped: 0, Time elapsed: 0.005 sec - in org.locationtech.geogig.model.impl.RevCommitImplTest
Running org.locationtech.geogig.model.impl.CanonicalTreeBuilderTest
Tests run: 8, Failures: 0, Errors: 0, Skipped: 0, Time elapsed: 4.11 sec - in org.locationtech.geogig.plumbing.HashObjectTest
Running org.locationtech.geogig.model.impl.RevPersonTest
Tests run: 3, Failures: 0, Errors: 0, Skipped: 0, Time elapsed: 0 sec - in org.locationtech.geogig.model.impl.RevPersonTest
Running org.locationtech.geogig.model.impl.RevFeatureTypeTest
Tests run: 14, Failures: 0, Errors: 0, Skipped: 0, Time elapsed: 14.768 sec - in org.locationtech.geogig.test.integration.SquashOpTest
Running org.locationtech.geogig.model.impl.QuadTreeBuilderExpandCollapseTest
Tests run: 1, Failures: 0, Errors: 0, Skipped: 0, Time elapsed: 0 sec - in org.locationtech.geogig.model.impl.QuadTreeBuilderExpandCollapseTest
Running org.locationtech.geogig.model.impl.LegacyTreeBuilderTest
Tests run: 4, Failures: 0, Errors: 0, Skipped: 0, Time elapsed: 1.972 sec - in org.locationtech.geogig.porcelain.InitOpTest
Running org.locationtech.geogig.model.impl.RevFeatureTest
Tests run: 2, Failures: 0, Errors: 0, Skipped: 0, Time elapsed: 0.001 sec - in org.locationtech.geogig.model.impl.RevFeatureTest
Running org.locationtech.geogig.model.impl.CommitBuilderTest
Tests run: 6, Failures: 0, Errors: 0, Skipped: 0, Time elapsed: 0.008 sec - in org.locationtech.geogig.model.impl.CommitBuilderTest
Running org.locationtech.geogig.model.internal.QuadTreeClusteringStrategy_computeIdTest
Tests run: 1, Failures: 0, Errors: 0, Skipped: 0, Time elapsed: 0.763 sec - in org.locationtech.geogig.data.FeatureBuilderTest
Tests run: 8, Failures: 0, Errors: 0, Skipped: 0, Time elapsed: 0.055 sec - in org.locationtech.geogig.model.internal.QuadTreeClusteringStrategy_computeIdTest
Running org.locationtech.geogig.model.internal.QuadTreeClusteringStrategyTest
Tests run: 12, Failures: 0, Errors: 0, Skipped: 12, Time elapsed: 0.002 sec - in org.locationtech.geogig.model.internal.QuadTreeClusteringStrategyTest
Running org.locationtech.geogig.model.internal.QuadrantTest
Running org.locationtech.geogig.model.internal.CanonicalClusteringStrategyHeapStorageTest
Tests run: 9, Failures: 0, Errors: 0, Skipped: 0, Time elapsed: 0.08 sec - in org.locationtech.geogig.model.internal.QuadrantTest
Running org.locationtech.geogig.model.internal.NodeIdTest
Tests run: 3, Failures: 0, Errors: 0, Skipped: 0, Time elapsed: 0.001 sec - in org.locationtech.geogig.model.internal.NodeIdTest
Running org.locationtech.geogig.model.internal.QuadTreeClusteringStrategy_putTest
DAG[id:[], orig:EMPTY, status: CHANGED, size: 129, children: 0, buckets: 1)[children: {}, buckets: [[2]]]
 DAG[id:[2], orig:EMPTY, status: CHANGED, size: 129, children: 0, buckets: 2)[children: {}, buckets: [[2, 0], [2, 3]]]
  DAG[id:[2, 0], orig:EMPTY, status: CHANGED, size: 90, children: 90, buckets: 0)[children: {node # 2=NodeId[node # 2, Env[2.0 : 2.0, 1.0 : 1.0]], node # 1=NodeId[node # 1, Env[1.0 : 1.0, 1.0 : 1.0]], node # 18=NodeId[node # 18, Env[18.0 : 18.0, 1.0 : 1.0]], node # 19=NodeId[node # 19, Env[19.0 : 19.0, 1.0 : 1.0]], node # 16=NodeId[node # 16, Env[16.0 : 16.0, 1.0 : 1.0]], node # 17=NodeId[node # 17, Env[17.0 : 17.0, 1.0 : 1.0]], node # 9=NodeId[node # 9, Env[9.0 : 9.0, 1.0 : 1.0]], node # 8=NodeId[node # 8, Env[8.0 : 8.0, 1.0 : 1.0]], node # 7=NodeId[node # 7, Env[7.0 : 7.0, 1.0 : 1.0]], node # 6=NodeId[node # 6, Env[6.0 : 6.0, 1.0 : 1.0]], node # 5=NodeId[node # 5, Env[5.0 : 5.0, 1.0 : 1.0]], node # 4=NodeId[node # 4, Env[4.0 : 4.0, 1.0 : 1.0]], node # 3=NodeId[node # 3, Env[3.0 : 3.0, 1.0 : 1.0]], node # 61=NodeId[node # 61, Env[61.0 : 61.0, 1.0 : 1.0]], node # 62=NodeId[node # 62, Env[62.0 : 62.0, 1.0 : 1.0]], node # 60=NodeId[node # 60, Env[60.0 : 60.0, 1.0 : 1.0]], node # 69=NodeId[node # 69, Env[69.0 : 69.0, 1.0 : 1.0]], node # 25=NodeId[node # 25, Env[25.0 : 25.0, 1.0 : 1.0]], node # 26=NodeId[node # 26, Env[26.0 : 26.0, 1.0 : 1.0]], node # 67=NodeId[node # 67, Env[67.0 : 67.0, 1.0 : 1.0]], node # 23=NodeId[node # 23, Env[23.0 : 23.0, 1.0 : 1.0]], node # 68=NodeId[node # 68, Env[68.0 : 68.0, 1.0 : 1.0]], node # 24=NodeId[node # 24, Env[24.0 : 24.0, 1.0 : 1.0]], node # 65=NodeId[node # 65, Env[65.0 : 65.0, 1.0 : 1.0]], node # 21=NodeId[node # 21, Env[21.0 : 21.0, 1.0 : 1.0]], node # 66=NodeId[node # 66, Env[66.0 : 66.0, 1.0 : 1.0]], node # 22=NodeId[node # 22, Env[22.0 : 22.0, 1.0 : 1.0]], node # 63=NodeId[node # 63, Env[63.0 : 63.0, 1.0 : 1.0]], node # 64=NodeId[node # 64, Env[64.0 : 64.0, 1.0 : 1.0]], node # 20=NodeId[node # 20, Env[20.0 : 20.0, 1.0 : 1.0]], node # 49=NodeId[node # 49, Env[49.0 : 49.0, 1.0 : 1.0]], node # 50=NodeId[node # 50, Env[50.0 : 50.0, 1.0 : 1.0]], node # 51=NodeId[node # 51, Env[51.0 : 51.0, 1.0 : 1.0]], node # 90=NodeId[node # 90, Env[90.0 : 90.0, 1.0 : 1.0]], node # 58=NodeId[node # 58, Env[58.0 : 58.0, 1.0 : 1.0]], node # 14=NodeId[node # 14, Env[14.0 : 14.0, 1.0 : 1.0]], node # 59=NodeId[node # 59, Env[59.0 : 59.0, 1.0 : 1.0]], node # 15=NodeId[node # 15, Env[15.0 : 15.0, 1.0 : 1.0]], node # 56=NodeId[node # 56, Env[56.0 : 56.0, 1.0 : 1.0]], node # 12=NodeId[node # 12, Env[12.0 : 12.0, 1.0 : 1.0]], node # 57=NodeId[node # 57, Env[57.0 : 57.0, 1.0 : 1.0]], node # 13=NodeId[node # 13, Env[13.0 : 13.0, 1.0 : 1.0]], node # 54=NodeId[node # 54, Env[54.0 : 54.0, 1.0 : 1.0]], node # 10=NodeId[node # 10, Env[10.0 : 10.0, 1.0 : 1.0]], node # 55=NodeId[node # 55, Env[55.0 : 55.0, 1.0 : 1.0]], node # 11=NodeId[node # 11, Env[11.0 : 11.0, 1.0 : 1.0]], node # 52=NodeId[node # 52, Env[52.0 : 52.0, 1.0 : 1.0]], node # 53=NodeId[node # 53, Env[53.0 : 53.0, 1.0 : 1.0]], node # 38=NodeId[node # 38, Env[38.0 : 38.0, 1.0 : 1.0]], node # 39=NodeId[node # 39, Env[39.0 : 39.0, 1.0 : 1.0]], node # 83=NodeId[node # 83, Env[83.0 : 83.0, 1.0 : 1.0]], node # 84=NodeId[node # 84, Env[84.0 : 84.0, 1.0 : 1.0]], node # 40=NodeId[node # 40, Env[40.0 : 40.0, 1.0 : 1.0]], node # 81=NodeId[node # 81, Env[81.0 : 81.0, 1.0 : 1.0]], node # 82=NodeId[node # 82, Env[82.0 : 82.0, 1.0 : 1.0]], node # 80=NodeId[node # 80, Env[80.0 : 80.0, 1.0 : 1.0]], node # 47=NodeId[node # 47, Env[47.0 : 47.0, 1.0 : 1.0]], node # 48=NodeId[node # 48, Env[48.0 : 48.0, 1.0 : 1.0]], node # 89=NodeId[node # 89, Env[89.0 : 89.0, 1.0 : 1.0]], node # 45=NodeId[node # 45, Env[45.0 : 45.0, 1.0 : 1.0]], node # 46=NodeId[node # 46, Env[46.0 : 46.0, 1.0 : 1.0]], node # 87=NodeId[node # 87, Env[87.0 : 87.0, 1.0 : 1.0]], node # 43=NodeId[node # 43, Env[43.0 : 43.0, 1.0 : 1.0]], node # 88=NodeId[node # 88, Env[88.0 : 88.0, 1.0 : 1.0]], node # 44=NodeId[node # 44, Env[44.0 : 44.0, 1.0 : 1.0]], node # 85=NodeId[node # 85, Env[85.0 : 85.0, 1.0 : 1.0]], node # 41=NodeId[node # 41, Env[41.0 : 41.0, 1.0 : 1.0]], node # 86=NodeId[node # 86, Env[86.0 : 86.0, 1.0 : 1.0]], node # 42=NodeId[node # 42, Env[42.0 : 42.0, 1.0 : 1.0]], node # 29=NodeId[node # 29, Env[29.0 : 29.0, 1.0 : 1.0]], node # 27=NodeId[node # 27, Env[27.0 : 27.0, 1.0 : 1.0]], node # 28=NodeId[node # 28, Env[28.0 : 28.0, 1.0 : 1.0]], node # 72=NodeId[node # 72, Env[72.0 : 72.0, 1.0 : 1.0]], node # 73=NodeId[node # 73, Env[73.0 : 73.0, 1.0 : 1.0]], node # 70=NodeId[node # 70, Env[70.0 : 70.0, 1.0 : 1.0]], node # 71=NodeId[node # 71, Env[71.0 : 71.0, 1.0 : 1.0]], node # 36=NodeId[node # 36, Env[36.0 : 36.0, 1.0 : 1.0]], node # 37=NodeId[node # 37, Env[37.0 : 37.0, 1.0 : 1.0]], node # 78=NodeId[node # 78, Env[78.0 : 78.0, 1.0 : 1.0]], node # 34=NodeId[node # 34, Env[34.0 : 34.0, 1.0 : 1.0]], node # 79=NodeId[node # 79, Env[79.0 : 79.0, 1.0 : 1.0]], node # 35=NodeId[node # 35, Env[35.0 : 35.0, 1.0 : 1.0]], node # 76=NodeId[node # 76, Env[76.0 : 76.0, 1.0 : 1.0]], node # 32=NodeId[node # 32, Env[32.0 : 32.0, 1.0 : 1.0]], node # 77=NodeId[node # 77, Env[77.0 : 77.0, 1.0 : 1.0]], node # 33=NodeId[node # 33, Env[33.0 : 33.0, 1.0 : 1.0]], node # 74=NodeId[node # 74, Env[74.0 : 74.0, 1.0 : 1.0]], node # 30=NodeId[node # 30, Env[30.0 : 30.0, 1.0 : 1.0]], node # 75=NodeId[node # 75, Env[75.0 : 75.0, 1.0 : 1.0]], node # 31=NodeId[node # 31, Env[31.0 : 31.0, 1.0 : 1.0]]}, buckets: []]
  DAG[id:[2, 3], orig:EMPTY, status: CHANGED, size: 39, children: 39, buckets: 0)[children: {node # 107=NodeId[node # 107, Env[107.0 : 107.0, 1.0 : 1.0]], node # 129=NodeId[node # 129, Env[129.0 : 129.0, 1.0 : 1.0]], node # 106=NodeId[node # 106, Env[106.0 : 106.0, 1.0 : 1.0]], node # 128=NodeId[node # 128, Env[128.0 : 128.0, 1.0 : 1.0]], node # 109=NodeId[node # 109, Env[109.0 : 109.0, 1.0 : 1.0]], node # 108=NodeId[node # 108, Env[108.0 : 108.0, 1.0 : 1.0]], node # 103=NodeId[node # 103, Env[103.0 : 103.0, 1.0 : 1.0]], node # 125=NodeId[node # 125, Env[125.0 : 125.0, 1.0 : 1.0]], node # 102=NodeId[node # 102, Env[102.0 : 102.0, 1.0 : 1.0]], node # 124=NodeId[node # 124, Env[124.0 : 124.0, 1.0 : 1.0]], node # 105=NodeId[node # 105, Env[105.0 : 105.0, 1.0 : 1.0]], node # 127=NodeId[node # 127, Env[127.0 : 127.0, 1.0 : 1.0]], node # 104=NodeId[node # 104, Env[104.0 : 104.0, 1.0 : 1.0]], node # 126=NodeId[node # 126, Env[126.0 : 126.0, 1.0 : 1.0]], node # 121=NodeId[node # 121, Env[121.0 : 121.0, 1.0 : 1.0]], node # 120=NodeId[node # 120, Env[120.0 : 120.0, 1.0 : 1.0]], node # 101=NodeId[node # 101, Env[101.0 : 101.0, 1.0 : 1.0]], node # 123=NodeId[node # 123, Env[123.0 : 123.0, 1.0 : 1.0]], node # 100=NodeId[node # 100, Env[100.0 : 100.0, 1.0 : 1.0]], node # 122=NodeId[node # 122, Env[122.0 : 122.0, 1.0 : 1.0]], node # 118=NodeId[node # 118, Env[118.0 : 118.0, 1.0 : 1.0]], node # 117=NodeId[node # 117, Env[117.0 : 117.0, 1.0 : 1.0]], node # 119=NodeId[node # 119, Env[119.0 : 119.0, 1.0 : 1.0]], node # 114=NodeId[node # 114, Env[114.0 : 114.0, 1.0 : 1.0]], node # 113=NodeId[node # 113, Env[113.0 : 113.0, 1.0 : 1.0]], node # 116=NodeId[node # 116, Env[116.0 : 116.0, 1.0 : 1.0]], node # 115=NodeId[node # 115, Env[115.0 : 115.0, 1.0 : 1.0]], node # 110=NodeId[node # 110, Env[110.0 : 110.0, 1.0 : 1.0]], node # 112=NodeId[node # 112, Env[112.0 : 112.0, 1.0 : 1.0]], node # 111=NodeId[node # 111, Env[111.0 : 111.0, 1.0 : 1.0]], node # 94=NodeId[node # 94, Env[94.0 : 94.0, 1.0 : 1.0]], node # 95=NodeId[node # 95, Env[95.0 : 95.0, 1.0 : 1.0]], node # 92=NodeId[node # 92, Env[92.0 : 92.0, 1.0 : 1.0]], node # 93=NodeId[node # 93, Env[93.0 : 93.0, 1.0 : 1.0]], node # 91=NodeId[node # 91, Env[91.0 : 91.0, 1.0 : 1.0]], node # 98=NodeId[node # 98, Env[98.0 : 98.0, 1.0 : 1.0]], node # 99=NodeId[node # 99, Env[99.0 : 99.0, 1.0 : 1.0]], node # 96=NodeId[node # 96, Env[96.0 : 96.0, 1.0 : 1.0]], node # 97=NodeId[node # 97, Env[97.0 : 97.0, 1.0 : 1.0]]}, buckets: []]
Tests run: 5, Failures: 0, Errors: 0, Skipped: 0, Time elapsed: 0.371 sec - in org.locationtech.geogig.model.internal.QuadTreeClusteringStrategy_putTest
Running org.locationtech.geogig.model.internal.CanonicalClusteringStrategyRocksdbStorageTest
Tests run: 21, Failures: 0, Errors: 0, Skipped: 0, Time elapsed: 26.537 sec - in org.locationtech.geogig.test.integration.CheckoutOpTest
Tests run: 2, Failures: 1, Errors: 0, Skipped: 0, Time elapsed: 1.519 sec <<< FAILURE! - in org.locationtech.geogig.model.impl.RevFeatureTypeTest
testToString(org.locationtech.geogig.model.impl.RevFeatureTypeTest)  Time elapsed: 0.731 sec  <<< FAILURE!
org.junit.ComparisonFailure: expected:<[FeatureType[49c3a20f921b04c714609852619d29ffa7869cc9; sp: String, ip: Integer, pp: LineString]]> but was:<[RevFeatureTypeImpl(49c3a20f921b04c7)[sp: String->STRING, ip: Integer->INTEGER, pp: LineString->LINESTRING]]>
	at org.junit.Assert.assertEquals(Assert.java:115)
	at org.junit.Assert.assertEquals(Assert.java:144)
	at org.locationtech.geogig.model.impl.RevFeatureTypeTest.testToString(RevFeatureTypeTest.java:51)

Running org.locationtech.geogig.model.internal.DAGNodeTest
Running org.locationtech.geogig.storage.impl.PersistedIterableTest
Tests run: 21, Failures: 0, Errors: 0, Skipped: 0, Time elapsed: 15.407 sec - in org.locationtech.geogig.test.integration.DiffOpTest
Running org.locationtech.geogig.storage.impl.INIBlobTest
Tests run: 2, Failures: 0, Errors: 0, Skipped: 0, Time elapsed: 0.212 sec - in org.locationtech.geogig.storage.impl.PersistedIterableTest
Running org.locationtech.geogig.storage.memory.HeapIndexDatabaseConformanceTest
Tests run: 1, Failures: 0, Errors: 0, Skipped: 0, Time elapsed: 0.295 sec - in org.locationtech.geogig.storage.impl.INIBlobTest
Running org.locationtech.geogig.storage.memory.HeapGraphDatabaseTest
Removed 32,600 nodes in 812.5 ms
Tests run: 4, Failures: 0, Errors: 0, Skipped: 0, Time elapsed: 1.026 sec - in org.locationtech.geogig.model.internal.DAGNodeTest
Running org.locationtech.geogig.storage.memory.HeapConflictsDatabaseConformanceTest
Added 7,000 nodes in 58.71 ms
Removed 32,600 nodes in 1.166 s
Tests run: 13, Failures: 0, Errors: 0, Skipped: 0, Time elapsed: 0.782 sec - in org.locationtech.geogig.storage.memory.HeapGraphDatabaseTest
Running org.locationtech.geogig.storage.memory.HeapObjectDatabaseConformanceTest
Tests run: 13, Failures: 0, Errors: 0, Skipped: 0, Time elapsed: 0.365 sec - in org.locationtech.geogig.storage.memory.HeapConflictsDatabaseConformanceTest
Running org.locationtech.geogig.storage.memory.HeapBlobStoreTest
Tests run: 7, Failures: 0, Errors: 0, Skipped: 0, Time elapsed: 0.129 sec - in org.locationtech.geogig.storage.memory.HeapBlobStoreTest
Running org.locationtech.geogig.storage.memory.HeapConfigDatabaseTest
Tests run: 26, Failures: 0, Errors: 0, Skipped: 0, Time elapsed: 17.552 sec - in org.locationtech.geogig.test.integration.CommitOpTest
Running org.locationtech.geogig.storage.memory.HeapObjectStoreConformanceTest
Added 5,000 nodes in 22.52 ms
Added 1,024 nodes in 3.911 ms
Removed 400 nodes in 1.247 ms
Tests run: 5, Failures: 0, Errors: 0, Skipped: 0, Time elapsed: 7.926 sec - in org.locationtech.geogig.porcelain.index.DropIndexOpTest
Running org.locationtech.geogig.storage.memory.HeapRefDatabaseTest
Added 7,000 nodes in 994.3 ms
Added 10,000 nodes in 70.91 ms
Tests run: 15, Failures: 0, Errors: 0, Skipped: 0, Time elapsed: 9.388 sec - in org.locationtech.geogig.plumbing.WriteTree2Test
Tests run: 11, Failures: 0, Errors: 0, Skipped: 0, Time elapsed: 0.352 sec - in org.locationtech.geogig.storage.memory.HeapRefDatabaseTest
Running org.locationtech.geogig.storage.datastream.DataStreamSerializationFactoryV2_1Test
Tests run: 23, Failures: 0, Errors: 0, Skipped: 0, Time elapsed: 1.242 sec - in org.locationtech.geogig.storage.memory.HeapConfigDatabaseTest
Running org.locationtech.geogig.storage.datastream.v2_3.RevTreeFormatPrefTest
[main] INFO org.locationtech.geogig.test.performance.EnablePerformanceTestRule - org.locationtech.geogig.storage.datastream.v2_3.RevTreeFormatPrefTest ignored, run with -Dgeogig.runPerformanceTests=true to enable it.
[main] INFO org.locationtech.geogig.test.performance.EnablePerformanceTestRule - org.locationtech.geogig.storage.datastream.v2_3.RevTreeFormatPrefTest ignored, run with -Dgeogig.runPerformanceTests=true to enable it.
[main] INFO org.locationtech.geogig.test.performance.EnablePerformanceTestRule - org.locationtech.geogig.storage.datastream.v2_3.RevTreeFormatPrefTest ignored, run with -Dgeogig.runPerformanceTests=true to enable it.
[main] INFO org.locationtech.geogig.test.performance.EnablePerformanceTestRule - org.locationtech.geogig.storage.datastream.v2_3.RevTreeFormatPrefTest ignored, run with -Dgeogig.runPerformanceTests=true to enable it.
[main] INFO org.locationtech.geogig.test.performance.EnablePerformanceTestRule - org.locationtech.geogig.storage.datastream.v2_3.RevTreeFormatPrefTest ignored, run with -Dgeogig.runPerformanceTests=true to enable it.
[main] INFO org.locationtech.geogig.test.performance.EnablePerformanceTestRule - org.locationtech.geogig.storage.datastream.v2_3.RevTreeFormatPrefTest ignored, run with -Dgeogig.runPerformanceTests=true to enable it.
Tests run: 6, Failures: 0, Errors: 0, Skipped: 0, Time elapsed: 0.012 sec - in org.locationtech.geogig.storage.datastream.v2_3.RevTreeFormatPrefTest
Running org.locationtech.geogig.storage.datastream.v2_3.TailTest
Tests run: 1, Failures: 0, Errors: 0, Skipped: 0, Time elapsed: 0 sec - in org.locationtech.geogig.storage.datastream.v2_3.TailTest
Running org.locationtech.geogig.storage.datastream.v2_3.DataStreamSerializationFactoryV2_3Test
Running org.locationtech.geogig.storage.datastream.v2_3.RevTreeFormatTest
Tests run: 10, Failures: 0, Errors: 0, Skipped: 1, Time elapsed: 6.682 sec - in org.locationtech.geogig.porcelain.RemoveOpTest
Running org.locationtech.geogig.storage.datastream.v2_3.NodeSetTest
Tests run: 11, Failures: 0, Errors: 0, Skipped: 0, Time elapsed: 4.371 sec - in org.locationtech.geogig.model.internal.CanonicalClusteringStrategyHeapStorageTest
Added 5,000 nodes in 367.8 ms
Running org.locationtech.geogig.storage.datastream.v2_3.StringTableTest
Added 1,024 nodes in 7.520 ms
Removed 400 nodes in 2.188 ms
Added 10,000 nodes in 172.4 ms
Tests run: 10, Failures: 0, Errors: 0, Skipped: 0, Time elapsed: 13.062 sec - in org.locationtech.geogig.plumbing.RevParseTest
Tests run: 24, Failures: 0, Errors: 0, Skipped: 0, Time elapsed: 1.212 sec - in org.locationtech.geogig.storage.datastream.v2_3.DataStreamSerializationFactoryV2_3Test
Tests run: 24, Failures: 0, Errors: 0, Skipped: 0, Time elapsed: 1.335 sec - in org.locationtech.geogig.storage.datastream.DataStreamSerializationFactoryV2_1Test
Tests run: 2, Failures: 0, Errors: 0, Skipped: 0, Time elapsed: 0.004 sec - in org.locationtech.geogig.storage.datastream.v2_3.StringTableTest
Tests run: 6, Failures: 0, Errors: 0, Skipped: 0, Time elapsed: 11.959 sec - in org.locationtech.geogig.plumbing.DiffBoundsTest
Running org.locationtech.geogig.storage.datastream.VarintTest
Running org.locationtech.geogig.storage.datastream.DataStreamSerializationFactoryV2_2Test
Tests run: 11, Failures: 0, Errors: 0, Skipped: 0, Time elapsed: 6.744 sec - in org.locationtech.geogig.model.impl.LegacyTreeBuilderTest
Tests run: 36, Failures: 0, Errors: 0, Skipped: 0, Time elapsed: 5.253 sec - in org.locationtech.geogig.storage.memory.HeapIndexDatabaseConformanceTest
Tests run: 11, Failures: 0, Errors: 0, Skipped: 0, Time elapsed: 6.747 sec - in org.locationtech.geogig.model.internal.CanonicalClusteringStrategyRocksdbStorageTest
Running org.locationtech.geogig.storage.datastream.Float32BoundsSerializationTest
Running org.locationtech.geogig.storage.datastream.DataStreamSerializationFactoryV2Test
Tests run: 2, Failures: 0, Errors: 0, Skipped: 0, Time elapsed: 0 sec - in org.locationtech.geogig.storage.datastream.Float32BoundsSerializationTest
Running org.locationtech.geogig.storage.datastream.DataStreamSerializationFactoryV1Test
Running org.locationtech.geogig.storage.datastream.FormatCommonV2_1Test
Running org.locationtech.geogig.storage.datastream.LZ4SerializationFactoryTest
Running org.locationtech.geogig.storage.datastream.LZFSerializationFactoryTest
Running org.locationtech.geogig.storage.datastream.FloatPackedCoordinateSequenceTest
Tests run: 3, Failures: 0, Errors: 0, Skipped: 0, Time elapsed: 0 sec - in org.locationtech.geogig.storage.datastream.FloatPackedCoordinateSequenceTest
Tests run: 4, Failures: 0, Errors: 0, Skipped: 0, Time elapsed: 0.023 sec - in org.locationtech.geogig.storage.datastream.VarintTest
Running org.locationtech.geogig.storage.cache.ObjectCacheTest
Running org.locationtech.geogig.storage.cache.KeyTest
Tests run: 2, Failures: 0, Errors: 0, Skipped: 0, Time elapsed: 0 sec - in org.locationtech.geogig.storage.cache.KeyTest
Running org.locationtech.geogig.storage.cache.CacheManagerTest
Tests run: 6, Failures: 0, Errors: 0, Skipped: 0, Time elapsed: 0.021 sec - in org.locationtech.geogig.storage.cache.ObjectCacheTest
Running org.locationtech.geogig.storage.text.TextSerializationFactoryTest
Tests run: 4, Failures: 0, Errors: 0, Skipped: 0, Time elapsed: 0.037 sec - in org.locationtech.geogig.storage.datastream.FormatCommonV2_1Test
Running org.locationtech.geogig.storage.fs.IniFileConfigDatabaseTest
Tests run: 28, Failures: 0, Errors: 0, Skipped: 0, Time elapsed: 5.206 sec - in org.locationtech.geogig.storage.memory.HeapObjectDatabaseConformanceTest
Running org.locationtech.geogig.storage.fs.FileBlobStoreTest
Tests run: 24, Failures: 0, Errors: 0, Skipped: 0, Time elapsed: 0.155 sec - in org.locationtech.geogig.storage.datastream.DataStreamSerializationFactoryV2Test
Tests run: 20, Failures: 0, Errors: 0, Skipped: 0, Time elapsed: 4.688 sec - in org.locationtech.geogig.storage.memory.HeapObjectStoreConformanceTest
Running org.locationtech.geogig.storage.fs.FileRefDatabaseTest
Running org.locationtech.geogig.storage.StorageTypeTest
Tests run: 4, Failures: 0, Errors: 0, Skipped: 0, Time elapsed: 0.011 sec - in org.locationtech.geogig.storage.StorageTypeTest
Running org.locationtech.geogig.repository.impl.RepositoryResolverTest
Tests run: 3, Failures: 0, Errors: 0, Skipped: 0, Time elapsed: 0.004 sec - in org.locationtech.geogig.repository.impl.RepositoryResolverTest
Running org.locationtech.geogig.repository.impl.SpatialOpsTest
[main] INFO org.locationtech.geogig.storage.cache.CacheManager - Registered GeoGig cache manager MBean as org.geogig:type=shared-cache
Tests run: 24, Failures: 0, Errors: 0, Skipped: 0, Time elapsed: 0.501 sec - in org.locationtech.geogig.storage.datastream.DataStreamSerializationFactoryV2_2Test
Running org.locationtech.geogig.repository.impl.DepthSearchTest
Tests run: 24, Failures: 0, Errors: 0, Skipped: 1, Time elapsed: 0.503 sec - in org.locationtech.geogig.storage.datastream.LZ4SerializationFactoryTest
Running org.locationtech.geogig.repository.impl.RevFeatureBuilderTest
[main] INFO org.locationtech.geogig.storage.cache.CacheManager - Configuring GeoGig shared object cache maximum size to the default of 2,500 bytes as given by the default 0.250000 percent of available heap. Use the GEOGIG_CACHE_MAX_SIZE System property or environmentvariable to set a different maximum size at runtime
[main] INFO org.locationtech.geogig.storage.cache.CacheManager - Configuring GeoGig shared object cache maximum size to 1,025 bytes as given by the System property GEOGIG_CACHE_MAX_SIZE=1025
Tests run: 24, Failures: 0, Errors: 0, Skipped: 0, Time elapsed: 0.553 sec - in org.locationtech.geogig.storage.datastream.DataStreamSerializationFactoryV1Test
[main] WARN org.locationtech.geogig.storage.cache.CacheManager - cache size is too big: 1025, maximum allowed: 921
[main] INFO org.locationtech.geogig.storage.cache.CacheManager - Configuring GeoGig shared object cache maximum size to the default of 256 bytes as given by the default 0.250000 percent of available heap. Use the GEOGIG_CACHE_MAX_SIZE System property or environmentvariable to set a different maximum size at runtime
[main] INFO org.locationtech.geogig.storage.cache.CacheManager - Configuring GeoGig shared object cache maximum size to the default of 119,406,592 bytes as given by the default 0.250000 percent of available heap. Use the GEOGIG_CACHE_MAX_SIZE System property or environmentvariable to set a different maximum size at runtime
[main] INFO org.locationtech.geogig.storage.cache.CacheManager - Obtained cache builder org.locationtech.geogig.storage.cache.CacheManagerTest$TestCacheBuilder
[main] INFO org.locationtech.geogig.storage.cache.CacheManager - Initialized shared cache org.locationtech.geogig.storage.cache.CacheManagerTest$TestCacheBuilder$TestCache
[main] INFO org.locationtech.geogig.storage.cache.CacheManager - Configuring GeoGig shared object cache maximum size to 1,048,576 bytes as given by the System property GEOGIG_CACHE_MAX_SIZE=1M
[main] INFO org.locationtech.geogig.storage.cache.CacheManager - Configuring GeoGig shared object cache maximum size to 102,400 bytes as given by the System property GEOGIG_CACHE_MAX_SIZE=100K
[main] INFO org.locationtech.geogig.storage.cache.CacheManager - Configuring GeoGig shared object cache maximum size to 5,000 bytes as given by the System property GEOGIG_CACHE_MAX_SIZE=0.5
[main] INFO org.locationtech.geogig.storage.cache.CacheManager - Obtained cache builder org.locationtech.geogig.storage.cache.CacheManagerTest$TestCacheBuilder
[main] INFO org.locationtech.geogig.storage.cache.CacheManager - Initialized shared cache org.locationtech.geogig.storage.cache.CacheManagerTest$TestCacheBuilder$TestCache
Tests run: 24, Failures: 0, Errors: 0, Skipped: 0, Time elapsed: 0.599 sec - in org.locationtech.geogig.storage.datastream.LZFSerializationFactoryTest
[main] WARN org.locationtech.geogig.storage.cache.CacheManager - Unable to parse System property GEOGIG_CACHE_MAX_SIZE=-1G. Falling back to default value
java.lang.IllegalArgumentException: Value must be a positive number or zero
	at com.google.common.base.Preconditions.checkArgument(Preconditions.java:135)
	at org.locationtech.geogig.storage.cache.CacheManager.parseCacheSizeArgument(CacheManager.java:272)
	at org.locationtech.geogig.storage.cache.CacheManagerTest.assertDefaultMaxSizeDefaultValue(CacheManagerTest.java:209)
	at org.locationtech.geogig.storage.cache.CacheManagerTest.resolveDefaultMaxSizeSystemPropertyInvalidValue(CacheManagerTest.java:228)
	at sun.reflect.NativeMethodAccessorImpl.invoke0(Native Method)
	at sun.reflect.NativeMethodAccessorImpl.invoke(NativeMethodAccessorImpl.java:62)
	at sun.reflect.DelegatingMethodAccessorImpl.invoke(DelegatingMethodAccessorImpl.java:43)
	at java.lang.reflect.Method.invoke(Method.java:498)
	at org.junit.runners.model.FrameworkMethod$1.runReflectiveCall(FrameworkMethod.java:50)
	at org.junit.internal.runners.model.ReflectiveCallable.run(ReflectiveCallable.java:12)
	at org.junit.runners.model.FrameworkMethod.invokeExplosively(FrameworkMethod.java:47)
	at org.junit.internal.runners.statements.InvokeMethod.evaluate(InvokeMethod.java:17)
	at org.junit.internal.runners.statements.RunBefores.evaluate(RunBefores.java:26)
	at org.junit.internal.runners.statements.RunAfters.evaluate(RunAfters.java:27)
	at org.junit.rules.ExpectedException$ExpectedExceptionStatement.evaluate(ExpectedException.java:239)
	at org.junit.rules.RunRules.evaluate(RunRules.java:20)
	at org.junit.runners.ParentRunner.runLeaf(ParentRunner.java:325)
	at org.junit.runners.BlockJUnit4ClassRunner.runChild(BlockJUnit4ClassRunner.java:78)
	at org.junit.runners.BlockJUnit4ClassRunner.runChild(BlockJUnit4ClassRunner.java:57)
	at org.junit.runners.ParentRunner$3.run(ParentRunner.java:290)
	at org.junit.runners.ParentRunner$1.schedule(ParentRunner.java:71)
	at org.junit.runners.ParentRunner.runChildren(ParentRunner.java:288)
	at org.junit.runners.ParentRunner.access$000(ParentRunner.java:58)
	at org.junit.runners.ParentRunner$2.evaluate(ParentRunner.java:268)
	at org.junit.runners.ParentRunner.run(ParentRunner.java:363)
	at org.apache.maven.surefire.junit4.JUnit4Provider.execute(JUnit4Provider.java:264)
	at org.apache.maven.surefire.junit4.JUnit4Provider.executeTestSet(JUnit4Provider.java:153)
	at org.apache.maven.surefire.junit4.JUnit4Provider.invoke(JUnit4Provider.java:124)
	at org.apache.maven.surefire.booter.ForkedBooter.invokeProviderInSameClassLoader(ForkedBooter.java:200)
	at org.apache.maven.surefire.booter.ForkedBooter.runSuitesInProcess(ForkedBooter.java:153)
	at org.apache.maven.surefire.booter.ForkedBooter.main(ForkedBooter.java:103)
[main] INFO org.locationtech.geogig.storage.cache.CacheManager - Configuring GeoGig shared object cache maximum size to the default of 2,500 bytes as given by the default 0.250000 percent of available heap. Use the GEOGIG_CACHE_MAX_SIZE System property or environmentvariable to set a different maximum size at runtime
[main] INFO org.locationtech.geogig.storage.cache.CacheManager - Obtained cache builder org.locationtech.geogig.storage.cache.CacheManagerTest$TestCacheBuilder
[main] INFO org.locationtech.geogig.storage.cache.CacheManager - Initialized shared cache org.locationtech.geogig.storage.cache.CacheManagerTest$TestCacheBuilder$TestCache
[main] INFO org.locationtech.geogig.storage.cache.CacheManager - Obtained cache builder org.locationtech.geogig.storage.cache.CacheManagerTest$TestCacheBuilder
[main] INFO org.locationtech.geogig.storage.cache.CacheManager - Initialized shared cache org.locationtech.geogig.storage.cache.CacheManagerTest$TestCacheBuilder$TestCache
[main] WARN org.locationtech.geogig.storage.cache.CacheManager - Unable to parse System property GEOGIG_CACHE_MAX_SIZE=. Falling back to default value
java.lang.IllegalArgumentException: Invalid format (), expected <float>[B|K|M|G]
	at org.locationtech.geogig.storage.cache.CacheManager.parseCacheSizeArgument(CacheManager.java:284)
	at org.locationtech.geogig.storage.cache.CacheManagerTest.getDefaultSizeMB(CacheManagerTest.java:291)
	at sun.reflect.NativeMethodAccessorImpl.invoke0(Native Method)
	at sun.reflect.NativeMethodAccessorImpl.invoke(NativeMethodAccessorImpl.java:62)
	at sun.reflect.DelegatingMethodAccessorImpl.invoke(DelegatingMethodAccessorImpl.java:43)
	at java.lang.reflect.Method.invoke(Method.java:498)
	at org.junit.runners.model.FrameworkMethod$1.runReflectiveCall(FrameworkMethod.java:50)
	at org.junit.internal.runners.model.ReflectiveCallable.run(ReflectiveCallable.java:12)
	at org.junit.runners.model.FrameworkMethod.invokeExplosively(FrameworkMethod.java:47)
	at org.junit.internal.runners.statements.InvokeMethod.evaluate(InvokeMethod.java:17)
	at org.junit.internal.runners.statements.RunBefores.evaluate(RunBefores.java:26)
	at org.junit.internal.runners.statements.RunAfters.evaluate(RunAfters.java:27)
	at org.junit.rules.ExpectedException$ExpectedExceptionStatement.evaluate(ExpectedException.java:239)
	at org.junit.rules.RunRules.evaluate(RunRules.java:20)
	at org.junit.runners.ParentRunner.runLeaf(ParentRunner.java:325)
	at org.junit.runners.BlockJUnit4ClassRunner.runChild(BlockJUnit4ClassRunner.java:78)
	at org.junit.runners.BlockJUnit4ClassRunner.runChild(BlockJUnit4ClassRunner.java:57)
	at org.junit.runners.ParentRunner$3.run(ParentRunner.java:290)
	at org.junit.runners.ParentRunner$1.schedule(ParentRunner.java:71)
	at org.junit.runners.ParentRunner.runChildren(ParentRunner.java:288)
	at org.junit.runners.ParentRunner.access$000(ParentRunner.java:58)
	at org.junit.runners.ParentRunner$2.evaluate(ParentRunner.java:268)
	at org.junit.runners.ParentRunner.run(ParentRunner.java:363)
	at org.apache.maven.surefire.junit4.JUnit4Provider.execute(JUnit4Provider.java:264)
	at org.apache.maven.surefire.junit4.JUnit4Provider.executeTestSet(JUnit4Provider.java:153)
	at org.apache.maven.surefire.junit4.JUnit4Provider.invoke(JUnit4Provider.java:124)
	at org.apache.maven.surefire.booter.ForkedBooter.invokeProviderInSameClassLoader(ForkedBooter.java:200)
	at org.apache.maven.surefire.booter.ForkedBooter.runSuitesInProcess(ForkedBooter.java:153)
	at org.apache.maven.surefire.booter.ForkedBooter.main(ForkedBooter.java:103)
[main] WARN org.locationtech.geogig.storage.cache.CacheManager - Unable to parse environment variable GEOGIG_CACHE_MAX_SIZE=
java.lang.IllegalArgumentException: Invalid format (), expected <float>[B|K|M|G]
	at org.locationtech.geogig.storage.cache.CacheManager.parseCacheSizeArgument(CacheManager.java:284)
	at org.locationtech.geogig.storage.cache.CacheManagerTest.getDefaultSizeMB(CacheManagerTest.java:291)
	at sun.reflect.NativeMethodAccessorImpl.invoke0(Native Method)
	at sun.reflect.NativeMethodAccessorImpl.invoke(NativeMethodAccessorImpl.java:62)
	at sun.reflect.DelegatingMethodAccessorImpl.invoke(DelegatingMethodAccessorImpl.java:43)
	at java.lang.reflect.Method.invoke(Method.java:498)
	at org.junit.runners.model.FrameworkMethod$1.runReflectiveCall(FrameworkMethod.java:50)
	at org.junit.internal.runners.model.ReflectiveCallable.run(ReflectiveCallable.java:12)
	at org.junit.runners.model.FrameworkMethod.invokeExplosively(FrameworkMethod.java:47)
	at org.junit.internal.runners.statements.InvokeMethod.evaluate(InvokeMethod.java:17)
	at org.junit.internal.runners.statements.RunBefores.evaluate(RunBefores.java:26)
	at org.junit.internal.runners.statements.RunAfters.evaluate(RunAfters.java:27)
	at org.junit.rules.ExpectedException$ExpectedExceptionStatement.evaluate(ExpectedException.java:239)
	at org.junit.rules.RunRules.evaluate(RunRules.java:20)
	at org.junit.runners.ParentRunner.runLeaf(ParentRunner.java:325)
	at org.junit.runners.BlockJUnit4ClassRunner.runChild(BlockJUnit4ClassRunner.java:78)
	at org.junit.runners.BlockJUnit4ClassRunner.runChild(BlockJUnit4ClassRunner.java:57)
	at org.junit.runners.ParentRunner$3.run(ParentRunner.java:290)
	at org.junit.runners.ParentRunner$1.schedule(ParentRunner.java:71)
	at org.junit.runners.ParentRunner.runChildren(ParentRunner.java:288)
	at org.junit.runners.ParentRunner.access$000(ParentRunner.java:58)
	at org.junit.runners.ParentRunner$2.evaluate(ParentRunner.java:268)
	at org.junit.runners.ParentRunner.run(ParentRunner.java:363)
	at org.apache.maven.surefire.junit4.JUnit4Provider.execute(JUnit4Provider.java:264)
	at org.apache.maven.surefire.junit4.JUnit4Provider.executeTestSet(JUnit4Provider.java:153)
	at org.apache.maven.surefire.junit4.JUnit4Provider.invoke(JUnit4Provider.java:124)
	at org.apache.maven.surefire.booter.ForkedBooter.invokeProviderInSameClassLoader(ForkedBooter.java:200)
	at org.apache.maven.surefire.booter.ForkedBooter.runSuitesInProcess(ForkedBooter.java:153)
	at org.apache.maven.surefire.booter.ForkedBooter.main(ForkedBooter.java:103)
[main] INFO org.locationtech.geogig.storage.cache.CacheManager - Configuring GeoGig shared object cache maximum size to the default of 2,621,440 bytes as given by the default 0.250000 percent of available heap. Use the GEOGIG_CACHE_MAX_SIZE System property or environmentvariable to set a different maximum size at runtime
[main] WARN org.locationtech.geogig.storage.cache.CacheManager - Unable to parse System property GEOGIG_CACHE_MAX_SIZE=-1G. Falling back to environment variable
java.lang.IllegalArgumentException: Value must be a positive number or zero
	at com.google.common.base.Preconditions.checkArgument(Preconditions.java:135)
	at org.locationtech.geogig.storage.cache.CacheManager.parseCacheSizeArgument(CacheManager.java:272)
	at org.locationtech.geogig.storage.cache.CacheManagerTest.resolveDefaultMaxSizeInvalidSysPropFallsBackToEnvVariable(CacheManagerTest.java:256)
	at sun.reflect.NativeMethodAccessorImpl.invoke0(Native Method)
	at sun.reflect.NativeMethodAccessorImpl.invoke(NativeMethodAccessorImpl.java:62)
	at sun.reflect.DelegatingMethodAccessorImpl.invoke(DelegatingMethodAccessorImpl.java:43)
	at java.lang.reflect.Method.invoke(Method.java:498)
	at org.junit.runners.model.FrameworkMethod$1.runReflectiveCall(FrameworkMethod.java:50)
	at org.junit.internal.runners.model.ReflectiveCallable.run(ReflectiveCallable.java:12)
	at org.junit.runners.model.FrameworkMethod.invokeExplosively(FrameworkMethod.java:47)
	at org.junit.internal.runners.statements.InvokeMethod.evaluate(InvokeMethod.java:17)
	at org.junit.internal.runners.statements.RunBefores.evaluate(RunBefores.java:26)
	at org.junit.internal.runners.statements.RunAfters.evaluate(RunAfters.java:27)
	at org.junit.rules.ExpectedException$ExpectedExceptionStatement.evaluate(ExpectedException.java:239)
	at org.junit.rules.RunRules.evaluate(RunRules.java:20)
	at org.junit.runners.ParentRunner.runLeaf(ParentRunner.java:325)
	at org.junit.runners.BlockJUnit4ClassRunner.runChild(BlockJUnit4ClassRunner.java:78)
	at org.junit.runners.BlockJUnit4ClassRunner.runChild(BlockJUnit4ClassRunner.java:57)
	at org.junit.runners.ParentRunner$3.run(ParentRunner.java:290)
	at org.junit.runners.ParentRunner$1.schedule(ParentRunner.java:71)
	at org.junit.runners.ParentRunner.runChildren(ParentRunner.java:288)
	at org.junit.runners.ParentRunner.access$000(ParentRunner.java:58)
	at org.junit.runners.ParentRunner$2.evaluate(ParentRunner.java:268)
	at org.junit.runners.ParentRunner.run(ParentRunner.java:363)
	at org.apache.maven.surefire.junit4.JUnit4Provider.execute(JUnit4Provider.java:264)
	at org.apache.maven.surefire.junit4.JUnit4Provider.executeTestSet(JUnit4Provider.java:153)
	at org.apache.maven.surefire.junit4.JUnit4Provider.invoke(JUnit4Provider.java:124)
	at org.apache.maven.surefire.booter.ForkedBooter.invokeProviderInSameClassLoader(ForkedBooter.java:200)
	at org.apache.maven.surefire.booter.ForkedBooter.runSuitesInProcess(ForkedBooter.java:153)
	at org.apache.maven.surefire.booter.ForkedBooter.main(ForkedBooter.java:103)
[main] INFO org.locationtech.geogig.storage.cache.CacheManager - Configuring GeoGig shared object cache maximum size to 1,024 bytes as given by the environment variable GEOGIG_CACHE_MAX_SIZE=1024
[main] WARN org.locationtech.geogig.storage.cache.CacheManager - Unable to parse System property GEOGIG_CACHE_MAX_SIZE=. Falling back to environment variable
java.lang.IllegalArgumentException: Invalid format (), expected <float>[B|K|M|G]
	at org.locationtech.geogig.storage.cache.CacheManager.parseCacheSizeArgument(CacheManager.java:284)
	at org.locationtech.geogig.storage.cache.CacheManagerTest.resolveDefaultMaxSizeEnvironmantVariable(CacheManagerTest.java:235)
	at sun.reflect.NativeMethodAccessorImpl.invoke0(Native Method)
	at sun.reflect.NativeMethodAccessorImpl.invoke(NativeMethodAccessorImpl.java:62)
	at sun.reflect.DelegatingMethodAccessorImpl.invoke(DelegatingMethodAccessorImpl.java:43)
	at java.lang.reflect.Method.invoke(Method.java:498)
	at org.junit.runners.model.FrameworkMethod$1.runReflectiveCall(FrameworkMethod.java:50)
	at org.junit.internal.runners.model.ReflectiveCallable.run(ReflectiveCallable.java:12)
	at org.junit.runners.model.FrameworkMethod.invokeExplosively(FrameworkMethod.java:47)
	at org.junit.internal.runners.statements.InvokeMethod.evaluate(InvokeMethod.java:17)
	at org.junit.internal.runners.statements.RunBefores.evaluate(RunBefores.java:26)
	at org.junit.internal.runners.statements.RunAfters.evaluate(RunAfters.java:27)
	at org.junit.rules.ExpectedException$ExpectedExceptionStatement.evaluate(ExpectedException.java:239)
	at org.junit.rules.RunRules.evaluate(RunRules.java:20)
	at org.junit.runners.ParentRunner.runLeaf(ParentRunner.java:325)
	at org.junit.runners.BlockJUnit4ClassRunner.runChild(BlockJUnit4ClassRunner.java:78)
	at org.junit.runners.BlockJUnit4ClassRunner.runChild(BlockJUnit4ClassRunner.java:57)
	at org.junit.runners.ParentRunner$3.run(ParentRunner.java:290)
	at org.junit.runners.ParentRunner$1.schedule(ParentRunner.java:71)
	at org.junit.runners.ParentRunner.runChildren(ParentRunner.java:288)
	at org.junit.runners.ParentRunner.access$000(ParentRunner.java:58)
	at org.junit.runners.ParentRunner$2.evaluate(ParentRunner.java:268)
	at org.junit.runners.ParentRunner.run(ParentRunner.java:363)
	at org.apache.maven.surefire.junit4.JUnit4Provider.execute(JUnit4Provider.java:264)
	at org.apache.maven.surefire.junit4.JUnit4Provider.executeTestSet(JUnit4Provider.java:153)
	at org.apache.maven.surefire.junit4.JUnit4Provider.invoke(JUnit4Provider.java:124)
	at org.apache.maven.surefire.booter.ForkedBooter.invokeProviderInSameClassLoader(ForkedBooter.java:200)
	at org.apache.maven.surefire.booter.ForkedBooter.runSuitesInProcess(ForkedBooter.java:153)
	at org.apache.maven.surefire.booter.ForkedBooter.main(ForkedBooter.java:103)
[main] INFO org.locationtech.geogig.storage.cache.CacheManager - Configuring GeoGig shared object cache maximum size to 1,048,576 bytes as given by the environment variable GEOGIG_CACHE_MAX_SIZE=1M
[main] WARN org.locationtech.geogig.storage.cache.CacheManager - Unable to parse System property GEOGIG_CACHE_MAX_SIZE=. Falling back to environment variable
java.lang.IllegalArgumentException: Invalid format (), expected <float>[B|K|M|G]
	at org.locationtech.geogig.storage.cache.CacheManager.parseCacheSizeArgument(CacheManager.java:284)
	at org.locationtech.geogig.storage.cache.CacheManagerTest.resolveDefaultMaxSizeEnvironmantVariable(CacheManagerTest.java:238)
	at sun.reflect.NativeMethodAccessorImpl.invoke0(Native Method)
	at sun.reflect.NativeMethodAccessorImpl.invoke(NativeMethodAccessorImpl.java:62)
	at sun.reflect.DelegatingMethodAccessorImpl.invoke(DelegatingMethodAccessorImpl.java:43)
	at java.lang.reflect.Method.invoke(Method.java:498)
	at org.junit.runners.model.FrameworkMethod$1.runReflectiveCall(FrameworkMethod.java:50)
	at org.junit.internal.runners.model.ReflectiveCallable.run(ReflectiveCallable.java:12)
	at org.junit.runners.model.FrameworkMethod.invokeExplosively(FrameworkMethod.java:47)
	at org.junit.internal.runners.statements.InvokeMethod.evaluate(InvokeMethod.java:17)
	at org.junit.internal.runners.statements.RunBefores.evaluate(RunBefores.java:26)
	at org.junit.internal.runners.statements.RunAfters.evaluate(RunAfters.java:27)
	at org.junit.rules.ExpectedException$ExpectedExceptionStatement.evaluate(ExpectedException.java:239)
	at org.junit.rules.RunRules.evaluate(RunRules.java:20)
	at org.junit.runners.ParentRunner.runLeaf(ParentRunner.java:325)
	at org.junit.runners.BlockJUnit4ClassRunner.runChild(BlockJUnit4ClassRunner.java:78)
	at org.junit.runners.BlockJUnit4ClassRunner.runChild(BlockJUnit4ClassRunner.java:57)
	at org.junit.runners.ParentRunner$3.run(ParentRunner.java:290)
	at org.junit.runners.ParentRunner$1.schedule(ParentRunner.java:71)
	at org.junit.runners.ParentRunner.runChildren(ParentRunner.java:288)
	at org.junit.runners.ParentRunner.access$000(ParentRunner.java:58)
	at org.junit.runners.ParentRunner$2.evaluate(ParentRunner.java:268)
	at org.junit.runners.ParentRunner.run(ParentRunner.java:363)
	at org.apache.maven.surefire.junit4.JUnit4Provider.execute(JUnit4Provider.java:264)
	at org.apache.maven.surefire.junit4.JUnit4Provider.executeTestSet(JUnit4Provider.java:153)
	at org.apache.maven.surefire.junit4.JUnit4Provider.invoke(JUnit4Provider.java:124)
	at org.apache.maven.surefire.booter.ForkedBooter.invokeProviderInSameClassLoader(ForkedBooter.java:200)
	at org.apache.maven.surefire.booter.ForkedBooter.runSuitesInProcess(ForkedBooter.java:153)
	at org.apache.maven.surefire.booter.ForkedBooter.main(ForkedBooter.java:103)
[main] INFO org.locationtech.geogig.storage.cache.CacheManager - Configuring GeoGig shared object cache maximum size to 102,400 bytes as given by the environment variable GEOGIG_CACHE_MAX_SIZE=100K
[main] WARN org.locationtech.geogig.storage.cache.CacheManager - Unable to parse System property GEOGIG_CACHE_MAX_SIZE=. Falling back to environment variable
java.lang.IllegalArgumentException: Invalid format (), expected <float>[B|K|M|G]
	at org.locationtech.geogig.storage.cache.CacheManager.parseCacheSizeArgument(CacheManager.java:284)
	at org.locationtech.geogig.storage.cache.CacheManagerTest.resolveDefaultMaxSizeEnvironmantVariable(CacheManagerTest.java:244)
	at sun.reflect.NativeMethodAccessorImpl.invoke0(Native Method)
	at sun.reflect.NativeMethodAccessorImpl.invoke(NativeMethodAccessorImpl.java:62)
	at sun.reflect.DelegatingMethodAccessorImpl.invoke(DelegatingMethodAccessorImpl.java:43)
	at java.lang.reflect.Method.invoke(Method.java:498)
	at org.junit.runners.model.FrameworkMethod$1.runReflectiveCall(FrameworkMethod.java:50)
	at org.junit.internal.runners.model.ReflectiveCallable.run(ReflectiveCallable.java:12)
	at org.junit.runners.model.FrameworkMethod.invokeExplosively(FrameworkMethod.java:47)
	at org.junit.internal.runners.statements.InvokeMethod.evaluate(InvokeMethod.java:17)
	at org.junit.internal.runners.statements.RunBefores.evaluate(RunBefores.java:26)
	at org.junit.internal.runners.statements.RunAfters.evaluate(RunAfters.java:27)
	at org.junit.rules.ExpectedException$ExpectedExceptionStatement.evaluate(ExpectedException.java:239)
	at org.junit.rules.RunRules.evaluate(RunRules.java:20)
	at org.junit.runners.ParentRunner.runLeaf(ParentRunner.java:325)
	at org.junit.runners.BlockJUnit4ClassRunner.runChild(BlockJUnit4ClassRunner.java:78)
	at org.junit.runners.BlockJUnit4ClassRunner.runChild(BlockJUnit4ClassRunner.java:57)
	at org.junit.runners.ParentRunner$3.run(ParentRunner.java:290)
	at org.junit.runners.ParentRunner$1.schedule(ParentRunner.java:71)
	at org.junit.runners.ParentRunner.runChildren(ParentRunner.java:288)
	at org.junit.runners.ParentRunner.access$000(ParentRunner.java:58)
	at org.junit.runners.ParentRunner$2.evaluate(ParentRunner.java:268)
	at org.junit.runners.ParentRunner.run(ParentRunner.java:363)
	at org.apache.maven.surefire.junit4.JUnit4Provider.execute(JUnit4Provider.java:264)
	at org.apache.maven.surefire.junit4.JUnit4Provider.executeTestSet(JUnit4Provider.java:153)
	at org.apache.maven.surefire.junit4.JUnit4Provider.invoke(JUnit4Provider.java:124)
	at org.apache.maven.surefire.booter.ForkedBooter.invokeProviderInSameClassLoader(ForkedBooter.java:200)
	at org.apache.maven.surefire.booter.ForkedBooter.runSuitesInProcess(ForkedBooter.java:153)
	at org.apache.maven.surefire.booter.ForkedBooter.main(ForkedBooter.java:103)
[main] INFO org.locationtech.geogig.storage.cache.CacheManager - Configuring GeoGig shared object cache maximum size to 5,000 bytes as given by the environment variable GEOGIG_CACHE_MAX_SIZE=0.5
[main] WARN org.locationtech.geogig.storage.cache.CacheManager - Unable to parse System property GEOGIG_CACHE_MAX_SIZE=. Falling back to environment variable
java.lang.IllegalArgumentException: Invalid format (), expected <float>[B|K|M|G]
	at org.locationtech.geogig.storage.cache.CacheManager.parseCacheSizeArgument(CacheManager.java:284)
	at org.locationtech.geogig.storage.cache.CacheManagerTest.assertDefaultMaxSizeDefaultValue(CacheManagerTest.java:209)
	at org.locationtech.geogig.storage.cache.CacheManagerTest.resolveDefaultMaxSizeEnvironmantVariableInvalidValue(CacheManagerTest.java:250)
	at sun.reflect.NativeMethodAccessorImpl.invoke0(Native Method)
	at sun.reflect.NativeMethodAccessorImpl.invoke(NativeMethodAccessorImpl.java:62)
	at sun.reflect.DelegatingMethodAccessorImpl.invoke(DelegatingMethodAccessorImpl.java:43)
	at java.lang.reflect.Method.invoke(Method.java:498)
	at org.junit.runners.model.FrameworkMethod$1.runReflectiveCall(FrameworkMethod.java:50)
	at org.junit.internal.runners.model.ReflectiveCallable.run(ReflectiveCallable.java:12)
	at org.junit.runners.model.FrameworkMethod.invokeExplosively(FrameworkMethod.java:47)
	at org.junit.internal.runners.statements.InvokeMethod.evaluate(InvokeMethod.java:17)
	at org.junit.internal.runners.statements.RunBefores.evaluate(RunBefores.java:26)
	at org.junit.internal.runners.statements.RunAfters.evaluate(RunAfters.java:27)
	at org.junit.rules.ExpectedException$ExpectedExceptionStatement.evaluate(ExpectedException.java:239)
	at org.junit.rules.RunRules.evaluate(RunRules.java:20)
	at org.junit.runners.ParentRunner.runLeaf(ParentRunner.java:325)
	at org.junit.runners.BlockJUnit4ClassRunner.runChild(BlockJUnit4ClassRunner.java:78)
	at org.junit.runners.BlockJUnit4ClassRunner.runChild(BlockJUnit4ClassRunner.java:57)
	at org.junit.runners.ParentRunner$3.run(ParentRunner.java:290)
	at org.junit.runners.ParentRunner$1.schedule(ParentRunner.java:71)
	at org.junit.runners.ParentRunner.runChildren(ParentRunner.java:288)
	at org.junit.runners.ParentRunner.access$000(ParentRunner.java:58)
	at org.junit.runners.ParentRunner$2.evaluate(ParentRunner.java:268)
	at org.junit.runners.ParentRunner.run(ParentRunner.java:363)
	at org.apache.maven.surefire.junit4.JUnit4Provider.execute(JUnit4Provider.java:264)
	at org.apache.maven.surefire.junit4.JUnit4Provider.executeTestSet(JUnit4Provider.java:153)
	at org.apache.maven.surefire.junit4.JUnit4Provider.invoke(JUnit4Provider.java:124)
	at org.apache.maven.surefire.booter.ForkedBooter.invokeProviderInSameClassLoader(ForkedBooter.java:200)
	at org.apache.maven.surefire.booter.ForkedBooter.runSuitesInProcess(ForkedBooter.java:153)
	at org.apache.maven.surefire.booter.ForkedBooter.main(ForkedBooter.java:103)
[main] WARN org.locationtech.geogig.storage.cache.CacheManager - Unable to parse environment variable GEOGIG_CACHE_MAX_SIZE=-1G
java.lang.IllegalArgumentException: Value must be a positive number or zero
	at com.google.common.base.Preconditions.checkArgument(Preconditions.java:135)
	at org.locationtech.geogig.storage.cache.CacheManager.parseCacheSizeArgument(CacheManager.java:272)
	at org.locationtech.geogig.storage.cache.CacheManagerTest.assertDefaultMaxSizeDefaultValue(CacheManagerTest.java:209)
	at org.locationtech.geogig.storage.cache.CacheManagerTest.resolveDefaultMaxSizeEnvironmantVariableInvalidValue(CacheManagerTest.java:250)
	at sun.reflect.NativeMethodAccessorImpl.invoke0(Native Method)
	at sun.reflect.NativeMethodAccessorImpl.invoke(NativeMethodAccessorImpl.java:62)
	at sun.reflect.DelegatingMethodAccessorImpl.invoke(DelegatingMethodAccessorImpl.java:43)
	at java.lang.reflect.Method.invoke(Method.java:498)
	at org.junit.runners.model.FrameworkMethod$1.runReflectiveCall(FrameworkMethod.java:50)
	at org.junit.internal.runners.model.ReflectiveCallable.run(ReflectiveCallable.java:12)
	at org.junit.runners.model.FrameworkMethod.invokeExplosively(FrameworkMethod.java:47)
	at org.junit.internal.runners.statements.InvokeMethod.evaluate(InvokeMethod.java:17)
	at org.junit.internal.runners.statements.RunBefores.evaluate(RunBefores.java:26)
	at org.junit.internal.runners.statements.RunAfters.evaluate(RunAfters.java:27)
	at org.junit.rules.ExpectedException$ExpectedExceptionStatement.evaluate(ExpectedException.java:239)
	at org.junit.rules.RunRules.evaluate(RunRules.java:20)
	at org.junit.runners.ParentRunner.runLeaf(ParentRunner.java:325)
	at org.junit.runners.BlockJUnit4ClassRunner.runChild(BlockJUnit4ClassRunner.java:78)
	at org.junit.runners.BlockJUnit4ClassRunner.runChild(BlockJUnit4ClassRunner.java:57)
	at org.junit.runners.ParentRunner$3.run(ParentRunner.java:290)
	at org.junit.runners.ParentRunner$1.schedule(ParentRunner.java:71)
	at org.junit.runners.ParentRunner.runChildren(ParentRunner.java:288)
	at org.junit.runners.ParentRunner.access$000(ParentRunner.java:58)
	at org.junit.runners.ParentRunner$2.evaluate(ParentRunner.java:268)
	at org.junit.runners.ParentRunner.run(ParentRunner.java:363)
	at org.apache.maven.surefire.junit4.JUnit4Provider.execute(JUnit4Provider.java:264)
	at org.apache.maven.surefire.junit4.JUnit4Provider.executeTestSet(JUnit4Provider.java:153)
	at org.apache.maven.surefire.junit4.JUnit4Provider.invoke(JUnit4Provider.java:124)
	at org.apache.maven.surefire.booter.ForkedBooter.invokeProviderInSameClassLoader(ForkedBooter.java:200)
	at org.apache.maven.surefire.booter.ForkedBooter.runSuitesInProcess(ForkedBooter.java:153)
	at org.apache.maven.surefire.booter.ForkedBooter.main(ForkedBooter.java:103)
[main] INFO org.locationtech.geogig.storage.cache.CacheManager - Configuring GeoGig shared object cache maximum size to the default of 2,500 bytes as given by the default 0.250000 percent of available heap. Use the GEOGIG_CACHE_MAX_SIZE System property or environmentvariable to set a different maximum size at runtime
[main] INFO org.locationtech.geogig.storage.cache.CacheManager - Configuring GeoGig shared object cache maximum size to the default of 119,406,592 bytes as given by the default 0.250000 percent of available heap. Use the GEOGIG_CACHE_MAX_SIZE System property or environmentvariable to set a different maximum size at runtime
[main] INFO org.locationtech.geogig.storage.cache.CacheManager - Obtained cache builder org.locationtech.geogig.storage.cache.CacheManagerTest$TestCacheBuilder
[main] INFO org.locationtech.geogig.storage.cache.CacheManager - Initialized shared cache org.locationtech.geogig.storage.cache.CacheManagerTest$TestCacheBuilder$TestCache
[main] INFO org.locationtech.geogig.storage.cache.CacheManager - Obtained cache builder org.locationtech.geogig.storage.cache.CacheManagerTest$TestCacheBuilder
[main] INFO org.locationtech.geogig.storage.cache.CacheManager - Initialized shared cache org.locationtech.geogig.storage.cache.CacheManagerTest$TestCacheBuilder$TestCache
[main] INFO org.locationtech.geogig.storage.cache.CacheManager - Obtained cache builder org.locationtech.geogig.storage.cache.CacheManagerTest$TestCacheBuilder
[main] INFO org.locationtech.geogig.storage.cache.CacheManager - Initialized shared cache org.locationtech.geogig.storage.cache.CacheManagerTest$TestCacheBuilder$TestCache
[main] WARN org.locationtech.geogig.storage.cache.CacheManager - Unable to parse System property GEOGIG_CACHE_MAX_SIZE=0.91. Falling back to environment variable
java.lang.IllegalArgumentException: percent must be between zero and 90% (0.9)
	at com.google.common.base.Preconditions.checkArgument(Preconditions.java:135)
	at org.locationtech.geogig.storage.cache.CacheManager.getCacheSizePercent(CacheManager.java:218)
	at org.locationtech.geogig.storage.cache.CacheManagerTest.assertDefaultMaxSizeDefaultValue(CacheManagerTest.java:209)
	at org.locationtech.geogig.storage.cache.CacheManagerTest.resolveDefaultMaxSizeInvalidSysPropAndEnvVarFallsBackToDefaultPercent(CacheManagerTest.java:263)
	at sun.reflect.NativeMethodAccessorImpl.invoke0(Native Method)
	at sun.reflect.NativeMethodAccessorImpl.invoke(NativeMethodAccessorImpl.java:62)
	at sun.reflect.DelegatingMethodAccessorImpl.invoke(DelegatingMethodAccessorImpl.java:43)
	at java.lang.reflect.Method.invoke(Method.java:498)
	at org.junit.runners.model.FrameworkMethod$1.runReflectiveCall(FrameworkMethod.java:50)
	at org.junit.internal.runners.model.ReflectiveCallable.run(ReflectiveCallable.java:12)
	at org.junit.runners.model.FrameworkMethod.invokeExplosively(FrameworkMethod.java:47)
	at org.junit.internal.runners.statements.InvokeMethod.evaluate(InvokeMethod.java:17)
	at org.junit.internal.runners.statements.RunBefores.evaluate(RunBefores.java:26)
	at org.junit.internal.runners.statements.RunAfters.evaluate(RunAfters.java:27)
	at org.junit.rules.ExpectedException$ExpectedExceptionStatement.evaluate(ExpectedException.java:239)
	at org.junit.rules.RunRules.evaluate(RunRules.java:20)
	at org.junit.runners.ParentRunner.runLeaf(ParentRunner.java:325)
	at org.junit.runners.BlockJUnit4ClassRunner.runChild(BlockJUnit4ClassRunner.java:78)
	at org.junit.runners.BlockJUnit4ClassRunner.runChild(BlockJUnit4ClassRunner.java:57)
	at org.junit.runners.ParentRunner$3.run(ParentRunner.java:290)
	at org.junit.runners.ParentRunner$1.schedule(ParentRunner.java:71)
	at org.junit.runners.ParentRunner.runChildren(ParentRunner.java:288)
	at org.junit.runners.ParentRunner.access$000(ParentRunner.java:58)
	at org.junit.runners.ParentRunner$2.evaluate(ParentRunner.java:268)
	at org.junit.runners.ParentRunner.run(ParentRunner.java:363)
	at org.apache.maven.surefire.junit4.JUnit4Provider.execute(JUnit4Provider.java:264)
	at org.apache.maven.surefire.junit4.JUnit4Provider.executeTestSet(JUnit4Provider.java:153)
	at org.apache.maven.surefire.junit4.JUnit4Provider.invoke(JUnit4Provider.java:124)
	at org.apache.maven.surefire.booter.ForkedBooter.invokeProviderInSameClassLoader(ForkedBooter.java:200)
	at org.apache.maven.surefire.booter.ForkedBooter.runSuitesInProcess(ForkedBooter.java:153)
	at org.apache.maven.surefire.booter.ForkedBooter.main(ForkedBooter.java:103)
[main] WARN org.locationtech.geogig.storage.cache.CacheManager - Unable to parse environment variable GEOGIG_CACHE_MAX_SIZE=alsoInvalid
java.lang.IllegalArgumentException: Invalid format (ALSOINVALID), expected <float>[B|K|M|G]
	at org.locationtech.geogig.storage.cache.CacheManager.parseCacheSizeArgument(CacheManager.java:284)
	at org.locationtech.geogig.storage.cache.CacheManagerTest.assertDefaultMaxSizeDefaultValue(CacheManagerTest.java:209)
	at org.locationtech.geogig.storage.cache.CacheManagerTest.resolveDefaultMaxSizeInvalidSysPropAndEnvVarFallsBackToDefaultPercent(CacheManagerTest.java:263)
	at sun.reflect.NativeMethodAccessorImpl.invoke0(Native Method)
	at sun.reflect.NativeMethodAccessorImpl.invoke(NativeMethodAccessorImpl.java:62)
	at sun.reflect.DelegatingMethodAccessorImpl.invoke(DelegatingMethodAccessorImpl.java:43)
	at java.lang.reflect.Method.invoke(Method.java:498)
	at org.junit.runners.model.FrameworkMethod$1.runReflectiveCall(FrameworkMethod.java:50)
	at org.junit.internal.runners.model.ReflectiveCallable.run(ReflectiveCallable.java:12)
	at org.junit.runners.model.FrameworkMethod.invokeExplosively(FrameworkMethod.java:47)
	at org.junit.internal.runners.statements.InvokeMethod.evaluate(InvokeMethod.java:17)
	at org.junit.internal.runners.statements.RunBefores.evaluate(RunBefores.java:26)
	at org.junit.internal.runners.statements.RunAfters.evaluate(RunAfters.java:27)
	at org.junit.rules.ExpectedException$ExpectedExceptionStatement.evaluate(ExpectedException.java:239)
	at org.junit.rules.RunRules.evaluate(RunRules.java:20)
	at org.junit.runners.ParentRunner.runLeaf(ParentRunner.java:325)
	at org.junit.runners.BlockJUnit4ClassRunner.runChild(BlockJUnit4ClassRunner.java:78)
	at org.junit.runners.BlockJUnit4ClassRunner.runChild(BlockJUnit4ClassRunner.java:57)
	at org.junit.runners.ParentRunner$3.run(ParentRunner.java:290)
	at org.junit.runners.ParentRunner$1.schedule(ParentRunner.java:71)
	at org.junit.runners.ParentRunner.runChildren(ParentRunner.java:288)
	at org.junit.runners.ParentRunner.access$000(ParentRunner.java:58)
	at org.junit.runners.ParentRunner$2.evaluate(ParentRunner.java:268)
	at org.junit.runners.ParentRunner.run(ParentRunner.java:363)
	at org.apache.maven.surefire.junit4.JUnit4Provider.execute(JUnit4Provider.java:264)
	at org.apache.maven.surefire.junit4.JUnit4Provider.executeTestSet(JUnit4Provider.java:153)
	at org.apache.maven.surefire.junit4.JUnit4Provider.invoke(JUnit4Provider.java:124)
	at org.apache.maven.surefire.booter.ForkedBooter.invokeProviderInSameClassLoader(ForkedBooter.java:200)
	at org.apache.maven.surefire.booter.ForkedBooter.runSuitesInProcess(ForkedBooter.java:153)
	at org.apache.maven.surefire.booter.ForkedBooter.main(ForkedBooter.java:103)
[main] INFO org.locationtech.geogig.storage.cache.CacheManager - Configuring GeoGig shared object cache maximum size to the default of 2,500 bytes as given by the default 0.250000 percent of available heap. Use the GEOGIG_CACHE_MAX_SIZE System property or environmentvariable to set a different maximum size at runtime
[main] INFO org.locationtech.geogig.storage.cache.CacheManager - Obtained cache builder org.locationtech.geogig.storage.cache.CacheManagerTest$TestCacheBuilder
[main] INFO org.locationtech.geogig.storage.cache.CacheManager - Initialized shared cache org.locationtech.geogig.storage.cache.CacheManagerTest$TestCacheBuilder$TestCache
Tests run: 31, Failures: 0, Errors: 0, Skipped: 0, Time elapsed: 0.709 sec - in org.locationtech.geogig.storage.cache.CacheManagerTest
Tests run: 7, Failures: 0, Errors: 0, Skipped: 0, Time elapsed: 0.747 sec - in org.locationtech.geogig.storage.fs.FileBlobStoreTest
Tests run: 25, Failures: 0, Errors: 0, Skipped: 1, Time elapsed: 0.951 sec - in org.locationtech.geogig.storage.text.TextSerializationFactoryTest
Tests run: 11, Failures: 0, Errors: 0, Skipped: 0, Time elapsed: 9.444 sec - in org.locationtech.geogig.model.impl.CanonicalTreeBuilderTest
Tests run: 8, Failures: 0, Errors: 0, Skipped: 0, Time elapsed: 4.736 sec - in org.locationtech.geogig.storage.datastream.v2_3.RevTreeFormatTest
Tests run: 11, Failures: 0, Errors: 0, Skipped: 0, Time elapsed: 1.513 sec - in org.locationtech.geogig.storage.fs.FileRefDatabaseTest
Tests run: 8, Failures: 0, Errors: 0, Skipped: 0, Time elapsed: 1.351 sec - in org.locationtech.geogig.repository.impl.RevFeatureBuilderTest
Tests run: 24, Failures: 0, Errors: 0, Skipped: 0, Time elapsed: 1.874 sec - in org.locationtech.geogig.storage.fs.IniFileConfigDatabaseTest
Tests run: 9, Failures: 0, Errors: 0, Skipped: 0, Time elapsed: 5.332 sec - in org.locationtech.geogig.storage.datastream.v2_3.NodeSetTest
Tests run: 30, Failures: 0, Errors: 0, Skipped: 0, Time elapsed: 36.332 sec - in org.locationtech.geogig.test.integration.MergeOpTest
Tests run: 5, Failures: 0, Errors: 0, Skipped: 0, Time elapsed: 12.365 sec - in org.locationtech.geogig.data.EPSGBoundsCalcTest
PreOrderDiffWalkTest: walked 524,288 vs 262144 trees in 554.6 ms
Tests run: 9, Failures: 0, Errors: 0, Skipped: 0, Time elapsed: 16.006 sec - in org.locationtech.geogig.porcelain.index.CreateIndexOpTest
PreOrderDiffWalkTest: walked 1,024 vs 512 trees in 38.11 ms
PreOrderDiffWalkTest: walked 16,384 vs 512 trees in 95.55 ms
Tests run: 16, Failures: 0, Errors: 0, Skipped: 0, Time elapsed: 17.011 sec - in org.locationtech.geogig.porcelain.index.UpdateIndexOpTest
Tests run: 2, Failures: 0, Errors: 0, Skipped: 0, Time elapsed: 5.857 sec - in org.locationtech.geogig.repository.impl.SpatialOpsTest
Tests run: 24, Failures: 0, Errors: 0, Skipped: 0, Time elapsed: 25.75 sec - in org.locationtech.geogig.plumbing.diff.PreOrderDiffWalkTest
Tests run: 9, Failures: 0, Errors: 0, Skipped: 0, Time elapsed: 19.88 sec - in org.locationtech.geogig.porcelain.index.UpdateIndexesOpTest
Tests run: 7, Failures: 0, Errors: 0, Skipped: 0, Time elapsed: 30.891 sec - in org.locationtech.geogig.plumbing.diff.DepthTreeIteratorTest
Tests run: 1, Failures: 0, Errors: 0, Skipped: 0, Time elapsed: 121.085 sec - in org.locationtech.geogig.plumbing.ResolveGeogigURITest
Tests run: 1, Failures: 0, Errors: 0, Skipped: 0, Time elapsed: 361.12 sec - in org.locationtech.geogig.repository.impl.DepthSearchTest
Tests run: 2, Failures: 0, Errors: 0, Skipped: 0, Time elapsed: 723.646 sec - in org.locationtech.geogig.plumbing.ParseTimestampTest
[Finalizer] WARN org.locationtech.geogig.repository.impl.RepositoryImpl - Repository instance being finalized without having been closed: file:/opt/public/hipp/ramdisk/geogig/junit6315592450375727242/mockWorkingDir/.geogig/
Runs: 1, FindChangedTrees: 951.7 μs, LsTreeOp: 13.45 ms, DiffTree: 12.97 ms
Runs: 10, FindChangedTrees: 10.25 ms, LsTreeOp: 70.69 ms, DiffTree: 91.40 ms
Runs: 100, FindChangedTrees: 57.43 ms, LsTreeOp: 644.2 ms, DiffTree: 1.735 s