Not builtConsole Output

Started calculate disk usage of build
Finished Calculation of disk usage of build in 0 seconds
Started calculate disk usage of workspace
Finished Calculation of disk usage of workspace in 0 seconds
[JENKINS] Archiving disabled
[JENKINS] Archiving disabled
[JENKINS] Archiving disabled
[JENKINS] Archiving disabled
[JENKINS] Archiving disabled
[JENKINS] Archiving disabled
[JENKINS] Archiving disabled
[JENKINS] Archiving disabled
[JENKINS] Archiving disabled
[JENKINS] Archiving disabled
[JENKINS] Archiving disabled
[JENKINS] Archiving disabled
[JENKINS] Archiving disabled
[JENKINS] Archiving disabled
[JENKINS] Archiving disabled
[JENKINS] Archiving disabled
[JENKINS] Archiving disabled
[JENKINS] Archiving disabled
[JENKINS] Archiving disabled
[JENKINS] Archiving disabled
[JENKINS] Archiving disabled
[JENKINS] Archiving disabled
[JENKINS] Archiving disabled
[JENKINS] Archiving disabled
[JENKINS] Archiving disabled
[JENKINS] Archiving disabled
[JENKINS] Archiving disabled
[JENKINS] Archiving disabled
[JENKINS] Archiving disabled
[INFO] ------------------------------------------------------------------------
[INFO] Reactor Summary for GeoGig Root 2.0-SNAPSHOT:
[INFO] 
[INFO] GeoGig Root ........................................ FAILURE [  1.840 s]
[INFO] CRS Metadata support ............................... SKIPPED
[INFO] GeoGig Core API .................................... SKIPPED
[INFO] GeoGig Core ........................................ SKIPPED
[INFO] Replication and synchronization .................... SKIPPED
[INFO] Storage backends ................................... SKIPPED
[INFO] Storage RevObject serialization formats ............ SKIPPED
[INFO] Flatbuffers serialization protocol ................. SKIPPED
[INFO] LZ4 compression serialization decorator ............ SKIPPED
[INFO] LZF compression serialization decorator ............ SKIPPED
[INFO] Rocksdb backed support for temporary storage ....... SKIPPED
[INFO] RevObject cache implementations .................... SKIPPED
[INFO] Caffeine implementation of SharedCache ............. SKIPPED
[INFO] GeoGig Command Line Interface ...................... SKIPPED
[INFO] GeoGig Command Line Interface Core ................. SKIPPED
[INFO] geogig-cli-remoting ................................ SKIPPED
[INFO] PostgreSQL Storage Backend ......................... SKIPPED
[INFO] RocksDB storage backend ............................ SKIPPED
[INFO] Guava Cache implementation of SharedCache .......... SKIPPED
[INFO] GeoGig Pull Requests Support Commands .............. SKIPPED
[INFO] GeoTools modules parent ............................ SKIPPED
[INFO] GeoGig to GeoTools Feature model adapter ........... SKIPPED
[INFO] GeoTools Command Extension ......................... SKIPPED
[INFO] GeoGig DataStore Implementation .................... SKIPPED
[INFO] GeoGig CLI GeoTools ................................ SKIPPED
[INFO] GeoGigi CLI Postgres Storage Commands .............. SKIPPED
[INFO] GeoGig Experimental Modules ........................ SKIPPED
[INFO] GeoGig Query Language Extension .................... SKIPPED
[INFO] GeoGig CLI App ..................................... SKIPPED
[INFO] ------------------------------------------------------------------------
[INFO] BUILD FAILURE
[INFO] ------------------------------------------------------------------------
[INFO] Total time:  11.534 s
[INFO] Finished at: 2019-06-26T15:53:36-04:00
[INFO] ------------------------------------------------------------------------
Waiting for Jenkins to finish collecting data
[ERROR] Failed to execute goal org.apache.maven.plugins:maven-enforcer-plugin:3.0.0-M2:enforce (enforce-maven) on project geogig: Some Enforcer rules have failed. Look above for specific messages explaining why the rule failed. -> [Help 1]
[ERROR] 
[ERROR] To see the full stack trace of the errors, re-run Maven with the -e switch.
[ERROR] Re-run Maven using the -X switch to enable full debug logging.
[ERROR] 
[ERROR] For more information about the errors and possible solutions, please read the following articles:
[ERROR] [Help 1] http://cwiki.apache.org/confluence/display/MAVEN/MojoExecutionException
Started
Build failed before it gets to this module
Started calculate disk usage of build
Finished Calculation of disk usage of build in 0 seconds
Started calculate disk usage of workspace
Finished Calculation of disk usage of workspace in 0 seconds
Finished: NOT_BUILT