AbortedConsole Output

Started by an SCM change
Building in workspace /home/hudson/genie.geogig/.jenkins/jobs/geogig-master/workspace
 > /usr/local/bin/git rev-parse --is-inside-work-tree # timeout=10
Fetching changes from the remote Git repository
 > /usr/local/bin/git config remote.origin.url https://github.com/locationtech/geogig.git # timeout=10
Fetching upstream changes from https://github.com/locationtech/geogig.git
 > /usr/local/bin/git --version # timeout=10
Setting http proxy: proxy.eclipse.org:9898
 > /usr/local/bin/git fetch --tags --progress https://github.com/locationtech/geogig.git +refs/heads/*:refs/remotes/origin/*
 > /usr/local/bin/git rev-parse refs/remotes/origin/master^{commit} # timeout=10
 > /usr/local/bin/git rev-parse refs/remotes/origin/origin/master^{commit} # timeout=10
Checking out Revision 8672764438ced63b82632698a22f7151c01cf22e (refs/remotes/origin/master)
 > /usr/local/bin/git config core.sparsecheckout # timeout=10
 > /usr/local/bin/git checkout -f 8672764438ced63b82632698a22f7151c01cf22e
Commit message: "Simplify PullResult with lombok"
 > /usr/local/bin/git rev-list --no-walk 655b1436f722250ce6e2769ae7913975b6d8b064 # timeout=10
Parsing POMs
Modules changed, recalculating dependency graph
Established TCP socket on 33167
[parent] $ /shared/common/jdk1.8.0_x64-latest/bin/java -Xmx2G -Djava.io.tmpdir=/tmp/genie.geogig -cp /home/hudson/genie.geogig/.jenkins/plugins/maven-plugin/WEB-INF/lib/maven35-agent-1.12-alpha-1.jar:/shared/common/apache-maven-latest/boot/plexus-classworlds-2.5.2.jar:/shared/common/apache-maven-latest/conf/logging jenkins.maven3.agent.Maven35Main /shared/common/apache-maven-latest /home/hudson/genie.geogig/.jenkins/war/WEB-INF/lib/remoting-3.21.jar /home/hudson/genie.geogig/.jenkins/plugins/maven-plugin/WEB-INF/lib/maven35-interceptor-1.12-alpha-1.jar /home/hudson/genie.geogig/.jenkins/plugins/maven-plugin/WEB-INF/lib/maven3-interceptor-commons-1.12-alpha-1.jar 33167
Picked up JAVA_TOOL_OPTIONS: -Xmx2G -Djava.io.tmpdir=/tmp/genie.geogig
<===[JENKINS REMOTING CAPACITY]===>channel started
Executing Maven:  -B -f /home/hudson/genie.geogig/.jenkins/jobs/geogig-master/workspace/src/parent/pom.xml -Dmaven.repo.local=/home/hudson/genie.geogig/.jenkins/jobs/geogig-master/workspace/.repository clean install -Pexperimental -DskipTests=false -Dcucumber.options=--monochrome --plugin json:target/cucumber.json -Djava.io.tmpdir=/opt/public/hipp/ramdisk/geogig
[INFO] Scanning for projects...
[WARNING] 
[WARNING] Some problems were encountered while building the effective model for org.locationtech.geogig:geogig-cli-geotools:jar:1.4-SNAPSHOT
[WARNING] 'dependencies.dependency.(groupId:artifactId:type:classifier)' must be unique: junit:junit:jar -> duplicate declaration of version (?) @ org.locationtech.geogig:geogig-cli-geotools:[unknown-version], /home/hudson/genie.geogig/.jenkins/jobs/geogig-master/workspace/src/cli/geotools/pom.xml, line 109, column 17
[WARNING] 
[WARNING] It is highly recommended to fix these problems because they threaten the stability of your build.
[WARNING] 
[WARNING] For this reason, future Maven versions might no longer support building such malformed projects.
[WARNING] 
[INFO] ------------------------------------------------------------------------
[INFO] Reactor Build Order:
[INFO] 
[INFO] GeoGig                                                             [pom]
[INFO] GeoGig Core API                                                    [jar]
[INFO] GeoGig Core                                                        [jar]
[INFO] Replication and synchronization                                    [jar]
[INFO] GeoGig DataStore Implementation                                    [jar]
[INFO] Storage backends                                                   [pom]
[INFO] RocksDB storage backend                                            [jar]
[INFO] GeoGig Command Line Interface                                      [pom]
[INFO] GeoGig Command Line Interface Core                                 [jar]
[INFO] geogig-cli-remoting                                                [jar]
[INFO] PostgreSQL Storage Backend                                         [jar]
[INFO] GeoTools Extension                                                 [jar]
[INFO] GeoGig Pull Requests Support Commands                              [jar]
[INFO] GeoGig CLI GeoTools                                                [jar]
[INFO] Web modules                                                        [pom]
[INFO] GeoGig Web API                                                     [jar]
[INFO] GeoGig WebApp                                                      [jar]
[INFO] GeoGig Web API Automated Functional Tests                          [jar]
[INFO] GeoGigi CLI Postgres Storage Commands                              [jar]
[INFO] GeoGig Query Language Extension                                    [jar]
[INFO] Basic GUI tools                                                    [jar]
[INFO] GeoGig CLI App                                                     [jar]
[INFO] 
[INFO] -------------------< org.locationtech.geogig:geogig >-------------------
[INFO] Building GeoGig 1.4-SNAPSHOT                                      [1/22]
[INFO] --------------------------------[ pom ]---------------------------------
[INFO] 
[INFO] --- maven-clean-plugin:2.5:clean (default-clean) @ geogig ---
[INFO] Deleting /home/hudson/genie.geogig/.jenkins/jobs/geogig-master/workspace/src/parent/target
[INFO] 
[INFO] --- git-commit-id-plugin:2.2.2:revision (default) @ geogig ---
[WARNING] Attempt to (de-)serialize anonymous class hudson.maven.reporters.BuildInfoRecorder$1; see: https://jenkins.io/redirect/serialization-of-anonymous-classes/
[INFO] 
[INFO] --- maven-jar-plugin:3.0.2:test-jar (default) @ geogig ---
[WARNING] JAR will be empty - no content was marked for inclusion!
[INFO] Building jar: /home/hudson/genie.geogig/.jenkins/jobs/geogig-master/workspace/src/parent/target/geogig-1.4-SNAPSHOT-tests.jar
[INFO] 
[INFO] >>> maven-source-plugin:3.0.1:jar (attach-sources) > generate-sources @ geogig >>>
[INFO] 
[INFO] --- git-commit-id-plugin:2.2.2:revision (default) @ geogig ---
[WARNING] Failed to getClass for org.apache.maven.plugins.source.SourceJarMojo
[INFO] 
[INFO] <<< maven-source-plugin:3.0.1:jar (attach-sources) < generate-sources @ geogig <<<
[INFO] 
[INFO] 
[INFO] --- maven-source-plugin:3.0.1:jar (attach-sources) @ geogig ---
[INFO] 
[INFO] >>> maven-source-plugin:3.0.1:test-jar (attach-sources) > generate-sources @ geogig >>>
[INFO] 
[INFO] --- git-commit-id-plugin:2.2.2:revision (default) @ geogig ---
[WARNING] Failed to getClass for org.apache.maven.plugins.source.TestSourceJarMojo
[INFO] 
[INFO] <<< maven-source-plugin:3.0.1:test-jar (attach-sources) < generate-sources @ geogig <<<
[INFO] 
[INFO] 
[INFO] --- maven-source-plugin:3.0.1:test-jar (attach-sources) @ geogig ---
[INFO] 
[INFO] --- maven-install-plugin:2.4:install (default-install) @ geogig ---
[INFO] Installing /home/hudson/genie.geogig/.jenkins/jobs/geogig-master/workspace/src/parent/pom.xml to /home/hudson/genie.geogig/.jenkins/jobs/geogig-master/workspace/.repository/org/locationtech/geogig/geogig/1.4-SNAPSHOT/geogig-1.4-SNAPSHOT.pom
[INFO] Installing /home/hudson/genie.geogig/.jenkins/jobs/geogig-master/workspace/src/parent/target/geogig-1.4-SNAPSHOT-tests.jar to /home/hudson/genie.geogig/.jenkins/jobs/geogig-master/workspace/.repository/org/locationtech/geogig/geogig/1.4-SNAPSHOT/geogig-1.4-SNAPSHOT-tests.jar
[WARNING] Attempt to (de-)serialize anonymous class hudson.maven.reporters.MavenArtifactArchiver$2; see: https://jenkins.io/redirect/serialization-of-anonymous-classes/
[JENKINS] Archiving disabled
[WARNING] Attempt to (de-)serialize anonymous class hudson.maven.reporters.MavenFingerprinter$1; see: https://jenkins.io/redirect/serialization-of-anonymous-classes/
Started calculate disk usage of build
Finished Calculation of disk usage of build in 0 seconds
Started calculate disk usage of workspace
Finished Calculation of disk usage of workspace in 0 seconds
[INFO] 
[INFO] -----------------< org.locationtech.geogig:geogig-api >-----------------
[INFO] Building GeoGig Core API 1.4-SNAPSHOT                             [2/22]
[INFO] --------------------------------[ jar ]---------------------------------
[INFO] 
[INFO] --- maven-clean-plugin:2.5:clean (default-clean) @ geogig-api ---
[INFO] Deleting /home/hudson/genie.geogig/.jenkins/jobs/geogig-master/workspace/src/api/target
[INFO] 
[INFO] --- git-commit-id-plugin:2.2.2:revision (default) @ geogig-api ---
[INFO] 
[INFO] --- maven-resources-plugin:3.0.1:resources (default-resources) @ geogig-api ---
[INFO] Using 'UTF-8' encoding to copy filtered resources.
[INFO] Copying 2 resources
[INFO] 
[INFO] --- maven-compiler-plugin:3.7.0:compile (default-compile) @ geogig-api ---
[INFO] Changes detected - recompiling the module!
[INFO] Compiling 62 source files to /home/hudson/genie.geogig/.jenkins/jobs/geogig-master/workspace/src/api/target/classes
[INFO] 
[INFO] --- maven-resources-plugin:3.0.1:testResources (default-testResources) @ geogig-api ---
[INFO] Using 'UTF-8' encoding to copy filtered resources.
[INFO] skip non existing resourceDirectory /home/hudson/genie.geogig/.jenkins/jobs/geogig-master/workspace/src/api/src/test/resources
[INFO] 
[INFO] --- maven-compiler-plugin:3.7.0:testCompile (default-testCompile) @ geogig-api ---
[INFO] Changes detected - recompiling the module!
[INFO] Compiling 28 source files to /home/hudson/genie.geogig/.jenkins/jobs/geogig-master/workspace/src/api/target/test-classes
[INFO] /home/hudson/genie.geogig/.jenkins/jobs/geogig-master/workspace/src/api/src/test/java/org/locationtech/geogig/repository/RemoteTest.java: Some input files use or override a deprecated API.
[INFO] /home/hudson/genie.geogig/.jenkins/jobs/geogig-master/workspace/src/api/src/test/java/org/locationtech/geogig/repository/RemoteTest.java: Recompile with -Xlint:deprecation for details.
[INFO] 
[INFO] --- maven-surefire-plugin:2.17:test (default-test) @ geogig-api ---
[INFO] Surefire report directory: /home/hudson/genie.geogig/.jenkins/jobs/geogig-master/workspace/src/api/target/surefire-reports

-------------------------------------------------------
 T E S T S
-------------------------------------------------------

-------------------------------------------------------
 T E S T S
-------------------------------------------------------
Picked up JAVA_TOOL_OPTIONS: -Xmx2G -Djava.io.tmpdir=/tmp/genie.geogig
Picked up JAVA_TOOL_OPTIONS: -Xmx2G -Djava.io.tmpdir=/tmp/genie.geogig
Picked up JAVA_TOOL_OPTIONS: -Xmx2G -Djava.io.tmpdir=/tmp/genie.geogig
Picked up JAVA_TOOL_OPTIONS: -Xmx2G -Djava.io.tmpdir=/tmp/genie.geogig
Picked up JAVA_TOOL_OPTIONS: -Xmx2G -Djava.io.tmpdir=/tmp/genie.geogig
Picked up JAVA_TOOL_OPTIONS: -Xmx2G -Djava.io.tmpdir=/tmp/genie.geogig
Picked up JAVA_TOOL_OPTIONS: -Xmx2G -Djava.io.tmpdir=/tmp/genie.geogig
Picked up JAVA_TOOL_OPTIONS: -Xmx2G -Djava.io.tmpdir=/tmp/genie.geogig
Picked up JAVA_TOOL_OPTIONS: -Xmx2G -Djava.io.tmpdir=/tmp/genie.geogig
Picked up JAVA_TOOL_OPTIONS: -Xmx2G -Djava.io.tmpdir=/tmp/genie.geogig
Picked up JAVA_TOOL_OPTIONS: -Xmx2G -Djava.io.tmpdir=/tmp/genie.geogig
Picked up JAVA_TOOL_OPTIONS: -Xmx2G -Djava.io.tmpdir=/tmp/genie.geogig
Picked up JAVA_TOOL_OPTIONS: -Xmx2G -Djava.io.tmpdir=/tmp/genie.geogig
Picked up JAVA_TOOL_OPTIONS: -Xmx2G -Djava.io.tmpdir=/tmp/genie.geogig
Picked up JAVA_TOOL_OPTIONS: -Xmx2G -Djava.io.tmpdir=/tmp/genie.geogig
Picked up JAVA_TOOL_OPTIONS: -Xmx2G -Djava.io.tmpdir=/tmp/genie.geogig
Picked up JAVA_TOOL_OPTIONS: -Xmx2G -Djava.io.tmpdir=/tmp/genie.geogig
Picked up JAVA_TOOL_OPTIONS: -Xmx2G -Djava.io.tmpdir=/tmp/genie.geogig
Picked up JAVA_TOOL_OPTIONS: -Xmx2G -Djava.io.tmpdir=/tmp/genie.geogig
Picked up JAVA_TOOL_OPTIONS: -Xmx2G -Djava.io.tmpdir=/tmp/genie.geogig
Picked up JAVA_TOOL_OPTIONS: -Xmx2G -Djava.io.tmpdir=/tmp/genie.geogig
Picked up JAVA_TOOL_OPTIONS: -Xmx2G -Djava.io.tmpdir=/tmp/genie.geogig
Picked up JAVA_TOOL_OPTIONS: -Xmx2G -Djava.io.tmpdir=/tmp/genie.geogig
Picked up JAVA_TOOL_OPTIONS: -Xmx2G -Djava.io.tmpdir=/tmp/genie.geogig
Running org.locationtech.geogig.repository.LocalRemoteRefSpecTest
Running org.locationtech.geogig.repository.DiffObjectCountTest
Running org.locationtech.geogig.repository.ConflictTest
Running org.locationtech.geogig.repository.AbstractGeoGigOpTest
Running org.locationtech.geogig.repository.RemoteTest
Running org.locationtech.geogig.repository.HintsTest
Running org.locationtech.geogig.repository.DiffEntryTest
Running org.locationtech.geogig.repository.ProgressListenerTest
Running org.locationtech.geogig.storage.AutoCloseableIteratorTest
Running org.locationtech.geogig.repository.FeatureInfoTest
Running org.locationtech.geogig.storage.PluginDefaultsTest
Running org.locationtech.geogig.storage.VersionedFormatTest
Running org.locationtech.geogig.storage.GraphDatabaseTest
Running org.locationtech.geogig.storage.ConfigExceptionTest
Running org.locationtech.geogig.storage.BulkOpListenerTest
Running org.locationtech.geogig.model.SymRefTest
Running org.locationtech.geogig.model.NodeTest
Running org.locationtech.geogig.model.HashObjectFunnelsTest
Running org.locationtech.geogig.model.FieldTypeTest
Running org.locationtech.geogig.model.BucketTest
Running org.locationtech.geogig.model.RevTreeTest
Tests run: 3, Failures: 0, Errors: 0, Skipped: 0, Time elapsed: 0.319 sec - in org.locationtech.geogig.repository.DiffObjectCountTest
Running org.locationtech.geogig.model.RevObjectTest
Running org.locationtech.geogig.model.ObjectIdTest
Running org.locationtech.geogig.model.NodeRefTest
Tests run: 7, Failures: 0, Errors: 0, Skipped: 0, Time elapsed: 0.321 sec - in org.locationtech.geogig.repository.HintsTest
Running org.locationtech.geogig.model.RefTest
Running org.locationtech.geogig.model.Float32BoundsTest
Tests run: 1, Failures: 0, Errors: 0, Skipped: 0, Time elapsed: 0.022 sec - in org.locationtech.geogig.model.Float32BoundsTest
Running org.locationtech.geogig.model.CanonicalNodeOrderTest
Tests run: 2, Failures: 0, Errors: 0, Skipped: 0, Time elapsed: 0.271 sec - in org.locationtech.geogig.storage.PluginDefaultsTest
Tests run: 5, Failures: 0, Errors: 0, Skipped: 0, Time elapsed: 0.534 sec - in org.locationtech.geogig.repository.ConflictTest
Tests run: 2, Failures: 0, Errors: 0, Skipped: 0, Time elapsed: 0.377 sec - in org.locationtech.geogig.storage.ConfigExceptionTest
Tests run: 2, Failures: 0, Errors: 0, Skipped: 0, Time elapsed: 0.414 sec - in org.locationtech.geogig.storage.VersionedFormatTest
Tests run: 11, Failures: 0, Errors: 0, Skipped: 0, Time elapsed: 0.312 sec - in org.locationtech.geogig.model.ObjectIdTest
Tests run: 5, Failures: 0, Errors: 0, Skipped: 0, Time elapsed: 0.22 sec - in org.locationtech.geogig.model.CanonicalNodeOrderTest
Tests run: 1, Failures: 0, Errors: 0, Skipped: 0, Time elapsed: 0.514 sec - in org.locationtech.geogig.repository.FeatureInfoTest
Tests run: 9, Failures: 0, Errors: 0, Skipped: 0, Time elapsed: 0.276 sec - in org.locationtech.geogig.model.RefTest
Tests run: 1, Failures: 0, Errors: 0, Skipped: 0, Time elapsed: 0.478 sec - in org.locationtech.geogig.model.SymRefTest
Tests run: 4, Failures: 0, Errors: 0, Skipped: 0, Time elapsed: 0.489 sec - in org.locationtech.geogig.storage.BulkOpListenerTest
Tests run: 3, Failures: 0, Errors: 0, Skipped: 0, Time elapsed: 0.52 sec - in org.locationtech.geogig.storage.GraphDatabaseTest
Tests run: 6, Failures: 0, Errors: 0, Skipped: 0, Time elapsed: 0.763 sec - in org.locationtech.geogig.repository.LocalRemoteRefSpecTest
Tests run: 4, Failures: 0, Errors: 0, Skipped: 0, Time elapsed: 0.48 sec - in org.locationtech.geogig.model.BucketTest
Tests run: 8, Failures: 0, Errors: 0, Skipped: 0, Time elapsed: 0.595 sec - in org.locationtech.geogig.storage.AutoCloseableIteratorTest
Tests run: 5, Failures: 0, Errors: 0, Skipped: 0, Time elapsed: 0.653 sec - in org.locationtech.geogig.repository.ProgressListenerTest
Tests run: 23, Failures: 0, Errors: 0, Skipped: 0, Time elapsed: 0.516 sec - in org.locationtech.geogig.model.NodeRefTest
Tests run: 7, Failures: 0, Errors: 0, Skipped: 0, Time elapsed: 0.747 sec - in org.locationtech.geogig.repository.DiffEntryTest
Tests run: 3, Failures: 0, Errors: 0, Skipped: 0, Time elapsed: 0.576 sec - in org.locationtech.geogig.model.RevObjectTest
Tests run: 5, Failures: 0, Errors: 0, Skipped: 0, Time elapsed: 0.657 sec - in org.locationtech.geogig.model.FieldTypeTest
Tests run: 10, Failures: 0, Errors: 0, Skipped: 0, Time elapsed: 0.752 sec - in org.locationtech.geogig.model.NodeTest
Tests run: 4, Failures: 0, Errors: 0, Skipped: 0, Time elapsed: 0.94 sec - in org.locationtech.geogig.repository.AbstractGeoGigOpTest
Tests run: 5, Failures: 0, Errors: 0, Skipped: 0, Time elapsed: 0.732 sec - in org.locationtech.geogig.model.RevTreeTest
Tests run: 3, Failures: 0, Errors: 0, Skipped: 0, Time elapsed: 1.043 sec - in org.locationtech.geogig.repository.RemoteTest
Tests run: 5, Failures: 0, Errors: 0, Skipped: 0, Time elapsed: 0.906 sec - in org.locationtech.geogig.model.HashObjectFunnelsTest

Results :

Tests run: 144, Failures: 0, Errors: 0, Skipped: 0

[JENKINS] Recording test results
[WARNING] Attempt to (de-)serialize anonymous class hudson.maven.reporters.SurefireArchiver$2; see: https://jenkins.io/redirect/serialization-of-anonymous-classes/
[INFO] 
[INFO] --- maven-jar-plugin:3.0.2:jar (default-jar) @ geogig-api ---
[INFO] Building jar: /home/hudson/genie.geogig/.jenkins/jobs/geogig-master/workspace/src/api/target/geogig-api-1.4-SNAPSHOT.jar
[INFO] 
[INFO] --- maven-jar-plugin:3.0.2:test-jar (default) @ geogig-api ---
[INFO] Building jar: /home/hudson/genie.geogig/.jenkins/jobs/geogig-master/workspace/src/api/target/geogig-api-1.4-SNAPSHOT-tests.jar
[INFO] 
[INFO] >>> maven-source-plugin:3.0.1:jar (attach-sources) > generate-sources @ geogig-api >>>
[INFO] 
[INFO] --- git-commit-id-plugin:2.2.2:revision (default) @ geogig-api ---
[WARNING] Failed to getClass for org.apache.maven.plugins.source.SourceJarMojo
[INFO] 
[INFO] <<< maven-source-plugin:3.0.1:jar (attach-sources) < generate-sources @ geogig-api <<<
[INFO] 
[INFO] 
[INFO] --- maven-source-plugin:3.0.1:jar (attach-sources) @ geogig-api ---
[INFO] Building jar: /home/hudson/genie.geogig/.jenkins/jobs/geogig-master/workspace/src/api/target/geogig-api-1.4-SNAPSHOT-sources.jar
[INFO] 
[INFO] >>> maven-source-plugin:3.0.1:test-jar (attach-sources) > generate-sources @ geogig-api >>>
[INFO] 
[INFO] --- git-commit-id-plugin:2.2.2:revision (default) @ geogig-api ---
[WARNING] Failed to getClass for org.apache.maven.plugins.source.TestSourceJarMojo
[INFO] 
[INFO] <<< maven-source-plugin:3.0.1:test-jar (attach-sources) < generate-sources @ geogig-api <<<
[INFO] 
[INFO] 
[INFO] --- maven-source-plugin:3.0.1:test-jar (attach-sources) @ geogig-api ---
[INFO] Building jar: /home/hudson/genie.geogig/.jenkins/jobs/geogig-master/workspace/src/api/target/geogig-api-1.4-SNAPSHOT-test-sources.jar
[INFO] 
[INFO] --- maven-install-plugin:2.4:install (default-install) @ geogig-api ---
[INFO] Installing /home/hudson/genie.geogig/.jenkins/jobs/geogig-master/workspace/src/api/target/geogig-api-1.4-SNAPSHOT.jar to /home/hudson/genie.geogig/.jenkins/jobs/geogig-master/workspace/.repository/org/locationtech/geogig/geogig-api/1.4-SNAPSHOT/geogig-api-1.4-SNAPSHOT.jar
[INFO] Installing /home/hudson/genie.geogig/.jenkins/jobs/geogig-master/workspace/src/api/pom.xml to /home/hudson/genie.geogig/.jenkins/jobs/geogig-master/workspace/.repository/org/locationtech/geogig/geogig-api/1.4-SNAPSHOT/geogig-api-1.4-SNAPSHOT.pom
[INFO] Installing /home/hudson/genie.geogig/.jenkins/jobs/geogig-master/workspace/src/api/target/geogig-api-1.4-SNAPSHOT-tests.jar to /home/hudson/genie.geogig/.jenkins/jobs/geogig-master/workspace/.repository/org/locationtech/geogig/geogig-api/1.4-SNAPSHOT/geogig-api-1.4-SNAPSHOT-tests.jar
[INFO] Installing /home/hudson/genie.geogig/.jenkins/jobs/geogig-master/workspace/src/api/target/geogig-api-1.4-SNAPSHOT-sources.jar to /home/hudson/genie.geogig/.jenkins/jobs/geogig-master/workspace/.repository/org/locationtech/geogig/geogig-api/1.4-SNAPSHOT/geogig-api-1.4-SNAPSHOT-sources.jar
[INFO] Installing /home/hudson/genie.geogig/.jenkins/jobs/geogig-master/workspace/src/api/target/geogig-api-1.4-SNAPSHOT-test-sources.jar to /home/hudson/genie.geogig/.jenkins/jobs/geogig-master/workspace/.repository/org/locationtech/geogig/geogig-api/1.4-SNAPSHOT/geogig-api-1.4-SNAPSHOT-test-sources.jar
[JENKINS] Archiving disabled
Started calculate disk usage of build
Finished Calculation of disk usage of build in 0 seconds
Started calculate disk usage of workspace
Finished Calculation of disk usage of workspace in 0 seconds
[INFO] 
[INFO] ----------------< org.locationtech.geogig:geogig-core >-----------------
[INFO] Building GeoGig Core 1.4-SNAPSHOT                                 [3/22]
[INFO] --------------------------------[ jar ]---------------------------------
[INFO] 
[INFO] --- maven-clean-plugin:2.5:clean (default-clean) @ geogig-core ---
[INFO] Deleting /home/hudson/genie.geogig/.jenkins/jobs/geogig-master/workspace/src/core/target
[INFO] 
[INFO] --- git-commit-id-plugin:2.2.2:revision (default) @ geogig-core ---
[INFO] 
[INFO] --- maven-resources-plugin:3.0.1:resources (default-resources) @ geogig-core ---
[INFO] Using 'UTF-8' encoding to copy filtered resources.
[INFO] Copying 6 resources
[INFO] 
[INFO] --- maven-compiler-plugin:3.7.0:compile (default-compile) @ geogig-core ---
[INFO] Changes detected - recompiling the module!
[INFO] Compiling 307 source files to /home/hudson/genie.geogig/.jenkins/jobs/geogig-master/workspace/src/core/target/classes
[INFO] /home/hudson/genie.geogig/.jenkins/jobs/geogig-master/workspace/src/core/src/main/java/org/locationtech/geogig/storage/datastream/FormatCommonV2.java: Some input files use or override a deprecated API.
[INFO] /home/hudson/genie.geogig/.jenkins/jobs/geogig-master/workspace/src/core/src/main/java/org/locationtech/geogig/storage/datastream/FormatCommonV2.java: Recompile with -Xlint:deprecation for details.
[INFO] /home/hudson/genie.geogig/.jenkins/jobs/geogig-master/workspace/src/core/src/main/java/org/locationtech/geogig/storage/datastream/ValueSerializer.java: Some input files use unchecked or unsafe operations.
[INFO] /home/hudson/genie.geogig/.jenkins/jobs/geogig-master/workspace/src/core/src/main/java/org/locationtech/geogig/storage/datastream/ValueSerializer.java: Recompile with -Xlint:unchecked for details.
[INFO] 
[INFO] --- maven-resources-plugin:3.0.1:testResources (default-testResources) @ geogig-core ---
[INFO] Using 'UTF-8' encoding to copy filtered resources.
[INFO] Copying 3 resources
[INFO] 
[INFO] --- maven-compiler-plugin:3.7.0:testCompile (default-testCompile) @ geogig-core ---
[INFO] Changes detected - recompiling the module!
[INFO] Compiling 188 source files to /home/hudson/genie.geogig/.jenkins/jobs/geogig-master/workspace/src/core/target/test-classes
[INFO] /home/hudson/genie.geogig/.jenkins/jobs/geogig-master/workspace/src/core/src/test/java/org/locationtech/geogig/model/internal/CanonicalClusteringStrategyTest.java: Some input files use or override a deprecated API.
[INFO] /home/hudson/genie.geogig/.jenkins/jobs/geogig-master/workspace/src/core/src/test/java/org/locationtech/geogig/model/internal/CanonicalClusteringStrategyTest.java: Recompile with -Xlint:deprecation for details.
[INFO] /home/hudson/genie.geogig/.jenkins/jobs/geogig-master/workspace/src/core/src/test/java/org/locationtech/geogig/data/retrieve/BackgroundingIteratorTest.java: /home/hudson/genie.geogig/.jenkins/jobs/geogig-master/workspace/src/core/src/test/java/org/locationtech/geogig/data/retrieve/BackgroundingIteratorTest.java uses unchecked or unsafe operations.
[INFO] /home/hudson/genie.geogig/.jenkins/jobs/geogig-master/workspace/src/core/src/test/java/org/locationtech/geogig/data/retrieve/BackgroundingIteratorTest.java: Recompile with -Xlint:unchecked for details.
[INFO] 
[INFO] --- maven-surefire-plugin:2.17:test (default-test) @ geogig-core ---
[INFO] Surefire report directory: /home/hudson/genie.geogig/.jenkins/jobs/geogig-master/workspace/src/core/target/surefire-reports

-------------------------------------------------------
 T E S T S
-------------------------------------------------------

-------------------------------------------------------
 T E S T S
-------------------------------------------------------
Picked up JAVA_TOOL_OPTIONS: -Xmx2G -Djava.io.tmpdir=/tmp/genie.geogig
Picked up JAVA_TOOL_OPTIONS: -Xmx2G -Djava.io.tmpdir=/tmp/genie.geogig
Picked up JAVA_TOOL_OPTIONS: -Xmx2G -Djava.io.tmpdir=/tmp/genie.geogig
Picked up JAVA_TOOL_OPTIONS: -Xmx2G -Djava.io.tmpdir=/tmp/genie.geogig
Picked up JAVA_TOOL_OPTIONS: -Xmx2G -Djava.io.tmpdir=/tmp/genie.geogig
Picked up JAVA_TOOL_OPTIONS: -Xmx2G -Djava.io.tmpdir=/tmp/genie.geogig
Picked up JAVA_TOOL_OPTIONS: -Xmx2G -Djava.io.tmpdir=/tmp/genie.geogig
Picked up JAVA_TOOL_OPTIONS: -Xmx2G -Djava.io.tmpdir=/tmp/genie.geogig
Picked up JAVA_TOOL_OPTIONS: -Xmx2G -Djava.io.tmpdir=/tmp/genie.geogig
Picked up JAVA_TOOL_OPTIONS: -Xmx2G -Djava.io.tmpdir=/tmp/genie.geogig
Picked up JAVA_TOOL_OPTIONS: -Xmx2G -Djava.io.tmpdir=/tmp/genie.geogig
Picked up JAVA_TOOL_OPTIONS: -Xmx2G -Djava.io.tmpdir=/tmp/genie.geogig
Picked up JAVA_TOOL_OPTIONS: -Xmx2G -Djava.io.tmpdir=/tmp/genie.geogig
Picked up JAVA_TOOL_OPTIONS: -Xmx2G -Djava.io.tmpdir=/tmp/genie.geogig
Picked up JAVA_TOOL_OPTIONS: -Xmx2G -Djava.io.tmpdir=/tmp/genie.geogig
Picked up JAVA_TOOL_OPTIONS: -Xmx2G -Djava.io.tmpdir=/tmp/genie.geogig
Picked up JAVA_TOOL_OPTIONS: -Xmx2G -Djava.io.tmpdir=/tmp/genie.geogig
Picked up JAVA_TOOL_OPTIONS: -Xmx2G -Djava.io.tmpdir=/tmp/genie.geogig
Picked up JAVA_TOOL_OPTIONS: -Xmx2G -Djava.io.tmpdir=/tmp/genie.geogig
Picked up JAVA_TOOL_OPTIONS: -Xmx2G -Djava.io.tmpdir=/tmp/genie.geogig
Picked up JAVA_TOOL_OPTIONS: -Xmx2G -Djava.io.tmpdir=/tmp/genie.geogig
Picked up JAVA_TOOL_OPTIONS: -Xmx2G -Djava.io.tmpdir=/tmp/genie.geogig
Picked up JAVA_TOOL_OPTIONS: -Xmx2G -Djava.io.tmpdir=/tmp/genie.geogig
Picked up JAVA_TOOL_OPTIONS: -Xmx2G -Djava.io.tmpdir=/tmp/genie.geogig
Running org.locationtech.geogig.test.integration.RebaseOpTest
Running org.locationtech.geogig.test.integration.CleanRefsOpTest
Running org.locationtech.geogig.test.integration.BlameOpTest
Running org.locationtech.geogig.test.integration.ReportCommitConflictsOpTest
Running org.locationtech.geogig.test.integration.ConflictsReadWriteOpTest
Running org.locationtech.geogig.test.integration.RevertOpTest
Running org.locationtech.geogig.test.integration.ConfigOpTest
Running org.locationtech.geogig.test.integration.FindCommonAncestorTest
Running org.locationtech.geogig.test.integration.RebuildGraphOpTest
Running org.locationtech.geogig.test.integration.repository.IndexTest
Running org.locationtech.geogig.test.integration.repository.WorkingTreeTest
Running org.locationtech.geogig.test.integration.GeogigAPITest
Running org.locationtech.geogig.test.integration.RevParseIntegrationTest
Running org.locationtech.geogig.test.integration.MergeOpTest
Running org.locationtech.geogig.test.integration.BranchDeleteOpTest
Running org.locationtech.geogig.test.integration.CheckoutOpTest
Running org.locationtech.geogig.test.integration.AddOpTest
Running org.locationtech.geogig.test.integration.CheckSparsePathTest
Running org.locationtech.geogig.test.integration.ReportMergeConflictsOpTest
Running org.locationtech.geogig.test.integration.CleanOpTest
Running org.locationtech.geogig.test.integration.LsTreeOpTest
Running org.locationtech.geogig.test.integration.GeogigTransactionTest
Running org.locationtech.geogig.test.integration.HooksTest
Running org.locationtech.geogig.test.integration.LogOpTest
testMergeNoCommits
testOctopusMerge
Tests run: 1, Failures: 0, Errors: 0, Skipped: 0, Time elapsed: 6.777 sec - in org.locationtech.geogig.test.integration.CleanRefsOpTest
Running org.locationtech.geogig.test.integration.TagTest
Tests run: 1, Failures: 0, Errors: 0, Skipped: 0, Time elapsed: 6.799 sec - in org.locationtech.geogig.test.integration.ConflictsReadWriteOpTest
Running org.locationtech.geogig.test.integration.StatusOpTest
[main] INFO org.locationtech.geogig.porcelain.RevertOp - Creating revert state of commit ee5a07e8c5e480ac2a69f066dc48a416415e0af6 (commit for Points.1)
[main] INFO org.locationtech.geogig.porcelain.RevertOp - Created revert state of 1 features in 53.21 ms
[main] INFO org.locationtech.geogig.porcelain.RevertOp - Staging 1 changes...
[main] INFO org.locationtech.geogig.porcelain.RevertOp - 1 changes staged in 34.22 ms

[main] INFO org.locationtech.geogig.hooks.Scripting - Running jvm script /opt/public/hipp/ramdisk/geogig/junit3896144534120062450/repo-1575665102/.geogig/hooks/pre_commit.js
testMergeTwice
Tests run: 3, Failures: 0, Errors: 0, Skipped: 0, Time elapsed: 9.899 sec - in org.locationtech.geogig.test.integration.CleanOpTest
Running org.locationtech.geogig.test.integration.BranchRenameOpTest
[main] INFO org.locationtech.geogig.hooks.Scripting - Running jvm script /opt/public/hipp/ramdisk/geogig/junit3896144534120062450/repo-1575665102/.geogig/hooks/pre_commit.js
Tests run: 3, Failures: 0, Errors: 0, Skipped: 0, Time elapsed: 10.191 sec - in org.locationtech.geogig.test.integration.GeogigAPITest
Running org.locationtech.geogig.test.integration.BranchCreateOpTest
Tests run: 3, Failures: 0, Errors: 0, Skipped: 0, Time elapsed: 3.853 sec - in org.locationtech.geogig.test.integration.TagTest
Running org.locationtech.geogig.test.integration.ApplyPatchOpTest
[main] INFO org.locationtech.geogig.hooks.Scripting - Running jvm script /opt/public/hipp/ramdisk/geogig/junit1741592820490301758/repo-342426254/.geogig/hooks/post_commit.js
[main] WARN org.locationtech.geogig.hooks.CommandHookChain - Post-command hook org.locationtech.geogig.hooks.JVMScriptHook@29d2d081 for command org.locationtech.geogig.porcelain.CommitOp threw an exception that will not be propagated
java.lang.NullPointerException
	at org.locationtech.geogig.hooks.Scripting.runJVMScript(Scripting.java:93)
	at org.locationtech.geogig.hooks.JVMScriptHook.post(JVMScriptHook.java:52)
	at org.locationtech.geogig.hooks.CommandHookChain.runPostHooks(CommandHookChain.java:65)
	at org.locationtech.geogig.hooks.CommandHooksDecorator$HooksListener.postCall(CommandHooksDecorator.java:60)
	at org.locationtech.geogig.repository.AbstractGeoGigOp.notifyPost(AbstractGeoGigOp.java:194)
	at org.locationtech.geogig.repository.AbstractGeoGigOp.call(AbstractGeoGigOp.java:170)
	at org.locationtech.geogig.test.integration.HooksTest.testFailingPostPostProcessHook(HooksTest.java:148)
	at sun.reflect.NativeMethodAccessorImpl.invoke0(Native Method)
	at sun.reflect.NativeMethodAccessorImpl.invoke(NativeMethodAccessorImpl.java:62)
	at sun.reflect.DelegatingMethodAccessorImpl.invoke(DelegatingMethodAccessorImpl.java:43)
	at java.lang.reflect.Method.invoke(Method.java:498)
	at org.junit.runners.model.FrameworkMethod$1.runReflectiveCall(FrameworkMethod.java:50)
	at org.junit.internal.runners.model.ReflectiveCallable.run(ReflectiveCallable.java:12)
	at org.junit.runners.model.FrameworkMethod.invokeExplosively(FrameworkMethod.java:47)
	at org.junit.internal.runners.statements.InvokeMethod.evaluate(InvokeMethod.java:17)
	at org.junit.internal.runners.statements.RunBefores.evaluate(RunBefores.java:26)
	at org.junit.internal.runners.statements.RunAfters.evaluate(RunAfters.java:27)
	at org.junit.rules.ExternalResource$1.evaluate(ExternalResource.java:48)
	at org.junit.rules.RunRules.evaluate(RunRules.java:20)
	at org.junit.runners.ParentRunner.runLeaf(ParentRunner.java:325)
	at org.junit.runners.BlockJUnit4ClassRunner.runChild(BlockJUnit4ClassRunner.java:78)
	at org.junit.runners.BlockJUnit4ClassRunner.runChild(BlockJUnit4ClassRunner.java:57)
	at org.junit.runners.ParentRunner$3.run(ParentRunner.java:290)
	at org.junit.runners.ParentRunner$1.schedule(ParentRunner.java:71)
	at org.junit.runners.ParentRunner.runChildren(ParentRunner.java:288)
	at org.junit.runners.ParentRunner.access$000(ParentRunner.java:58)
	at org.junit.runners.ParentRunner$2.evaluate(ParentRunner.java:268)
	at org.junit.runners.ParentRunner.run(ParentRunner.java:363)
	at org.apache.maven.surefire.junit4.JUnit4Provider.execute(JUnit4Provider.java:264)
	at org.apache.maven.surefire.junit4.JUnit4Provider.executeTestSet(JUnit4Provider.java:153)
	at org.apache.maven.surefire.junit4.JUnit4Provider.invoke(JUnit4Provider.java:124)
	at org.apache.maven.surefire.booter.ForkedBooter.invokeProviderInSameClassLoader(ForkedBooter.java:200)
	at org.apache.maven.surefire.booter.ForkedBooter.runSuitesInProcess(ForkedBooter.java:153)
	at org.apache.maven.surefire.booter.ForkedBooter.main(ForkedBooter.java:103)
Tests run: 4, Failures: 0, Errors: 0, Skipped: 0, Time elapsed: 3.921 sec - in org.locationtech.geogig.test.integration.StatusOpTest
Running org.locationtech.geogig.test.integration.ResetOpTest
testNoFastForwardSpecifyAuthor
Tests run: 6, Failures: 0, Errors: 0, Skipped: 0, Time elapsed: 10.931 sec - in org.locationtech.geogig.test.integration.BlameOpTest
Running org.locationtech.geogig.test.integration.CreatePatchOpTest
[main] WARN org.locationtech.geogig.hooks.CommandHookChain - Post-command hook org.locationtech.geogig.test.integration.HooksTest$ClasspathHookTest@6f6a7463 for command org.locationtech.geogig.porcelain.AddOp threw an exception that will not be propagated
java.lang.RuntimeException: expected
	at org.locationtech.geogig.test.integration.HooksTest$ClasspathHookTest.post(HooksTest.java:266)
	at org.locationtech.geogig.hooks.CommandHookChain.runPostHooks(CommandHookChain.java:65)
	at org.locationtech.geogig.hooks.CommandHooksDecorator$HooksListener.postCall(CommandHooksDecorator.java:60)
	at org.locationtech.geogig.repository.AbstractGeoGigOp.notifyPost(AbstractGeoGigOp.java:194)
	at org.locationtech.geogig.repository.AbstractGeoGigOp.call(AbstractGeoGigOp.java:170)
	at org.locationtech.geogig.test.integration.RepositoryTestCase.insertAndAdd(RepositoryTestCase.java:407)
	at org.locationtech.geogig.test.integration.RepositoryTestCase.insertAndAdd(RepositoryTestCase.java:395)
	at org.locationtech.geogig.test.integration.HooksTest.testClasspathHookPostFail(HooksTest.java:191)
	at sun.reflect.NativeMethodAccessorImpl.invoke0(Native Method)
	at sun.reflect.NativeMethodAccessorImpl.invoke(NativeMethodAccessorImpl.java:62)
	at sun.reflect.DelegatingMethodAccessorImpl.invoke(DelegatingMethodAccessorImpl.java:43)
	at java.lang.reflect.Method.invoke(Method.java:498)
	at org.junit.runners.model.FrameworkMethod$1.runReflectiveCall(FrameworkMethod.java:50)
	at org.junit.internal.runners.model.ReflectiveCallable.run(ReflectiveCallable.java:12)
	at org.junit.runners.model.FrameworkMethod.invokeExplosively(FrameworkMethod.java:47)
	at org.junit.internal.runners.statements.InvokeMethod.evaluate(InvokeMethod.java:17)
	at org.junit.internal.runners.statements.RunBefores.evaluate(RunBefores.java:26)
	at org.junit.internal.runners.statements.RunAfters.evaluate(RunAfters.java:27)
	at org.junit.rules.ExternalResource$1.evaluate(ExternalResource.java:48)
	at org.junit.rules.RunRules.evaluate(RunRules.java:20)
	at org.junit.runners.ParentRunner.runLeaf(ParentRunner.java:325)
	at org.junit.runners.BlockJUnit4ClassRunner.runChild(BlockJUnit4ClassRunner.java:78)
	at org.junit.runners.BlockJUnit4ClassRunner.runChild(BlockJUnit4ClassRunner.java:57)
	at org.junit.runners.ParentRunner$3.run(ParentRunner.java:290)
	at org.junit.runners.ParentRunner$1.schedule(ParentRunner.java:71)
	at org.junit.runners.ParentRunner.runChildren(ParentRunner.java:288)
	at org.junit.runners.ParentRunner.access$000(ParentRunner.java:58)
	at org.junit.runners.ParentRunner$2.evaluate(ParentRunner.java:268)
	at org.junit.runners.ParentRunner.run(ParentRunner.java:363)
	at org.apache.maven.surefire.junit4.JUnit4Provider.execute(JUnit4Provider.java:264)
	at org.apache.maven.surefire.junit4.JUnit4Provider.executeTestSet(JUnit4Provider.java:153)
	at org.apache.maven.surefire.junit4.JUnit4Provider.invoke(JUnit4Provider.java:124)
	at org.apache.maven.surefire.booter.ForkedBooter.invokeProviderInSameClassLoader(ForkedBooter.java:200)
	at org.apache.maven.surefire.booter.ForkedBooter.runSuitesInProcess(ForkedBooter.java:153)
	at org.apache.maven.surefire.booter.ForkedBooter.main(ForkedBooter.java:103)
Tests run: 3, Failures: 0, Errors: 0, Skipped: 0, Time elapsed: 11.049 sec - in org.locationtech.geogig.test.integration.RebuildGraphOpTest
[main] INFO org.locationtech.geogig.porcelain.RevertOp - Creating revert state of commit 022af25b3af80b9b0f10438d62ba8684adbca4b7 (commit for modified Points.1)
Running org.locationtech.geogig.test.integration.SquashOpTest
[main] INFO org.locationtech.geogig.porcelain.RevertOp - Created revert state of 1 features in 25.53 ms
[main] INFO org.locationtech.geogig.porcelain.RevertOp - Staging 0 changes...
[main] INFO org.locationtech.geogig.porcelain.RevertOp - 0 changes staged in 3.357 ms

testBothBranchesSameGeometryChange
Tests run: 6, Failures: 0, Errors: 0, Skipped: 0, Time elapsed: 11.528 sec - in org.locationtech.geogig.test.integration.BranchDeleteOpTest
Running org.locationtech.geogig.test.integration.CherryPickOpTest
[main] INFO org.locationtech.geogig.porcelain.RevertOp - Creating revert state of commit 7ddf4914526fd4d35a7f09198dfebaee2f7329b2 (commit for modified Points.1)
[main] INFO org.locationtech.geogig.porcelain.RevertOp - Created revert state of 1 features in 9.075 ms
[main] INFO org.locationtech.geogig.porcelain.RevertOp - Staging 0 changes...
[main] INFO org.locationtech.geogig.porcelain.RevertOp - 0 changes staged in 7.134 ms

Tests run: 2, Failures: 0, Errors: 0, Skipped: 0, Time elapsed: 11.585 sec - in org.locationtech.geogig.test.integration.CheckSparsePathTest
Running org.locationtech.geogig.test.integration.CommitOpTest
[main] INFO org.locationtech.geogig.hooks.Scripting - Running shell script /opt/public/hipp/ramdisk/geogig/junit5833627118927288439/repo1417301279/.geogig/hooks/pre_commit.bat
[main] INFO org.locationtech.geogig.hooks.Scripting - Running shell script /opt/public/hipp/ramdisk/geogig/junit5833627118927288439/repo1417301279/.geogig/hooks/pre_commit.bat
testMergeFastForwardSecondCase
[main] INFO org.locationtech.geogig.porcelain.RevertOp - Creating revert state of commit 064eaf450521ce592722d3d2a8f4d577986b4e05 (commit for Points.1)
[main] INFO org.locationtech.geogig.porcelain.RevertOp - Created revert state of 1 features in 9.043 ms
[main] INFO org.locationtech.geogig.porcelain.RevertOp - Staging 1 changes...
[main] INFO org.locationtech.geogig.porcelain.RevertOp - 1 changes staged in 16.05 ms

Tests run: 7, Failures: 0, Errors: 0, Skipped: 0, Time elapsed: 12.069 sec - in org.locationtech.geogig.test.integration.RevParseIntegrationTest
Running org.locationtech.geogig.test.integration.DiffOpTest
[main] INFO org.locationtech.geogig.hooks.Scripting - Running jvm script /opt/public/hipp/ramdisk/geogig/junit6574342759961978140/repo-748096171/.geogig/hooks/pre_commit.js
testOctopusMergeWithAutomerge
Tests run: 7, Failures: 0, Errors: 0, Skipped: 0, Time elapsed: 12.254 sec - in org.locationtech.geogig.test.integration.HooksTest
Running org.locationtech.geogig.test.performance.LogOpPerformanceTest
[main] INFO org.locationtech.geogig.test.performance.EnablePerformanceTestRule - org.locationtech.geogig.test.performance.LogOpPerformanceTest ignored, run with -Dgeogig.runPerformanceTests=true to enable it.
Tests run: 0, Failures: 0, Errors: 0, Skipped: 0, Time elapsed: 0.002 sec - in org.locationtech.geogig.test.performance.LogOpPerformanceTest
Running org.locationtech.geogig.test.performance.HeapGraphDatabaseStressTest
[main] INFO org.locationtech.geogig.test.performance.EnablePerformanceTestRule - org.locationtech.geogig.test.performance.HeapGraphDatabaseStressTest ignored, run with -Dgeogig.runPerformanceTests=true to enable it.
Tests run: 0, Failures: 0, Errors: 0, Skipped: 0, Time elapsed: 0.004 sec - in org.locationtech.geogig.test.performance.HeapGraphDatabaseStressTest
Running org.locationtech.geogig.test.performance.RevTreeBuilderPerformanceTest
[main] INFO org.locationtech.geogig.test.performance.EnablePerformanceTestRule - org.locationtech.geogig.test.performance.RevTreeBuilderPerformanceTest ignored, run with -Dgeogig.runPerformanceTests=true to enable it.
Tests run: 0, Failures: 0, Errors: 0, Skipped: 0, Time elapsed: 0.023 sec - in org.locationtech.geogig.test.performance.RevTreeBuilderPerformanceTest
Running org.locationtech.geogig.test.TestPlatformTest
Tests run: 1, Failures: 0, Errors: 0, Skipped: 0, Time elapsed: 0.296 sec - in org.locationtech.geogig.test.TestPlatformTest
Running org.locationtech.geogig.plumbing.ParseTimestampTest
[main] INFO org.locationtech.geogig.porcelain.RevertOp - Creating revert state of commit 9b811357912f7892977b3308b6e7c28e5d303585 (commit for modified Points.1)
[main] INFO org.locationtech.geogig.porcelain.RevertOp - Created revert state of 1 features in 16.99 ms
[main] INFO org.locationtech.geogig.porcelain.RevertOp - Staging 0 changes...
[main] INFO org.locationtech.geogig.porcelain.RevertOp - 0 changes staged in 5.067 ms

Tests run: 9, Failures: 0, Errors: 0, Skipped: 0, Time elapsed: 12.979 sec - in org.locationtech.geogig.test.integration.repository.IndexTest
Running org.locationtech.geogig.plumbing.index.BuildIndexOpTest
Tests run: 8, Failures: 0, Errors: 0, Skipped: 0, Time elapsed: 3.059 sec - in org.locationtech.geogig.test.integration.BranchRenameOpTest
Tests run: 5, Failures: 0, Errors: 0, Skipped: 0, Time elapsed: 13.098 sec - in org.locationtech.geogig.test.integration.FindCommonAncestorTest
Running org.locationtech.geogig.plumbing.DescribeFeatureTypeTest
Running org.locationtech.geogig.plumbing.index.BuildFullHistoryIndexOpTest
testConflictingMergeInterceptor
[main] INFO org.locationtech.geogig.porcelain.RevertOp - Creating revert state of commit 71745087e16fb9381cef3a4e27b6b61c4e36f950 (commit for Points.1)
[main] INFO org.locationtech.geogig.porcelain.RevertOp - Created revert state of 1 features in 1.709 ms
[main] INFO org.locationtech.geogig.porcelain.RevertOp - Staging 1 changes...
[main] INFO org.locationtech.geogig.porcelain.RevertOp - 1 changes staged in 4.622 ms

testMerge
Tests run: 2, Failures: 0, Errors: 0, Skipped: 0, Time elapsed: 0.687 sec - in org.locationtech.geogig.plumbing.DescribeFeatureTypeTest
Running org.locationtech.geogig.plumbing.CheckRefFormatTest
Tests run: 8, Failures: 0, Errors: 0, Skipped: 0, Time elapsed: 3.14 sec - in org.locationtech.geogig.test.integration.CreatePatchOpTest
Running org.locationtech.geogig.plumbing.diff.DiffCountConsumerTest
[main] INFO org.locationtech.geogig.porcelain.RevertOp - Creating revert state of commit 97fb394fc1879d277680793fb1e9862fed03520a (commit for removing Points.1)
[main] INFO org.locationtech.geogig.porcelain.RevertOp - Created revert state of 1 features in 15.36 ms
[main] INFO org.locationtech.geogig.porcelain.RevertOp - Staging 0 changes...
[main] INFO org.locationtech.geogig.porcelain.RevertOp - 0 changes staged in 6.004 ms

testConflictingOctopusMerge
Tests run: 2, Failures: 0, Errors: 0, Skipped: 0, Time elapsed: 0.708 sec - in org.locationtech.geogig.plumbing.CheckRefFormatTest
Running org.locationtech.geogig.plumbing.diff.DepthTreeIteratorTest
Tests run: 12, Failures: 0, Errors: 0, Skipped: 0, Time elapsed: 14.599 sec - in org.locationtech.geogig.test.integration.AddOpTest
Running org.locationtech.geogig.plumbing.diff.TreeDifferenceTest
Tests run: 7, Failures: 0, Errors: 0, Skipped: 0, Time elapsed: 0.028 sec - in org.locationtech.geogig.plumbing.diff.TreeDifferenceTest
Running org.locationtech.geogig.plumbing.diff.PreOrderDiffWalkTest
[main] INFO org.locationtech.geogig.porcelain.RevertOp - Creating revert state of commit 6e9952570fe9715ab0ad4527e2c01a988bba655a (commit for Lines.1)
[main] INFO org.locationtech.geogig.porcelain.RevertOp - Created revert state of 1 features in 2.792 ms
[main] INFO org.locationtech.geogig.porcelain.RevertOp - Staging 1 changes...
Tests run: 7, Failures: 0, Errors: 0, Skipped: 1, Time elapsed: 3.247 sec - in org.locationtech.geogig.test.integration.CherryPickOpTest
Running org.locationtech.geogig.plumbing.diff.MutableTreeTest
[main] INFO org.locationtech.geogig.porcelain.RevertOp - 1 changes staged in 16.98 ms

Tests run: 7, Failures: 0, Errors: 0, Skipped: 0, Time elapsed: 0.012 sec - in org.locationtech.geogig.plumbing.diff.MutableTreeTest
Running org.locationtech.geogig.plumbing.diff.GeometryDiffTest
Tests run: 14, Failures: 0, Errors: 0, Skipped: 0, Time elapsed: 0.151 sec - in org.locationtech.geogig.plumbing.diff.GeometryDiffTest
Running org.locationtech.geogig.plumbing.diff.PreOrderDiffWalkQuadTreeTest
Tests run: 1, Failures: 0, Errors: 0, Skipped: 1, Time elapsed: 0.004 sec - in org.locationtech.geogig.plumbing.diff.PreOrderDiffWalkQuadTreeTest
Running org.locationtech.geogig.plumbing.diff.PostOrderDiffWalkTest
Merge: merging [911e5cc0d1fae2dc7c52b9af56855e73addc4858] onto HEAD -> [refs/heads/intermediate_left -> 00a785c0037f0a70a511ec49233fdc71f8cc9dd6]
Checking for possible conflicts...
Merging commit 911e5cc0 (right modify 1) onto 00a785c0 (left modify 1)
Conflicts: 0, merged: 0, unconflicted: 1
Staging changes...
Building final tree Points
Tree Points staged in 644.6 μs
Done.
Creating merge commit
Tests run: 10, Failures: 0, Errors: 0, Skipped: 0, Time elapsed: 15.186 sec - in org.locationtech.geogig.test.integration.ReportCommitConflictsOpTest
Running org.locationtech.geogig.plumbing.diff.PatchSerializationTest
Merge: created merge commit Commit[6a42431cdb0466def4e1d2889676c0777ffa3208, 'merge 1']
Tests run: 21, Failures: 0, Errors: 0, Skipped: 0, Time elapsed: 15.455 sec - in org.locationtech.geogig.test.integration.ConfigOpTest
Merge: merging [a2077e2daeeecfdd993cd28c5c914a40f5dc6701] onto HEAD -> [refs/heads/intermediate_left -> 6a42431cdb0466def4e1d2889676c0777ffa3208]
Checking for possible conflicts...
Running org.locationtech.geogig.plumbing.diff.AttributeDiffTest
Tests run: 4, Failures: 0, Errors: 0, Skipped: 0, Time elapsed: 0 sec - in org.locationtech.geogig.plumbing.diff.AttributeDiffTest
Running org.locationtech.geogig.plumbing.remotes.RemoteRemoveOpTest
Merging commit a2077e2d (left modify 2) onto 6a42431c (merge 1)
Conflicts: 0, merged: 0, unconflicted: 1
Staging changes...
Building final tree Points
Tree Points staged in 586.5 μs
Done.
Creating merge commit
Merge: created merge commit Commit[4228fec77cb5f67cc58b1968fd4f30df89006966, 'merge 2 left']
testFastForwardOnly
Tests run: 20, Failures: 0, Errors: 0, Skipped: 0, Time elapsed: 16.064 sec - in org.locationtech.geogig.test.integration.repository.WorkingTreeTest
Running org.locationtech.geogig.plumbing.remotes.RemoteAddOpTest
Tests run: 11, Failures: 0, Errors: 0, Skipped: 0, Time elapsed: 5.886 sec - in org.locationtech.geogig.test.integration.BranchCreateOpTest
Merge: merging [c2cd09a81756d2e93c122d5d09ee4916f0a6baed] onto HEAD -> [refs/heads/intermediate_right -> 6a42431cdb0466def4e1d2889676c0777ffa3208]
Checking for possible conflicts...
Running org.locationtech.geogig.plumbing.FindChangedTreesTest
Merging commit c2cd09a8 (right modify 2) onto 6a42431c (merge 1)
Conflicts: 0, merged: 0, unconflicted: 2
Staging changes...
Building final tree Lines
Tree Lines staged in 619.1 μs
Done.
Creating merge commit
Tests run: 10, Failures: 0, Errors: 0, Skipped: 0, Time elapsed: 16.061 sec - in org.locationtech.geogig.test.integration.LsTreeOpTest
Running org.locationtech.geogig.plumbing.merge.MergeFeaturesOpTest
Merge: created merge commit Commit[aa470d2f4f45589bb1d7e3af730d0b29899834e9, 'merge 2 right']
Merge: merging [aa470d2f4f45589bb1d7e3af730d0b29899834e9] onto HEAD -> [refs/heads/master -> 4228fec77cb5f67cc58b1968fd4f30df89006966]
Checking for possible conflicts...
Merging commit aa470d2f (merge 2 right) onto 4228fec7 (merge 2 left)
Conflicts: 0, merged: 0, unconflicted: 2
Staging changes...
Building final tree Lines
Tree Lines staged in 633.7 μs
Done.
Creating merge commit
Merge: created merge commit Commit[0ee1ad170a24729625324727491c72c0c08ae8c0, 'final merge']
[main] INFO org.locationtech.geogig.porcelain.RevertOp - Creating revert state of commit f0879f5002be41335185624e32e30ecf29c5eb14 (commit for Points.2)
[main] INFO org.locationtech.geogig.porcelain.RevertOp - Created revert state of 1 features in 13.71 ms
[main] INFO org.locationtech.geogig.porcelain.RevertOp - Staging 1 changes...
[main] INFO org.locationtech.geogig.porcelain.RevertOp - 1 changes staged in 9.318 ms

[main] INFO org.locationtech.geogig.porcelain.RevertOp - Creating revert state of commit 982c1ee225ad75904a97a5df0000a4d6d6aed3fc (commit for modified Points.1)
[main] INFO org.locationtech.geogig.porcelain.RevertOp - Created revert state of 1 features in 12.96 ms
[main] INFO org.locationtech.geogig.porcelain.RevertOp - Staging 1 changes...
[main] INFO org.locationtech.geogig.porcelain.RevertOp - 1 changes staged in 4.882 ms

[main] INFO org.locationtech.geogig.porcelain.RevertOp - Creating revert state of commit cbf149d345d321de0c9135f74f320bf1a1b77f93 (commit for deleted Points.3)
[main] INFO org.locationtech.geogig.porcelain.RevertOp - Created revert state of 1 features in 150.4 ms
[main] INFO org.locationtech.geogig.porcelain.RevertOp - Staging 1 changes...
[main] INFO org.locationtech.geogig.porcelain.RevertOp - 1 changes staged in 7.716 ms

Tests run: 9, Failures: 0, Errors: 0, Skipped: 0, Time elapsed: 2.825 sec - in org.locationtech.geogig.plumbing.diff.DiffCountConsumerTest
Running org.locationtech.geogig.plumbing.merge.MergeStatusBuilderDiffEntrySerializerTest
Tests run: 7, Failures: 0, Errors: 0, Skipped: 0, Time elapsed: 1.958 sec - in org.locationtech.geogig.plumbing.diff.PostOrderDiffWalkTest
Running org.locationtech.geogig.plumbing.ResolveRepositoryNameTest
Tests run: 1, Failures: 0, Errors: 0, Skipped: 0, Time elapsed: 0.782 sec - in org.locationtech.geogig.plumbing.merge.MergeFeaturesOpTest
Running org.locationtech.geogig.plumbing.UpdateRefTest
testSpecifyAuthor
Tests run: 13, Failures: 0, Errors: 0, Skipped: 0, Time elapsed: 17.478 sec - in org.locationtech.geogig.test.integration.ReportMergeConflictsOpTest
Running org.locationtech.geogig.plumbing.ResolveFeatureTypeTest
[main] INFO org.locationtech.geogig.porcelain.RevertOp - Creating revert state of commit b9dc405e016b5c2f4dea150f13cb09c9212a57b9 (commit for Points.2)
[main] INFO org.locationtech.geogig.porcelain.RevertOp - Created revert state of 1 features in 16.97 ms
[main] INFO org.locationtech.geogig.porcelain.RevertOp - Staging 1 changes...
[main] INFO org.locationtech.geogig.porcelain.RevertOp - 1 changes staged in 17.03 ms

[main] INFO org.locationtech.geogig.porcelain.RevertOp - Creating revert state of commit f30db364c2c5e785a3c388703705ea01aedbcd09 (commit for modified Points.1)
[main] INFO org.locationtech.geogig.porcelain.RevertOp - Created revert state of 1 features in 2.622 ms
[main] INFO org.locationtech.geogig.porcelain.RevertOp - Staging 1 changes...
[main] INFO org.locationtech.geogig.porcelain.RevertOp - 1 changes staged in 5.844 ms

[main] INFO org.locationtech.geogig.porcelain.RevertOp - Creating revert state of commit a57a7326241eb5857ba60b97880c8f95c1c530d5 (commit for deleted Points.3)
[main] INFO org.locationtech.geogig.porcelain.RevertOp - Created revert state of 1 features in 2.989 ms
[main] INFO org.locationtech.geogig.porcelain.RevertOp - Staging 1 changes...
[main] INFO org.locationtech.geogig.porcelain.RevertOp - 1 changes staged in 4.848 ms

Tests run: 18, Failures: 0, Errors: 0, Skipped: 0, Time elapsed: 7.054 sec - in org.locationtech.geogig.test.integration.ApplyPatchOpTest
Running org.locationtech.geogig.plumbing.RevParseTest
Tests run: 15, Failures: 0, Errors: 0, Skipped: 0, Time elapsed: 17.541 sec - in org.locationtech.geogig.test.integration.GeogigTransactionTest
Running org.locationtech.geogig.plumbing.UpdateSymRefTest
Tests run: 2, Failures: 0, Errors: 0, Skipped: 0, Time elapsed: 0.752 sec - in org.locationtech.geogig.plumbing.ResolveRepositoryNameTest
Running org.locationtech.geogig.plumbing.DiffTreeTest
testOursAndTheirs
Tests run: 15, Failures: 0, Errors: 0, Skipped: 0, Time elapsed: 17.995 sec - in org.locationtech.geogig.test.integration.RevertOpTest
Running org.locationtech.geogig.plumbing.WalkGraphOpTest
Tests run: 5, Failures: 0, Errors: 0, Skipped: 0, Time elapsed: 1.101 sec - in org.locationtech.geogig.plumbing.merge.MergeStatusBuilderDiffEntrySerializerTest
Running org.locationtech.geogig.plumbing.RefParseTest
Tests run: 5, Failures: 0, Errors: 0, Skipped: 0, Time elapsed: 0.222 sec - in org.locationtech.geogig.plumbing.RefParseTest
Running org.locationtech.geogig.plumbing.DiffFeatureTest
Tests run: 12, Failures: 0, Errors: 0, Skipped: 0, Time elapsed: 18.469 sec - in org.locationtech.geogig.test.integration.RebaseOpTest
Running org.locationtech.geogig.plumbing.ResolveGeogigURITest
testNoCommitMerge
Tests run: 8, Failures: 0, Errors: 0, Skipped: 0, Time elapsed: 3.291 sec - in org.locationtech.geogig.plumbing.diff.PatchSerializationTest
Running org.locationtech.geogig.plumbing.DiffBoundsTest
Tests run: 5, Failures: 0, Errors: 0, Skipped: 0, Time elapsed: 1.933 sec - in org.locationtech.geogig.plumbing.UpdateRefTest
Running org.locationtech.geogig.plumbing.WriteTree2Test
Tests run: 13, Failures: 0, Errors: 0, Skipped: 0, Time elapsed: 8.274 sec - in org.locationtech.geogig.test.integration.ResetOpTest
Running org.locationtech.geogig.plumbing.UpdateTreeTest

Tests run: 8, Failures: 0, Errors: 0, Skipped: 0, Time elapsed: 3.726 sec - in org.locationtech.geogig.plumbing.remotes.RemoteRemoveOpTest
Running org.locationtech.geogig.plumbing.CatObjectTest
testMergeFastForward
testOctopusMergeSameFeatureChanges
Tests run: 5, Failures: 0, Errors: 0, Skipped: 0, Time elapsed: 2.145 sec - in org.locationtech.geogig.plumbing.ResolveFeatureTypeTest
Running org.locationtech.geogig.plumbing.HashObjectTest
Tests run: 5, Failures: 0, Errors: 0, Skipped: 0, Time elapsed: 2.087 sec - in org.locationtech.geogig.plumbing.UpdateSymRefTest
Running org.locationtech.geogig.porcelain.index.DropIndexOpTest
Tests run: 10, Failures: 0, Errors: 0, Skipped: 0, Time elapsed: 3.922 sec - in org.locationtech.geogig.plumbing.remotes.RemoteAddOpTest
Running org.locationtech.geogig.porcelain.index.CreateIndexOpTest
sp	StringProp1_1 -> StringProp1_1a
ip	1000 -> 1001
pp	0 point(s) deleted, 0 new point(s) added, 1 point(s) moved

Tests run: 4, Failures: 0, Errors: 0, Skipped: 0, Time elapsed: 2.049 sec - in org.locationtech.geogig.plumbing.DiffFeatureTest
Running org.locationtech.geogig.porcelain.index.UpdateIndexOpTest
left : Tree[c932cbd11ec75bcc145e2a362a3199bb85eb3abc; size=7; subtrees=2, buckets=0, features=0]
	[TreeNode[buildings -> a400000000000000000000000000000000000000], TreeNode[roads -> ff488999ad51848c7850ffd4d12568a3125172b0]]
	[]
right: Tree[8996d6e4437a8d8ea41ffc1f32cfaab9bf9de384; size=5; subtrees=1, buckets=0, features=0]
	[TreeNode[roads -> 72e2f547f3adc30edd55733abb885e8e6de1f1a4]]
	[]
Tests run: 19, Failures: 0, Errors: 0, Skipped: 0, Time elapsed: 20.244 sec - in org.locationtech.geogig.test.integration.LogOpTest
Running org.locationtech.geogig.porcelain.index.UpdateIndexesOpTest
[main] ERROR org.locationtech.geogig.plumbing.diff.PreOrderDiffWalk - Exception caught executing task
java.lang.IllegalStateException: java.lang.IllegalStateException: Object NodeRef[Points/Points.1 -> a47ca38e5c3e92c94dec9e8ea597c642003ec878] not found.
	at sun.reflect.NativeConstructorAccessorImpl.newInstance0(Native Method)
	at sun.reflect.NativeConstructorAccessorImpl.newInstance(NativeConstructorAccessorImpl.java:62)
	at sun.reflect.DelegatingConstructorAccessorImpl.newInstance(DelegatingConstructorAccessorImpl.java:45)
	at java.lang.reflect.Constructor.newInstance(Constructor.java:423)
	at java.util.concurrent.ForkJoinTask.getThrowableException(ForkJoinTask.java:593)
	at java.util.concurrent.ForkJoinTask.reportException(ForkJoinTask.java:677)
	at java.util.concurrent.ForkJoinTask.join(ForkJoinTask.java:720)
	at java.util.concurrent.ForkJoinPool.invoke(ForkJoinPool.java:2616)
	at org.locationtech.geogig.plumbing.diff.PreOrderDiffWalk.walk(PreOrderDiffWalk.java:386)
	at org.locationtech.geogig.plumbing.WalkGraphOp._call(WalkGraphOp.java:160)
	at org.locationtech.geogig.plumbing.WalkGraphOp._call(WalkGraphOp.java:32)
	at org.locationtech.geogig.repository.AbstractGeoGigOp.call(AbstractGeoGigOp.java:169)
	at org.locationtech.geogig.plumbing.WalkGraphOpTest.testObjectDoesNotExist(WalkGraphOpTest.java:179)
	at sun.reflect.NativeMethodAccessorImpl.invoke0(Native Method)
	at sun.reflect.NativeMethodAccessorImpl.invoke(NativeMethodAccessorImpl.java:62)
	at sun.reflect.DelegatingMethodAccessorImpl.invoke(DelegatingMethodAccessorImpl.java:43)
	at java.lang.reflect.Method.invoke(Method.java:498)
	at org.junit.runners.model.FrameworkMethod$1.runReflectiveCall(FrameworkMethod.java:50)
	at org.junit.internal.runners.model.ReflectiveCallable.run(ReflectiveCallable.java:12)
	at org.junit.runners.model.FrameworkMethod.invokeExplosively(FrameworkMethod.java:47)
	at org.junit.internal.runners.statements.InvokeMethod.evaluate(InvokeMethod.java:17)
	at org.junit.internal.runners.statements.RunBefores.evaluate(RunBefores.java:26)
	at org.junit.internal.runners.statements.RunAfters.evaluate(RunAfters.java:27)
	at org.junit.rules.ExpectedException$ExpectedExceptionStatement.evaluate(ExpectedException.java:239)
	at org.junit.rules.ExternalResource$1.evaluate(ExternalResource.java:48)
	at org.junit.rules.RunRules.evaluate(RunRules.java:20)
	at org.junit.runners.ParentRunner.runLeaf(ParentRunner.java:325)
	at org.junit.runners.BlockJUnit4ClassRunner.runChild(BlockJUnit4ClassRunner.java:78)
	at org.junit.runners.BlockJUnit4ClassRunner.runChild(BlockJUnit4ClassRunner.java:57)
	at org.junit.runners.ParentRunner$3.run(ParentRunner.java:290)
	at org.junit.runners.ParentRunner$1.schedule(ParentRunner.java:71)
	at org.junit.runners.ParentRunner.runChildren(ParentRunner.java:288)
	at org.junit.runners.ParentRunner.access$000(ParentRunner.java:58)
	at org.junit.runners.ParentRunner$2.evaluate(ParentRunner.java:268)
	at org.junit.runners.ParentRunner.run(ParentRunner.java:363)
	at org.apache.maven.surefire.junit4.JUnit4Provider.execute(JUnit4Provider.java:264)
	at org.apache.maven.surefire.junit4.JUnit4Provider.executeTestSet(JUnit4Provider.java:153)
	at org.apache.maven.surefire.junit4.JUnit4Provider.invoke(JUnit4Provider.java:124)
	at org.apache.maven.surefire.booter.ForkedBooter.invokeProviderInSameClassLoader(ForkedBooter.java:200)
	at org.apache.maven.surefire.booter.ForkedBooter.runSuitesInProcess(ForkedBooter.java:153)
	at org.apache.maven.surefire.booter.ForkedBooter.main(ForkedBooter.java:103)
Caused by: java.lang.IllegalStateException: Object NodeRef[Points/Points.1 -> a47ca38e5c3e92c94dec9e8ea597c642003ec878] not found.
	at org.locationtech.geogig.plumbing.WalkGraphOp$1.checkExists(WalkGraphOp.java:155)
	at org.locationtech.geogig.plumbing.WalkGraphOp$1.feature(WalkGraphOp.java:128)
	at org.locationtech.geogig.plumbing.diff.PreOrderDiffWalk$CancellableConsumer.feature(PreOrderDiffWalk.java:1408)
	at org.locationtech.geogig.plumbing.diff.PreOrderDiffWalk$WalkAction.node(PreOrderDiffWalk.java:713)
	at org.locationtech.geogig.plumbing.diff.PreOrderDiffWalk$TraverseLeafLeaf.compute(PreOrderDiffWalk.java:918)
	at org.locationtech.geogig.plumbing.diff.PreOrderDiffWalk$TraverseTreeContents.compute(PreOrderDiffWalk.java:824)
	at org.locationtech.geogig.plumbing.diff.PreOrderDiffWalk$TraverseTree.compute(PreOrderDiffWalk.java:782)
	at java.util.concurrent.RecursiveAction.exec(RecursiveAction.java:189)
	at java.util.concurrent.ForkJoinTask.doExec(ForkJoinTask.java:289)
	at java.util.concurrent.ForkJoinTask.doInvoke(ForkJoinTask.java:401)
	at java.util.concurrent.ForkJoinTask.invokeAll(ForkJoinTask.java:843)
	at org.locationtech.geogig.plumbing.diff.PreOrderDiffWalk$TraverseLeafLeaf.compute(PreOrderDiffWalk.java:925)
	at org.locationtech.geogig.plumbing.diff.PreOrderDiffWalk$TraverseTreeContents.compute(PreOrderDiffWalk.java:824)
	at org.locationtech.geogig.plumbing.diff.PreOrderDiffWalk$TraverseTree.compute(PreOrderDiffWalk.java:782)
	at java.util.concurrent.RecursiveAction.exec(RecursiveAction.java:189)
	at java.util.concurrent.ForkJoinTask.doExec(ForkJoinTask.java:289)
	at java.util.concurrent.ForkJoinPool$WorkQueue.runTask(ForkJoinPool.java:1056)
	at java.util.concurrent.ForkJoinPool.runWorker(ForkJoinPool.java:1692)
	at java.util.concurrent.ForkJoinWorkerThread.run(ForkJoinWorkerThread.java:157)
testMergeNullCommit
Tests run: 7, Failures: 0, Errors: 0, Skipped: 0, Time elapsed: 2.085 sec - in org.locationtech.geogig.plumbing.UpdateTreeTest
Tests run: 7, Failures: 0, Errors: 0, Skipped: 0, Time elapsed: 3.077 sec - in org.locationtech.geogig.plumbing.WalkGraphOpTest
Running org.locationtech.geogig.porcelain.RemoveOpTest
Running org.locationtech.geogig.porcelain.InitOpTest
Tests run: 3, Failures: 0, Errors: 0, Skipped: 0, Time elapsed: 2.03 sec - in org.locationtech.geogig.plumbing.CatObjectTest
Running org.locationtech.geogig.data.EPSGBoundsYXTest
Tests run: 1, Failures: 0, Errors: 0, Skipped: 1, Time elapsed: 0.004 sec - in org.locationtech.geogig.data.EPSGBoundsYXTest
Running org.locationtech.geogig.data.EPSGBoundsXYTest
Tests run: 1, Failures: 0, Errors: 0, Skipped: 1, Time elapsed: 0 sec - in org.locationtech.geogig.data.EPSGBoundsXYTest
Running org.locationtech.geogig.data.retrieve.BackgroundingIteratorTest
testMergeMultiple
Tests run: 9, Failures: 0, Errors: 0, Skipped: 0, Time elapsed: 8.74 sec - in org.locationtech.geogig.plumbing.index.BuildIndexOpTest
Running org.locationtech.geogig.data.retrieve.IteratorBackedFeatureReaderTest
Tests run: 1, Failures: 0, Errors: 0, Skipped: 0, Time elapsed: 0 sec - in org.locationtech.geogig.data.retrieve.IteratorBackedFeatureReaderTest
Running org.locationtech.geogig.data.retrieve.BulkFeatureRetrieverTest
Tests run: 21, Failures: 0, Errors: 0, Skipped: 0, Time elapsed: 21.734 sec - in org.locationtech.geogig.test.integration.CheckoutOpTest
Running org.locationtech.geogig.data.retrieve.MultiFeatureTypeBuilderTest
Tests run: 14, Failures: 0, Errors: 0, Skipped: 0, Time elapsed: 10.867 sec - in org.locationtech.geogig.test.integration.SquashOpTest
Tests run: 8, Failures: 0, Errors: 0, Skipped: 0, Time elapsed: 2.234 sec - in org.locationtech.geogig.plumbing.HashObjectTest
Running org.locationtech.geogig.data.PrimitiveArrayToStringConverterFactoryTest
Running org.locationtech.geogig.data.EPSGBoundsCalcTest
Tests run: 8, Failures: 0, Errors: 0, Skipped: 0, Time elapsed: 0.015 sec - in org.locationtech.geogig.data.PrimitiveArrayToStringConverterFactoryTest
Running org.locationtech.geogig.data.FeatureBuilderTest
Tests run: 4, Failures: 0, Errors: 0, Skipped: 0, Time elapsed: 0.953 sec - in org.locationtech.geogig.porcelain.InitOpTest
Running org.locationtech.geogig.data.MapToStringConverterFactoryTest
Tests run: 2, Failures: 0, Errors: 0, Skipped: 0, Time elapsed: 0.298 sec - in org.locationtech.geogig.data.retrieve.MultiFeatureTypeBuilderTest
Running org.locationtech.geogig.model.impl.RevCommitImplTest
Tests run: 2, Failures: 0, Errors: 0, Skipped: 0, Time elapsed: 0.001 sec - in org.locationtech.geogig.model.impl.RevCommitImplTest
Running org.locationtech.geogig.model.impl.CanonicalTreeBuilderTest
Tests run: 2, Failures: 0, Errors: 0, Skipped: 0, Time elapsed: 0.117 sec - in org.locationtech.geogig.data.MapToStringConverterFactoryTest
Running org.locationtech.geogig.model.impl.RevPersonTest
Tests run: 3, Failures: 0, Errors: 0, Skipped: 0, Time elapsed: 0.003 sec - in org.locationtech.geogig.model.impl.RevPersonTest
Running org.locationtech.geogig.model.impl.RevFeatureTypeTest
testMergeConflictingPolygon
Tests run: 1, Failures: 0, Errors: 0, Skipped: 0, Time elapsed: 0.433 sec - in org.locationtech.geogig.data.retrieve.BulkFeatureRetrieverTest
Running org.locationtech.geogig.model.impl.QuadTreeBuilderExpandCollapseTest
Tests run: 1, Failures: 0, Errors: 0, Skipped: 0, Time elapsed: 0.004 sec - in org.locationtech.geogig.model.impl.QuadTreeBuilderExpandCollapseTest
Running org.locationtech.geogig.model.impl.LegacyTreeBuilderTest
Tests run: 9, Failures: 0, Errors: 0, Skipped: 0, Time elapsed: 1.084 sec - in org.locationtech.geogig.data.retrieve.BackgroundingIteratorTest
Tests run: 7, Failures: 0, Errors: 0, Skipped: 0, Time elapsed: 9.239 sec - in org.locationtech.geogig.plumbing.index.BuildFullHistoryIndexOpTest
Running org.locationtech.geogig.model.impl.RevFeatureTest
Tests run: 2, Failures: 0, Errors: 0, Skipped: 0, Time elapsed: 0 sec - in org.locationtech.geogig.model.impl.RevFeatureTest
Tests run: 1, Failures: 0, Errors: 0, Skipped: 0, Time elapsed: 0.344 sec - in org.locationtech.geogig.data.FeatureBuilderTest
Running org.locationtech.geogig.model.impl.CommitBuilderTest
Running org.locationtech.geogig.model.internal.QuadTreeClusteringStrategy_computeIdTest
Running org.locationtech.geogig.model.internal.QuadTreeClusteringStrategyTest
Tests run: 6, Failures: 0, Errors: 0, Skipped: 0, Time elapsed: 0.021 sec - in org.locationtech.geogig.model.impl.CommitBuilderTest
Running org.locationtech.geogig.model.internal.CanonicalClusteringStrategyHeapStorageTest
Tests run: 12, Failures: 0, Errors: 0, Skipped: 12, Time elapsed: 0.015 sec - in org.locationtech.geogig.model.internal.QuadTreeClusteringStrategyTest
Running org.locationtech.geogig.model.internal.QuadrantTest
Tests run: 9, Failures: 0, Errors: 0, Skipped: 0, Time elapsed: 0.076 sec - in org.locationtech.geogig.model.internal.QuadrantTest
Running org.locationtech.geogig.model.internal.NodeIdTest
Tests run: 3, Failures: 0, Errors: 0, Skipped: 0, Time elapsed: 0.063 sec - in org.locationtech.geogig.model.internal.NodeIdTest
Running org.locationtech.geogig.model.internal.QuadTreeClusteringStrategy_putTest
Tests run: 8, Failures: 0, Errors: 0, Skipped: 0, Time elapsed: 0.32 sec - in org.locationtech.geogig.model.internal.QuadTreeClusteringStrategy_computeIdTest
Tests run: 2, Failures: 0, Errors: 0, Skipped: 0, Time elapsed: 0.53 sec - in org.locationtech.geogig.model.impl.RevFeatureTypeTest
Running org.locationtech.geogig.model.internal.CanonicalClusteringStrategyRocksdbStorageTest
DAG[id:[], orig:EMPTY, status: CHANGED, size: 129, children: 0, buckets: 1)[children: {}, buckets: [[2]]]
 DAG[id:[2], orig:EMPTY, status: CHANGED, size: 129, children: 0, buckets: 2)[children: {}, buckets: [[2, 0], [2, 3]]]
  Running org.locationtech.geogig.model.internal.DAGNodeTest
DAG[id:[2, 0], orig:EMPTY, status: CHANGED, size: 90, children: 90, buckets: 0)[children: {node # 2=NodeId[node # 2, Env[2.0 : 2.0, 1.0 : 1.0]], node # 1=NodeId[node # 1, Env[1.0 : 1.0, 1.0 : 1.0]], node # 18=NodeId[node # 18, Env[18.0 : 18.0, 1.0 : 1.0]], node # 19=NodeId[node # 19, Env[19.0 : 19.0, 1.0 : 1.0]], node # 16=NodeId[node # 16, Env[16.0 : 16.0, 1.0 : 1.0]], node # 17=NodeId[node # 17, Env[17.0 : 17.0, 1.0 : 1.0]], node # 9=NodeId[node # 9, Env[9.0 : 9.0, 1.0 : 1.0]], node # 8=NodeId[node # 8, Env[8.0 : 8.0, 1.0 : 1.0]], node # 7=NodeId[node # 7, Env[7.0 : 7.0, 1.0 : 1.0]], node # 6=NodeId[node # 6, Env[6.0 : 6.0, 1.0 : 1.0]], node # 5=NodeId[node # 5, Env[5.0 : 5.0, 1.0 : 1.0]], node # 4=NodeId[node # 4, Env[4.0 : 4.0, 1.0 : 1.0]], node # 3=NodeId[node # 3, Env[3.0 : 3.0, 1.0 : 1.0]], node # 61=NodeId[node # 61, Env[61.0 : 61.0, 1.0 : 1.0]], node # 62=NodeId[node # 62, Env[62.0 : 62.0, 1.0 : 1.0]], node # 60=NodeId[node # 60, Env[60.0 : 60.0, 1.0 : 1.0]], node # 69=NodeId[node # 69, Env[69.0 : 69.0, 1.0 : 1.0]], node # 25=NodeId[node # 25, Env[25.0 : 25.0, 1.0 : 1.0]], node # 26=NodeId[node # 26, Env[26.0 : 26.0, 1.0 : 1.0]], node # 67=NodeId[node # 67, Env[67.0 : 67.0, 1.0 : 1.0]], node # 23=NodeId[node # 23, Env[23.0 : 23.0, 1.0 : 1.0]], node # 68=NodeId[node # 68, Env[68.0 : 68.0, 1.0 : 1.0]], node # 24=NodeId[node # 24, Env[24.0 : 24.0, 1.0 : 1.0]], node # 65=NodeId[node # 65, Env[65.0 : 65.0, 1.0 : 1.0]], node # 21=NodeId[node # 21, Env[21.0 : 21.0, 1.0 : 1.0]], node # 66=NodeId[node # 66, Env[66.0 : 66.0, 1.0 : 1.0]], node # 22=NodeId[node # 22, Env[22.0 : 22.0, 1.0 : 1.0]], node # 63=NodeId[node # 63, Env[63.0 : 63.0, 1.0 : 1.0]], node # 64=NodeId[node # 64, Env[64.0 : 64.0, 1.0 : 1.0]], node # 20=NodeId[node # 20, Env[20.0 : 20.0, 1.0 : 1.0]], node # 49=NodeId[node # 49, Env[49.0 : 49.0, 1.0 : 1.0]], node # 50=NodeId[node # 50, Env[50.0 : 50.0, 1.0 : 1.0]], node # 51=NodeId[node # 51, Env[51.0 : 51.0, 1.0 : 1.0]], node # 90=NodeId[node # 90, Env[90.0 : 90.0, 1.0 : 1.0]], node # 58=NodeId[node # 58, Env[58.0 : 58.0, 1.0 : 1.0]], node # 14=NodeId[node # 14, Env[14.0 : 14.0, 1.0 : 1.0]], node # 59=NodeId[node # 59, Env[59.0 : 59.0, 1.0 : 1.0]], node # 15=NodeId[node # 15, Env[15.0 : 15.0, 1.0 : 1.0]], node # 56=NodeId[node # 56, Env[56.0 : 56.0, 1.0 : 1.0]], node # 12=NodeId[node # 12, Env[12.0 : 12.0, 1.0 : 1.0]], node # 57=NodeId[node # 57, Env[57.0 : 57.0, 1.0 : 1.0]], node # 13=NodeId[node # 13, Env[13.0 : 13.0, 1.0 : 1.0]], node # 54=NodeId[node # 54, Env[54.0 : 54.0, 1.0 : 1.0]], node # 10=NodeId[node # 10, Env[10.0 : 10.0, 1.0 : 1.0]], node # 55=NodeId[node # 55, Env[55.0 : 55.0, 1.0 : 1.0]], node # 11=NodeId[node # 11, Env[11.0 : 11.0, 1.0 : 1.0]], node # 52=NodeId[node # 52, Env[52.0 : 52.0, 1.0 : 1.0]], node # 53=NodeId[node # 53, Env[53.0 : 53.0, 1.0 : 1.0]], node # 38=NodeId[node # 38, Env[38.0 : 38.0, 1.0 : 1.0]], node # 39=NodeId[node # 39, Env[39.0 : 39.0, 1.0 : 1.0]], node # 83=NodeId[node # 83, Env[83.0 : 83.0, 1.0 : 1.0]], node # 84=NodeId[node # 84, Env[84.0 : 84.0, 1.0 : 1.0]], node # 40=NodeId[node # 40, Env[40.0 : 40.0, 1.0 : 1.0]], node # 81=NodeId[node # 81, Env[81.0 : 81.0, 1.0 : 1.0]], node # 82=NodeId[node # 82, Env[82.0 : 82.0, 1.0 : 1.0]], node # 80=NodeId[node # 80, Env[80.0 : 80.0, 1.0 : 1.0]], node # 47=NodeId[node # 47, Env[47.0 : 47.0, 1.0 : 1.0]], node # 48=NodeId[node # 48, Env[48.0 : 48.0, 1.0 : 1.0]], node # 89=NodeId[node # 89, Env[89.0 : 89.0, 1.0 : 1.0]], node # 45=NodeId[node # 45, Env[45.0 : 45.0, 1.0 : 1.0]], node # 46=NodeId[node # 46, Env[46.0 : 46.0, 1.0 : 1.0]], node # 87=NodeId[node # 87, Env[87.0 : 87.0, 1.0 : 1.0]], node # 43=NodeId[node # 43, Env[43.0 : 43.0, 1.0 : 1.0]], node # 88=NodeId[node # 88, Env[88.0 : 88.0, 1.0 : 1.0]], node # 44=NodeId[node # 44, Env[44.0 : 44.0, 1.0 : 1.0]], node # 85=NodeId[node # 85, Env[85.0 : 85.0, 1.0 : 1.0]], node # 41=NodeId[node # 41, Env[41.0 : 41.0, 1.0 : 1.0]], node # 86=NodeId[node # 86, Env[86.0 : 86.0, 1.0 : 1.0]], node # 42=NodeId[node # 42, Env[42.0 : 42.0, 1.0 : 1.0]], node # 29=NodeId[node # 29, Env[29.0 : 29.0, 1.0 : 1.0]], node # 27=NodeId[node # 27, Env[27.0 : 27.0, 1.0 : 1.0]], node # 28=NodeId[node # 28, Env[28.0 : 28.0, 1.0 : 1.0]], node # 72=NodeId[node # 72, Env[72.0 : 72.0, 1.0 : 1.0]], node # 73=NodeId[node # 73, Env[73.0 : 73.0, 1.0 : 1.0]], node # 70=NodeId[node # 70, Env[70.0 : 70.0, 1.0 : 1.0]], node # 71=NodeId[node # 71, Env[71.0 : 71.0, 1.0 : 1.0]], node # 36=NodeId[node # 36, Env[36.0 : 36.0, 1.0 : 1.0]], node # 37=NodeId[node # 37, Env[37.0 : 37.0, 1.0 : 1.0]], node # 78=NodeId[node # 78, Env[78.0 : 78.0, 1.0 : 1.0]], node # 34=NodeId[node # 34, Env[34.0 : 34.0, 1.0 : 1.0]], node # 79=NodeId[node # 79, Env[79.0 : 79.0, 1.0 : 1.0]], node # 35=NodeId[node # 35, Env[35.0 : 35.0, 1.0 : 1.0]], node # 76=NodeId[node # 76, Env[76.0 : 76.0, 1.0 : 1.0]], node # 32=NodeId[node # 32, Env[32.0 : 32.0, 1.0 : 1.0]], node # 77=NodeId[node # 77, Env[77.0 : 77.0, 1.0 : 1.0]], node # 33=NodeId[node # 33, Env[33.0 : 33.0, 1.0 : 1.0]], node # 74=NodeId[node # 74, Env[74.0 : 74.0, 1.0 : 1.0]], node # 30=NodeId[node # 30, Env[30.0 : 30.0, 1.0 : 1.0]], node # 75=NodeId[node # 75, Env[75.0 : 75.0, 1.0 : 1.0]], node # 31=NodeId[node # 31, Env[31.0 : 31.0, 1.0 : 1.0]]}, buckets: []]
  DAG[id:[2, 3], orig:EMPTY, status: CHANGED, size: 39, children: 39, buckets: 0)[children: {node # 107=NodeId[node # 107, Env[107.0 : 107.0, 1.0 : 1.0]], node # 129=NodeId[node # 129, Env[129.0 : 129.0, 1.0 : 1.0]], node # 106=NodeId[node # 106, Env[106.0 : 106.0, 1.0 : 1.0]], node # 128=NodeId[node # 128, Env[128.0 : 128.0, 1.0 : 1.0]], node # 109=NodeId[node # 109, Env[109.0 : 109.0, 1.0 : 1.0]], node # 108=NodeId[node # 108, Env[108.0 : 108.0, 1.0 : 1.0]], node # 103=NodeId[node # 103, Env[103.0 : 103.0, 1.0 : 1.0]], node # 125=NodeId[node # 125, Env[125.0 : 125.0, 1.0 : 1.0]], node # 102=NodeId[node # 102, Env[102.0 : 102.0, 1.0 : 1.0]], node # 124=NodeId[node # 124, Env[124.0 : 124.0, 1.0 : 1.0]], node # 105=NodeId[node # 105, Env[105.0 : 105.0, 1.0 : 1.0]], node # 127=NodeId[node # 127, Env[127.0 : 127.0, 1.0 : 1.0]], node # 104=NodeId[node # 104, Env[104.0 : 104.0, 1.0 : 1.0]], node # 126=NodeId[node # 126, Env[126.0 : 126.0, 1.0 : 1.0]], node # 121=NodeId[node # 121, Env[121.0 : 121.0, 1.0 : 1.0]], node # 120=NodeId[node # 120, Env[120.0 : 120.0, 1.0 : 1.0]], node # 101=NodeId[node # 101, Env[101.0 : 101.0, 1.0 : 1.0]], node # 123=NodeId[node # 123, Env[123.0 : 123.0, 1.0 : 1.0]], node # 100=NodeId[node # 100, Env[100.0 : 100.0, 1.0 : 1.0]], node # 122=NodeId[node # 122, Env[122.0 : 122.0, 1.0 : 1.0]], node # 118=NodeId[node # 118, Env[118.0 : 118.0, 1.0 : 1.0]], node # 117=NodeId[node # 117, Env[117.0 : 117.0, 1.0 : 1.0]], node # 119=NodeId[node # 119, Env[119.0 : 119.0, 1.0 : 1.0]], node # 114=NodeId[node # 114, Env[114.0 : 114.0, 1.0 : 1.0]], node # 113=NodeId[node # 113, Env[113.0 : 113.0, 1.0 : 1.0]], node # 116=NodeId[node # 116, Env[116.0 : 116.0, 1.0 : 1.0]], node # 115=NodeId[node # 115, Env[115.0 : 115.0, 1.0 : 1.0]], node # 110=NodeId[node # 110, Env[110.0 : 110.0, 1.0 : 1.0]], node # 112=NodeId[node # 112, Env[112.0 : 112.0, 1.0 : 1.0]], node # 111=NodeId[node # 111, Env[111.0 : 111.0, 1.0 : 1.0]], node # 94=NodeId[node # 94, Env[94.0 : 94.0, 1.0 : 1.0]], node # 95=NodeId[node # 95, Env[95.0 : 95.0, 1.0 : 1.0]], node # 92=NodeId[node # 92, Env[92.0 : 92.0, 1.0 : 1.0]], node # 93=NodeId[node # 93, Env[93.0 : 93.0, 1.0 : 1.0]], node # 91=NodeId[node # 91, Env[91.0 : 91.0, 1.0 : 1.0]], node # 98=NodeId[node # 98, Env[98.0 : 98.0, 1.0 : 1.0]], node # 99=NodeId[node # 99, Env[99.0 : 99.0, 1.0 : 1.0]], node # 96=NodeId[node # 96, Env[96.0 : 96.0, 1.0 : 1.0]], node # 97=NodeId[node # 97, Env[97.0 : 97.0, 1.0 : 1.0]]}, buckets: []]
testMergeConflictingBranchesTheirs
Tests run: 5, Failures: 0, Errors: 0, Skipped: 0, Time elapsed: 0.864 sec - in org.locationtech.geogig.model.internal.QuadTreeClusteringStrategy_putTest
Running org.locationtech.geogig.storage.impl.PersistedIterableTest
Tests run: 2, Failures: 0, Errors: 0, Skipped: 0, Time elapsed: 0.177 sec - in org.locationtech.geogig.storage.impl.PersistedIterableTest
Tests run: 4, Failures: 0, Errors: 0, Skipped: 0, Time elapsed: 0.896 sec - in org.locationtech.geogig.model.internal.DAGNodeTest
Running org.locationtech.geogig.storage.impl.INIBlobTest
Running org.locationtech.geogig.storage.memory.HeapIndexDatabaseConformanceTest
Tests run: 21, Failures: 0, Errors: 0, Skipped: 0, Time elapsed: 11.483 sec - in org.locationtech.geogig.test.integration.DiffOpTest
Running org.locationtech.geogig.storage.memory.HeapGraphDatabaseTest
Tests run: 15, Failures: 0, Errors: 0, Skipped: 0, Time elapsed: 4.784 sec - in org.locationtech.geogig.plumbing.WriteTree2Test
Running org.locationtech.geogig.storage.memory.HeapConflictsDatabaseConformanceTest
Tests run: 1, Failures: 0, Errors: 0, Skipped: 0, Time elapsed: 0.159 sec - in org.locationtech.geogig.storage.impl.INIBlobTest
Running org.locationtech.geogig.storage.memory.HeapObjectDatabaseConformanceTest
testMergeWithFeatureMerge
Tests run: 14, Failures: 0, Errors: 0, Skipped: 0, Time elapsed: 0.462 sec - in org.locationtech.geogig.storage.memory.HeapConflictsDatabaseConformanceTest
Running org.locationtech.geogig.storage.memory.HeapBlobStoreTest
Tests run: 7, Failures: 0, Errors: 0, Skipped: 0, Time elapsed: 0.083 sec - in org.locationtech.geogig.storage.memory.HeapBlobStoreTest
Running org.locationtech.geogig.storage.memory.HeapConfigDatabaseTest
Tests run: 13, Failures: 0, Errors: 0, Skipped: 0, Time elapsed: 0.71 sec - in org.locationtech.geogig.storage.memory.HeapGraphDatabaseTest
testMergeNoCommitMessage
Running org.locationtech.geogig.storage.memory.HeapObjectStoreConformanceTest
Tests run: 26, Failures: 0, Errors: 0, Skipped: 0, Time elapsed: 13.139 sec - in org.locationtech.geogig.test.integration.CommitOpTest
Running org.locationtech.geogig.storage.memory.HeapRefDatabaseTest
Tests run: 11, Failures: 0, Errors: 0, Skipped: 0, Time elapsed: 0.393 sec - in org.locationtech.geogig.storage.memory.HeapRefDatabaseTest
Running org.locationtech.geogig.storage.datastream.DataStreamSerializationFactoryV2_1Test
Tests run: 10, Failures: 0, Errors: 0, Skipped: 1, Time elapsed: 4.312 sec - in org.locationtech.geogig.porcelain.RemoveOpTest
Tests run: 23, Failures: 0, Errors: 0, Skipped: 0, Time elapsed: 1.057 sec - in org.locationtech.geogig.storage.memory.HeapConfigDatabaseTest
Running org.locationtech.geogig.storage.datastream.v2_3.TailTest
Tests run: 1, Failures: 0, Errors: 0, Skipped: 0, Time elapsed: 0 sec - in org.locationtech.geogig.storage.datastream.v2_3.TailTest
Running org.locationtech.geogig.storage.datastream.v2_3.RevTreeFormatPrefTest
Running org.locationtech.geogig.storage.datastream.v2_3.RevTreeFormatTest
[main] INFO org.locationtech.geogig.test.performance.EnablePerformanceTestRule - org.locationtech.geogig.storage.datastream.v2_3.RevTreeFormatPrefTest ignored, run with -Dgeogig.runPerformanceTests=true to enable it.
[main] INFO org.locationtech.geogig.test.performance.EnablePerformanceTestRule - org.locationtech.geogig.storage.datastream.v2_3.RevTreeFormatPrefTest ignored, run with -Dgeogig.runPerformanceTests=true to enable it.
[main] INFO org.locationtech.geogig.test.performance.EnablePerformanceTestRule - org.locationtech.geogig.storage.datastream.v2_3.RevTreeFormatPrefTest ignored, run with -Dgeogig.runPerformanceTests=true to enable it.
[main] INFO org.locationtech.geogig.test.performance.EnablePerformanceTestRule - org.locationtech.geogig.storage.datastream.v2_3.RevTreeFormatPrefTest ignored, run with -Dgeogig.runPerformanceTests=true to enable it.
[main] INFO org.locationtech.geogig.test.performance.EnablePerformanceTestRule - org.locationtech.geogig.storage.datastream.v2_3.RevTreeFormatPrefTest ignored, run with -Dgeogig.runPerformanceTests=true to enable it.
[main] INFO org.locationtech.geogig.test.performance.EnablePerformanceTestRule - org.locationtech.geogig.storage.datastream.v2_3.RevTreeFormatPrefTest ignored, run with -Dgeogig.runPerformanceTests=true to enable it.
Tests run: 6, Failures: 0, Errors: 0, Skipped: 0, Time elapsed: 0.037 sec - in org.locationtech.geogig.storage.datastream.v2_3.RevTreeFormatPrefTest
Running org.locationtech.geogig.storage.datastream.v2_3.DataStreamSerializationFactoryV2_3Test
Tests run: 5, Failures: 0, Errors: 0, Skipped: 0, Time elapsed: 5.801 sec - in org.locationtech.geogig.porcelain.index.DropIndexOpTest
Running org.locationtech.geogig.storage.datastream.v2_3.NodeSetTest
Removed 32,600 nodes in 1.346 s
Tests run: 23, Failures: 0, Errors: 0, Skipped: 0, Time elapsed: 0.561 sec - in org.locationtech.geogig.storage.datastream.DataStreamSerializationFactoryV2_1Test
Running org.locationtech.geogig.storage.datastream.v2_3.StringTableTest
Tests run: 2, Failures: 0, Errors: 0, Skipped: 0, Time elapsed: 0.004 sec - in org.locationtech.geogig.storage.datastream.v2_3.StringTableTest
Running org.locationtech.geogig.storage.datastream.DataStreamSerializationFactoryV2_2Test
Tests run: 23, Failures: 0, Errors: 0, Skipped: 0, Time elapsed: 0.152 sec - in org.locationtech.geogig.storage.datastream.DataStreamSerializationFactoryV2_2Test
Running org.locationtech.geogig.storage.datastream.DataStreamSerializationFactoryV2Test
Added 7,000 nodes in 50.76 ms
testMergeTwoBranchesWithNewFeatureType
Tests run: 23, Failures: 0, Errors: 0, Skipped: 0, Time elapsed: 0.883 sec - in org.locationtech.geogig.storage.datastream.v2_3.DataStreamSerializationFactoryV2_3Test
Running org.locationtech.geogig.storage.datastream.FormatCommonV2_1Test
Tests run: 4, Failures: 0, Errors: 0, Skipped: 0, Time elapsed: 0.014 sec - in org.locationtech.geogig.storage.datastream.FormatCommonV2_1Test
Running org.locationtech.geogig.storage.datastream.VarintTest
Tests run: 4, Failures: 0, Errors: 0, Skipped: 0, Time elapsed: 0.003 sec - in org.locationtech.geogig.storage.datastream.VarintTest
Running org.locationtech.geogig.storage.datastream.Float32BoundsSerializationTest
Tests run: 2, Failures: 0, Errors: 0, Skipped: 0, Time elapsed: 0.002 sec - in org.locationtech.geogig.storage.datastream.Float32BoundsSerializationTest
Running org.locationtech.geogig.storage.datastream.LZFSerializationFactoryTest
Tests run: 23, Failures: 0, Errors: 0, Skipped: 0, Time elapsed: 0.513 sec - in org.locationtech.geogig.storage.datastream.DataStreamSerializationFactoryV2Test
Running org.locationtech.geogig.storage.datastream.FloatPackedCoordinateSequenceTest
Tests run: 3, Failures: 0, Errors: 0, Skipped: 0, Time elapsed: 0.011 sec - in org.locationtech.geogig.storage.datastream.FloatPackedCoordinateSequenceTest
Running org.locationtech.geogig.storage.datastream.LZ4SerializationFactoryTest
Removed 32,600 nodes in 2.266 s
Tests run: 23, Failures: 0, Errors: 0, Skipped: 0, Time elapsed: 0.522 sec - in org.locationtech.geogig.storage.datastream.LZFSerializationFactoryTest
Running org.locationtech.geogig.storage.datastream.DataStreamSerializationFactoryV1Test
testCancelScenario1
Tests run: 23, Failures: 0, Errors: 0, Skipped: 1, Time elapsed: 0.442 sec - in org.locationtech.geogig.storage.datastream.LZ4SerializationFactoryTest
Running org.locationtech.geogig.storage.cache.ObjectCacheTest
Tests run: 6, Failures: 0, Errors: 0, Skipped: 0, Time elapsed: 0.043 sec - in org.locationtech.geogig.storage.cache.ObjectCacheTest
Running org.locationtech.geogig.storage.cache.KeyTest
Tests run: 2, Failures: 0, Errors: 0, Skipped: 0, Time elapsed: 0.003 sec - in org.locationtech.geogig.storage.cache.KeyTest
Running org.locationtech.geogig.storage.cache.SharedCacheTest
Tests run: 10, Failures: 0, Errors: 0, Skipped: 0, Time elapsed: 9.412 sec - in org.locationtech.geogig.plumbing.RevParseTest
Running org.locationtech.geogig.storage.cache.CacheManagerTest
Tests run: 36, Failures: 0, Errors: 0, Skipped: 0, Time elapsed: 3.7 sec - in org.locationtech.geogig.storage.memory.HeapIndexDatabaseConformanceTest
Added 5,000 nodes in 94.45 ms
Added 1,024 nodes in 1.568 ms
Running org.locationtech.geogig.storage.text.TextSerializationFactoryTest
Tests run: 23, Failures: 0, Errors: 0, Skipped: 0, Time elapsed: 0.46 sec - in org.locationtech.geogig.storage.datastream.DataStreamSerializationFactoryV1Test
Running org.locationtech.geogig.storage.fs.IniFileConfigDatabaseTest
Removed 400 nodes in 18.26 ms
Tests run: 11, Failures: 0, Errors: 0, Skipped: 0, Time elapsed: 5.138 sec - in org.locationtech.geogig.model.impl.LegacyTreeBuilderTest
Running org.locationtech.geogig.storage.fs.FileBlobStoreTest
[main] INFO org.locationtech.geogig.storage.cache.CacheManager - Registered GeoGig cache manager MBean as org.geogig:type=shared-cache
[main] INFO org.locationtech.geogig.storage.cache.CacheManager - Configuring GeoGig shared object cache maximum size to the default of 2,500 bytes as given by the default 0.250000 percent of available heap. Use the GEOGIG_CACHE_MAX_SIZE System property or environmentvariable to set a different maximum size at runtime
[main] INFO org.locationtech.geogig.storage.cache.CacheManager - Configuring GeoGig shared object cache maximum size to 1,025 bytes as given by the System property GEOGIG_CACHE_MAX_SIZE=1025
[main] WARN org.locationtech.geogig.storage.cache.CacheManager - cache size is too big: 1025, maximum allowed: 921
[main] INFO org.locationtech.geogig.storage.cache.CacheManager - Configuring GeoGig shared object cache maximum size to the default of 256 bytes as given by the default 0.250000 percent of available heap. Use the GEOGIG_CACHE_MAX_SIZE System property or environmentvariable to set a different maximum size at runtime
[main] INFO org.locationtech.geogig.storage.cache.CacheManager - Configuring GeoGig shared object cache maximum size to the default of 119,406,592 bytes as given by the default 0.250000 percent of available heap. Use the GEOGIG_CACHE_MAX_SIZE System property or environmentvariable to set a different maximum size at runtime
[main] INFO org.locationtech.geogig.storage.cache.CacheManager - Configuring GeoGig shared object cache maximum size to 1,048,576 bytes as given by the System property GEOGIG_CACHE_MAX_SIZE=1M
[main] INFO org.locationtech.geogig.storage.cache.CacheManager - Configuring GeoGig shared object cache maximum size to 102,400 bytes as given by the System property GEOGIG_CACHE_MAX_SIZE=100K
[main] INFO org.locationtech.geogig.storage.cache.CacheManager - Configuring GeoGig shared object cache maximum size to 5,000 bytes as given by the System property GEOGIG_CACHE_MAX_SIZE=0.5
[main] WARN org.locationtech.geogig.storage.cache.CacheManager - Unable to parse System property GEOGIG_CACHE_MAX_SIZE=-1G. Falling back to default value
java.lang.IllegalArgumentException: Value must be a positive number or zero
	at com.google.common.base.Preconditions.checkArgument(Preconditions.java:135)
	at org.locationtech.geogig.storage.cache.CacheManager.parseCacheSizeArgument(CacheManager.java:257)
	at org.locationtech.geogig.storage.cache.CacheManagerTest.assertDefaultMaxSizeDefaultValue(CacheManagerTest.java:188)
	at org.locationtech.geogig.storage.cache.CacheManagerTest.resolveDefaultMaxSizeSystemPropertyInvalidValue(CacheManagerTest.java:207)
	at sun.reflect.NativeMethodAccessorImpl.invoke0(Native Method)
	at sun.reflect.NativeMethodAccessorImpl.invoke(NativeMethodAccessorImpl.java:62)
	at sun.reflect.DelegatingMethodAccessorImpl.invoke(DelegatingMethodAccessorImpl.java:43)
	at java.lang.reflect.Method.invoke(Method.java:498)
	at org.junit.runners.model.FrameworkMethod$1.runReflectiveCall(FrameworkMethod.java:50)
	at org.junit.internal.runners.model.ReflectiveCallable.run(ReflectiveCallable.java:12)
	at org.junit.runners.model.FrameworkMethod.invokeExplosively(FrameworkMethod.java:47)
	at org.junit.internal.runners.statements.InvokeMethod.evaluate(InvokeMethod.java:17)
	at org.junit.internal.runners.statements.RunBefores.evaluate(RunBefores.java:26)
	at org.junit.internal.runners.statements.RunAfters.evaluate(RunAfters.java:27)
	at org.junit.rules.ExpectedException$ExpectedExceptionStatement.evaluate(ExpectedException.java:239)
	at org.junit.rules.RunRules.evaluate(RunRules.java:20)
	at org.junit.runners.ParentRunner.runLeaf(ParentRunner.java:325)
	at org.junit.runners.BlockJUnit4ClassRunner.runChild(BlockJUnit4ClassRunner.java:78)
	at org.junit.runners.BlockJUnit4ClassRunner.runChild(BlockJUnit4ClassRunner.java:57)
	at org.junit.runners.ParentRunner$3.run(ParentRunner.java:290)
	at org.junit.runners.ParentRunner$1.schedule(ParentRunner.java:71)
	at org.junit.runners.ParentRunner.runChildren(ParentRunner.java:288)
	at org.junit.runners.ParentRunner.access$000(ParentRunner.java:58)
	at org.junit.runners.ParentRunner$2.evaluate(ParentRunner.java:268)
	at org.junit.runners.ParentRunner.run(ParentRunner.java:363)
	at org.apache.maven.surefire.junit4.JUnit4Provider.execute(JUnit4Provider.java:264)
	at org.apache.maven.surefire.junit4.JUnit4Provider.executeTestSet(JUnit4Provider.java:153)
	at org.apache.maven.surefire.junit4.JUnit4Provider.invoke(JUnit4Provider.java:124)
	at org.apache.maven.surefire.booter.ForkedBooter.invokeProviderInSameClassLoader(ForkedBooter.java:200)
	at org.apache.maven.surefire.booter.ForkedBooter.runSuitesInProcess(ForkedBooter.java:153)
	at org.apache.maven.surefire.booter.ForkedBooter.main(ForkedBooter.java:103)
[main] INFO org.locationtech.geogig.storage.cache.CacheManager - Configuring GeoGig shared object cache maximum size to the default of 2,500 bytes as given by the default 0.250000 percent of available heap. Use the GEOGIG_CACHE_MAX_SIZE System property or environmentvariable to set a different maximum size at runtime
Tests run: 20, Failures: 0, Errors: 0, Skipped: 0, Time elapsed: 3.397 sec - in org.locationtech.geogig.storage.memory.HeapObjectStoreConformanceTest
[main] WARN org.locationtech.geogig.storage.cache.CacheManager - Unable to parse System property GEOGIG_CACHE_MAX_SIZE=. Falling back to default value
java.lang.IllegalArgumentException: Invalid format (), expected <float>[B|K|M|G]
	at org.locationtech.geogig.storage.cache.CacheManager.parseCacheSizeArgument(CacheManager.java:269)
	at org.locationtech.geogig.storage.cache.CacheManagerTest.getDefaultSizeMB(CacheManagerTest.java:270)
	at sun.reflect.NativeMethodAccessorImpl.invoke0(Native Method)
	at sun.reflect.NativeMethodAccessorImpl.invoke(NativeMethodAccessorImpl.java:62)
	at sun.reflect.DelegatingMethodAccessorImpl.invoke(DelegatingMethodAccessorImpl.java:43)
	at java.lang.reflect.Method.invoke(Method.java:498)
	at org.junit.runners.model.FrameworkMethod$1.runReflectiveCall(FrameworkMethod.java:50)
	at org.junit.internal.runners.model.ReflectiveCallable.run(ReflectiveCallable.java:12)
	at org.junit.runners.model.FrameworkMethod.invokeExplosively(FrameworkMethod.java:47)
	at org.junit.internal.runners.statements.InvokeMethod.evaluate(InvokeMethod.java:17)
	at org.junit.internal.runners.statements.RunBefores.evaluate(RunBefores.java:26)
	at org.junit.internal.runners.statements.RunAfters.evaluate(RunAfters.java:27)
	at org.junit.rules.ExpectedException$ExpectedExceptionStatement.evaluate(ExpectedException.java:239)
	at org.junit.rules.RunRules.evaluate(RunRules.java:20)
	at org.junit.runners.ParentRunner.runLeaf(ParentRunner.java:325)
	at org.junit.runners.BlockJUnit4ClassRunner.runChild(BlockJUnit4ClassRunner.java:78)
	at org.junit.runners.BlockJUnit4ClassRunner.runChild(BlockJUnit4ClassRunner.java:57)
	at org.junit.runners.ParentRunner$3.run(ParentRunner.java:290)
	at org.junit.runners.ParentRunner$1.schedule(ParentRunner.java:71)
	at org.junit.runners.ParentRunner.runChildren(ParentRunner.java:288)
	at org.junit.runners.ParentRunner.access$000(ParentRunner.java:58)
	at org.junit.runners.ParentRunner$2.evaluate(ParentRunner.java:268)
	at org.junit.runners.ParentRunner.run(ParentRunner.java:363)
	at org.apache.maven.surefire.junit4.JUnit4Provider.execute(JUnit4Provider.java:264)
	at org.apache.maven.surefire.junit4.JUnit4Provider.executeTestSet(JUnit4Provider.java:153)
	at org.apache.maven.surefire.junit4.JUnit4Provider.invoke(JUnit4Provider.java:124)
	at org.apache.maven.surefire.booter.ForkedBooter.invokeProviderInSameClassLoader(ForkedBooter.java:200)
	at org.apache.maven.surefire.booter.ForkedBooter.runSuitesInProcess(ForkedBooter.java:153)
	at org.apache.maven.surefire.booter.ForkedBooter.main(ForkedBooter.java:103)
[main] WARN org.locationtech.geogig.storage.cache.CacheManager - Unable to parse environment variable GEOGIG_CACHE_MAX_SIZE=
java.lang.IllegalArgumentException: Invalid format (), expected <float>[B|K|M|G]
	at org.locationtech.geogig.storage.cache.CacheManager.parseCacheSizeArgument(CacheManager.java:269)
	at org.locationtech.geogig.storage.cache.CacheManagerTest.getDefaultSizeMB(CacheManagerTest.java:270)
	at sun.reflect.NativeMethodAccessorImpl.invoke0(Native Method)
	at sun.reflect.NativeMethodAccessorImpl.invoke(NativeMethodAccessorImpl.java:62)
	at sun.reflect.DelegatingMethodAccessorImpl.invoke(DelegatingMethodAccessorImpl.java:43)
	at java.lang.reflect.Method.invoke(Method.java:498)
	at org.junit.runners.model.FrameworkMethod$1.runReflectiveCall(FrameworkMethod.java:50)
	at org.junit.internal.runners.model.ReflectiveCallable.run(ReflectiveCallable.java:12)
	at org.junit.runners.model.FrameworkMethod.invokeExplosively(FrameworkMethod.java:47)
	at org.junit.internal.runners.statements.InvokeMethod.evaluate(InvokeMethod.java:17)
	at org.junit.internal.runners.statements.RunBefores.evaluate(RunBefores.java:26)
	at org.junit.internal.runners.statements.RunAfters.evaluate(RunAfters.java:27)
	at org.junit.rules.ExpectedException$ExpectedExceptionStatement.evaluate(ExpectedException.java:239)
	at org.junit.rules.RunRules.evaluate(RunRules.java:20)
	at org.junit.runners.ParentRunner.runLeaf(ParentRunner.java:325)
	at org.junit.runners.BlockJUnit4ClassRunner.runChild(BlockJUnit4ClassRunner.java:78)
	at org.junit.runners.BlockJUnit4ClassRunner.runChild(BlockJUnit4ClassRunner.java:57)
	at org.junit.runners.ParentRunner$3.run(ParentRunner.java:290)
	at org.junit.runners.ParentRunner$1.schedule(ParentRunner.java:71)
	at org.junit.runners.ParentRunner.runChildren(ParentRunner.java:288)
	at org.junit.runners.ParentRunner.access$000(ParentRunner.java:58)
	at org.junit.runners.ParentRunner$2.evaluate(ParentRunner.java:268)
	at org.junit.runners.ParentRunner.run(ParentRunner.java:363)
	at org.apache.maven.surefire.junit4.JUnit4Provider.execute(JUnit4Provider.java:264)
	at org.apache.maven.surefire.junit4.JUnit4Provider.executeTestSet(JUnit4Provider.java:153)
	at org.apache.maven.surefire.junit4.JUnit4Provider.invoke(JUnit4Provider.java:124)
	at org.apache.maven.surefire.booter.ForkedBooter.invokeProviderInSameClassLoader(ForkedBooter.java:200)
	at org.apache.maven.surefire.booter.ForkedBooter.runSuitesInProcess(ForkedBooter.java:153)
	at org.apache.maven.surefire.booter.ForkedBooter.main(ForkedBooter.java:103)
[main] INFO org.locationtech.geogig.storage.cache.CacheManager - Configuring GeoGig shared object cache maximum size to the default of 2,621,440 bytes as given by the default 0.250000 percent of available heap. Use the GEOGIG_CACHE_MAX_SIZE System property or environmentvariable to set a different maximum size at runtime
Running org.locationtech.geogig.storage.fs.FileRefDatabaseTest
Tests run: 6, Failures: 0, Errors: 0, Skipped: 0, Time elapsed: 9.342 sec - in org.locationtech.geogig.plumbing.DiffBoundsTest
Running org.locationtech.geogig.storage.StorageTypeTest
Tests run: 4, Failures: 0, Errors: 0, Skipped: 0, Time elapsed: 0 sec - in org.locationtech.geogig.storage.StorageTypeTest
[main] WARN org.locationtech.geogig.storage.cache.CacheManager - Unable to parse System property GEOGIG_CACHE_MAX_SIZE=-1G. Falling back to environment variable
java.lang.IllegalArgumentException: Value must be a positive number or zero
	at com.google.common.base.Preconditions.checkArgument(Preconditions.java:135)
	at org.locationtech.geogig.storage.cache.CacheManager.parseCacheSizeArgument(CacheManager.java:257)
	at org.locationtech.geogig.storage.cache.CacheManagerTest.resolveDefaultMaxSizeInvalidSysPropFallsBackToEnvVariable(CacheManagerTest.java:235)
	at sun.reflect.NativeMethodAccessorImpl.invoke0(Native Method)
	at sun.reflect.NativeMethodAccessorImpl.invoke(NativeMethodAccessorImpl.java:62)
	at sun.reflect.DelegatingMethodAccessorImpl.invoke(DelegatingMethodAccessorImpl.java:43)
	at java.lang.reflect.Method.invoke(Method.java:498)
	at org.junit.runners.model.FrameworkMethod$1.runReflectiveCall(FrameworkMethod.java:50)
	at org.junit.internal.runners.model.ReflectiveCallable.run(ReflectiveCallable.java:12)
	at org.junit.runners.model.FrameworkMethod.invokeExplosively(FrameworkMethod.java:47)
	at org.junit.internal.runners.statements.InvokeMethod.evaluate(InvokeMethod.java:17)
	at org.junit.internal.runners.statements.RunBefores.evaluate(RunBefores.java:26)
	at org.junit.internal.runners.statements.RunAfters.evaluate(RunAfters.java:27)
	at org.junit.rules.ExpectedException$ExpectedExceptionStatement.evaluate(ExpectedException.java:239)
	at org.junit.rules.RunRules.evaluate(RunRules.java:20)
	at org.junit.runners.ParentRunner.runLeaf(ParentRunner.java:325)
Added 	at org.junit.runners.BlockJUnit4ClassRunner.runChild(BlockJUnit4ClassRunner.java:78)
7,000	at org.junit.runners.BlockJUnit4ClassRunner.runChild(BlockJUnit4ClassRunner.java:57) nodes in 
	at org.junit.runners.ParentRunner$3.run(ParentRunner.java:290)635.5 ms

	at org.junit.runners.ParentRunner$1.schedule(ParentRunner.java:71)
	at org.junit.runners.ParentRunner.runChildren(ParentRunner.java:288)
	at org.junit.runners.ParentRunner.access$000(ParentRunner.java:58)
	at org.junit.runners.ParentRunner$2.evaluate(ParentRunner.java:268)
	at org.junit.runners.ParentRunner.run(ParentRunner.java:363)
	at org.apache.maven.surefire.junit4.JUnit4Provider.execute(JUnit4Provider.java:264)
	at org.apache.maven.surefire.junit4.JUnit4Provider.executeTestSet(JUnit4Provider.java:153)
	at org.apache.maven.surefire.junit4.JUnit4Provider.invoke(JUnit4Provider.java:124)
	at org.apache.maven.surefire.booter.ForkedBooter.invokeProviderInSameClassLoader(ForkedBooter.java:200)
	at org.apache.maven.surefire.booter.ForkedBooter.runSuitesInProcess(ForkedBooter.java:153)
	at org.apache.maven.surefire.booter.ForkedBooter.main(ForkedBooter.java:103)
[main] INFO org.locationtech.geogig.storage.cache.CacheManager - Configuring GeoGig shared object cache maximum size to 1,024 bytes as given by the environment variable GEOGIG_CACHE_MAX_SIZE=1024
[main] WARN org.locationtech.geogig.storage.cache.CacheManager - Unable to parse System property GEOGIG_CACHE_MAX_SIZE=. Falling back to environment variable
java.lang.IllegalArgumentException: Invalid format (), expected <float>[B|K|M|G]
	at org.locationtech.geogig.storage.cache.CacheManager.parseCacheSizeArgument(CacheManager.java:269)
	at org.locationtech.geogig.storage.cache.CacheManagerTest.resolveDefaultMaxSizeEnvironmantVariable(CacheManagerTest.java:214)
	at sun.reflect.NativeMethodAccessorImpl.invoke0(Native Method)
	at sun.reflect.NativeMethodAccessorImpl.invoke(NativeMethodAccessorImpl.java:62)
	at sun.reflect.DelegatingMethodAccessorImpl.invoke(DelegatingMethodAccessorImpl.java:43)
	at java.lang.reflect.Method.invoke(Method.java:498)
	at org.junit.runners.model.FrameworkMethod$1.runReflectiveCall(FrameworkMethod.java:50)
	at org.junit.internal.runners.model.ReflectiveCallable.run(ReflectiveCallable.java:12)
	at org.junit.runners.model.FrameworkMethod.invokeExplosively(FrameworkMethod.java:47)
	at org.junit.internal.runners.statements.InvokeMethod.evaluate(InvokeMethod.java:17)
	at org.junit.internal.runners.statements.RunBefores.evaluate(RunBefores.java:26)
	at org.junit.internal.runners.statements.RunAfters.evaluate(RunAfters.java:27)
	at org.junit.rules.ExpectedException$ExpectedExceptionStatement.evaluate(ExpectedException.java:239)
	at org.junit.rules.RunRules.evaluate(RunRules.java:20)
	at org.junit.runners.ParentRunner.runLeaf(ParentRunner.java:325)
	at org.junit.runners.BlockJUnit4ClassRunner.runChild(BlockJUnit4ClassRunner.java:78)
	at org.junit.runners.BlockJUnit4ClassRunner.runChild(BlockJUnit4ClassRunner.java:57)
	at org.junit.runners.ParentRunner$3.run(ParentRunner.java:290)
	at org.junit.runners.ParentRunner$1.schedule(ParentRunner.java:71)
	at org.junit.runners.ParentRunner.runChildren(ParentRunner.java:288)
	at org.junit.runners.ParentRunner.access$000(ParentRunner.java:58)
	at org.junit.runners.ParentRunner$2.evaluate(ParentRunner.java:268)
	at org.junit.runners.ParentRunner.run(ParentRunner.java:363)
	at org.apache.maven.surefire.junit4.JUnit4Provider.execute(JUnit4Provider.java:264)
	at org.apache.maven.surefire.junit4.JUnit4Provider.executeTestSet(JUnit4Provider.java:153)
	at org.apache.maven.surefire.junit4.JUnit4Provider.invoke(JUnit4Provider.java:124)
	at org.apache.maven.surefire.booter.ForkedBooter.invokeProviderInSameClassLoader(ForkedBooter.java:200)
	at org.apache.maven.surefire.booter.ForkedBooter.runSuitesInProcess(ForkedBooter.java:153)
	at org.apache.maven.surefire.booter.ForkedBooter.main(ForkedBooter.java:103)
[main] INFO org.locationtech.geogig.storage.cache.CacheManager - Configuring GeoGig shared object cache maximum size to 1,048,576 bytes as given by the environment variable GEOGIG_CACHE_MAX_SIZE=1M
[main] WARN org.locationtech.geogig.storage.cache.CacheManager - Unable to parse System property GEOGIG_CACHE_MAX_SIZE=. Falling back to environment variable
java.lang.IllegalArgumentException: Invalid format (), expected <float>[B|K|M|G]
	at org.locationtech.geogig.storage.cache.CacheManager.parseCacheSizeArgument(CacheManager.java:269)
	at org.locationtech.geogig.storage.cache.CacheManagerTest.resolveDefaultMaxSizeEnvironmantVariable(CacheManagerTest.java:217)
	at sun.reflect.NativeMethodAccessorImpl.invoke0(Native Method)
	at sun.reflect.NativeMethodAccessorImpl.invoke(NativeMethodAccessorImpl.java:62)
	at sun.reflect.DelegatingMethodAccessorImpl.invoke(DelegatingMethodAccessorImpl.java:43)
	at java.lang.reflect.Method.invoke(Method.java:498)
	at org.junit.runners.model.FrameworkMethod$1.runReflectiveCall(FrameworkMethod.java:50)
	at org.junit.internal.runners.model.ReflectiveCallable.run(ReflectiveCallable.java:12)
	at org.junit.runners.model.FrameworkMethod.invokeExplosively(FrameworkMethod.java:47)
	at org.junit.internal.runners.statements.InvokeMethod.evaluate(InvokeMethod.java:17)
	at org.junit.internal.runners.statements.RunBefores.evaluate(RunBefores.java:26)
	at org.junit.internal.runners.statements.RunAfters.evaluate(RunAfters.java:27)
	at org.junit.rules.ExpectedException$ExpectedExceptionStatement.evaluate(ExpectedException.java:239)
	at org.junit.rules.RunRules.evaluate(RunRules.java:20)
	at org.junit.runners.ParentRunner.runLeaf(ParentRunner.java:325)
	at org.junit.runners.BlockJUnit4ClassRunner.runChild(BlockJUnit4ClassRunner.java:78)
	at org.junit.runners.BlockJUnit4ClassRunner.runChild(BlockJUnit4ClassRunner.java:57)
	at org.junit.runners.ParentRunner$3.run(ParentRunner.java:290)
	at org.junit.runners.ParentRunner$1.schedule(ParentRunner.java:71)
	at org.junit.runners.ParentRunner.runChildren(ParentRunner.java:288)
	at org.junit.runners.ParentRunner.access$000(ParentRunner.java:58)
	at org.junit.runners.ParentRunner$2.evaluate(ParentRunner.java:268)
	at org.junit.runners.ParentRunner.run(ParentRunner.java:363)
	at org.apache.maven.surefire.junit4.JUnit4Provider.execute(JUnit4Provider.java:264)
	at org.apache.maven.surefire.junit4.JUnit4Provider.executeTestSet(JUnit4Provider.java:153)
	at org.apache.maven.surefire.junit4.JUnit4Provider.invoke(JUnit4Provider.java:124)
	at org.apache.maven.surefire.booter.ForkedBooter.invokeProviderInSameClassLoader(ForkedBooter.java:200)
	at org.apache.maven.surefire.booter.ForkedBooter.runSuitesInProcess(ForkedBooter.java:153)
	at org.apache.maven.surefire.booter.ForkedBooter.main(ForkedBooter.java:103)
[main] INFO org.locationtech.geogig.storage.cache.CacheManager - Configuring GeoGig shared object cache maximum size to 102,400 bytes as given by the environment variable GEOGIG_CACHE_MAX_SIZE=100K
Added 10,000 nodes in 185.2 ms
Tests run: 11, Failures: 0, Errors: 0, Skipped: 0, Time elapsed: 5.482 sec - in org.locationtech.geogig.model.internal.CanonicalClusteringStrategyHeapStorageTest
Running org.locationtech.geogig.repository.impl.SpatialOpsTest
Tests run: 7, Failures: 0, Errors: 0, Skipped: 0, Time elapsed: 0.474 sec - in org.locationtech.geogig.storage.fs.FileBlobStoreTest
[main] WARN org.locationtech.geogig.storage.cache.CacheManager - Unable to parse System property GEOGIG_CACHE_MAX_SIZE=. Falling back to environment variable
java.lang.IllegalArgumentException: Invalid format (), expected <float>[B|K|M|G]
	at org.locationtech.geogig.storage.cache.CacheManager.parseCacheSizeArgument(CacheManager.java:269)
	at org.locationtech.geogig.storage.cache.CacheManagerTest.resolveDefaultMaxSizeEnvironmantVariable(CacheManagerTest.java:223)
	at sun.reflect.NativeMethodAccessorImpl.invoke0(Native Method)
	at sun.reflect.NativeMethodAccessorImpl.invoke(NativeMethodAccessorImpl.java:62)
	at sun.reflect.DelegatingMethodAccessorImpl.invoke(DelegatingMethodAccessorImpl.java:43)
	at java.lang.reflect.Method.invoke(Method.java:498)
	at org.junit.runners.model.FrameworkMethod$1.runReflectiveCall(FrameworkMethod.java:50)
Running org.locationtech.geogig.repository.impl.RepositoryResolverTest
	at org.junit.internal.runners.model.ReflectiveCallable.run(ReflectiveCallable.java:12)
	at org.junit.runners.model.FrameworkMethod.invokeExplosively(FrameworkMethod.java:47)
	at org.junit.internal.runners.statements.InvokeMethod.evaluate(InvokeMethod.java:17)
	at org.junit.internal.runners.statements.RunBefores.evaluate(RunBefores.java:26)
	at org.junit.internal.runners.statements.RunAfters.evaluate(RunAfters.java:27)
	at org.junit.rules.ExpectedException$ExpectedExceptionStatement.evaluate(ExpectedException.java:239)
	at org.junit.rules.RunRules.evaluate(RunRules.java:20)
	at org.junit.runners.ParentRunner.runLeaf(ParentRunner.java:325)
	at org.junit.runners.BlockJUnit4ClassRunner.runChild(BlockJUnit4ClassRunner.java:78)
Tests run: 3, Failures: 0, Errors: 0, Skipped: 0, Time elapsed: 0 sec - in org.locationtech.geogig.repository.impl.RepositoryResolverTest
	at org.junit.runners.BlockJUnit4ClassRunner.runChild(BlockJUnit4ClassRunner.java:57)
	at org.junit.runners.ParentRunner$3.run(ParentRunner.java:290)
	at org.junit.runners.ParentRunner$1.schedule(ParentRunner.java:71)
	at org.junit.runners.ParentRunner.runChildren(ParentRunner.java:288)
	at org.junit.runners.ParentRunner.access$000(ParentRunner.java:58)
	at org.junit.runners.ParentRunner$2.evaluate(ParentRunner.java:268)
	at org.junit.runners.ParentRunner.run(ParentRunner.java:363)
	at org.apache.maven.surefire.junit4.JUnit4Provider.execute(JUnit4Provider.java:264)
Running org.locationtech.geogig.repository.impl.DepthSearchTest
	at org.apache.maven.surefire.junit4.JUnit4Provider.executeTestSet(JUnit4Provider.java:153)
	at org.apache.maven.surefire.junit4.JUnit4Provider.invoke(JUnit4Provider.java:124)
	at org.apache.maven.surefire.booter.ForkedBooter.invokeProviderInSameClassLoader(ForkedBooter.java:200)
	at org.apache.maven.surefire.booter.ForkedBooter.runSuitesInProcess(ForkedBooter.java:153)
	at org.apache.maven.surefire.booter.ForkedBooter.main(ForkedBooter.java:103)
[main] INFO org.locationtech.geogig.storage.cache.CacheManager - Configuring GeoGig shared object cache maximum size to 5,000 bytes as given by the environment variable GEOGIG_CACHE_MAX_SIZE=0.5
[main] WARN org.locationtech.geogig.storage.cache.CacheManager - Unable to parse System property GEOGIG_CACHE_MAX_SIZE=. Falling back to environment variable
java.lang.IllegalArgumentException: Invalid format (), expected <float>[B|K|M|G]
	at org.locationtech.geogig.storage.cache.CacheManager.parseCacheSizeArgument(CacheManager.java:269)
	at org.locationtech.geogig.storage.cache.CacheManagerTest.assertDefaultMaxSizeDefaultValue(CacheManagerTest.java:188)
	at org.locationtech.geogig.storage.cache.CacheManagerTest.resolveDefaultMaxSizeEnvironmantVariableInvalidValue(CacheManagerTest.java:229)
	at sun.reflect.NativeMethodAccessorImpl.invoke0(Native Method)
	at sun.reflect.NativeMethodAccessorImpl.invoke(NativeMethodAccessorImpl.java:62)
	at sun.reflect.DelegatingMethodAccessorImpl.invoke(DelegatingMethodAccessorImpl.java:43)
	at java.lang.reflect.Method.invoke(Method.java:498)
	at org.junit.runners.model.FrameworkMethod$1.runReflectiveCall(FrameworkMethod.java:50)
	at org.junit.internal.runners.model.ReflectiveCallable.run(ReflectiveCallable.java:12)
	at org.junit.runners.model.FrameworkMethod.invokeExplosively(FrameworkMethod.java:47)
	at org.junit.internal.runners.statements.InvokeMethod.evaluate(InvokeMethod.java:17)
	at org.junit.internal.runners.statements.RunBefores.evaluate(RunBefores.java:26)
	at org.junit.internal.runners.statements.RunAfters.evaluate(RunAfters.java:27)
	at org.junit.rules.ExpectedException$ExpectedExceptionStatement.evaluate(ExpectedException.java:239)
	at org.junit.rules.RunRules.evaluate(RunRules.java:20)
	at org.junit.runners.ParentRunner.runLeaf(ParentRunner.java:325)
	at org.junit.runners.BlockJUnit4ClassRunner.runChild(BlockJUnit4ClassRunner.java:78)
	at org.junit.runners.BlockJUnit4ClassRunner.runChild(BlockJUnit4ClassRunner.java:57)
	at org.junit.runners.ParentRunner$3.run(ParentRunner.java:290)
	at org.junit.runners.ParentRunner$1.schedule(ParentRunner.java:71)
	at org.junit.runners.ParentRunner.runChildren(ParentRunner.java:288)
	at org.junit.runners.ParentRunner.access$000(ParentRunner.java:58)
	at org.junit.runners.ParentRunner$2.evaluate(ParentRunner.java:268)
	at org.junit.runners.ParentRunner.run(ParentRunner.java:363)
	at org.apache.maven.surefire.junit4.JUnit4Provider.execute(JUnit4Provider.java:264)
	at org.apache.maven.surefire.junit4.JUnit4Provider.executeTestSet(JUnit4Provider.java:153)
	at org.apache.maven.surefire.junit4.JUnit4Provider.invoke(JUnit4Provider.java:124)
	at org.apache.maven.surefire.booter.ForkedBooter.invokeProviderInSameClassLoader(ForkedBooter.java:200)
	at org.apache.maven.surefire.booter.ForkedBooter.runSuitesInProcess(ForkedBooter.java:153)
	at org.apache.maven.surefire.booter.ForkedBooter.main(ForkedBooter.java:103)
[main] WARN org.locationtech.geogig.storage.cache.CacheManager - Unable to parse environment variable GEOGIG_CACHE_MAX_SIZE=-1G
java.lang.IllegalArgumentException: Value must be a positive number or zero
	at com.google.common.base.Preconditions.checkArgument(Preconditions.java:135)
	at org.locationtech.geogig.storage.cache.CacheManager.parseCacheSizeArgument(CacheManager.java:257)
	at org.locationtech.geogig.storage.cache.CacheManagerTest.assertDefaultMaxSizeDefaultValue(CacheManagerTest.java:188)
	at org.locationtech.geogig.storage.cache.CacheManagerTest.resolveDefaultMaxSizeEnvironmantVariableInvalidValue(CacheManagerTest.java:229)
	at sun.reflect.NativeMethodAccessorImpl.invoke0(Native Method)
	at sun.reflect.NativeMethodAccessorImpl.invoke(NativeMethodAccessorImpl.java:62)
	at sun.reflect.DelegatingMethodAccessorImpl.invoke(DelegatingMethodAccessorImpl.java:43)
	at java.lang.reflect.Method.invoke(Method.java:498)
	at org.junit.runners.model.FrameworkMethod$1.runReflectiveCall(FrameworkMethod.java:50)
	at org.junit.internal.runners.model.ReflectiveCallable.run(ReflectiveCallable.java:12)
	at org.junit.runners.model.FrameworkMethod.invokeExplosively(FrameworkMethod.java:47)
	at org.junit.internal.runners.statements.InvokeMethod.evaluate(InvokeMethod.java:17)
	at org.junit.internal.runners.statements.RunBefores.evaluate(RunBefores.java:26)
	at org.junit.internal.runners.statements.RunAfters.evaluate(RunAfters.java:27)
	at org.junit.rules.ExpectedException$ExpectedExceptionStatement.evaluate(ExpectedException.java:239)
	at org.junit.rules.RunRules.evaluate(RunRules.java:20)
	at org.junit.runners.ParentRunner.runLeaf(ParentRunner.java:325)
	at org.junit.runners.BlockJUnit4ClassRunner.runChild(BlockJUnit4ClassRunner.java:78)
	at org.junit.runners.BlockJUnit4ClassRunner.runChild(BlockJUnit4ClassRunner.java:57)
	at org.junit.runners.ParentRunner$3.run(ParentRunner.java:290)
	at org.junit.runners.ParentRunner$1.schedule(ParentRunner.java:71)
	at org.junit.runners.ParentRunner.runChildren(ParentRunner.java:288)
	at org.junit.runners.ParentRunner.access$000(ParentRunner.java:58)
	at org.junit.runners.ParentRunner$2.evaluate(ParentRunner.java:268)
	at org.junit.runners.ParentRunner.run(ParentRunner.java:363)
	at org.apache.maven.surefire.junit4.JUnit4Provider.execute(JUnit4Provider.java:264)
	at org.apache.maven.surefire.junit4.JUnit4Provider.executeTestSet(JUnit4Provider.java:153)
	at org.apache.maven.surefire.junit4.JUnit4Provider.invoke(JUnit4Provider.java:124)
	at org.apache.maven.surefire.booter.ForkedBooter.invokeProviderInSameClassLoader(ForkedBooter.java:200)
	at org.apache.maven.surefire.booter.ForkedBooter.runSuitesInProcess(ForkedBooter.java:153)
	at org.apache.maven.surefire.booter.ForkedBooter.main(ForkedBooter.java:103)
Running org.locationtech.geogig.repository.impl.RevFeatureBuilderTest
[main] INFO org.locationtech.geogig.storage.cache.CacheManager - Configuring GeoGig shared object cache maximum size to the default of 2,500 bytes as given by the default 0.250000 percent of available heap. Use the GEOGIG_CACHE_MAX_SIZE System property or environmentvariable to set a different maximum size at runtime
[main] INFO org.locationtech.geogig.storage.cache.CacheManager - Configuring GeoGig shared object cache maximum size to the default of 119,406,592 bytes as given by the default 0.250000 percent of available heap. Use the GEOGIG_CACHE_MAX_SIZE System property or environmentvariable to set a different maximum size at runtime
[main] WARN org.locationtech.geogig.storage.cache.CacheManager - Unable to parse System property GEOGIG_CACHE_MAX_SIZE=0.91. Falling back to environment variable
java.lang.IllegalArgumentException: percent must be between zero and 90% (0.9)
	at com.google.common.base.Preconditions.checkArgument(Preconditions.java:135)
	at org.locationtech.geogig.storage.cache.CacheManager.getCacheSizePercent(CacheManager.java:203)
	at org.locationtech.geogig.storage.cache.CacheManagerTest.assertDefaultMaxSizeDefaultValue(CacheManagerTest.java:188)
	at org.locationtech.geogig.storage.cache.CacheManagerTest.resolveDefaultMaxSizeInvalidSysPropAndEnvVarFallsBackToDefaultPercent(CacheManagerTest.java:242)
	at sun.reflect.NativeMethodAccessorImpl.invoke0(Native Method)
	at sun.reflect.NativeMethodAccessorImpl.invoke(NativeMethodAccessorImpl.java:62)
	at sun.reflect.DelegatingMethodAccessorImpl.invoke(DelegatingMethodAccessorImpl.java:43)
	at java.lang.reflect.Method.invoke(Method.java:498)
	at org.junit.runners.model.FrameworkMethod$1.runReflectiveCall(FrameworkMethod.java:50)
	at org.junit.internal.runners.model.ReflectiveCallable.run(ReflectiveCallable.java:12)
	at org.junit.runners.model.FrameworkMethod.invokeExplosively(FrameworkMethod.java:47)
	at org.junit.internal.runners.statements.InvokeMethod.evaluate(InvokeMethod.java:17)
	at org.junit.internal.runners.statements.RunBefores.evaluate(RunBefores.java:26)
	at org.junit.internal.runners.statements.RunAfters.evaluate(RunAfters.java:27)
	at org.junit.rules.ExpectedException$ExpectedExceptionStatement.evaluate(ExpectedException.java:239)
	at org.junit.rules.RunRules.evaluate(RunRules.java:20)
	at org.junit.runners.ParentRunner.runLeaf(ParentRunner.java:325)
	at org.junit.runners.BlockJUnit4ClassRunner.runChild(BlockJUnit4ClassRunner.java:78)
	at org.junit.runners.BlockJUnit4ClassRunner.runChild(BlockJUnit4ClassRunner.java:57)
	at org.junit.runners.ParentRunner$3.run(ParentRunner.java:290)
	at org.junit.runners.ParentRunner$1.schedule(ParentRunner.java:71)
	at org.junit.runners.ParentRunner.runChildren(ParentRunner.java:288)
	at org.junit.runners.ParentRunner.access$000(ParentRunner.java:58)
	at org.junit.runners.ParentRunner$2.evaluate(ParentRunner.java:268)
	at org.junit.runners.ParentRunner.run(ParentRunner.java:363)
	at org.apache.maven.surefire.junit4.JUnit4Provider.execute(JUnit4Provider.java:264)
	at org.apache.maven.surefire.junit4.JUnit4Provider.executeTestSet(JUnit4Provider.java:153)
	at org.apache.maven.surefire.junit4.JUnit4Provider.invoke(JUnit4Provider.java:124)
	at org.apache.maven.surefire.booter.ForkedBooter.invokeProviderInSameClassLoader(ForkedBooter.java:200)
	at org.apache.maven.surefire.booter.ForkedBooter.runSuitesInProcess(ForkedBooter.java:153)
	at org.apache.maven.surefire.booter.ForkedBooter.main(ForkedBooter.java:103)
[main] WARN org.locationtech.geogig.storage.cache.CacheManager - Unable to parse environment variable GEOGIG_CACHE_MAX_SIZE=alsoInvalid
java.lang.IllegalArgumentException: Invalid format (ALSOINVALID), expected <float>[B|K|M|G]
	at org.locationtech.geogig.storage.cache.CacheManager.parseCacheSizeArgument(CacheManager.java:269)
	at org.locationtech.geogig.storage.cache.CacheManagerTest.assertDefaultMaxSizeDefaultValue(CacheManagerTest.java:188)
	at org.locationtech.geogig.storage.cache.CacheManagerTest.resolveDefaultMaxSizeInvalidSysPropAndEnvVarFallsBackToDefaultPercent(CacheManagerTest.java:242)
	at sun.reflect.NativeMethodAccessorImpl.invoke0(Native Method)
	at sun.reflect.NativeMethodAccessorImpl.invoke(NativeMethodAccessorImpl.java:62)
	at sun.reflect.DelegatingMethodAccessorImpl.invoke(DelegatingMethodAccessorImpl.java:43)
	at java.lang.reflect.Method.invoke(Method.java:498)
	at org.junit.runners.model.FrameworkMethod$1.runReflectiveCall(FrameworkMethod.java:50)
	at org.junit.internal.runners.model.ReflectiveCallable.run(ReflectiveCallable.java:12)
Tests run: 24, Failures: 0, Errors: 0, Skipped: 1, Time elapsed: 0.642 sec - in org.locationtech.geogig.storage.text.TextSerializationFactoryTest
	at org.junit.runners.model.FrameworkMethod.invokeExplosively(FrameworkMethod.java:47)
	at org.junit.internal.runners.statements.InvokeMethod.evaluate(InvokeMethod.java:17)
	at org.junit.internal.runners.statements.RunBefores.evaluate(RunBefores.java:26)
	at org.junit.internal.runners.statements.RunAfters.evaluate(RunAfters.java:27)
	at org.junit.rules.ExpectedException$ExpectedExceptionStatement.evaluate(ExpectedException.java:239)
	at org.junit.rules.RunRules.evaluate(RunRules.java:20)
	at org.junit.runners.ParentRunner.runLeaf(ParentRunner.java:325)
	at org.junit.runners.BlockJUnit4ClassRunner.runChild(BlockJUnit4ClassRunner.java:78)
	at org.junit.runners.BlockJUnit4ClassRunner.runChild(BlockJUnit4ClassRunner.java:57)
	at org.junit.runners.ParentRunner$3.run(ParentRunner.java:290)
	at org.junit.runners.ParentRunner$1.schedule(ParentRunner.java:71)
	at org.junit.runners.ParentRunner.runChildren(ParentRunner.java:288)
	at org.junit.runners.ParentRunner.access$000(ParentRunner.java:58)
	at org.junit.runners.ParentRunner$2.evaluate(ParentRunner.java:268)
	at org.junit.runners.ParentRunner.run(ParentRunner.java:363)
	at org.apache.maven.surefire.junit4.JUnit4Provider.execute(JUnit4Provider.java:264)
	at org.apache.maven.surefire.junit4.JUnit4Provider.executeTestSet(JUnit4Provider.java:153)
	at org.apache.maven.surefire.junit4.JUnit4Provider.invoke(JUnit4Provider.java:124)
	at org.apache.maven.surefire.booter.ForkedBooter.invokeProviderInSameClassLoader(ForkedBooter.java:200)
	at org.apache.maven.surefire.booter.ForkedBooter.runSuitesInProcess(ForkedBooter.java:153)
	at org.apache.maven.surefire.booter.ForkedBooter.main(ForkedBooter.java:103)
[main] INFO org.locationtech.geogig.storage.cache.CacheManager - Configuring GeoGig shared object cache maximum size to the default of 2,500 bytes as given by the default 0.250000 percent of available heap. Use the GEOGIG_CACHE_MAX_SIZE System property or environmentvariable to set a different maximum size at runtime
Tests run: 31, Failures: 0, Errors: 0, Skipped: 0, Time elapsed: 0.907 sec - in org.locationtech.geogig.storage.cache.CacheManagerTest
testCancelScenario2
Tests run: 9, Failures: 0, Errors: 0, Skipped: 0, Time elapsed: 2.695 sec - in org.locationtech.geogig.storage.datastream.v2_3.NodeSetTest
Tests run: 28, Failures: 0, Errors: 0, Skipped: 0, Time elapsed: 4.726 sec - in org.locationtech.geogig.storage.memory.HeapObjectDatabaseConformanceTest
Tests run: 9, Failures: 0, Errors: 0, Skipped: 2, Time elapsed: 1.758 sec - in org.locationtech.geogig.storage.cache.SharedCacheTest
testCancelScenario3
testCancelScenario4
Tests run: 8, Failures: 0, Errors: 0, Skipped: 0, Time elapsed: 2.145 sec - in org.locationtech.geogig.repository.impl.RevFeatureBuilderTest
Tests run: 11, Failures: 0, Errors: 0, Skipped: 0, Time elapsed: 2.333 sec - in org.locationtech.geogig.storage.fs.FileRefDatabaseTest
Tests run: 24, Failures: 0, Errors: 0, Skipped: 0, Time elapsed: 2.84 sec - in org.locationtech.geogig.storage.fs.IniFileConfigDatabaseTest
testNoFastForward
testMergeConflictingBranches
Tests run: 8, Failures: 0, Errors: 0, Skipped: 0, Time elapsed: 5.498 sec - in org.locationtech.geogig.storage.datastream.v2_3.RevTreeFormatTest
Tests run: 11, Failures: 0, Errors: 0, Skipped: 0, Time elapsed: 8.776 sec - in org.locationtech.geogig.model.impl.CanonicalTreeBuilderTest
Added 5,000 nodes in 395.9 ms
Added 1,024 nodes in 6.856 ms
Removed 400 nodes in 1.468 ms
testMergeConflictingBranchesOurs
Tests run: 30, Failures: 0, Errors: 0, Skipped: 0, Time elapsed: 31.308 sec - in org.locationtech.geogig.test.integration.MergeOpTest
Added 10,000 nodes in 225.4 ms
Tests run: 11, Failures: 0, Errors: 0, Skipped: 0, Time elapsed: 9.05 sec - in org.locationtech.geogig.model.internal.CanonicalClusteringStrategyRocksdbStorageTest
Tests run: 9, Failures: 0, Errors: 0, Skipped: 0, Time elapsed: 12.094 sec - in org.locationtech.geogig.porcelain.index.CreateIndexOpTest
Tests run: 2, Failures: 0, Errors: 0, Skipped: 0, Time elapsed: 5.148 sec - in org.locationtech.geogig.repository.impl.SpatialOpsTest
Tests run: 5, Failures: 0, Errors: 0, Skipped: 0, Time elapsed: 11.301 sec - in org.locationtech.geogig.data.EPSGBoundsCalcTest
PreOrderDiffWalkTest: walked 524,288 vs 262144 trees in 226.1 ms
Tests run: 16, Failures: 0, Errors: 0, Skipped: 0, Time elapsed: 14.093 sec - in org.locationtech.geogig.porcelain.index.UpdateIndexOpTest
PreOrderDiffWalkTest: walked 1,024 vs 512 trees in 11.97 ms
PreOrderDiffWalkTest: walked 16,384 vs 512 trees in 52.78 ms
Tests run: 9, Failures: 0, Errors: 0, Skipped: 0, Time elapsed: 14.561 sec - in org.locationtech.geogig.porcelain.index.UpdateIndexesOpTest
Tests run: 24, Failures: 0, Errors: 0, Skipped: 0, Time elapsed: 20.84 sec - in org.locationtech.geogig.plumbing.diff.PreOrderDiffWalkTest
Tests run: 7, Failures: 0, Errors: 0, Skipped: 0, Time elapsed: 23.5 sec - in org.locationtech.geogig.plumbing.diff.DepthTreeIteratorTest
Tests run: 1, Failures: 0, Errors: 0, Skipped: 0, Time elapsed: 121.145 sec - in org.locationtech.geogig.plumbing.ResolveGeogigURITest
Tests run: 1, Failures: 0, Errors: 0, Skipped: 0, Time elapsed: 360.862 sec - in org.locationtech.geogig.repository.impl.DepthSearchTest
Tests run: 2, Failures: 0, Errors: 0, Skipped: 0, Time elapsed: 723.883 sec - in org.locationtech.geogig.plumbing.ParseTimestampTest
Runs: 1, FindChangedTrees: 994.4 μs, LsTreeOp: 12.98 ms, DiffTree: 11.64 ms
Runs: 10, FindChangedTrees: 7.855 ms, LsTreeOp: 68.86 ms, DiffTree: 146.5 ms
[Finalizer] WARN org.locationtech.geogig.repository.impl.RepositoryImpl - Repository instance being finalized without having been closed: file:/opt/public/hipp/ramdisk/geogig/junit6503084356515045701/mockWorkingDir/.geogig/
Runs: 100, FindChangedTrees: 58.88 ms, LsTreeOp: 755.2 ms, DiffTree: 1.605 s
[Finalizer] WARN org.locationtech.geogig.repository.impl.RepositoryImpl - Repository instance being finalized without having been closed: file:/opt/public/hipp/ramdisk/geogig/junit1489673251101277091/mockWorkingDir/.geogig/
[Finalizer] WARN org.locationtech.geogig.repository.impl.RepositoryImpl - Repository instance being finalized without having been closed: file:/opt/public/hipp/ramdisk/geogig/junit7992064534581450298/mockWorkingDir/.geogig/
[Finalizer] WARN org.locationtech.geogig.repository.impl.RepositoryImpl - Repository instance being finalized without having been closed: file:/opt/public/hipp/ramdisk/geogig/junit7118133724276682758/mockWorkingDir/.geogig/
[Finalizer] WARN org.locationtech.geogig.repository.impl.RepositoryImpl - Repository instance being finalized without having been closed: file:/opt/public/hipp/ramdisk/geogig/junit4924245810536724606/mockWorkingDir/.geogig/
[Finalizer] WARN org.locationtech.geogig.repository.impl.RepositoryImpl - Repository instance being finalized without having been closed: file:/opt/public/hipp/ramdisk/geogig/junit8209623585128603260/mockWorkingDir/.geogig/
[Finalizer] WARN org.locationtech.geogig.repository.impl.RepositoryImpl - Repository instance being finalized without having been closed: file:/opt/public/hipp/ramdisk/geogig/junit7061686379879189115/mockWorkingDir/.geogig/
[Finalizer] WARN org.locationtech.geogig.repository.impl.RepositoryImpl - Repository instance being finalized without having been closed: file:/opt/public/hipp/ramdisk/geogig/junit5875097705897818996/mockWorkingDir/.geogig/
[Finalizer] WARN org.locationtech.geogig.repository.impl.RepositoryImpl - Repository instance being finalized without having been closed: file:/opt/public/hipp/ramdisk/geogig/junit1642975925575064852/mockWorkingDir/.geogig/
[Finalizer] WARN org.locationtech.geogig.repository.impl.RepositoryImpl - Repository instance being finalized without having been closed: file:/opt/public/hipp/ramdisk/geogig/junit2065045292489015935/mockWorkingDir/.geogig/
[Finalizer] WARN org.locationtech.geogig.repository.impl.RepositoryImpl - Repository instance being finalized without having been closed: file:/opt/public/hipp/ramdisk/geogig/junit8820385884239181245/mockWorkingDir/.geogig/
[Finalizer] WARN org.locationtech.geogig.repository.impl.RepositoryImpl - Repository instance being finalized without having been closed: file:/opt/public/hipp/ramdisk/geogig/junit2523382050789402964/mockWorkingDir/.geogig/
[Finalizer] WARN org.locationtech.geogig.repository.impl.RepositoryImpl - Repository instance being finalized without having been closed: file:/opt/public/hipp/ramdisk/geogig/junit1228840838847575374/mockWorkingDir/.geogig/
[Finalizer] WARN org.locationtech.geogig.repository.impl.RepositoryImpl - Repository instance being finalized without having been closed: file:/opt/public/hipp/ramdisk/geogig/junit6100060805668791886/mockWorkingDir/.geogig/
Tests run: 10, Failures: 0, Errors: 0, Skipped: 0, Time elapsed: 3,665.892 sec - in org.locationtech.geogig.plumbing.FindChangedTreesTest
Tests run: 11, Failures: 0, Errors: 0, Skipped: 0, Time elapsed: 4,026.788 sec - in org.locationtech.geogig.plumbing.DiffTreeTest

Results :

Tests run: 1295, Failures: 0, Errors: 0, Skipped: 21

[JENKINS] Recording test results
[INFO] 
[INFO] --- maven-jar-plugin:3.0.2:jar (default-jar) @ geogig-core ---
[INFO] Building jar: /home/hudson/genie.geogig/.jenkins/jobs/geogig-master/workspace/src/core/target/geogig-core-1.4-SNAPSHOT.jar
[INFO] 
[INFO] --- maven-jar-plugin:3.0.2:test-jar (default) @ geogig-core ---
[INFO] Building jar: /home/hudson/genie.geogig/.jenkins/jobs/geogig-master/workspace/src/core/target/geogig-core-1.4-SNAPSHOT-tests.jar
[INFO] 
[INFO] >>> maven-source-plugin:3.0.1:jar (attach-sources) > generate-sources @ geogig-core >>>
[INFO] 
[INFO] --- git-commit-id-plugin:2.2.2:revision (default) @ geogig-core ---
[WARNING] Failed to getClass for org.apache.maven.plugins.source.SourceJarMojo
[INFO] 
[INFO] <<< maven-source-plugin:3.0.1:jar (attach-sources) < generate-sources @ geogig-core <<<
[INFO] 
[INFO] 
[INFO] --- maven-source-plugin:3.0.1:jar (attach-sources) @ geogig-core ---
[INFO] Building jar: /home/hudson/genie.geogig/.jenkins/jobs/geogig-master/workspace/src/core/target/geogig-core-1.4-SNAPSHOT-sources.jar
[INFO] 
[INFO] >>> maven-source-plugin:3.0.1:test-jar (attach-sources) > generate-sources @ geogig-core >>>
[INFO] 
[INFO] --- git-commit-id-plugin:2.2.2:revision (default) @ geogig-core ---
[WARNING] Failed to getClass for org.apache.maven.plugins.source.TestSourceJarMojo
[INFO] 
[INFO] <<< maven-source-plugin:3.0.1:test-jar (attach-sources) < generate-sources @ geogig-core <<<
[INFO] 
[INFO] 
[INFO] --- maven-source-plugin:3.0.1:test-jar (attach-sources) @ geogig-core ---
[INFO] Building jar: /home/hudson/genie.geogig/.jenkins/jobs/geogig-master/workspace/src/core/target/geogig-core-1.4-SNAPSHOT-test-sources.jar
[INFO] 
[INFO] --- maven-install-plugin:2.4:install (default-install) @ geogig-core ---
[INFO] Installing /home/hudson/genie.geogig/.jenkins/jobs/geogig-master/workspace/src/core/target/geogig-core-1.4-SNAPSHOT.jar to /home/hudson/genie.geogig/.jenkins/jobs/geogig-master/workspace/.repository/org/locationtech/geogig/geogig-core/1.4-SNAPSHOT/geogig-core-1.4-SNAPSHOT.jar
[INFO] Installing /home/hudson/genie.geogig/.jenkins/jobs/geogig-master/workspace/src/core/pom.xml to /home/hudson/genie.geogig/.jenkins/jobs/geogig-master/workspace/.repository/org/locationtech/geogig/geogig-core/1.4-SNAPSHOT/geogig-core-1.4-SNAPSHOT.pom
[INFO] Installing /home/hudson/genie.geogig/.jenkins/jobs/geogig-master/workspace/src/core/target/geogig-core-1.4-SNAPSHOT-tests.jar to /home/hudson/genie.geogig/.jenkins/jobs/geogig-master/workspace/.repository/org/locationtech/geogig/geogig-core/1.4-SNAPSHOT/geogig-core-1.4-SNAPSHOT-tests.jar
[INFO] Installing /home/hudson/genie.geogig/.jenkins/jobs/geogig-master/workspace/src/core/target/geogig-core-1.4-SNAPSHOT-sources.jar to /home/hudson/genie.geogig/.jenkins/jobs/geogig-master/workspace/.repository/org/locationtech/geogig/geogig-core/1.4-SNAPSHOT/geogig-core-1.4-SNAPSHOT-sources.jar
[INFO] Installing /home/hudson/genie.geogig/.jenkins/jobs/geogig-master/workspace/src/core/target/geogig-core-1.4-SNAPSHOT-test-sources.jar to /home/hudson/genie.geogig/.jenkins/jobs/geogig-master/workspace/.repository/org/locationtech/geogig/geogig-core/1.4-SNAPSHOT/geogig-core-1.4-SNAPSHOT-test-sources.jar
[JENKINS] Archiving disabled
Started calculate disk usage of build
Finished Calculation of disk usage of build in 0 seconds
Started calculate disk usage of workspace
Finished Calculation of disk usage of workspace in 0 seconds
[INFO] 
[INFO] --------------< org.locationtech.geogig:geogig-remoting >---------------
[INFO] Building Replication and synchronization 1.4-SNAPSHOT             [4/22]
[INFO] --------------------------------[ jar ]---------------------------------
[INFO] 
[INFO] --- maven-clean-plugin:2.5:clean (default-clean) @ geogig-remoting ---
[INFO] Deleting /home/hudson/genie.geogig/.jenkins/jobs/geogig-master/workspace/src/remoting/target
[INFO] 
[INFO] --- git-commit-id-plugin:2.2.2:revision (default) @ geogig-remoting ---
[INFO] 
[INFO] --- maven-resources-plugin:3.0.1:resources (default-resources) @ geogig-remoting ---
[INFO] Using 'UTF-8' encoding to copy filtered resources.
[INFO] Copying 3 resources
[INFO] 
[INFO] --- maven-compiler-plugin:3.7.0:compile (default-compile) @ geogig-remoting ---
[INFO] Changes detected - recompiling the module!
[INFO] Compiling 51 source files to /home/hudson/genie.geogig/.jenkins/jobs/geogig-master/workspace/src/remoting/target/classes
[INFO] /home/hudson/genie.geogig/.jenkins/jobs/geogig-master/workspace/src/remoting/src/main/java/org/locationtech/geogig/remotes/FetchOp.java: /home/hudson/genie.geogig/.jenkins/jobs/geogig-master/workspace/src/remoting/src/main/java/org/locationtech/geogig/remotes/FetchOp.java uses or overrides a deprecated API.
[INFO] /home/hudson/genie.geogig/.jenkins/jobs/geogig-master/workspace/src/remoting/src/main/java/org/locationtech/geogig/remotes/FetchOp.java: Recompile with -Xlint:deprecation for details.
[INFO] 
[INFO] --- maven-resources-plugin:3.0.1:testResources (default-testResources) @ geogig-remoting ---
[INFO] Using 'UTF-8' encoding to copy filtered resources.
[INFO] Copying 1 resource
[INFO] 
[INFO] --- maven-compiler-plugin:3.7.0:testCompile (default-testCompile) @ geogig-remoting ---
[INFO] Changes detected - recompiling the module!
[INFO] Compiling 12 source files to /home/hudson/genie.geogig/.jenkins/jobs/geogig-master/workspace/src/remoting/target/test-classes
[INFO] /home/hudson/genie.geogig/.jenkins/jobs/geogig-master/workspace/src/remoting/src/test/java/org/locationtech/geogig/test/integration/remoting/FetchOpTest.java: Some input files use or override a deprecated API.
[INFO] /home/hudson/genie.geogig/.jenkins/jobs/geogig-master/workspace/src/remoting/src/test/java/org/locationtech/geogig/test/integration/remoting/FetchOpTest.java: Recompile with -Xlint:deprecation for details.
[INFO] /home/hudson/genie.geogig/.jenkins/jobs/geogig-master/workspace/src/remoting/src/test/java/org/locationtech/geogig/test/integration/remoting/RemoteRepositoryTestCase.java: /home/hudson/genie.geogig/.jenkins/jobs/geogig-master/workspace/src/remoting/src/test/java/org/locationtech/geogig/test/integration/remoting/RemoteRepositoryTestCase.java uses unchecked or unsafe operations.
[INFO] /home/hudson/genie.geogig/.jenkins/jobs/geogig-master/workspace/src/remoting/src/test/java/org/locationtech/geogig/test/integration/remoting/RemoteRepositoryTestCase.java: Recompile with -Xlint:unchecked for details.
[INFO] 
[INFO] --- maven-surefire-plugin:2.17:test (default-test) @ geogig-remoting ---
[INFO] Surefire report directory: /home/hudson/genie.geogig/.jenkins/jobs/geogig-master/workspace/src/remoting/target/surefire-reports

-------------------------------------------------------
 T E S T S
-------------------------------------------------------

-------------------------------------------------------
 T E S T S
-------------------------------------------------------
Picked up JAVA_TOOL_OPTIONS: -Xmx2G -Djava.io.tmpdir=/tmp/genie.geogig
Picked up JAVA_TOOL_OPTIONS: -Xmx2G -Djava.io.tmpdir=/tmp/genie.geogig
Picked up JAVA_TOOL_OPTIONS: -Xmx2G -Djava.io.tmpdir=/tmp/genie.geogig
Picked up JAVA_TOOL_OPTIONS: -Xmx2G -Djava.io.tmpdir=/tmp/genie.geogig
Picked up JAVA_TOOL_OPTIONS: -Xmx2G -Djava.io.tmpdir=/tmp/genie.geogig
Picked up JAVA_TOOL_OPTIONS: -Xmx2G -Djava.io.tmpdir=/tmp/genie.geogig
Picked up JAVA_TOOL_OPTIONS: -Xmx2G -Djava.io.tmpdir=/tmp/genie.geogig
Picked up JAVA_TOOL_OPTIONS: -Xmx2G -Djava.io.tmpdir=/tmp/genie.geogig
Picked up JAVA_TOOL_OPTIONS: -Xmx2G -Djava.io.tmpdir=/tmp/genie.geogig
Picked up JAVA_TOOL_OPTIONS: -Xmx2G -Djava.io.tmpdir=/tmp/genie.geogig
Running org.locationtech.geogig.test.integration.remoting.PullOpTest
Running org.locationtech.geogig.test.integration.remoting.FetchOpWithIndexTest
Running org.locationtech.geogig.test.integration.remoting.FetchOpTest
Running org.locationtech.geogig.test.integration.remoting.CloneOpWithIndexTest
Running org.locationtech.geogig.test.integration.remoting.CloneOpTest
Running org.locationtech.geogig.test.integration.remoting.RemoteListOpTest
Running org.locationtech.geogig.test.integration.remoting.ShallowCloneTest
Running org.locationtech.geogig.test.integration.remoting.BranchListOpTest
Running org.locationtech.geogig.test.integration.remoting.PushOpTest
Running org.locationtech.geogig.test.integration.remoting.SparseCloneTest
Tests run: 4, Failures: 0, Errors: 0, Skipped: 0, Time elapsed: 2.071 sec - in org.locationtech.geogig.test.integration.remoting.RemoteListOpTest
Build was aborted
Aborted by groldan@boundlessgeo.com
channel stopped
Started calculate disk usage of build
Finished Calculation of disk usage of build in 0 seconds
Started calculate disk usage of workspace
Finished Calculation of disk usage of workspace in 0 seconds
Finished: ABORTED