AbortedConsole Output

Started by an SCM change
Building in workspace /home/hudson/genie.geogig/.jenkins/jobs/geogig-1.2.x/workspace
 > /usr/local/bin/git rev-parse --is-inside-work-tree # timeout=10
Fetching changes from the remote Git repository
 > /usr/local/bin/git config remote.origin.url https://github.com/locationtech/geogig.git # timeout=10
Fetching upstream changes from https://github.com/locationtech/geogig.git
 > /usr/local/bin/git --version # timeout=10
Setting http proxy: proxy.eclipse.org:9898
 > /usr/local/bin/git fetch --tags --progress https://github.com/locationtech/geogig.git +refs/heads/*:refs/remotes/origin/*
 > /usr/local/bin/git rev-parse origin/1.2.x^{commit} # timeout=10
Checking out Revision ede863df5985af70002d519ff0d970f587b1ac04 (origin/1.2.x)
 > /usr/local/bin/git config core.sparsecheckout # timeout=10
 > /usr/local/bin/git checkout -f ede863df5985af70002d519ff0d970f587b1ac04
Commit message: "Merge pull request #468 from groldan/1.2.x_pg10"
 > /usr/local/bin/git rev-list --no-walk 400f98aeb5e221b3c825c4150878960fc1f10332 # timeout=10
Parsing POMs
Established TCP socket on 53021
[parent] $ /shared/common/jdk1.8.0_x64-latest/bin/java -Xmx2G -Djava.io.tmpdir=/tmp/genie.geogig -cp /home/hudson/genie.geogig/.jenkins/plugins/maven-plugin/WEB-INF/lib/maven35-agent-1.12-alpha-1.jar:/shared/common/apache-maven-latest/boot/plexus-classworlds-2.5.2.jar:/shared/common/apache-maven-latest/conf/logging jenkins.maven3.agent.Maven35Main /shared/common/apache-maven-latest /home/hudson/genie.geogig/.jenkins/war/WEB-INF/lib/remoting-3.21.jar /home/hudson/genie.geogig/.jenkins/plugins/maven-plugin/WEB-INF/lib/maven35-interceptor-1.12-alpha-1.jar /home/hudson/genie.geogig/.jenkins/plugins/maven-plugin/WEB-INF/lib/maven3-interceptor-commons-1.12-alpha-1.jar 53021
Picked up JAVA_TOOL_OPTIONS: -Xmx2G -Djava.io.tmpdir=/tmp/genie.geogig
<===[JENKINS REMOTING CAPACITY]===>channel started
Executing Maven:  -B -f /home/hudson/genie.geogig/.jenkins/jobs/geogig-1.2.x/workspace/src/parent/pom.xml -Dmaven.repo.local=/home/hudson/genie.geogig/.jenkins/jobs/geogig-1.2.x/workspace/.repository clean install -Pexperimental -DskipTests=false -Dcucumber.options=--monochrome --plugin json:target/cucumber.json -Djava.io.tmpdir=/opt/public/hipp/ramdisk/geogig
[INFO] Scanning for projects...
[INFO] ------------------------------------------------------------------------
[INFO] Reactor Build Order:
[INFO] 
[INFO] GeoGig                                                             [pom]
[INFO] GeoGig Core API                                                    [jar]
[INFO] GeoGig Core                                                        [jar]
[INFO] Replication and synchronization                                    [jar]
[INFO] GeoGig DataStore Implementation                                    [jar]
[INFO] Storage backends                                                   [pom]
[INFO] RocksDB storage backend                                            [jar]
[INFO] GeoGig Command Line Interface                                      [jar]
[INFO] PostgreSQL Storage Backend                                         [jar]
[INFO] GeoTools Extension                                                 [jar]
[INFO] Web modules                                                        [pom]
[INFO] GeoGig Web API                                                     [jar]
[INFO] GeoGig WebApp                                                      [jar]
[INFO] GeoGig Web API Automated Functional Tests                          [jar]
[INFO] GeoGig Query Language Extension                                    [jar]
[INFO] Basic GUI tools                                                    [jar]
[INFO] GeoGig CLI App                                                     [jar]
[INFO] 
[INFO] -------------------< org.locationtech.geogig:geogig >-------------------
[INFO] Building GeoGig 1.2-SNAPSHOT                                      [1/17]
[INFO] --------------------------------[ pom ]---------------------------------
[INFO] 
[INFO] --- maven-clean-plugin:2.5:clean (default-clean) @ geogig ---
[INFO] Deleting /home/hudson/genie.geogig/.jenkins/jobs/geogig-1.2.x/workspace/src/parent/target
[INFO] 
[INFO] --- git-commit-id-plugin:2.2.2:revision (default) @ geogig ---
[WARNING] Attempt to (de-)serialize anonymous class hudson.maven.reporters.BuildInfoRecorder$1; see: https://jenkins.io/redirect/serialization-of-anonymous-classes/
[INFO] 
[INFO] --- maven-jar-plugin:2.4:test-jar (default) @ geogig ---
[WARNING] JAR will be empty - no content was marked for inclusion!
[INFO] Building jar: /home/hudson/genie.geogig/.jenkins/jobs/geogig-1.2.x/workspace/src/parent/target/geogig-1.2-SNAPSHOT-tests.jar
[INFO] 
[INFO] >>> maven-source-plugin:2.2.1:jar (attach-sources) > generate-sources @ geogig >>>
[INFO] 
[INFO] --- git-commit-id-plugin:2.2.2:revision (default) @ geogig ---
[WARNING] Failed to getClass for org.apache.maven.plugin.source.SourceJarMojo
[INFO] 
[INFO] <<< maven-source-plugin:2.2.1:jar (attach-sources) < generate-sources @ geogig <<<
[INFO] 
[INFO] 
[INFO] --- maven-source-plugin:2.2.1:jar (attach-sources) @ geogig ---
[INFO] 
[INFO] >>> maven-source-plugin:2.2.1:test-jar (attach-sources) > generate-sources @ geogig >>>
[INFO] 
[INFO] --- git-commit-id-plugin:2.2.2:revision (default) @ geogig ---
[WARNING] Failed to getClass for org.apache.maven.plugin.source.TestSourceJarMojo
[INFO] 
[INFO] <<< maven-source-plugin:2.2.1:test-jar (attach-sources) < generate-sources @ geogig <<<
[INFO] 
[INFO] 
[INFO] --- maven-source-plugin:2.2.1:test-jar (attach-sources) @ geogig ---
[INFO] 
[INFO] --- maven-install-plugin:2.4:install (default-install) @ geogig ---
[INFO] Installing /home/hudson/genie.geogig/.jenkins/jobs/geogig-1.2.x/workspace/src/parent/pom.xml to /home/hudson/genie.geogig/.jenkins/jobs/geogig-1.2.x/workspace/.repository/org/locationtech/geogig/geogig/1.2-SNAPSHOT/geogig-1.2-SNAPSHOT.pom
[INFO] Installing /home/hudson/genie.geogig/.jenkins/jobs/geogig-1.2.x/workspace/src/parent/target/geogig-1.2-SNAPSHOT-tests.jar to /home/hudson/genie.geogig/.jenkins/jobs/geogig-1.2.x/workspace/.repository/org/locationtech/geogig/geogig/1.2-SNAPSHOT/geogig-1.2-SNAPSHOT-tests.jar
[WARNING] Attempt to (de-)serialize anonymous class hudson.maven.reporters.MavenArtifactArchiver$2; see: https://jenkins.io/redirect/serialization-of-anonymous-classes/
[JENKINS] Archiving disabled
[WARNING] Attempt to (de-)serialize anonymous class hudson.maven.reporters.MavenFingerprinter$1; see: https://jenkins.io/redirect/serialization-of-anonymous-classes/
Started calculate disk usage of build
Finished Calculation of disk usage of build in 0 seconds
Started calculate disk usage of workspace
Finished Calculation of disk usage of workspace in 0 seconds
[INFO] 
[INFO] -----------------< org.locationtech.geogig:geogig-api >-----------------
[INFO] Building GeoGig Core API 1.2-SNAPSHOT                             [2/17]
[INFO] --------------------------------[ jar ]---------------------------------
[INFO] 
[INFO] --- maven-clean-plugin:2.5:clean (default-clean) @ geogig-api ---
[INFO] Deleting /home/hudson/genie.geogig/.jenkins/jobs/geogig-1.2.x/workspace/src/api/target
[INFO] 
[INFO] --- git-commit-id-plugin:2.2.2:revision (default) @ geogig-api ---
[INFO] 
[INFO] --- maven-resources-plugin:2.6:resources (default-resources) @ geogig-api ---
[INFO] Using 'UTF-8' encoding to copy filtered resources.
[INFO] Copying 2 resources
[INFO] 
[INFO] --- maven-compiler-plugin:3.1:compile (default-compile) @ geogig-api ---
[INFO] Changes detected - recompiling the module!
[INFO] Compiling 55 source files to /home/hudson/genie.geogig/.jenkins/jobs/geogig-1.2.x/workspace/src/api/target/classes
[INFO] 
[INFO] --- maven-resources-plugin:2.6:testResources (default-testResources) @ geogig-api ---
[INFO] Using 'UTF-8' encoding to copy filtered resources.
[INFO] skip non existing resourceDirectory /home/hudson/genie.geogig/.jenkins/jobs/geogig-1.2.x/workspace/src/api/src/test/resources
[INFO] 
[INFO] --- maven-compiler-plugin:3.1:testCompile (default-testCompile) @ geogig-api ---
[INFO] Changes detected - recompiling the module!
[INFO] Compiling 27 source files to /home/hudson/genie.geogig/.jenkins/jobs/geogig-1.2.x/workspace/src/api/target/test-classes
[WARNING] /home/hudson/genie.geogig/.jenkins/jobs/geogig-1.2.x/workspace/src/api/src/test/java/org/locationtech/geogig/model/FieldTypeTest.java: /home/hudson/genie.geogig/.jenkins/jobs/geogig-1.2.x/workspace/src/api/src/test/java/org/locationtech/geogig/model/FieldTypeTest.java uses or overrides a deprecated API.
[WARNING] /home/hudson/genie.geogig/.jenkins/jobs/geogig-1.2.x/workspace/src/api/src/test/java/org/locationtech/geogig/model/FieldTypeTest.java: Recompile with -Xlint:deprecation for details.
[INFO] 
[INFO] --- maven-surefire-plugin:2.17:test (default-test) @ geogig-api ---
[INFO] Surefire report directory: /home/hudson/genie.geogig/.jenkins/jobs/geogig-1.2.x/workspace/src/api/target/surefire-reports

-------------------------------------------------------
 T E S T S
-------------------------------------------------------

-------------------------------------------------------
 T E S T S
-------------------------------------------------------
Picked up JAVA_TOOL_OPTIONS: -Xmx2G -Djava.io.tmpdir=/tmp/genie.geogig
Picked up JAVA_TOOL_OPTIONS: -Xmx2G -Djava.io.tmpdir=/tmp/genie.geogig
Picked up JAVA_TOOL_OPTIONS: -Xmx2G -Djava.io.tmpdir=/tmp/genie.geogig
Picked up JAVA_TOOL_OPTIONS: -Xmx2G -Djava.io.tmpdir=/tmp/genie.geogig
Picked up JAVA_TOOL_OPTIONS: -Xmx2G -Djava.io.tmpdir=/tmp/genie.geogig
Picked up JAVA_TOOL_OPTIONS: -Xmx2G -Djava.io.tmpdir=/tmp/genie.geogig
Picked up JAVA_TOOL_OPTIONS: -Xmx2G -Djava.io.tmpdir=/tmp/genie.geogig
Picked up JAVA_TOOL_OPTIONS: -Xmx2G -Djava.io.tmpdir=/tmp/genie.geogig
Picked up JAVA_TOOL_OPTIONS: -Xmx2G -Djava.io.tmpdir=/tmp/genie.geogig
Picked up JAVA_TOOL_OPTIONS: -Xmx2G -Djava.io.tmpdir=/tmp/genie.geogig
Picked up JAVA_TOOL_OPTIONS: -Xmx2G -Djava.io.tmpdir=/tmp/genie.geogig
Picked up JAVA_TOOL_OPTIONS: -Xmx2G -Djava.io.tmpdir=/tmp/genie.geogig
Picked up JAVA_TOOL_OPTIONS: -Xmx2G -Djava.io.tmpdir=/tmp/genie.geogig
Picked up JAVA_TOOL_OPTIONS: -Xmx2G -Djava.io.tmpdir=/tmp/genie.geogig
Picked up JAVA_TOOL_OPTIONS: -Xmx2G -Djava.io.tmpdir=/tmp/genie.geogig
Picked up JAVA_TOOL_OPTIONS: -Xmx2G -Djava.io.tmpdir=/tmp/genie.geogig
Picked up JAVA_TOOL_OPTIONS: -Xmx2G -Djava.io.tmpdir=/tmp/genie.geogig
Picked up JAVA_TOOL_OPTIONS: -Xmx2G -Djava.io.tmpdir=/tmp/genie.geogig
Picked up JAVA_TOOL_OPTIONS: -Xmx2G -Djava.io.tmpdir=/tmp/genie.geogig
Picked up JAVA_TOOL_OPTIONS: -Xmx2G -Djava.io.tmpdir=/tmp/genie.geogig
Picked up JAVA_TOOL_OPTIONS: -Xmx2G -Djava.io.tmpdir=/tmp/genie.geogig
Picked up JAVA_TOOL_OPTIONS: -Xmx2G -Djava.io.tmpdir=/tmp/genie.geogig
Picked up JAVA_TOOL_OPTIONS: -Xmx2G -Djava.io.tmpdir=/tmp/genie.geogig
Picked up JAVA_TOOL_OPTIONS: -Xmx2G -Djava.io.tmpdir=/tmp/genie.geogig
Running org.locationtech.geogig.model.SymRefTest
Running org.locationtech.geogig.model.CanonicalNodeOrderTest
Running org.locationtech.geogig.model.RefTest
Running org.locationtech.geogig.model.NodeTest
Running org.locationtech.geogig.model.NodeRefTest
Running org.locationtech.geogig.model.BucketTest
Running org.locationtech.geogig.model.HashObjectFunnelsTest
Running org.locationtech.geogig.model.FieldTypeTest
Running org.locationtech.geogig.model.Float32BoundsTest
Running org.locationtech.geogig.model.ObjectIdTest
Running org.locationtech.geogig.model.RevObjectTest
Running org.locationtech.geogig.repository.AbstractGeoGigOpTest
Running org.locationtech.geogig.repository.ProgressListenerTest
Running org.locationtech.geogig.model.RevTreeTest
Running org.locationtech.geogig.repository.ConflictTest
Running org.locationtech.geogig.repository.DiffObjectCountTest
Running org.locationtech.geogig.repository.DiffEntryTest
Running org.locationtech.geogig.repository.HintsTest
Running org.locationtech.geogig.repository.FeatureInfoTest
Running org.locationtech.geogig.repository.RemoteTest
Tests run: 11, Failures: 0, Errors: 0, Skipped: 0, Time elapsed: 0.135 sec - in org.locationtech.geogig.model.ObjectIdTest
Running org.locationtech.geogig.storage.BulkOpListenerTest
Tests run: 9, Failures: 0, Errors: 0, Skipped: 0, Time elapsed: 0.231 sec - in org.locationtech.geogig.model.RefTest
Running org.locationtech.geogig.storage.GraphDatabaseTest
Running org.locationtech.geogig.storage.VersionedFormatTest
Tests run: 3, Failures: 0, Errors: 0, Skipped: 0, Time elapsed: 0.006 sec - in org.locationtech.geogig.storage.GraphDatabaseTest
Running org.locationtech.geogig.storage.AutoCloseableIteratorTest
Running org.locationtech.geogig.storage.ConfigExceptionTest
Running org.locationtech.geogig.storage.PluginDefaultsTest
Tests run: 1, Failures: 0, Errors: 0, Skipped: 0, Time elapsed: 0.411 sec - in org.locationtech.geogig.model.SymRefTest
Tests run: 4, Failures: 0, Errors: 0, Skipped: 0, Time elapsed: 0.339 sec - in org.locationtech.geogig.model.BucketTest
Tests run: 5, Failures: 0, Errors: 0, Skipped: 0, Time elapsed: 0.471 sec - in org.locationtech.geogig.model.CanonicalNodeOrderTest
Tests run: 3, Failures: 0, Errors: 0, Skipped: 0, Time elapsed: 0.313 sec - in org.locationtech.geogig.repository.DiffObjectCountTest
Tests run: 5, Failures: 0, Errors: 0, Skipped: 0, Time elapsed: 0.343 sec - in org.locationtech.geogig.repository.ConflictTest
Tests run: 1, Failures: 0, Errors: 0, Skipped: 0, Time elapsed: 0.383 sec - in org.locationtech.geogig.model.Float32BoundsTest
Tests run: 4, Failures: 0, Errors: 0, Skipped: 0, Time elapsed: 0.269 sec - in org.locationtech.geogig.storage.BulkOpListenerTest
Tests run: 8, Failures: 0, Errors: 0, Skipped: 0, Time elapsed: 0.25 sec - in org.locationtech.geogig.storage.AutoCloseableIteratorTest
Tests run: 7, Failures: 0, Errors: 0, Skipped: 0, Time elapsed: 0.369 sec - in org.locationtech.geogig.repository.HintsTest
Tests run: 2, Failures: 0, Errors: 0, Skipped: 0, Time elapsed: 0.308 sec - in org.locationtech.geogig.storage.ConfigExceptionTest
Tests run: 23, Failures: 0, Errors: 0, Skipped: 0, Time elapsed: 0.534 sec - in org.locationtech.geogig.model.NodeRefTest
Tests run: 2, Failures: 0, Errors: 0, Skipped: 0, Time elapsed: 0.346 sec - in org.locationtech.geogig.storage.VersionedFormatTest
Tests run: 2, Failures: 0, Errors: 0, Skipped: 0, Time elapsed: 0.337 sec - in org.locationtech.geogig.storage.PluginDefaultsTest
Tests run: 1, Failures: 0, Errors: 0, Skipped: 0, Time elapsed: 0.465 sec - in org.locationtech.geogig.repository.FeatureInfoTest
Tests run: 5, Failures: 0, Errors: 0, Skipped: 0, Time elapsed: 0.504 sec - in org.locationtech.geogig.repository.ProgressListenerTest
Tests run: 7, Failures: 0, Errors: 0, Skipped: 0, Time elapsed: 0.492 sec - in org.locationtech.geogig.repository.DiffEntryTest
Tests run: 5, Failures: 0, Errors: 0, Skipped: 0, Time elapsed: 0.607 sec - in org.locationtech.geogig.model.FieldTypeTest
Tests run: 5, Failures: 0, Errors: 0, Skipped: 0, Time elapsed: 0.635 sec - in org.locationtech.geogig.model.RevTreeTest
Tests run: 3, Failures: 0, Errors: 0, Skipped: 0, Time elapsed: 0.651 sec - in org.locationtech.geogig.model.RevObjectTest
Tests run: 10, Failures: 0, Errors: 0, Skipped: 0, Time elapsed: 0.767 sec - in org.locationtech.geogig.model.NodeTest
Tests run: 4, Failures: 0, Errors: 0, Skipped: 0, Time elapsed: 0.735 sec - in org.locationtech.geogig.repository.AbstractGeoGigOpTest
Tests run: 5, Failures: 0, Errors: 0, Skipped: 0, Time elapsed: 0.809 sec - in org.locationtech.geogig.model.HashObjectFunnelsTest
Tests run: 3, Failures: 0, Errors: 0, Skipped: 0, Time elapsed: 0.774 sec - in org.locationtech.geogig.repository.RemoteTest

Results :

Tests run: 138, Failures: 0, Errors: 0, Skipped: 0

[JENKINS] Recording test results
[WARNING] Attempt to (de-)serialize anonymous class hudson.maven.reporters.SurefireArchiver$2; see: https://jenkins.io/redirect/serialization-of-anonymous-classes/
[INFO] 
[INFO] --- maven-jar-plugin:2.4:jar (default-jar) @ geogig-api ---
[INFO] Building jar: /home/hudson/genie.geogig/.jenkins/jobs/geogig-1.2.x/workspace/src/api/target/geogig-api-1.2-SNAPSHOT.jar
[INFO] 
[INFO] --- maven-jar-plugin:2.4:test-jar (default) @ geogig-api ---
[INFO] Building jar: /home/hudson/genie.geogig/.jenkins/jobs/geogig-1.2.x/workspace/src/api/target/geogig-api-1.2-SNAPSHOT-tests.jar
[INFO] 
[INFO] >>> maven-source-plugin:2.2.1:jar (attach-sources) > generate-sources @ geogig-api >>>
[INFO] 
[INFO] --- git-commit-id-plugin:2.2.2:revision (default) @ geogig-api ---
[WARNING] Failed to getClass for org.apache.maven.plugin.source.SourceJarMojo
[INFO] 
[INFO] <<< maven-source-plugin:2.2.1:jar (attach-sources) < generate-sources @ geogig-api <<<
[INFO] 
[INFO] 
[INFO] --- maven-source-plugin:2.2.1:jar (attach-sources) @ geogig-api ---
[INFO] Building jar: /home/hudson/genie.geogig/.jenkins/jobs/geogig-1.2.x/workspace/src/api/target/geogig-api-1.2-SNAPSHOT-sources.jar
[INFO] 
[INFO] >>> maven-source-plugin:2.2.1:test-jar (attach-sources) > generate-sources @ geogig-api >>>
[INFO] 
[INFO] --- git-commit-id-plugin:2.2.2:revision (default) @ geogig-api ---
[WARNING] Failed to getClass for org.apache.maven.plugin.source.TestSourceJarMojo
[INFO] 
[INFO] <<< maven-source-plugin:2.2.1:test-jar (attach-sources) < generate-sources @ geogig-api <<<
[INFO] 
[INFO] 
[INFO] --- maven-source-plugin:2.2.1:test-jar (attach-sources) @ geogig-api ---
[INFO] Building jar: /home/hudson/genie.geogig/.jenkins/jobs/geogig-1.2.x/workspace/src/api/target/geogig-api-1.2-SNAPSHOT-test-sources.jar
[INFO] 
[INFO] --- maven-install-plugin:2.4:install (default-install) @ geogig-api ---
[INFO] Installing /home/hudson/genie.geogig/.jenkins/jobs/geogig-1.2.x/workspace/src/api/target/geogig-api-1.2-SNAPSHOT.jar to /home/hudson/genie.geogig/.jenkins/jobs/geogig-1.2.x/workspace/.repository/org/locationtech/geogig/geogig-api/1.2-SNAPSHOT/geogig-api-1.2-SNAPSHOT.jar
[INFO] Installing /home/hudson/genie.geogig/.jenkins/jobs/geogig-1.2.x/workspace/src/api/pom.xml to /home/hudson/genie.geogig/.jenkins/jobs/geogig-1.2.x/workspace/.repository/org/locationtech/geogig/geogig-api/1.2-SNAPSHOT/geogig-api-1.2-SNAPSHOT.pom
[INFO] Installing /home/hudson/genie.geogig/.jenkins/jobs/geogig-1.2.x/workspace/src/api/target/geogig-api-1.2-SNAPSHOT-tests.jar to /home/hudson/genie.geogig/.jenkins/jobs/geogig-1.2.x/workspace/.repository/org/locationtech/geogig/geogig-api/1.2-SNAPSHOT/geogig-api-1.2-SNAPSHOT-tests.jar
[INFO] Installing /home/hudson/genie.geogig/.jenkins/jobs/geogig-1.2.x/workspace/src/api/target/geogig-api-1.2-SNAPSHOT-sources.jar to /home/hudson/genie.geogig/.jenkins/jobs/geogig-1.2.x/workspace/.repository/org/locationtech/geogig/geogig-api/1.2-SNAPSHOT/geogig-api-1.2-SNAPSHOT-sources.jar
[INFO] Installing /home/hudson/genie.geogig/.jenkins/jobs/geogig-1.2.x/workspace/src/api/target/geogig-api-1.2-SNAPSHOT-test-sources.jar to /home/hudson/genie.geogig/.jenkins/jobs/geogig-1.2.x/workspace/.repository/org/locationtech/geogig/geogig-api/1.2-SNAPSHOT/geogig-api-1.2-SNAPSHOT-test-sources.jar
[JENKINS] Archiving disabled
Started calculate disk usage of build
Finished Calculation of disk usage of build in 0 seconds
Started calculate disk usage of workspace
Finished Calculation of disk usage of workspace in 0 seconds
[INFO] 
[INFO] ----------------< org.locationtech.geogig:geogig-core >-----------------
[INFO] Building GeoGig Core 1.2-SNAPSHOT                                 [3/17]
[INFO] --------------------------------[ jar ]---------------------------------
[INFO] 
[INFO] --- maven-clean-plugin:2.5:clean (default-clean) @ geogig-core ---
[INFO] Deleting /home/hudson/genie.geogig/.jenkins/jobs/geogig-1.2.x/workspace/src/core/target
[INFO] 
[INFO] --- git-commit-id-plugin:2.2.2:revision (default) @ geogig-core ---
[INFO] 
[INFO] --- maven-resources-plugin:2.6:resources (default-resources) @ geogig-core ---
[INFO] Using 'UTF-8' encoding to copy filtered resources.
[INFO] Copying 6 resources
[INFO] 
[INFO] --- maven-compiler-plugin:3.1:compile (default-compile) @ geogig-core ---
[INFO] Changes detected - recompiling the module!
[INFO] Compiling 291 source files to /home/hudson/genie.geogig/.jenkins/jobs/geogig-1.2.x/workspace/src/core/target/classes
[WARNING] /home/hudson/genie.geogig/.jenkins/jobs/geogig-1.2.x/workspace/src/core/src/main/java/org/locationtech/geogig/hooks/Scripting.java: Some input files use or override a deprecated API.
[WARNING] /home/hudson/genie.geogig/.jenkins/jobs/geogig-1.2.x/workspace/src/core/src/main/java/org/locationtech/geogig/hooks/Scripting.java: Recompile with -Xlint:deprecation for details.
[WARNING] /home/hudson/genie.geogig/.jenkins/jobs/geogig-1.2.x/workspace/src/core/src/main/java/org/locationtech/geogig/model/internal/NodeId.java: Some input files use unchecked or unsafe operations.
[WARNING] /home/hudson/genie.geogig/.jenkins/jobs/geogig-1.2.x/workspace/src/core/src/main/java/org/locationtech/geogig/model/internal/NodeId.java: Recompile with -Xlint:unchecked for details.
[INFO] 
[INFO] --- maven-resources-plugin:2.6:testResources (default-testResources) @ geogig-core ---
[INFO] Using 'UTF-8' encoding to copy filtered resources.
[INFO] Copying 3 resources
[INFO] 
[INFO] --- maven-compiler-plugin:3.1:testCompile (default-testCompile) @ geogig-core ---
[INFO] Changes detected - recompiling the module!
[INFO] Compiling 184 source files to /home/hudson/genie.geogig/.jenkins/jobs/geogig-1.2.x/workspace/src/core/target/test-classes
[WARNING] /home/hudson/genie.geogig/.jenkins/jobs/geogig-1.2.x/workspace/src/core/src/test/java/org/locationtech/geogig/model/internal/CanonicalClusteringStrategyTest.java: Some input files use or override a deprecated API.
[WARNING] /home/hudson/genie.geogig/.jenkins/jobs/geogig-1.2.x/workspace/src/core/src/test/java/org/locationtech/geogig/model/internal/CanonicalClusteringStrategyTest.java: Recompile with -Xlint:deprecation for details.
[WARNING] /home/hudson/genie.geogig/.jenkins/jobs/geogig-1.2.x/workspace/src/core/src/test/java/org/locationtech/geogig/data/retrieve/BackgroundingIteratorTest.java: Some input files use unchecked or unsafe operations.
[WARNING] /home/hudson/genie.geogig/.jenkins/jobs/geogig-1.2.x/workspace/src/core/src/test/java/org/locationtech/geogig/data/retrieve/BackgroundingIteratorTest.java: Recompile with -Xlint:unchecked for details.
[INFO] 
[INFO] --- maven-surefire-plugin:2.17:test (default-test) @ geogig-core ---
[INFO] Surefire report directory: /home/hudson/genie.geogig/.jenkins/jobs/geogig-1.2.x/workspace/src/core/target/surefire-reports

-------------------------------------------------------
 T E S T S
-------------------------------------------------------

-------------------------------------------------------
 T E S T S
-------------------------------------------------------
Picked up JAVA_TOOL_OPTIONS: -Xmx2G -Djava.io.tmpdir=/tmp/genie.geogig
Picked up JAVA_TOOL_OPTIONS: -Xmx2G -Djava.io.tmpdir=/tmp/genie.geogig
Picked up JAVA_TOOL_OPTIONS: -Xmx2G -Djava.io.tmpdir=/tmp/genie.geogig
Picked up JAVA_TOOL_OPTIONS: -Xmx2G -Djava.io.tmpdir=/tmp/genie.geogig
Picked up JAVA_TOOL_OPTIONS: -Xmx2G -Djava.io.tmpdir=/tmp/genie.geogig
Picked up JAVA_TOOL_OPTIONS: -Xmx2G -Djava.io.tmpdir=/tmp/genie.geogig
Picked up JAVA_TOOL_OPTIONS: -Xmx2G -Djava.io.tmpdir=/tmp/genie.geogig
Picked up JAVA_TOOL_OPTIONS: -Xmx2G -Djava.io.tmpdir=/tmp/genie.geogig
Picked up JAVA_TOOL_OPTIONS: -Xmx2G -Djava.io.tmpdir=/tmp/genie.geogig
Picked up JAVA_TOOL_OPTIONS: -Xmx2G -Djava.io.tmpdir=/tmp/genie.geogig
Picked up JAVA_TOOL_OPTIONS: -Xmx2G -Djava.io.tmpdir=/tmp/genie.geogig
Picked up JAVA_TOOL_OPTIONS: -Xmx2G -Djava.io.tmpdir=/tmp/genie.geogig
Picked up JAVA_TOOL_OPTIONS: -Xmx2G -Djava.io.tmpdir=/tmp/genie.geogig
Picked up JAVA_TOOL_OPTIONS: -Xmx2G -Djava.io.tmpdir=/tmp/genie.geogig
Picked up JAVA_TOOL_OPTIONS: -Xmx2G -Djava.io.tmpdir=/tmp/genie.geogig
Picked up JAVA_TOOL_OPTIONS: -Xmx2G -Djava.io.tmpdir=/tmp/genie.geogig
Picked up JAVA_TOOL_OPTIONS: -Xmx2G -Djava.io.tmpdir=/tmp/genie.geogig
Picked up JAVA_TOOL_OPTIONS: -Xmx2G -Djava.io.tmpdir=/tmp/genie.geogig
Picked up JAVA_TOOL_OPTIONS: -Xmx2G -Djava.io.tmpdir=/tmp/genie.geogig
Picked up JAVA_TOOL_OPTIONS: -Xmx2G -Djava.io.tmpdir=/tmp/genie.geogig
Picked up JAVA_TOOL_OPTIONS: -Xmx2G -Djava.io.tmpdir=/tmp/genie.geogig
Picked up JAVA_TOOL_OPTIONS: -Xmx2G -Djava.io.tmpdir=/tmp/genie.geogig
Picked up JAVA_TOOL_OPTIONS: -Xmx2G -Djava.io.tmpdir=/tmp/genie.geogig
Picked up JAVA_TOOL_OPTIONS: -Xmx2G -Djava.io.tmpdir=/tmp/genie.geogig
Running org.locationtech.geogig.model.impl.CommitBuilderTest
Running org.locationtech.geogig.model.impl.RevFeatureTypeTest
Running org.locationtech.geogig.model.impl.CanonicalTreeBuilderTest
Running org.locationtech.geogig.model.impl.QuadTreeBuilderExpandCollapseTest
Running org.locationtech.geogig.model.impl.RevCommitImplTest
Running org.locationtech.geogig.model.impl.LegacyTreeBuilderTest
Running org.locationtech.geogig.model.impl.RevFeatureTest
Running org.locationtech.geogig.model.impl.RevPersonTest
Running org.locationtech.geogig.model.internal.QuadTreeClusteringStrategy_putTest
Running org.locationtech.geogig.model.internal.CanonicalClusteringStrategyHeapStorageTest
Running org.locationtech.geogig.model.internal.CanonicalClusteringStrategyRocksdbStorageTest
Running org.locationtech.geogig.model.internal.QuadTreeClusteringStrategy_computeIdTest
Running org.locationtech.geogig.model.internal.DAGNodeTest
Running org.locationtech.geogig.model.internal.QuadTreeClusteringStrategyTest
Running org.locationtech.geogig.model.internal.NodeIdTest
Running org.locationtech.geogig.storage.memory.HeapRefDatabaseTest
Running org.locationtech.geogig.model.internal.QuadrantTest
Running org.locationtech.geogig.storage.memory.HeapObjectStoreConformanceTest
Running org.locationtech.geogig.storage.memory.HeapConfigDatabaseTest
Running org.locationtech.geogig.storage.memory.HeapBlobStoreTest
Running org.locationtech.geogig.storage.memory.HeapConflictsDatabaseConformanceTest
Running org.locationtech.geogig.storage.memory.HeapObjectDatabaseConformanceTest
Running org.locationtech.geogig.storage.memory.HeapGraphDatabaseTest
Running org.locationtech.geogig.storage.memory.HeapIndexDatabaseConformanceTest
Tests run: 1, Failures: 0, Errors: 0, Skipped: 0, Time elapsed: 0.263 sec - in org.locationtech.geogig.model.impl.QuadTreeBuilderExpandCollapseTest
Running org.locationtech.geogig.storage.datastream.v2_3.NodeSetTest
Tests run: 12, Failures: 0, Errors: 0, Skipped: 12, Time elapsed: 0.346 sec - in org.locationtech.geogig.model.internal.QuadTreeClusteringStrategyTest
Tests run: 3, Failures: 0, Errors: 0, Skipped: 0, Time elapsed: 0.397 sec - in org.locationtech.geogig.model.impl.RevPersonTest
Running org.locationtech.geogig.storage.datastream.v2_3.TailTest
Tests run: 1, Failures: 0, Errors: 0, Skipped: 0, Time elapsed: 0 sec - in org.locationtech.geogig.storage.datastream.v2_3.TailTest
Running org.locationtech.geogig.storage.datastream.v2_3.StringTableTest
Running org.locationtech.geogig.storage.datastream.v2_3.RevTreeFormatPrefTest
Tests run: 2, Failures: 0, Errors: 0, Skipped: 0, Time elapsed: 0.079 sec - in org.locationtech.geogig.storage.datastream.v2_3.StringTableTest
Running org.locationtech.geogig.storage.datastream.v2_3.RevTreeFormatTest
Tests run: 2, Failures: 0, Errors: 0, Skipped: 0, Time elapsed: 0.568 sec - in org.locationtech.geogig.model.impl.RevCommitImplTest
Running org.locationtech.geogig.storage.datastream.v2_3.DataStreamSerializationFactoryV2_3Test
[main] INFO org.locationtech.geogig.test.performance.EnablePerformanceTestRule - org.locationtech.geogig.storage.datastream.v2_3.RevTreeFormatPrefTest ignored, run with -Dgeogig.runPerformanceTests=true to enable it.
[main] INFO org.locationtech.geogig.test.performance.EnablePerformanceTestRule - org.locationtech.geogig.storage.datastream.v2_3.RevTreeFormatPrefTest ignored, run with -Dgeogig.runPerformanceTests=true to enable it.
[main] INFO org.locationtech.geogig.test.performance.EnablePerformanceTestRule - org.locationtech.geogig.storage.datastream.v2_3.RevTreeFormatPrefTest ignored, run with -Dgeogig.runPerformanceTests=true to enable it.
[main] INFO org.locationtech.geogig.test.performance.EnablePerformanceTestRule - org.locationtech.geogig.storage.datastream.v2_3.RevTreeFormatPrefTest ignored, run with -Dgeogig.runPerformanceTests=true to enable it.
[main] INFO org.locationtech.geogig.test.performance.EnablePerformanceTestRule - org.locationtech.geogig.storage.datastream.v2_3.RevTreeFormatPrefTest ignored, run with -Dgeogig.runPerformanceTests=true to enable it.
[main] INFO org.locationtech.geogig.test.performance.EnablePerformanceTestRule - org.locationtech.geogig.storage.datastream.v2_3.RevTreeFormatPrefTest ignored, run with -Dgeogig.runPerformanceTests=true to enable it.
Tests run: 6, Failures: 0, Errors: 0, Skipped: 0, Time elapsed: 0.161 sec - in org.locationtech.geogig.storage.datastream.v2_3.RevTreeFormatPrefTest
Running org.locationtech.geogig.storage.datastream.FloatPackedCoordinateSequenceTest
Tests run: 3, Failures: 0, Errors: 0, Skipped: 0, Time elapsed: 0.008 sec - in org.locationtech.geogig.storage.datastream.FloatPackedCoordinateSequenceTest
Running org.locationtech.geogig.storage.datastream.DataStreamSerializationFactoryV2Test
Tests run: 2, Failures: 0, Errors: 0, Skipped: 0, Time elapsed: 0.664 sec - in org.locationtech.geogig.model.impl.RevFeatureTest
Tests run: 9, Failures: 0, Errors: 0, Skipped: 0, Time elapsed: 0.577 sec - in org.locationtech.geogig.model.internal.QuadrantTest
Running org.locationtech.geogig.storage.datastream.VarintTest
Running org.locationtech.geogig.storage.datastream.Float32BoundsSerializationTest
Tests run: 6, Failures: 0, Errors: 0, Skipped: 0, Time elapsed: 0.759 sec - in org.locationtech.geogig.model.impl.CommitBuilderTest
Tests run: 2, Failures: 0, Errors: 0, Skipped: 0, Time elapsed: 0 sec - in org.locationtech.geogig.storage.datastream.Float32BoundsSerializationTest
Running org.locationtech.geogig.storage.datastream.LZFSerializationFactoryTest
Running org.locationtech.geogig.storage.datastream.DataStreamSerializationFactoryV1Test
Tests run: 4, Failures: 0, Errors: 0, Skipped: 0, Time elapsed: 0.068 sec - in org.locationtech.geogig.storage.datastream.VarintTest
Tests run: 3, Failures: 0, Errors: 0, Skipped: 0, Time elapsed: 0.674 sec - in org.locationtech.geogig.model.internal.NodeIdTest
Running org.locationtech.geogig.storage.datastream.FormatCommonV2_1Test
Running org.locationtech.geogig.storage.datastream.DataStreamSerializationFactoryV2_2Test
Tests run: 7, Failures: 0, Errors: 0, Skipped: 0, Time elapsed: 0.855 sec - in org.locationtech.geogig.storage.memory.HeapBlobStoreTest
Running org.locationtech.geogig.storage.datastream.LZ4SerializationFactoryTest
Tests run: 4, Failures: 0, Errors: 0, Skipped: 0, Time elapsed: 0.582 sec - in org.locationtech.geogig.storage.datastream.FormatCommonV2_1Test
Running org.locationtech.geogig.storage.datastream.DataStreamSerializationFactoryV2_1Test
Tests run: 8, Failures: 0, Errors: 0, Skipped: 0, Time elapsed: 1.291 sec - in org.locationtech.geogig.model.internal.QuadTreeClusteringStrategy_computeIdTest
Running org.locationtech.geogig.storage.impl.INIBlobTest
Tests run: 14, Failures: 0, Errors: 0, Skipped: 0, Time elapsed: 1.545 sec - in org.locationtech.geogig.storage.memory.HeapConflictsDatabaseConformanceTest
Running org.locationtech.geogig.storage.impl.PersistedIterableTest
Tests run: 4, Failures: 0, Errors: 0, Skipped: 0, Time elapsed: 1.911 sec - in org.locationtech.geogig.model.internal.DAGNodeTest
Running org.locationtech.geogig.storage.cache.SharedCacheTest
Tests run: 19, Failures: 0, Errors: 0, Skipped: 0, Time elapsed: 2.426 sec - in org.locationtech.geogig.storage.memory.HeapObjectStoreConformanceTest
Running org.locationtech.geogig.storage.cache.ObjectCacheTest
Tests run: 6, Failures: 0, Errors: 0, Skipped: 0, Time elapsed: 0.236 sec - in org.locationtech.geogig.storage.cache.ObjectCacheTest
Running org.locationtech.geogig.storage.cache.CacheManagerTest
Tests run: 2, Failures: 0, Errors: 0, Skipped: 0, Time elapsed: 1.171 sec - in org.locationtech.geogig.storage.impl.PersistedIterableTest
Running org.locationtech.geogig.storage.cache.KeyTest
Tests run: 2, Failures: 0, Errors: 0, Skipped: 0, Time elapsed: 0.001 sec - in org.locationtech.geogig.storage.cache.KeyTest
Running org.locationtech.geogig.storage.fs.FileBlobStoreTest
Removed 32,600 nodes in Tests run: 34, Failures: 0, Errors: 0, Skipped: 0, Time elapsed: 2.804 sec - in org.locationtech.geogig.storage.memory.HeapIndexDatabaseConformanceTest
Running org.locationtech.geogig.storage.fs.FileRefDatabaseTest
528.8 ms
[main] INFO org.locationtech.geogig.storage.cache.CacheManager - Registered GeoGig cache manager MBean as org.geogig:type=shared-cache
Tests run: 11, Failures: 0, Errors: 0, Skipped: 0, Time elapsed: 3.039 sec - in org.locationtech.geogig.storage.memory.HeapRefDatabaseTest
Running org.locationtech.geogig.storage.fs.IniFileConfigDatabaseTest
[main] INFO org.locationtech.geogig.storage.cache.CacheManager - Configuring GeoGig shared object cache maximum size to the default of 2,500 bytes as given by the default 0.250000 percent of available heap. Use the GEOGIG_CACHE_MAX_SIZE System property or environmentvariable to set a different maximum size at runtime
[main] INFO org.locationtech.geogig.storage.cache.CacheManager - Configuring GeoGig shared object cache maximum size to 1,025 bytes as given by the System property GEOGIG_CACHE_MAX_SIZE=1025
[main] WARN org.locationtech.geogig.storage.cache.CacheManager - cache size is too big: 1025, maximum allowed: 921
[main] INFO org.locationtech.geogig.storage.cache.CacheManager - Configuring GeoGig shared object cache maximum size to the default of 256 bytes as given by the default 0.250000 percent of available heap. Use the GEOGIG_CACHE_MAX_SIZE System property or environmentvariable to set a different maximum size at runtime
[main] INFO org.locationtech.geogig.storage.cache.CacheManager - Configuring GeoGig shared object cache maximum size to the default of 119,406,592 bytes as given by the default 0.250000 percent of available heap. Use the GEOGIG_CACHE_MAX_SIZE System property or environmentvariable to set a different maximum size at runtime
DAG[id:[], orig:EMPTY, status: CHANGED, size: 129, children: 0, buckets: 1)[children: {}, buckets: [[2]]]
 DAG[id:[2], orig:EMPTY, status: CHANGED, size: 129, children: 0, buckets: 2)[children: {}, buckets: [[2, 0], [2, 3]]]
  Tests run: 13, Failures: 0, Errors: 0, Skipped: 0, Time elapsed: 3.385 sec - in org.locationtech.geogig.storage.memory.HeapGraphDatabaseTest
DAG[id:[2, 0], orig:EMPTY, status: CHANGED, size: 90, children: 90, buckets: 0)[children: {node # 2=NodeId[node # 2, Env[2.0 : 2.0, 1.0 : 1.0]], node # 1=NodeId[node # 1, Env[1.0 : 1.0, 1.0 : 1.0]], node # 18=NodeId[node # 18, Env[18.0 : 18.0, 1.0 : 1.0]], node # 19=NodeId[node # 19, Env[19.0 : 19.0, 1.0 : 1.0]], node # 16=NodeId[node # 16, Env[16.0 : 16.0, 1.0 : 1.0]], node # 17=NodeId[node # 17, Env[17.0 : 17.0, 1.0 : 1.0]], node # 9=NodeId[node # 9, Env[9.0 : 9.0, 1.0 : 1.0]], node # 8=NodeId[node # 8, Env[8.0 : 8.0, 1.0 : 1.0]], node # 7=NodeId[node # 7, Env[7.0 : 7.0, 1.0 : 1.0]], node # 6=NodeId[node # 6, Env[6.0 : 6.0, 1.0 : 1.0]], node # 5=NodeId[node # 5, Env[5.0 : 5.0, 1.0 : 1.0]], node # 4=NodeId[node # 4, Env[4.0 : 4.0, 1.0 : 1.0]], node # 3=NodeId[node # 3, Env[3.0 : 3.0, 1.0 : 1.0]], node # 61=NodeId[node # 61, Env[61.0 : 61.0, 1.0 : 1.0]], node # 62=NodeId[node # 62, Env[62.0 : 62.0, 1.0 : 1.0]], node # 60=NodeId[node # 60, Env[60.0 : 60.0, 1.0 : 1.0]], node # 69=NodeId[node # 69, Env[69.0 : 69.0, 1.0 : 1.0]], node # 25=NodeId[node # 25, Env[25.0 : 25.0, 1.0 : 1.0]], node # 26=NodeId[node # 26, Env[26.0 : 26.0, 1.0 : 1.0]], node # 67=NodeId[node # 67, Env[67.0 : 67.0, 1.0 : 1.0]], node # 23=NodeId[node # 23, Env[23.0 : 23.0, 1.0 : 1.0]], node # 68=NodeId[node # 68, Env[68.0 : 68.0, 1.0 : 1.0]], node # 24=NodeId[node # 24, Env[24.0 : 24.0, 1.0 : 1.0]], node # 65=NodeId[node # 65, Env[65.0 : 65.0, 1.0 : 1.0]], node # 21=NodeId[node # 21, Env[21.0 : 21.0, 1.0 : 1.0]], node # 66=NodeId[node # 66, Env[66.0 : 66.0, 1.0 : 1.0]], node # 22=NodeId[node # 22, Env[22.0 : 22.0, 1.0 : 1.0]], node # 63=NodeId[node # 63, Env[63.0 : 63.0, 1.0 : 1.0]], node # 64=NodeId[node # 64, Env[64.0 : 64.0, 1.0 : 1.0]], node # 20=NodeId[node # 20, Env[20.0 : 20.0, 1.0 : 1.0]], node # 49=NodeId[node # 49, Env[49.0 : 49.0, 1.0 : 1.0]], node # 50=NodeId[node # 50, Env[50.0 : 50.0, 1.0 : 1.0]], node # 51=NodeId[node # 51, Env[51.0 : 51.0, 1.0 : 1.0]], node # 90=NodeId[node # 90, Env[90.0 : 90.0, 1.0 : 1.0]], node # 58=NodeId[node # 58, Env[58.0 : 58.0, 1.0 : 1.0]], node # 14=NodeId[node # 14, Env[14.0 : 14.0, 1.0 : 1.0]], node # 59=NodeId[node # 59, Env[59.0 : 59.0, 1.0 : 1.0]], node # 15=NodeId[node # 15, Env[15.0 : 15.0, 1.0 : 1.0]], node # 56=NodeId[node # 56, Env[56.0 : 56.0, 1.0 : 1.0]], node # 12=NodeId[node # 12, Env[12.0 : 12.0, 1.0 : 1.0]], node # 57=NodeId[node # 57, Env[57.0 : 57.0, 1.0 : 1.0]], node # 13=NodeId[node # 13, Env[13.0 : 13.0, 1.0 : 1.0]], node # 54=NodeId[node # 54, Env[54.0 : 54.0, 1.0 : 1.0]], node # 10=NodeId[node # 10, Env[10.0 : 10.0, 1.0 : 1.0]], node # 55=NodeId[node # 55, Env[55.0 : 55.0, 1.0 : 1.0]], node # 11=NodeId[node # 11, Env[11.0 : 11.0, 1.0 : 1.0]], node # 52=NodeId[node # 52, Env[52.0 : 52.0, 1.0 : 1.0]], node # 53=NodeId[node # 53, Env[53.0 : 53.0, 1.0 : 1.0]], node # 38=NodeId[node # 38, Env[38.0 : 38.0, 1.0 : 1.0]], node # 39=NodeId[node # 39, Env[39.0 : 39.0, 1.0 : 1.0]], node # 83=NodeId[node # 83, Env[83.0 : 83.0, 1.0 : 1.0]], node # 84=NodeId[node # 84, Env[84.0 : 84.0, 1.0 : 1.0]], node # 40=NodeId[node # 40, Env[40.0 : 40.0, 1.0 : 1.0]], node # 81=NodeId[node # 81, Env[81.0 : 81.0, 1.0 : 1.0]], node # 82=NodeId[node # 82, Env[82.0 : 82.0, 1.0 : 1.0]], node # 80=NodeId[node # 80, Env[80.0 : 80.0, 1.0 : 1.0]], node # 47=NodeId[node # 47, Env[47.0 : 47.0, 1.0 : 1.0]], node # 48=NodeId[node # 48, Env[48.0 : 48.0, 1.0 : 1.0]], node # 89=NodeId[node # 89, Env[89.0 : 89.0, 1.0 : 1.0]], node # 45=NodeId[node # 45, Env[45.0 : 45.0, 1.0 : 1.0]], node # 46=NodeId[node # 46, Env[46.0 : 46.0, 1.0 : 1.0]], node # 87=NodeId[node # 87, Env[87.0 : 87.0, 1.0 : 1.0]], node # 43=NodeId[node # 43, Env[43.0 : 43.0, 1.0 : 1.0]], node # 88=NodeId[node # 88, Env[88.0 : 88.0, 1.0 : 1.0]], node # 44=NodeId[node # 44, Env[44.0 : 44.0, 1.0 : 1.0]], node # 85=NodeId[node # 85, Env[85.0 : 85.0, 1.0 : 1.0]], node # 41=NodeId[node # 41, Env[41.0 : 41.0, 1.0 : 1.0]], node # 86=NodeId[node # 86, Env[86.0 : 86.0, 1.0 : 1.0]], node # 42=NodeId[node # 42, Env[42.0 : 42.0, 1.0 : 1.0]], node # 29=NodeId[node # 29, Env[29.0 : 29.0, 1.0 : 1.0]], node # 27=NodeId[node # 27, Env[27.0 : 27.0, 1.0 : 1.0]], node # 28=NodeId[node # 28, Env[28.0 : 28.0, 1.0 : 1.0]], node # 72=NodeId[node # 72, Env[72.0 : 72.0, 1.0 : 1.0]], node # 73=NodeId[node # 73, Env[73.0 : 73.0, 1.0 : 1.0]], node # 70=NodeId[node # 70, Env[70.0 : 70.0, 1.0 : 1.0]], node # 71=NodeId[node # 71, Env[71.0 : 71.0, 1.0 : 1.0]], node # 36=NodeId[node # 36, Env[36.0 : 36.0, 1.0 : 1.0]], node # 37=NodeId[node # 37, Env[37.0 : 37.0, 1.0 : 1.0]], node # 78=NodeId[node # 78, Env[78.0 : 78.0, 1.0 : 1.0]], node # 34=NodeId[node # 34, Env[34.0 : 34.0, 1.0 : 1.0]], node # 79=NodeId[node # 79, Env[79.0 : 79.0, 1.0 : 1.0]], node # 35=NodeId[node # 35, Env[35.0 : 35.0, 1.0 : 1.0]], node # 76=NodeId[node # 76, Env[76.0 : 76.0, 1.0 : 1.0]], node # 32=NodeId[node # 32, Env[32.0 : 32.0, 1.0 : 1.0]], node # 77=NodeId[node # 77, Env[77.0 : 77.0, 1.0 : 1.0]], node # 33=NodeId[node # 33, Env[33.0 : 33.0, 1.0 : 1.0]], node # 74=NodeId[node # 74, Env[74.0 : 74.0, 1.0 : 1.0]], node # 30=NodeId[node # 30, Env[30.0 : 30.0, 1.0 : 1.0]], node # 75=NodeId[node # 75, Env[75.0 : 75.0, 1.0 : 1.0]], node # 31=NodeId[node # 31, Env[31.0 : 31.0, 1.0 : 1.0]]}, buckets: []]
  Running org.locationtech.geogig.storage.StorageTypeTest
Tests run: 4, Failures: 0, Errors: 0, Skipped: 0, Time elapsed: 0 sec - in org.locationtech.geogig.storage.StorageTypeTest
DAG[id:[2, 3], orig:EMPTY, status: CHANGED, size: 39, children: 39, buckets: 0)[children: {node # 107=NodeId[node # 107, Env[107.0 : 107.0, 1.0 : 1.0]], node # 129=NodeId[node # 129, Env[129.0 : 129.0, 1.0 : 1.0]], node # 106=NodeId[node # 106, Env[106.0 : 106.0, 1.0 : 1.0]], node # 128=NodeId[node # 128, Env[128.0 : 128.0, 1.0 : 1.0]], node # 109=NodeId[node # 109, Env[109.0 : 109.0, 1.0 : 1.0]], node # 108=NodeId[node # 108, Env[108.0 : 108.0, 1.0 : 1.0]], node # 103=NodeId[node # 103, Env[103.0 : 103.0, 1.0 : 1.0]], node # 125=NodeId[node # 125, Env[125.0 : 125.0, 1.0 : 1.0]], node # 102=NodeId[node # 102, Env[102.0 : 102.0, 1.0 : 1.0]], node # 124=NodeId[node # 124, Env[124.0 : 124.0, 1.0 : 1.0]], node # 105=NodeId[node # 105, Env[105.0 : 105.0, 1.0 : 1.0]], node # 127=NodeId[node # 127, Env[127.0 : 127.0, 1.0 : 1.0]], node # 104=NodeId[node # 104, Env[104.0 : 104.0, 1.0 : 1.0]], node # 126=NodeId[node # 126, Env[126.0 : 126.0, 1.0 : 1.0]], node # 121=NodeId[node # 121, Env[121.0 : 121.0, 1.0 : 1.0]], node # 120=NodeId[node # 120, Env[120.0 : 120.0, 1.0 : 1.0]], node # 101=NodeId[node # 101, Env[101.0 : 101.0, 1.0 : 1.0]], node # 123=NodeId[node # 123, Env[123.0 : 123.0, 1.0 : 1.0]], node # 100=NodeId[node # 100, Env[100.0 : 100.0, 1.0 : 1.0]], node # 122=NodeId[node # 122, Env[122.0 : 122.0, 1.0 : 1.0]], node # 118=NodeId[node # 118, Env[118.0 : 118.0, 1.0 : 1.0]], node # 117=NodeId[node # 117, Env[117.0 : 117.0, 1.0 : 1.0]], node # 119=NodeId[node # 119, Env[119.0 : 119.0, 1.0 : 1.0]], node # 114=NodeId[node # 114, Env[114.0 : 114.0, 1.0 : 1.0]], node # 113=NodeId[node # 113, Env[113.0 : 113.0, 1.0 : 1.0]], node # 116=NodeId[node # 116, Env[116.0 : 116.0, 1.0 : 1.0]], node # 115=NodeId[node # 115, Env[115.0 : 115.0, 1.0 : 1.0]], node # 110=NodeId[node # 110, Env[110.0 : 110.0, 1.0 : 1.0]], node # 112=NodeId[node # 112, Env[112.0 : 112.0, 1.0 : 1.0]], node # 111=NodeId[node # 111, Env[111.0 : 111.0, 1.0 : 1.0]], node # 94=NodeId[node # 94, Env[94.0 : 94.0, 1.0 : 1.0]], node # 95=NodeId[node # 95, Env[95.0 : 95.0, 1.0 : 1.0]], node # 92=NodeId[node # 92, Env[92.0 : 92.0, 1.0 : 1.0]], node # 93=NodeId[node # 93, Env[93.0 : 93.0, 1.0 : 1.0]], node # 91=NodeId[node # 91, Env[91.0 : 91.0, 1.0 : 1.0]], node # 98=NodeId[node # 98, Env[98.0 : 98.0, 1.0 : 1.0]], node # 99=NodeId[node # 99, Env[99.0 : 99.0, 1.0 : 1.0]], node # 96=NodeId[node # 96, Env[96.0 : 96.0, 1.0 : 1.0]], node # 97=NodeId[node # 97, Env[97.0 : 97.0, 1.0 : 1.0]]}, buckets: []]
Running org.locationtech.geogig.storage.text.TextSerializationFactoryTest
[main] INFO org.locationtech.geogig.storage.cache.CacheManager - Configuring GeoGig shared object cache maximum size to 1,048,576 bytes as given by the System property GEOGIG_CACHE_MAX_SIZE=1M
[main] INFO org.locationtech.geogig.storage.cache.CacheManager - Configuring GeoGig shared object cache maximum size to 102,400 bytes as given by the System property GEOGIG_CACHE_MAX_SIZE=100K
[main] INFO org.locationtech.geogig.storage.cache.CacheManager - Configuring GeoGig shared object cache maximum size to 5,000 bytes as given by the System property GEOGIG_CACHE_MAX_SIZE=0.5
Added 7,000 nodes in 148.7 ms
[main] WARN org.locationtech.geogig.storage.cache.CacheManager - Unable to parse System property GEOGIG_CACHE_MAX_SIZE=-1G. Falling back to default value
java.lang.IllegalArgumentException: Value must be a positive number or zero
	at com.google.common.base.Preconditions.checkArgument(Preconditions.java:122)
	at org.locationtech.geogig.storage.cache.CacheManager.parseCacheSizeArgument(CacheManager.java:257)
	at org.locationtech.geogig.storage.cache.CacheManagerTest.assertDefaultMaxSizeDefaultValue(CacheManagerTest.java:188)
	at org.locationtech.geogig.storage.cache.CacheManagerTest.resolveDefaultMaxSizeSystemPropertyInvalidValue(CacheManagerTest.java:207)
	at sun.reflect.NativeMethodAccessorImpl.invoke0(Native Method)
	at sun.reflect.NativeMethodAccessorImpl.invoke(NativeMethodAccessorImpl.java:62)
	at sun.reflect.DelegatingMethodAccessorImpl.invoke(DelegatingMethodAccessorImpl.java:43)
	at java.lang.reflect.Method.invoke(Method.java:498)
	at org.junit.runners.model.FrameworkMethod$1.runReflectiveCall(FrameworkMethod.java:50)
	at org.junit.internal.runners.model.ReflectiveCallable.run(ReflectiveCallable.java:12)
	at org.junit.runners.model.FrameworkMethod.invokeExplosively(FrameworkMethod.java:47)
	at org.junit.internal.runners.statements.InvokeMethod.evaluate(InvokeMethod.java:17)
	at org.junit.internal.runners.statements.RunBefores.evaluate(RunBefores.java:26)
	at org.junit.internal.runners.statements.RunAfters.evaluate(RunAfters.java:27)
	at org.junit.rules.ExpectedException$ExpectedExceptionStatement.evaluate(ExpectedException.java:239)
	at org.junit.rules.RunRules.evaluate(RunRules.java:20)
	at org.junit.runners.ParentRunner.runLeaf(ParentRunner.java:325)
	at org.junit.runners.BlockJUnit4ClassRunner.runChild(BlockJUnit4ClassRunner.java:78)
	at org.junit.runners.BlockJUnit4ClassRunner.runChild(BlockJUnit4ClassRunner.java:57)
	at org.junit.runners.ParentRunner$3.run(ParentRunner.java:290)
	at org.junit.runners.ParentRunner$1.schedule(ParentRunner.java:71)
	at org.junit.runners.ParentRunner.runChildren(ParentRunner.java:288)
	at org.junit.runners.ParentRunner.access$000(ParentRunner.java:58)
	at org.junit.runners.ParentRunner$2.evaluate(ParentRunner.java:268)
	at org.junit.runners.ParentRunner.run(ParentRunner.java:363)
	at org.apache.maven.surefire.junit4.JUnit4Provider.execute(JUnit4Provider.java:264)
	at org.apache.maven.surefire.junit4.JUnit4Provider.executeTestSet(JUnit4Provider.java:153)
	at org.apache.maven.surefire.junit4.JUnit4Provider.invoke(JUnit4Provider.java:124)
	at org.apache.maven.surefire.booter.ForkedBooter.invokeProviderInSameClassLoader(ForkedBooter.java:200)
	at org.apache.maven.surefire.booter.ForkedBooter.runSuitesInProcess(ForkedBooter.java:153)
	at org.apache.maven.surefire.booter.ForkedBooter.main(ForkedBooter.java:103)
[main] INFO org.locationtech.geogig.storage.cache.CacheManager - Configuring GeoGig shared object cache maximum size to the default of 2,500 bytes as given by the default 0.250000 percent of available heap. Use the GEOGIG_CACHE_MAX_SIZE System property or environmentvariable to set a different maximum size at runtime
Tests run: 7, Failures: 0, Errors: 0, Skipped: 0, Time elapsed: 1.133 sec - in org.locationtech.geogig.storage.fs.FileBlobStoreTest
[main] WARN org.locationtech.geogig.storage.cache.CacheManager - Unable to parse System property GEOGIG_CACHE_MAX_SIZE=. Falling back to default value
java.lang.IllegalArgumentException: Invalid format (), expected <float>[B|K|M|G]
	at org.locationtech.geogig.storage.cache.CacheManager.parseCacheSizeArgument(CacheManager.java:269)
	at org.locationtech.geogig.storage.cache.CacheManagerTest.getDefaultSizeMB(CacheManagerTest.java:270)
	at sun.reflect.NativeMethodAccessorImpl.invoke0(Native Method)
	at sun.reflect.NativeMethodAccessorImpl.invoke(NativeMethodAccessorImpl.java:62)
	at sun.reflect.DelegatingMethodAccessorImpl.invoke(DelegatingMethodAccessorImpl.java:43)
	at java.lang.reflect.Method.invoke(Method.java:498)
	at org.junit.runners.model.FrameworkMethod$1.runReflectiveCall(FrameworkMethod.java:50)
	at org.junit.internal.runners.model.ReflectiveCallable.run(ReflectiveCallable.java:12)
	at org.junit.runners.model.FrameworkMethod.invokeExplosively(FrameworkMethod.java:47)
	at org.junit.internal.runners.statements.InvokeMethod.evaluate(InvokeMethod.java:17)
	at org.junit.internal.runners.statements.RunBefores.evaluate(RunBefores.java:26)
	at org.junit.internal.runners.statements.RunAfters.evaluate(RunAfters.java:27)
	at org.junit.rules.ExpectedException$ExpectedExceptionStatement.evaluate(ExpectedException.java:239)
	at org.junit.rules.RunRules.evaluate(RunRules.java:20)
	at org.junit.runners.ParentRunner.runLeaf(ParentRunner.java:325)
	at org.junit.runners.BlockJUnit4ClassRunner.runChild(BlockJUnit4ClassRunner.java:78)
	at org.junit.runners.BlockJUnit4ClassRunner.runChild(BlockJUnit4ClassRunner.java:57)
	at org.junit.runners.ParentRunner$3.run(ParentRunner.java:290)
	at org.junit.runners.ParentRunner$1.schedule(ParentRunner.java:71)
	at org.junit.runners.ParentRunner.runChildren(ParentRunner.java:288)
	at org.junit.runners.ParentRunner.access$000(ParentRunner.java:58)
	at org.junit.runners.ParentRunner$2.evaluate(ParentRunner.java:268)
	at org.junit.runners.ParentRunner.run(ParentRunner.java:363)
	at org.apache.maven.surefire.junit4.JUnit4Provider.execute(JUnit4Provider.java:264)
	at org.apache.maven.surefire.junit4.JUnit4Provider.executeTestSet(JUnit4Provider.java:153)
	at org.apache.maven.surefire.junit4.JUnit4Provider.invoke(JUnit4Provider.java:124)
	at org.apache.maven.surefire.booter.ForkedBooter.invokeProviderInSameClassLoader(ForkedBooter.java:200)
	at org.apache.maven.surefire.booter.ForkedBooter.runSuitesInProcess(ForkedBooter.java:153)
	at org.apache.maven.surefire.booter.ForkedBooter.main(ForkedBooter.java:103)
[main] WARN org.locationtech.geogig.storage.cache.CacheManager - Unable to parse environment variable GEOGIG_CACHE_MAX_SIZE=
java.lang.IllegalArgumentException: Invalid format (), expected <float>[B|K|M|G]
	at org.locationtech.geogig.storage.cache.CacheManager.parseCacheSizeArgument(CacheManager.java:269)
	at org.locationtech.geogig.storage.cache.CacheManagerTest.getDefaultSizeMB(CacheManagerTest.java:270)
	at sun.reflect.NativeMethodAccessorImpl.invoke0(Native Method)
	at sun.reflect.NativeMethodAccessorImpl.invoke(NativeMethodAccessorImpl.java:62)
	at sun.reflect.DelegatingMethodAccessorImpl.invoke(DelegatingMethodAccessorImpl.java:43)
	at java.lang.reflect.Method.invoke(Method.java:498)
	at org.junit.runners.model.FrameworkMethod$1.runReflectiveCall(FrameworkMethod.java:50)
	at org.junit.internal.runners.model.ReflectiveCallable.run(ReflectiveCallable.java:12)
	at org.junit.runners.model.FrameworkMethod.invokeExplosively(FrameworkMethod.java:47)
	at org.junit.internal.runners.statements.InvokeMethod.evaluate(InvokeMethod.java:17)
	at org.junit.internal.runners.statements.RunBefores.evaluate(RunBefores.java:26)
	at org.junit.internal.runners.statements.RunAfters.evaluate(RunAfters.java:27)
	at org.junit.rules.ExpectedException$ExpectedExceptionStatement.evaluate(ExpectedException.java:239)
	at org.junit.rules.RunRules.evaluate(RunRules.java:20)
	at org.junit.runners.ParentRunner.runLeaf(ParentRunner.java:325)
	at org.junit.runners.BlockJUnit4ClassRunner.runChild(BlockJUnit4ClassRunner.java:78)
	at org.junit.runners.BlockJUnit4ClassRunner.runChild(BlockJUnit4ClassRunner.java:57)
	at org.junit.runners.ParentRunner$3.run(ParentRunner.java:290)
	at org.junit.runners.ParentRunner$1.schedule(ParentRunner.java:71)
	at org.junit.runners.ParentRunner.runChildren(ParentRunner.java:288)
	at org.junit.runners.ParentRunner.access$000(ParentRunner.java:58)
	at org.junit.runners.ParentRunner$2.evaluate(ParentRunner.java:268)
	at org.junit.runners.ParentRunner.run(ParentRunner.java:363)
	at org.apache.maven.surefire.junit4.JUnit4Provider.execute(JUnit4Provider.java:264)
	at org.apache.maven.surefire.junit4.JUnit4Provider.executeTestSet(JUnit4Provider.java:153)
	at org.apache.maven.surefire.junit4.JUnit4Provider.invoke(JUnit4Provider.java:124)
	at org.apache.maven.surefire.booter.ForkedBooter.invokeProviderInSameClassLoader(ForkedBooter.java:200)
	at org.apache.maven.surefire.booter.ForkedBooter.runSuitesInProcess(ForkedBooter.java:153)
	at org.apache.maven.surefire.booter.ForkedBooter.main(ForkedBooter.java:103)
[main] INFO org.locationtech.geogig.storage.cache.CacheManager - Configuring GeoGig shared object cache maximum size to the default of 2,621,440 bytes as given by the default 0.250000 percent of available heap. Use the GEOGIG_CACHE_MAX_SIZE System property or environmentvariable to set a different maximum size at runtime
[main] WARN org.locationtech.geogig.storage.cache.CacheManager - Unable to parse System property GEOGIG_CACHE_MAX_SIZE=-1G. Falling back to environment variable
java.lang.IllegalArgumentException: Value must be a positive number or zero
	at com.google.common.base.Preconditions.checkArgument(Preconditions.java:122)
	at org.locationtech.geogig.storage.cache.CacheManager.parseCacheSizeArgument(CacheManager.java:257)
	at org.locationtech.geogig.storage.cache.CacheManagerTest.resolveDefaultMaxSizeInvalidSysPropFallsBackToEnvVariable(CacheManagerTest.java:235)
	at sun.reflect.NativeMethodAccessorImpl.invoke0(Native Method)
	at sun.reflect.NativeMethodAccessorImpl.invoke(NativeMethodAccessorImpl.java:62)
	at sun.reflect.DelegatingMethodAccessorImpl.invoke(DelegatingMethodAccessorImpl.java:43)
Running org.locationtech.geogig.test.integration.repository.IndexTest
	at java.lang.reflect.Method.invoke(Method.java:498)
	at org.junit.runners.model.FrameworkMethod$1.runReflectiveCall(FrameworkMethod.java:50)
	at org.junit.internal.runners.model.ReflectiveCallable.run(ReflectiveCallable.java:12)
	at org.junit.runners.model.FrameworkMethod.invokeExplosively(FrameworkMethod.java:47)
	at org.junit.internal.runners.statements.InvokeMethod.evaluate(InvokeMethod.java:17)
	at org.junit.internal.runners.statements.RunBefores.evaluate(RunBefores.java:26)
	at org.junit.internal.runners.statements.RunAfters.evaluate(RunAfters.java:27)
	at org.junit.rules.ExpectedException$ExpectedExceptionStatement.evaluate(ExpectedException.java:239)
	at org.junit.rules.RunRules.evaluate(RunRules.java:20)
	at org.junit.runners.ParentRunner.runLeaf(ParentRunner.java:325)
	at org.junit.runners.BlockJUnit4ClassRunner.runChild(BlockJUnit4ClassRunner.java:78)
	at org.junit.runners.BlockJUnit4ClassRunner.runChild(BlockJUnit4ClassRunner.java:57)
	at org.junit.runners.ParentRunner$3.run(ParentRunner.java:290)
	at org.junit.runners.ParentRunner$1.schedule(ParentRunner.java:71)
	at org.junit.runners.ParentRunner.runChildren(ParentRunner.java:288)
	at org.junit.runners.ParentRunner.access$000(ParentRunner.java:58)
	at org.junit.runners.ParentRunner$2.evaluate(ParentRunner.java:268)
	at org.junit.runners.ParentRunner.run(ParentRunner.java:363)
	at org.apache.maven.surefire.junit4.JUnit4Provider.execute(JUnit4Provider.java:264)
	at org.apache.maven.surefire.junit4.JUnit4Provider.executeTestSet(JUnit4Provider.java:153)
	at org.apache.maven.surefire.junit4.JUnit4Provider.invoke(JUnit4Provider.java:124)
	at org.apache.maven.surefire.booter.ForkedBooter.invokeProviderInSameClassLoader(ForkedBooter.java:200)
	at org.apache.maven.surefire.booter.ForkedBooter.runSuitesInProcess(ForkedBooter.java:153)
	at org.apache.maven.surefire.booter.ForkedBooter.main(ForkedBooter.java:103)
[main] INFO org.locationtech.geogig.storage.cache.CacheManager - Configuring GeoGig shared object cache maximum size to 1,024 bytes as given by the environment variable GEOGIG_CACHE_MAX_SIZE=1024
[main] WARN org.locationtech.geogig.storage.cache.CacheManager - Unable to parse System property GEOGIG_CACHE_MAX_SIZE=. Falling back to environment variable
java.lang.IllegalArgumentException: Invalid format (), expected <float>[B|K|M|G]
	at org.locationtech.geogig.storage.cache.CacheManager.parseCacheSizeArgument(CacheManager.java:269)
	at org.locationtech.geogig.storage.cache.CacheManagerTest.resolveDefaultMaxSizeEnvironmantVariable(CacheManagerTest.java:214)
	at sun.reflect.NativeMethodAccessorImpl.invoke0(Native Method)
	at sun.reflect.NativeMethodAccessorImpl.invoke(NativeMethodAccessorImpl.java:62)
	at sun.reflect.DelegatingMethodAccessorImpl.invoke(DelegatingMethodAccessorImpl.java:43)
	at java.lang.reflect.Method.invoke(Method.java:498)
	at org.junit.runners.model.FrameworkMethod$1.runReflectiveCall(FrameworkMethod.java:50)
	at org.junit.internal.runners.model.ReflectiveCallable.run(ReflectiveCallable.java:12)
	at org.junit.runners.model.FrameworkMethod.invokeExplosively(FrameworkMethod.java:47)
	at org.junit.internal.runners.statements.InvokeMethod.evaluate(InvokeMethod.java:17)
	at org.junit.internal.runners.statements.RunBefores.evaluate(RunBefores.java:26)
	at org.junit.internal.runners.statements.RunAfters.evaluate(RunAfters.java:27)
	at org.junit.rules.ExpectedException$ExpectedExceptionStatement.evaluate(ExpectedException.java:239)
	at org.junit.rules.RunRules.evaluate(RunRules.java:20)
	at org.junit.runners.ParentRunner.runLeaf(ParentRunner.java:325)
	at org.junit.runners.BlockJUnit4ClassRunner.runChild(BlockJUnit4ClassRunner.java:78)
	at org.junit.runners.BlockJUnit4ClassRunner.runChild(BlockJUnit4ClassRunner.java:57)
	at org.junit.runners.ParentRunner$3.run(ParentRunner.java:290)
	at org.junit.runners.ParentRunner$1.schedule(ParentRunner.java:71)
	at org.junit.runners.ParentRunner.runChildren(ParentRunner.java:288)
	at org.junit.runners.ParentRunner.access$000(ParentRunner.java:58)
	at org.junit.runners.ParentRunner$2.evaluate(ParentRunner.java:268)
	at org.junit.runners.ParentRunner.run(ParentRunner.java:363)
	at org.apache.maven.surefire.junit4.JUnit4Provider.execute(JUnit4Provider.java:264)
	at org.apache.maven.surefire.junit4.JUnit4Provider.executeTestSet(JUnit4Provider.java:153)
	at org.apache.maven.surefire.junit4.JUnit4Provider.invoke(JUnit4Provider.java:124)
	at org.apache.maven.surefire.booter.ForkedBooter.invokeProviderInSameClassLoader(ForkedBooter.java:200)
	at org.apache.maven.surefire.booter.ForkedBooter.runSuitesInProcess(ForkedBooter.java:153)
	at org.apache.maven.surefire.booter.ForkedBooter.main(ForkedBooter.java:103)
[main] INFO org.locationtech.geogig.storage.cache.CacheManager - Configuring GeoGig shared object cache maximum size to 1,048,576 bytes as given by the environment variable GEOGIG_CACHE_MAX_SIZE=1M
[main] WARN org.locationtech.geogig.storage.cache.CacheManager - Unable to parse System property GEOGIG_CACHE_MAX_SIZE=. Falling back to environment variable
java.lang.IllegalArgumentException: Invalid format (), expected <float>[B|K|M|G]
	at org.locationtech.geogig.storage.cache.CacheManager.parseCacheSizeArgument(CacheManager.java:269)
	at org.locationtech.geogig.storage.cache.CacheManagerTest.resolveDefaultMaxSizeEnvironmantVariable(CacheManagerTest.java:217)
	at sun.reflect.NativeMethodAccessorImpl.invoke0(Native Method)
	at sun.reflect.NativeMethodAccessorImpl.invoke(NativeMethodAccessorImpl.java:62)
	at sun.reflect.DelegatingMethodAccessorImpl.invoke(DelegatingMethodAccessorImpl.java:43)
	at java.lang.reflect.Method.invoke(Method.java:498)
	at org.junit.runners.model.FrameworkMethod$1.runReflectiveCall(FrameworkMethod.java:50)
	at org.junit.internal.runners.model.ReflectiveCallable.run(ReflectiveCallable.java:12)
	at org.junit.runners.model.FrameworkMethod.invokeExplosively(FrameworkMethod.java:47)
	at org.junit.internal.runners.statements.InvokeMethod.evaluate(InvokeMethod.java:17)
	at org.junit.internal.runners.statements.RunBefores.evaluate(RunBefores.java:26)
	at org.junit.internal.runners.statements.RunAfters.evaluate(RunAfters.java:27)
	at org.junit.rules.ExpectedException$ExpectedExceptionStatement.evaluate(ExpectedException.java:239)
	at org.junit.rules.RunRules.evaluate(RunRules.java:20)
	at org.junit.runners.ParentRunner.runLeaf(ParentRunner.java:325)
	at org.junit.runners.BlockJUnit4ClassRunner.runChild(BlockJUnit4ClassRunner.java:78)
	at org.junit.runners.BlockJUnit4ClassRunner.runChild(BlockJUnit4ClassRunner.java:57)
	at org.junit.runners.ParentRunner$3.run(ParentRunner.java:290)
	at org.junit.runners.ParentRunner$1.schedule(ParentRunner.java:71)
	at org.junit.runners.ParentRunner.runChildren(ParentRunner.java:288)
	at org.junit.runners.ParentRunner.access$000(ParentRunner.java:58)
	at org.junit.runners.ParentRunner$2.evaluate(ParentRunner.java:268)
	at org.junit.runners.ParentRunner.run(ParentRunner.java:363)
	at org.apache.maven.surefire.junit4.JUnit4Provider.execute(JUnit4Provider.java:264)
	at org.apache.maven.surefire.junit4.JUnit4Provider.executeTestSet(JUnit4Provider.java:153)
	at org.apache.maven.surefire.junit4.JUnit4Provider.invoke(JUnit4Provider.java:124)
	at org.apache.maven.surefire.booter.ForkedBooter.invokeProviderInSameClassLoader(ForkedBooter.java:200)
	at org.apache.maven.surefire.booter.ForkedBooter.runSuitesInProcess(ForkedBooter.java:153)
	at org.apache.maven.surefire.booter.ForkedBooter.main(ForkedBooter.java:103)
[main] INFO org.locationtech.geogig.storage.cache.CacheManager - Configuring GeoGig shared object cache maximum size to 102,400 bytes as given by the environment variable GEOGIG_CACHE_MAX_SIZE=100K
[main] WARN org.locationtech.geogig.storage.cache.CacheManager - Unable to parse System property GEOGIG_CACHE_MAX_SIZE=. Falling back to environment variable
java.lang.IllegalArgumentException: Invalid format (), expected <float>[B|K|M|G]
	at org.locationtech.geogig.storage.cache.CacheManager.parseCacheSizeArgument(CacheManager.java:269)
	at org.locationtech.geogig.storage.cache.CacheManagerTest.resolveDefaultMaxSizeEnvironmantVariable(CacheManagerTest.java:223)
	at sun.reflect.NativeMethodAccessorImpl.invoke0(Native Method)
	at sun.reflect.NativeMethodAccessorImpl.invoke(NativeMethodAccessorImpl.java:62)
	at sun.reflect.DelegatingMethodAccessorImpl.invoke(DelegatingMethodAccessorImpl.java:43)
	at java.lang.reflect.Method.invoke(Method.java:498)
	at org.junit.runners.model.FrameworkMethod$1.runReflectiveCall(FrameworkMethod.java:50)
	at org.junit.internal.runners.model.ReflectiveCallable.run(ReflectiveCallable.java:12)
	at org.junit.runners.model.FrameworkMethod.invokeExplosively(FrameworkMethod.java:47)
	at org.junit.internal.runners.statements.InvokeMethod.evaluate(InvokeMethod.java:17)
	at org.junit.internal.runners.statements.RunBefores.evaluate(RunBefores.java:26)
	at org.junit.internal.runners.statements.RunAfters.evaluate(RunAfters.java:27)
	at org.junit.rules.ExpectedException$ExpectedExceptionStatement.evaluate(ExpectedException.java:239)
	at org.junit.rules.RunRules.evaluate(RunRules.java:20)
	at org.junit.runners.ParentRunner.runLeaf(ParentRunner.java:325)
	at org.junit.runners.BlockJUnit4ClassRunner.runChild(BlockJUnit4ClassRunner.java:78)
	at org.junit.runners.BlockJUnit4ClassRunner.runChild(BlockJUnit4ClassRunner.java:57)
	at org.junit.runners.ParentRunner$3.run(ParentRunner.java:290)
	at org.junit.runners.ParentRunner$1.schedule(ParentRunner.java:71)
	at org.junit.runners.ParentRunner.runChildren(ParentRunner.java:288)
	at org.junit.runners.ParentRunner.access$000(ParentRunner.java:58)
	at org.junit.runners.ParentRunner$2.evaluate(ParentRunner.java:268)
	at org.junit.runners.ParentRunner.run(ParentRunner.java:363)
	at org.apache.maven.surefire.junit4.JUnit4Provider.execute(JUnit4Provider.java:264)
	at org.apache.maven.surefire.junit4.JUnit4Provider.executeTestSet(JUnit4Provider.java:153)
	at org.apache.maven.surefire.junit4.JUnit4Provider.invoke(JUnit4Provider.java:124)
	at org.apache.maven.surefire.booter.ForkedBooter.invokeProviderInSameClassLoader(ForkedBooter.java:200)
	at org.apache.maven.surefire.booter.ForkedBooter.runSuitesInProcess(ForkedBooter.java:153)
	at org.apache.maven.surefire.booter.ForkedBooter.main(ForkedBooter.java:103)
[main] INFO org.locationtech.geogig.storage.cache.CacheManager - Configuring GeoGig shared object cache maximum size to 5,000 bytes as given by the environment variable GEOGIG_CACHE_MAX_SIZE=0.5
[main] WARN org.locationtech.geogig.storage.cache.CacheManager - Unable to parse System property GEOGIG_CACHE_MAX_SIZE=. Falling back to environment variable
java.lang.IllegalArgumentException: Invalid format (), expected <float>[B|K|M|G]
	at org.locationtech.geogig.storage.cache.CacheManager.parseCacheSizeArgument(CacheManager.java:269)
	at org.locationtech.geogig.storage.cache.CacheManagerTest.assertDefaultMaxSizeDefaultValue(CacheManagerTest.java:188)
	at org.locationtech.geogig.storage.cache.CacheManagerTest.resolveDefaultMaxSizeEnvironmantVariableInvalidValue(CacheManagerTest.java:229)
	at sun.reflect.NativeMethodAccessorImpl.invoke0(Native Method)
	at sun.reflect.NativeMethodAccessorImpl.invoke(NativeMethodAccessorImpl.java:62)
	at sun.reflect.DelegatingMethodAccessorImpl.invoke(DelegatingMethodAccessorImpl.java:43)
	at java.lang.reflect.Method.invoke(Method.java:498)
	at org.junit.runners.model.FrameworkMethod$1.runReflectiveCall(FrameworkMethod.java:50)
	at org.junit.internal.runners.model.ReflectiveCallable.run(ReflectiveCallable.java:12)
	at org.junit.runners.model.FrameworkMethod.invokeExplosively(FrameworkMethod.java:47)
	at org.junit.internal.runners.statements.InvokeMethod.evaluate(InvokeMethod.java:17)
	at org.junit.internal.runners.statements.RunBefores.evaluate(RunBefores.java:26)
	at org.junit.internal.runners.statements.RunAfters.evaluate(RunAfters.java:27)
	at org.junit.rules.ExpectedException$ExpectedExceptionStatement.evaluate(ExpectedException.java:239)
	at org.junit.rules.RunRules.evaluate(RunRules.java:20)
	at org.junit.runners.ParentRunner.runLeaf(ParentRunner.java:325)
	at org.junit.runners.BlockJUnit4ClassRunner.runChild(BlockJUnit4ClassRunner.java:78)
	at org.junit.runners.BlockJUnit4ClassRunner.runChild(BlockJUnit4ClassRunner.java:57)
	at org.junit.runners.ParentRunner$3.run(ParentRunner.java:290)
	at org.junit.runners.ParentRunner$1.schedule(ParentRunner.java:71)
	at org.junit.runners.ParentRunner.runChildren(ParentRunner.java:288)
	at org.junit.runners.ParentRunner.access$000(ParentRunner.java:58)
	at org.junit.runners.ParentRunner$2.evaluate(ParentRunner.java:268)
	at org.junit.runners.ParentRunner.run(ParentRunner.java:363)
	at org.apache.maven.surefire.junit4.JUnit4Provider.execute(JUnit4Provider.java:264)
	at org.apache.maven.surefire.junit4.JUnit4Provider.executeTestSet(JUnit4Provider.java:153)
	at org.apache.maven.surefire.junit4.JUnit4Provider.invoke(JUnit4Provider.java:124)
	at org.apache.maven.surefire.booter.ForkedBooter.invokeProviderInSameClassLoader(ForkedBooter.java:200)
	at org.apache.maven.surefire.booter.ForkedBooter.runSuitesInProcess(ForkedBooter.java:153)
	at org.apache.maven.surefire.booter.ForkedBooter.main(ForkedBooter.java:103)
[main] WARN org.locationtech.geogig.storage.cache.CacheManager - Unable to parse environment variable GEOGIG_CACHE_MAX_SIZE=-1G
java.lang.IllegalArgumentException: Value must be a positive number or zero
	at com.google.common.base.Preconditions.checkArgument(Preconditions.java:122)
	at org.locationtech.geogig.storage.cache.CacheManager.parseCacheSizeArgument(CacheManager.java:257)
	at org.locationtech.geogig.storage.cache.CacheManagerTest.assertDefaultMaxSizeDefaultValue(CacheManagerTest.java:188)
	at org.locationtech.geogig.storage.cache.CacheManagerTest.resolveDefaultMaxSizeEnvironmantVariableInvalidValue(CacheManagerTest.java:229)
	at sun.reflect.NativeMethodAccessorImpl.invoke0(Native Method)
	at sun.reflect.NativeMethodAccessorImpl.invoke(NativeMethodAccessorImpl.java:62)
	at sun.reflect.DelegatingMethodAccessorImpl.invoke(DelegatingMethodAccessorImpl.java:43)
	at java.lang.reflect.Method.invoke(Method.java:498)
	at org.junit.runners.model.FrameworkMethod$1.runReflectiveCall(FrameworkMethod.java:50)
	at org.junit.internal.runners.model.ReflectiveCallable.run(ReflectiveCallable.java:12)
	at org.junit.runners.model.FrameworkMethod.invokeExplosively(FrameworkMethod.java:47)
	at org.junit.internal.runners.statements.InvokeMethod.evaluate(InvokeMethod.java:17)
	at org.junit.internal.runners.statements.RunBefores.evaluate(RunBefores.java:26)
	at org.junit.internal.runners.statements.RunAfters.evaluate(RunAfters.java:27)
	at org.junit.rules.ExpectedException$ExpectedExceptionStatement.evaluate(ExpectedException.java:239)
	at org.junit.rules.RunRules.evaluate(RunRules.java:20)
	at org.junit.runners.ParentRunner.runLeaf(ParentRunner.java:325)
	at org.junit.runners.BlockJUnit4ClassRunner.runChild(BlockJUnit4ClassRunner.java:78)
	at org.junit.runners.BlockJUnit4ClassRunner.runChild(BlockJUnit4ClassRunner.java:57)
	at org.junit.runners.ParentRunner$3.run(ParentRunner.java:290)
	at org.junit.runners.ParentRunner$1.schedule(ParentRunner.java:71)
	at org.junit.runners.ParentRunner.runChildren(ParentRunner.java:288)
	at org.junit.runners.ParentRunner.access$000(ParentRunner.java:58)
	at org.junit.runners.ParentRunner$2.evaluate(ParentRunner.java:268)
	at org.junit.runners.ParentRunner.run(ParentRunner.java:363)
	at org.apache.maven.surefire.junit4.JUnit4Provider.execute(JUnit4Provider.java:264)
	at org.apache.maven.surefire.junit4.JUnit4Provider.executeTestSet(JUnit4Provider.java:153)
	at org.apache.maven.surefire.junit4.JUnit4Provider.invoke(JUnit4Provider.java:124)
	at org.apache.maven.surefire.booter.ForkedBooter.invokeProviderInSameClassLoader(ForkedBooter.java:200)
	at org.apache.maven.surefire.booter.ForkedBooter.runSuitesInProcess(ForkedBooter.java:153)
	at org.apache.maven.surefire.booter.ForkedBooter.main(ForkedBooter.java:103)
[main] INFO org.locationtech.geogig.storage.cache.CacheManager - Configuring GeoGig shared object cache maximum size to the default of 2,500 bytes as given by the default 0.250000 percent of available heap. Use the GEOGIG_CACHE_MAX_SIZE System property or environmentvariable to set a different maximum size at runtime
[main] INFO org.locationtech.geogig.storage.cache.CacheManager - Configuring GeoGig shared object cache maximum size to the default of 119,406,592 bytes as given by the default 0.250000 percent of available heap. Use the GEOGIG_CACHE_MAX_SIZE System property or environmentvariable to set a different maximum size at runtime
[main] WARN org.locationtech.geogig.storage.cache.CacheManager - Unable to parse System property GEOGIG_CACHE_MAX_SIZE=0.91. Falling back to environment variable
java.lang.IllegalArgumentException: percent must be between zero and 90% (0.9)
	at com.google.common.base.Preconditions.checkArgument(Preconditions.java:122)
	at org.locationtech.geogig.storage.cache.CacheManager.getCacheSizePercent(CacheManager.java:203)
	at org.locationtech.geogig.storage.cache.CacheManagerTest.assertDefaultMaxSizeDefaultValue(CacheManagerTest.java:188)
	at org.locationtech.geogig.storage.cache.CacheManagerTest.resolveDefaultMaxSizeInvalidSysPropAndEnvVarFallsBackToDefaultPercent(CacheManagerTest.java:242)
	at sun.reflect.NativeMethodAccessorImpl.invoke0(Native Method)
	at sun.reflect.NativeMethodAccessorImpl.invoke(NativeMethodAccessorImpl.java:62)
	at sun.reflect.DelegatingMethodAccessorImpl.invoke(DelegatingMethodAccessorImpl.java:43)
	at java.lang.reflect.Method.invoke(Method.java:498)
	at org.junit.runners.model.FrameworkMethod$1.runReflectiveCall(FrameworkMethod.java:50)
	at org.junit.internal.runners.model.ReflectiveCallable.run(ReflectiveCallable.java:12)
	at org.junit.runners.model.FrameworkMethod.invokeExplosively(FrameworkMethod.java:47)
	at org.junit.internal.runners.statements.InvokeMethod.evaluate(InvokeMethod.java:17)
	at org.junit.internal.runners.statements.RunBefores.evaluate(RunBefores.java:26)
	at org.junit.internal.runners.statements.RunAfters.evaluate(RunAfters.java:27)
	at org.junit.rules.ExpectedException$ExpectedExceptionStatement.evaluate(ExpectedException.java:239)
	at org.junit.rules.RunRules.evaluate(RunRules.java:20)
	at org.junit.runners.ParentRunner.runLeaf(ParentRunner.java:325)
	at org.junit.runners.BlockJUnit4ClassRunner.runChild(BlockJUnit4ClassRunner.java:78)
	at org.junit.runners.BlockJUnit4ClassRunner.runChild(BlockJUnit4ClassRunner.java:57)
	at org.junit.runners.ParentRunner$3.run(ParentRunner.java:290)
	at org.junit.runners.ParentRunner$1.schedule(ParentRunner.java:71)
	at org.junit.runners.ParentRunner.runChildren(ParentRunner.java:288)
	at org.junit.runners.ParentRunner.access$000(ParentRunner.java:58)
	at org.junit.runners.ParentRunner$2.evaluate(ParentRunner.java:268)
	at org.junit.runners.ParentRunner.run(ParentRunner.java:363)
	at org.apache.maven.surefire.junit4.JUnit4Provider.execute(JUnit4Provider.java:264)
	at org.apache.maven.surefire.junit4.JUnit4Provider.executeTestSet(JUnit4Provider.java:153)
	at org.apache.maven.surefire.junit4.JUnit4Provider.invoke(JUnit4Provider.java:124)
	at org.apache.maven.surefire.booter.ForkedBooter.invokeProviderInSameClassLoader(ForkedBooter.java:200)
	at org.apache.maven.surefire.booter.ForkedBooter.runSuitesInProcess(ForkedBooter.java:153)
	at org.apache.maven.surefire.booter.ForkedBooter.main(ForkedBooter.java:103)
[main] WARN org.locationtech.geogig.storage.cache.CacheManager - Unable to parse environment variable GEOGIG_CACHE_MAX_SIZE=alsoInvalid
java.lang.IllegalArgumentException: Invalid format (ALSOINVALID), expected <float>[B|K|M|G]
	at org.locationtech.geogig.storage.cache.CacheManager.parseCacheSizeArgument(CacheManager.java:269)
	at org.locationtech.geogig.storage.cache.CacheManagerTest.assertDefaultMaxSizeDefaultValue(CacheManagerTest.java:188)
	at org.locationtech.geogig.storage.cache.CacheManagerTest.resolveDefaultMaxSizeInvalidSysPropAndEnvVarFallsBackToDefaultPercent(CacheManagerTest.java:242)
	at sun.reflect.NativeMethodAccessorImpl.invoke0(Native Method)
	at sun.reflect.NativeMethodAccessorImpl.invoke(NativeMethodAccessorImpl.java:62)
	at sun.reflect.DelegatingMethodAccessorImpl.invoke(DelegatingMethodAccessorImpl.java:43)
	at java.lang.reflect.Method.invoke(Method.java:498)
	at org.junit.runners.model.FrameworkMethod$1.runReflectiveCall(FrameworkMethod.java:50)
	at org.junit.internal.runners.model.ReflectiveCallable.run(ReflectiveCallable.java:12)
	at org.junit.runners.model.FrameworkMethod.invokeExplosively(FrameworkMethod.java:47)
	at org.junit.internal.runners.statements.InvokeMethod.evaluate(InvokeMethod.java:17)
	at org.junit.internal.runners.statements.RunBefores.evaluate(RunBefores.java:26)
	at org.junit.internal.runners.statements.RunAfters.evaluate(RunAfters.java:27)
	at org.junit.rules.ExpectedException$ExpectedExceptionStatement.evaluate(ExpectedException.java:239)
	at org.junit.rules.RunRules.evaluate(RunRules.java:20)
	at org.junit.runners.ParentRunner.runLeaf(ParentRunner.java:325)
	at org.junit.runners.BlockJUnit4ClassRunner.runChild(BlockJUnit4ClassRunner.java:78)
	at org.junit.runners.BlockJUnit4ClassRunner.runChild(BlockJUnit4ClassRunner.java:57)
	at org.junit.runners.ParentRunner$3.run(ParentRunner.java:290)
	at org.junit.runners.ParentRunner$1.schedule(ParentRunner.java:71)
	at org.junit.runners.ParentRunner.runChildren(ParentRunner.java:288)
	at org.junit.runners.ParentRunner.access$000(ParentRunner.java:58)
	at org.junit.runners.ParentRunner$2.evaluate(ParentRunner.java:268)
	at org.junit.runners.ParentRunner.run(ParentRunner.java:363)
	at org.apache.maven.surefire.junit4.JUnit4Provider.execute(JUnit4Provider.java:264)
	at org.apache.maven.surefire.junit4.JUnit4Provider.executeTestSet(JUnit4Provider.java:153)
	at org.apache.maven.surefire.junit4.JUnit4Provider.invoke(JUnit4Provider.java:124)
	at org.apache.maven.surefire.booter.ForkedBooter.invokeProviderInSameClassLoader(ForkedBooter.java:200)
	at org.apache.maven.surefire.booter.ForkedBooter.runSuitesInProcess(ForkedBooter.java:153)
	at org.apache.maven.surefire.booter.ForkedBooter.main(ForkedBooter.java:103)
[main] INFO org.locationtech.geogig.storage.cache.CacheManager - Configuring GeoGig shared object cache maximum size to the default of 2,500 bytes as given by the default 0.250000 percent of available heap. Use the GEOGIG_CACHE_MAX_SIZE System property or environmentvariable to set a different maximum size at runtime
Tests run: 31, Failures: 0, Errors: 0, Skipped: 0, Time elapsed: 1.502 sec - in org.locationtech.geogig.storage.cache.CacheManagerTest
Running org.locationtech.geogig.test.integration.repository.WorkingTreeTest
Tests run: 22, Failures: 0, Errors: 0, Skipped: 0, Time elapsed: 4.21 sec - in org.locationtech.geogig.storage.memory.HeapConfigDatabaseTest
Running org.locationtech.geogig.test.integration.ConfigOpTest
Tests run: 7, Failures: 0, Errors: 0, Skipped: 0, Time elapsed: 4.53 sec - in org.locationtech.geogig.storage.datastream.v2_3.NodeSetTest
Running org.locationtech.geogig.test.integration.ApplyPatchOpTest
Tests run: 23, Failures: 0, Errors: 0, Skipped: 0, Time elapsed: 4.39 sec - in org.locationtech.geogig.storage.datastream.LZFSerializationFactoryTest
Running org.locationtech.geogig.test.integration.CleanOpTest
Tests run: 23, Failures: 0, Errors: 0, Skipped: 0, Time elapsed: 3.909 sec - in org.locationtech.geogig.storage.datastream.DataStreamSerializationFactoryV2_1Test
Running org.locationtech.geogig.test.integration.LogOpTest
Tests run: 23, Failures: 0, Errors: 0, Skipped: 0, Time elapsed: 4.6 sec - in org.locationtech.geogig.storage.datastream.DataStreamSerializationFactoryV2_2Test
Running org.locationtech.geogig.test.integration.CheckoutOpTest
Tests run: 11, Failures: 0, Errors: 0, Skipped: 0, Time elapsed: 5.496 sec - in org.locationtech.geogig.model.impl.LegacyTreeBuilderTest
Running org.locationtech.geogig.test.integration.ReportCommitConflictsOpTest
Tests run: 23, Failures: 0, Errors: 0, Skipped: 0, Time elapsed: 4.889 sec - in org.locationtech.geogig.storage.datastream.DataStreamSerializationFactoryV2Test
Running org.locationtech.geogig.test.integration.HooksTest
Tests run: 23, Failures: 0, Errors: 0, Skipped: 1, Time elapsed: 4.64 sec - in org.locationtech.geogig.storage.datastream.LZ4SerializationFactoryTest
Running org.locationtech.geogig.test.integration.CommitOpTest
Tests run: 11, Failures: 0, Errors: 0, Skipped: 0, Time elapsed: 2.791 sec - in org.locationtech.geogig.storage.fs.FileRefDatabaseTest
Running org.locationtech.geogig.test.integration.ResetOpTest
Tests run: 23, Failures: 0, Errors: 0, Skipped: 0, Time elapsed: 5.303 sec - in org.locationtech.geogig.storage.datastream.v2_3.DataStreamSerializationFactoryV2_3Test
Running org.locationtech.geogig.test.integration.GeogigAPITest
Added 5,000 nodes in 55.55 ms
Added 1,024 nodes in 56.60 ms
Removed 400 nodes in 1.850 ms
Tests run: 23, Failures: 0, Errors: 0, Skipped: 0, Time elapsed: 5.572 sec - in org.locationtech.geogig.storage.datastream.DataStreamSerializationFactoryV1Test
Running org.locationtech.geogig.test.integration.StatusOpTest
Added 10,000 nodes in 57.05 ms
Tests run: 11, Failures: 0, Errors: 0, Skipped: 0, Time elapsed: 6.291 sec - in org.locationtech.geogig.model.internal.CanonicalClusteringStrategyHeapStorageTest
Running org.locationtech.geogig.test.integration.GeogigTransactionTest
Tests run: 5, Failures: 0, Errors: 0, Skipped: 0, Time elapsed: 6.571 sec - in org.locationtech.geogig.model.internal.QuadTreeClusteringStrategy_putTest
Tests run: 1, Failures: 0, Errors: 0, Skipped: 0, Time elapsed: 5.262 sec - in org.locationtech.geogig.storage.impl.INIBlobTest
Running org.locationtech.geogig.test.integration.BlameOpTest
Running org.locationtech.geogig.test.integration.TagTest
Removed 32,600 nodes in 1.079 s
Tests run: 2, Failures: 0, Errors: 0, Skipped: 0, Time elapsed: 7.212 sec - in org.locationtech.geogig.model.impl.RevFeatureTypeTest
Running org.locationtech.geogig.test.integration.RebuildGraphOpTest
Tests run: 23, Failures: 0, Errors: 0, Skipped: 0, Time elapsed: 4.018 sec - in org.locationtech.geogig.storage.fs.IniFileConfigDatabaseTest
Running org.locationtech.geogig.test.integration.ReportMergeConflictsOpTest
Added 7,000 nodes in 528.3 ms
Tests run: 27, Failures: 0, Errors: 0, Skipped: 0, Time elapsed: 8.19 sec - in org.locationtech.geogig.storage.memory.HeapObjectDatabaseConformanceTest
Running org.locationtech.geogig.test.integration.DiffOpTest
Tests run: 9, Failures: 0, Errors: 0, Skipped: 0, Time elapsed: 6.422 sec - in org.locationtech.geogig.storage.cache.SharedCacheTest
Running org.locationtech.geogig.test.integration.BranchCreateOpTest
[main] INFO org.locationtech.geogig.hooks.Scripting - Running jvm script /opt/public/hipp/ramdisk/geogig/junit5486060869873572565/repo1273214659/.geogig/hooks/pre_commit.js
Tests run: 24, Failures: 0, Errors: 0, Skipped: 1, Time elapsed: 5.219 sec - in org.locationtech.geogig.storage.text.TextSerializationFactoryTest
Running org.locationtech.geogig.test.integration.SquashOpTest
Tests run: 8, Failures: 0, Errors: 0, Skipped: 0, Time elapsed: 8.373 sec - in org.locationtech.geogig.storage.datastream.v2_3.RevTreeFormatTest
Running org.locationtech.geogig.test.integration.BranchRenameOpTest
[main] INFO org.locationtech.geogig.hooks.Scripting - Running jvm script /opt/public/hipp/ramdisk/geogig/junit5486060869873572565/repo1273214659/.geogig/hooks/pre_commit.js
Tests run: 3, Failures: 0, Errors: 0, Skipped: 0, Time elapsed: 4.898 sec - in org.locationtech.geogig.test.integration.CleanOpTest
Running org.locationtech.geogig.test.integration.CreatePatchOpTest
Tests run: 3, Failures: 0, Errors: 0, Skipped: 0, Time elapsed: 4.178 sec - in org.locationtech.geogig.test.integration.GeogigAPITest
Running org.locationtech.geogig.test.integration.CherryPickOpTest
[main] INFO org.locationtech.geogig.hooks.Scripting - Running jvm script /opt/public/hipp/ramdisk/geogig/junit4127670790647566274/repo-1027828502/.geogig/hooks/post_commit.js
[main] WARN org.locationtech.geogig.hooks.CommandHookChain - Post-command hook org.locationtech.geogig.hooks.JVMScriptHook@4362d7df for command org.locationtech.geogig.porcelain.CommitOp threw an exception that will not be propagated
java.lang.NullPointerException
	at org.locationtech.geogig.hooks.Scripting.runJVMScript(Scripting.java:93)
	at org.locationtech.geogig.hooks.JVMScriptHook.post(JVMScriptHook.java:52)
	at org.locationtech.geogig.hooks.CommandHookChain.runPostHooks(CommandHookChain.java:65)
	at org.locationtech.geogig.hooks.CommandHooksDecorator$HooksListener.postCall(CommandHooksDecorator.java:60)
	at org.locationtech.geogig.repository.AbstractGeoGigOp.notifyPost(AbstractGeoGigOp.java:179)
	at org.locationtech.geogig.repository.AbstractGeoGigOp.call(AbstractGeoGigOp.java:155)
	at org.locationtech.geogig.test.integration.HooksTest.testFailingPostPostProcessHook(HooksTest.java:148)
	at sun.reflect.NativeMethodAccessorImpl.invoke0(Native Method)
	at sun.reflect.NativeMethodAccessorImpl.invoke(NativeMethodAccessorImpl.java:62)
	at sun.reflect.DelegatingMethodAccessorImpl.invoke(DelegatingMethodAccessorImpl.java:43)
	at java.lang.reflect.Method.invoke(Method.java:498)
	at org.junit.runners.model.FrameworkMethod$1.runReflectiveCall(FrameworkMethod.java:50)
	at org.junit.internal.runners.model.ReflectiveCallable.run(ReflectiveCallable.java:12)
	at org.junit.runners.model.FrameworkMethod.invokeExplosively(FrameworkMethod.java:47)
	at org.junit.internal.runners.statements.InvokeMethod.evaluate(InvokeMethod.java:17)
	at org.junit.internal.runners.statements.RunBefores.evaluate(RunBefores.java:26)
	at org.junit.internal.runners.statements.RunAfters.evaluate(RunAfters.java:27)
	at org.junit.rules.ExternalResource$1.evaluate(ExternalResource.java:48)
	at org.junit.rules.RunRules.evaluate(RunRules.java:20)
	at org.junit.runners.ParentRunner.runLeaf(ParentRunner.java:325)
	at org.junit.runners.BlockJUnit4ClassRunner.runChild(BlockJUnit4ClassRunner.java:78)
	at org.junit.runners.BlockJUnit4ClassRunner.runChild(BlockJUnit4ClassRunner.java:57)
	at org.junit.runners.ParentRunner$3.run(ParentRunner.java:290)
	at org.junit.runners.ParentRunner$1.schedule(ParentRunner.java:71)
	at org.junit.runners.ParentRunner.runChildren(ParentRunner.java:288)
	at org.junit.runners.ParentRunner.access$000(ParentRunner.java:58)
	at org.junit.runners.ParentRunner$2.evaluate(ParentRunner.java:268)
	at org.junit.runners.ParentRunner.run(ParentRunner.java:363)
	at org.apache.maven.surefire.junit4.JUnit4Provider.execute(JUnit4Provider.java:264)
	at org.apache.maven.surefire.junit4.JUnit4Provider.executeTestSet(JUnit4Provider.java:153)
	at org.apache.maven.surefire.junit4.JUnit4Provider.invoke(JUnit4Provider.java:124)
	at org.apache.maven.surefire.booter.ForkedBooter.invokeProviderInSameClassLoader(ForkedBooter.java:200)
	at org.apache.maven.surefire.booter.ForkedBooter.runSuitesInProcess(ForkedBooter.java:153)
	at org.apache.maven.surefire.booter.ForkedBooter.main(ForkedBooter.java:103)
Tests run: 3, Failures: 0, Errors: 0, Skipped: 0, Time elapsed: 3.786 sec - in org.locationtech.geogig.test.integration.RebuildGraphOpTest
Running org.locationtech.geogig.test.integration.LsTreeOpTest
Tests run: 4, Failures: 0, Errors: 0, Skipped: 0, Time elapsed: 4.688 sec - in org.locationtech.geogig.test.integration.StatusOpTest
Running org.locationtech.geogig.test.integration.RevertOpTest
[main] WARN org.locationtech.geogig.hooks.CommandHookChain - Post-command hook org.locationtech.geogig.test.integration.HooksTest$ClasspathHookTest@ec2bf82 for command org.locationtech.geogig.porcelain.AddOp threw an exception that will not be propagated
java.lang.RuntimeException: expected
	at org.locationtech.geogig.test.integration.HooksTest$ClasspathHookTest.post(HooksTest.java:266)
	at org.locationtech.geogig.hooks.CommandHookChain.runPostHooks(CommandHookChain.java:65)
	at org.locationtech.geogig.hooks.CommandHooksDecorator$HooksListener.postCall(CommandHooksDecorator.java:60)
	at org.locationtech.geogig.repository.AbstractGeoGigOp.notifyPost(AbstractGeoGigOp.java:179)
	at org.locationtech.geogig.repository.AbstractGeoGigOp.call(AbstractGeoGigOp.java:155)
	at org.locationtech.geogig.test.integration.RepositoryTestCase.insertAndAdd(RepositoryTestCase.java:403)
	at org.locationtech.geogig.test.integration.RepositoryTestCase.insertAndAdd(RepositoryTestCase.java:391)
	at org.locationtech.geogig.test.integration.HooksTest.testClasspathHookPostFail(HooksTest.java:191)
	at sun.reflect.NativeMethodAccessorImpl.invoke0(Native Method)
	at sun.reflect.NativeMethodAccessorImpl.invoke(NativeMethodAccessorImpl.java:62)
	at sun.reflect.DelegatingMethodAccessorImpl.invoke(DelegatingMethodAccessorImpl.java:43)
	at java.lang.reflect.Method.invoke(Method.java:498)Tests run: 11, Failures: 0, Errors: 0, Skipped: 0, Time elapsed: 11.169 sec - in org.locationtech.geogig.model.impl.CanonicalTreeBuilderTest
Running org.locationtech.geogig.test.integration.MergeOpTest

	at org.junit.runners.model.FrameworkMethod$1.runReflectiveCall(FrameworkMethod.java:50)
	at org.junit.internal.runners.model.ReflectiveCallable.run(ReflectiveCallable.java:12)
	at org.junit.runners.model.FrameworkMethod.invokeExplosively(FrameworkMethod.java:47)
	at org.junit.internal.runners.statements.InvokeMethod.evaluate(InvokeMethod.java:17)
	at org.junit.internal.runners.statements.RunBefores.evaluate(RunBefores.java:26)
	at org.junit.internal.runners.statements.RunAfters.evaluate(RunAfters.java:27)
	at org.junit.rules.ExternalResource$1.evaluate(ExternalResource.java:48)
	at org.junit.rules.RunRules.evaluate(RunRules.java:20)
	at org.junit.runners.ParentRunner.runLeaf(ParentRunner.java:325)
	at org.junit.runners.BlockJUnit4ClassRunner.runChild(BlockJUnit4ClassRunner.java:78)
	at org.junit.runners.BlockJUnit4ClassRunner.runChild(BlockJUnit4ClassRunner.java:57)
	at org.junit.runners.ParentRunner$3.run(ParentRunner.java:290)
	at org.junit.runners.ParentRunner$1.schedule(ParentRunner.java:71)
	at org.junit.runners.ParentRunner.runChildren(ParentRunner.java:288)
	at org.junit.runners.ParentRunner.access$000(ParentRunner.java:58)
	at org.junit.runners.ParentRunner$2.evaluate(ParentRunner.java:268)
	at org.junit.runners.ParentRunner.run(ParentRunner.java:363)
	at org.apache.maven.surefire.junit4.JUnit4Provider.execute(JUnit4Provider.java:264)
	at org.apache.maven.surefire.junit4.JUnit4Provider.executeTestSet(JUnit4Provider.java:153)
	at org.apache.maven.surefire.junit4.JUnit4Provider.invoke(JUnit4Provider.java:124)
	at org.apache.maven.surefire.booter.ForkedBooter.invokeProviderInSameClassLoader(ForkedBooter.java:200)
	at org.apache.maven.surefire.booter.ForkedBooter.runSuitesInProcess(ForkedBooter.java:153)
	at org.apache.maven.surefire.booter.ForkedBooter.main(ForkedBooter.java:103)
Tests run: 6, Failures: 0, Errors: 0, Skipped: 0, Time elapsed: 4.849 sec - in org.locationtech.geogig.test.integration.BlameOpTest
Running org.locationtech.geogig.test.integration.ConflictsReadWriteOpTest
Tests run: 1, Failures: 0, Errors: 0, Skipped: 0, Time elapsed: 0.386 sec - in org.locationtech.geogig.test.integration.ConflictsReadWriteOpTest
Running org.locationtech.geogig.test.integration.CheckSparsePathTest
Tests run: 3, Failures: 0, Errors: 0, Skipped: 0, Time elapsed: 5.689 sec - in org.locationtech.geogig.test.integration.TagTest
Running org.locationtech.geogig.test.integration.BranchDeleteOpTest
Added 5,000 nodes in 74.09 ms
[main] INFO org.locationtech.geogig.hooks.Scripting - Running shell script /opt/public/hipp/ramdisk/geogig/junit8692932032810307035/repo1768956102/.geogig/hooks/pre_commit.bat
[main] INFO org.locationtech.geogig.hooks.Scripting - Running shell script /opt/public/hipp/ramdisk/geogig/junit8692932032810307035/repo1768956102/.geogig/hooks/pre_commit.bat
Added 1,024 nodes in 32.77 ms
[main] INFO org.locationtech.geogig.hooks.Scripting - Running jvm script /opt/public/hipp/ramdisk/geogig/junit5167079189187682344/repo-907213780/.geogig/hooks/pre_commit.js
Tests run: 7, Failures: 0, Errors: 0, Skipped: 0, Time elapsed: 7.648 sec - in org.locationtech.geogig.test.integration.HooksTest
Running org.locationtech.geogig.test.integration.RevParseIntegrationTest
Removed 400 nodes in 3.213 ms
testMergeNoCommits
testOctopusMerge
Tests run: 8, Failures: 0, Errors: 0, Skipped: 0, Time elapsed: 3.845 sec - in org.locationtech.geogig.test.integration.CreatePatchOpTest
Running org.locationtech.geogig.test.integration.RebaseOpTest
Tests run: 2, Failures: 0, Errors: 0, Skipped: 0, Time elapsed: 2.091 sec - in org.locationtech.geogig.test.integration.CheckSparsePathTest
Running org.locationtech.geogig.test.integration.CleanRefsOpTest
Tests run: 7, Failures: 0, Errors: 0, Skipped: 1, Time elapsed: 4.175 sec - in org.locationtech.geogig.test.integration.CherryPickOpTest
Running org.locationtech.geogig.test.integration.AddOpTest
Tests run: 1, Failures: 0, Errors: 0, Skipped: 0, Time elapsed: 0.285 sec - in org.locationtech.geogig.test.integration.CleanRefsOpTest
Running org.locationtech.geogig.test.integration.FindCommonAncestorTest
Tests run: 9, Failures: 0, Errors: 0, Skipped: 0, Time elapsed: 10.374 sec - in org.locationtech.geogig.test.integration.repository.IndexTest
Running org.locationtech.geogig.test.performance.LogOpPerformanceTest
[main] INFO org.locationtech.geogig.test.performance.EnablePerformanceTestRule - org.locationtech.geogig.test.performance.LogOpPerformanceTest ignored, run with -Dgeogig.runPerformanceTests=true to enable it.
Tests run: 0, Failures: 0, Errors: 0, Skipped: 0, Time elapsed: 0.002 sec - in org.locationtech.geogig.test.performance.LogOpPerformanceTest
Running org.locationtech.geogig.test.performance.RevTreeBuilderPerformanceTest
[main] INFO org.locationtech.geogig.test.performance.EnablePerformanceTestRule - org.locationtech.geogig.test.performance.RevTreeBuilderPerformanceTest ignored, run with -Dgeogig.runPerformanceTests=true to enable it.
Tests run: 0, Failures: 0, Errors: 0, Skipped: 0, Time elapsed: 0.009 sec - in org.locationtech.geogig.test.performance.RevTreeBuilderPerformanceTest
Running org.locationtech.geogig.test.performance.HeapGraphDatabaseStressTest
[main] INFO org.locationtech.geogig.test.performance.EnablePerformanceTestRule - org.locationtech.geogig.test.performance.HeapGraphDatabaseStressTest ignored, run with -Dgeogig.runPerformanceTests=true to enable it.
Tests run: 0, Failures: 0, Errors: 0, Skipped: 0, Time elapsed: 0.002 sec - in org.locationtech.geogig.test.performance.HeapGraphDatabaseStressTest
Running org.locationtech.geogig.test.TestPlatformTest
Tests run: 5, Failures: 0, Errors: 0, Skipped: 0, Time elapsed: 2.117 sec - in org.locationtech.geogig.test.integration.BranchDeleteOpTest
Running org.locationtech.geogig.plumbing.HashObjectTest
Tests run: 1, Failures: 0, Errors: 0, Skipped: 0, Time elapsed: 0.215 sec - in org.locationtech.geogig.test.TestPlatformTest
Running org.locationtech.geogig.plumbing.UpdateRefTest
Added 10,000 nodes in 109.5 ms
testMergeTwice
Tests run: 11, Failures: 0, Errors: 0, Skipped: 0, Time elapsed: 15.119 sec - in org.locationtech.geogig.model.internal.CanonicalClusteringStrategyRocksdbStorageTest
Running org.locationtech.geogig.plumbing.ParseTimestampTest
Checking for possible conflicts...
Merging commit 5038b82f3b20c7873d932311c11c85db1676d15b
Conflicts: 0, merged: 0, unconflicted: 1
Staging changes...
Building final tree Points
Done.
Checking for possible conflicts...
Merging commit e78889835679f667f08421c288b816d8835ab6ac
Conflicts: 0, merged: 0, unconflicted: 1
Staging changes...
Building final tree Points
Done.
Tests run: 8, Failures: 0, Errors: 0, Skipped: 0, Time elapsed: 6.57 sec - in org.locationtech.geogig.test.integration.BranchRenameOpTest
Running org.locationtech.geogig.plumbing.CheckRefFormatTest
Checking for possible conflicts...
Merging commit cf62ba9e11e56b0872ce72bd11cd1c9d7dab0c9a
Conflicts: 0, merged: 0, unconflicted: 2
Staging changes...
Building final tree Lines
testNoFastForwardSpecifyAuthor
Done.
Checking for possible conflicts...
testBothBranchesSameGeometryChange
Tests run: 11, Failures: 0, Errors: 0, Skipped: 0, Time elapsed: 7.384 sec - in org.locationtech.geogig.test.integration.BranchCreateOpTest
Running org.locationtech.geogig.plumbing.WriteTree2Test
Merging commit 7d933cb3db294aa05326107e022b271d32d1a5d3
Conflicts: 0, merged: 0, unconflicted: 2
Staging changes...
Building final tree Lines
Done.
Tests run: 10, Failures: 0, Errors: 0, Skipped: 0, Time elapsed: 10.383 sec - in org.locationtech.geogig.test.integration.ReportCommitConflictsOpTest
Tests run: 2, Failures: 0, Errors: 0, Skipped: 0, Time elapsed: 0.558 sec - in org.locationtech.geogig.plumbing.CheckRefFormatTest
Tests run: 7, Failures: 0, Errors: 0, Skipped: 0, Time elapsed: 2.894 sec - in org.locationtech.geogig.test.integration.RevParseIntegrationTest
Tests run: 21, Failures: 0, Errors: 0, Skipped: 0, Time elapsed: 11.829 sec - in org.locationtech.geogig.test.integration.ConfigOpTest
testMergeFastForwardSecondCase
testOctopusMergeWithAutomerge
testConflictingMergeInterceptor
Tests run: 15, Failures: 0, Errors: 0, Skipped: 0, Time elapsed: 10.703 sec - in org.locationtech.geogig.test.integration.GeogigTransactionTest
Running org.locationtech.geogig.plumbing.diff.AttributeDiffTest
Tests run: 4, Failures: 0, Errors: 0, Skipped: 0, Time elapsed: 0.003 sec - in org.locationtech.geogig.plumbing.diff.AttributeDiffTest
Running org.locationtech.geogig.plumbing.diff.PatchSerializationTest
testMerge
Running org.locationtech.geogig.plumbing.diff.DiffCountConsumerTest
Running org.locationtech.geogig.plumbing.UpdateSymRefTest
Running org.locationtech.geogig.plumbing.diff.DepthTreeIteratorTest
Running org.locationtech.geogig.plumbing.diff.PreOrderDiffWalkTest
testConflictingOctopusMerge
Tests run: 5, Failures: 0, Errors: 0, Skipped: 0, Time elapsed: 3.12 sec - in org.locationtech.geogig.plumbing.UpdateRefTest
Running org.locationtech.geogig.plumbing.diff.MutableTreeTest
Tests run: 8, Failures: 0, Errors: 0, Skipped: 0, Time elapsed: 3.336 sec - in org.locationtech.geogig.plumbing.HashObjectTest
Running org.locationtech.geogig.plumbing.diff.TreeDifferenceTest
Tests run: 7, Failures: 0, Errors: 0, Skipped: 0, Time elapsed: 0.023 sec - in org.locationtech.geogig.plumbing.diff.MutableTreeTest
Running org.locationtech.geogig.plumbing.diff.GeometryDiffTest
Tests run: 7, Failures: 0, Errors: 0, Skipped: 0, Time elapsed: 0.025 sec - in org.locationtech.geogig.plumbing.diff.TreeDifferenceTest
Running org.locationtech.geogig.plumbing.diff.PostOrderDiffWalkTest
Tests run: 14, Failures: 0, Errors: 0, Skipped: 0, Time elapsed: 0.199 sec - in org.locationtech.geogig.plumbing.diff.GeometryDiffTest
Running org.locationtech.geogig.plumbing.index.BuildIndexOpTest
Tests run: 18, Failures: 0, Errors: 0, Skipped: 0, Time elapsed: 13.236 sec - in org.locationtech.geogig.test.integration.ApplyPatchOpTest
Running org.locationtech.geogig.plumbing.index.BuildFullHistoryIndexOpTest
testFastForwardOnly
Tests run: 9, Failures: 0, Errors: 0, Skipped: 0, Time elapsed: 1.571 sec - in org.locationtech.geogig.plumbing.diff.DiffCountConsumerTest
Running org.locationtech.geogig.plumbing.merge.MergeStatusBuilderDiffEntrySerializerTest
Tests run: 7, Failures: 0, Errors: 0, Skipped: 0, Time elapsed: 1.067 sec - in org.locationtech.geogig.plumbing.diff.PostOrderDiffWalkTest
Running org.locationtech.geogig.plumbing.merge.MergeFeaturesOpTest
Tests run: 14, Failures: 0, Errors: 0, Skipped: 0, Time elapsed: 10.3 sec - in org.locationtech.geogig.test.integration.SquashOpTest
Tests run: 13, Failures: 0, Errors: 0, Skipped: 0, Time elapsed: 13.367 sec - in org.locationtech.geogig.test.integration.ResetOpTest
Running org.locationtech.geogig.plumbing.ResolveRepositoryNameTest
Running org.locationtech.geogig.plumbing.RefParseTest
Tests run: 20, Failures: 0, Errors: 0, Skipped: 0, Time elapsed: 14.869 sec - in org.locationtech.geogig.test.integration.repository.WorkingTreeTest
Running org.locationtech.geogig.plumbing.ResolveFeatureTypeTest
Tests run: 5, Failures: 0, Errors: 0, Skipped: 0, Time elapsed: 0.293 sec - in org.locationtech.geogig.plumbing.RefParseTest
Running org.locationtech.geogig.plumbing.ResolveGeogigURITest
testSpecifyAuthor
Tests run: 1, Failures: 0, Errors: 0, Skipped: 0, Time elapsed: 1.081 sec - in org.locationtech.geogig.plumbing.merge.MergeFeaturesOpTest
Running org.locationtech.geogig.plumbing.UpdateTreeTest
Tests run: 10, Failures: 0, Errors: 0, Skipped: 0, Time elapsed: 9.02 sec - in org.locationtech.geogig.test.integration.LsTreeOpTest
Running org.locationtech.geogig.plumbing.DescribeFeatureTypeTest
left : Tree[c932cbd11ec75bcc145e2a362a3199bb85eb3abc; size=7; subtrees=2, buckets=0, features=0]
	[TreeNode[buildings -> a400000000000000000000000000000000000000], TreeNode[roads -> ff488999ad51848c7850ffd4d12568a3125172b0]]
	[]
right: Tree[8996d6e4437a8d8ea41ffc1f32cfaab9bf9de384; size=5; subtrees=1, buckets=0, features=0]
	[TreeNode[roads -> 72e2f547f3adc30edd55733abb885e8e6de1f1a4]]
	[]
Tests run: 8, Failures: 0, Errors: 0, Skipped: 0, Time elapsed: 2.993 sec - in org.locationtech.geogig.plumbing.diff.PatchSerializationTest
Running org.locationtech.geogig.plumbing.DiffBoundsTest
Tests run: 2, Failures: 0, Errors: 0, Skipped: 0, Time elapsed: 0.983 sec - in org.locationtech.geogig.plumbing.ResolveRepositoryNameTest
Running org.locationtech.geogig.plumbing.DiffFeatureTest
Tests run: 5, Failures: 0, Errors: 0, Skipped: 0, Time elapsed: 1.549 sec - in org.locationtech.geogig.plumbing.merge.MergeStatusBuilderDiffEntrySerializerTest
Running org.locationtech.geogig.plumbing.WalkGraphOpTest
Tests run: 5, Failures: 0, Errors: 0, Skipped: 0, Time elapsed: 6.173 sec - in org.locationtech.geogig.test.integration.FindCommonAncestorTest
Running org.locationtech.geogig.plumbing.RevParseTest
testOursAndTheirs
Tests run: 5, Failures: 0, Errors: 0, Skipped: 0, Time elapsed: 5.01 sec - in org.locationtech.geogig.plumbing.UpdateSymRefTest
Running org.locationtech.geogig.plumbing.CatObjectTest
Tests run: 15, Failures: 0, Errors: 0, Skipped: 0, Time elapsed: 11.499 sec - in org.locationtech.geogig.test.integration.RevertOpTest
Running org.locationtech.geogig.plumbing.DiffTreeTest
Tests run: 2, Failures: 0, Errors: 0, Skipped: 0, Time elapsed: 2.518 sec - in org.locationtech.geogig.plumbing.DescribeFeatureTypeTest
Running org.locationtech.geogig.porcelain.InitOpTest

Tests run: 13, Failures: 0, Errors: 0, Skipped: 0, Time elapsed: 15.535 sec - in org.locationtech.geogig.test.integration.ReportMergeConflictsOpTest
Running org.locationtech.geogig.porcelain.index.UpdateIndexOpTest
testNoCommitMerge
Tests run: 26, Failures: 0, Errors: 0, Skipped: 0, Time elapsed: 17.53 sec - in org.locationtech.geogig.test.integration.CommitOpTest
Running org.locationtech.geogig.porcelain.index.DropIndexOpTest
testMergeFastForward
Tests run: 5, Failures: 0, Errors: 0, Skipped: 0, Time elapsed: 4.225 sec - in org.locationtech.geogig.plumbing.ResolveFeatureTypeTest
Running org.locationtech.geogig.porcelain.index.UpdateIndexesOpTest
Tests run: 12, Failures: 0, Errors: 0, Skipped: 0, Time elapsed: 9.708 sec - in org.locationtech.geogig.test.integration.AddOpTest
Running org.locationtech.geogig.porcelain.index.CreateIndexOpTest
testOctopusMergeSameFeatureChanges
Tests run: 3, Failures: 0, Errors: 0, Skipped: 0, Time elapsed: 1.914 sec - in org.locationtech.geogig.plumbing.CatObjectTest
Running org.locationtech.geogig.data.MapToStringConverterFactoryTest
ip	1000 -> 1001
sp	StringProp1_1 -> StringProp1_1a
pp	0 point(s) deleted, 0 new point(s) added, 1 point(s) moved

Tests run: 2, Failures: 0, Errors: 0, Skipped: 0, Time elapsed: 0.122 sec - in org.locationtech.geogig.data.MapToStringConverterFactoryTest
Running org.locationtech.geogig.data.EPSGBoundsCalcTest
testMergeNullCommit
Exception caught executing task: 
java.lang.IllegalStateException: java.lang.IllegalStateException: Object NodeRef[Points/Points.1 -> a47ca38e5c3e92c94dec9e8ea597c642003ec878] not found.
	at sun.reflect.NativeConstructorAccessorImpl.newInstance0(Native Method)
	at sun.reflect.NativeConstructorAccessorImpl.newInstance(NativeConstructorAccessorImpl.java:62)
	at sun.reflect.DelegatingConstructorAccessorImpl.newInstance(DelegatingConstructorAccessorImpl.java:45)
	at java.lang.reflect.Constructor.newInstance(Constructor.java:423)
	at java.util.concurrent.ForkJoinTask.getThrowableException(ForkJoinTask.java:593)
	at java.util.concurrent.ForkJoinTask.reportException(ForkJoinTask.java:677)
	at java.util.concurrent.ForkJoinTask.join(ForkJoinTask.java:720)
	at java.util.concurrent.ForkJoinPool.invoke(ForkJoinPool.java:2616)
	at org.locationtech.geogig.plumbing.diff.PreOrderDiffWalk.walk(PreOrderDiffWalk.java:367)
	at org.locationtech.geogig.plumbing.WalkGraphOp._call(WalkGraphOp.java:160)
	at org.locationtech.geogig.plumbing.WalkGraphOp._call(WalkGraphOp.java:32)
	at org.locationtech.geogig.repository.AbstractGeoGigOp.call(AbstractGeoGigOp.java:154)
	at org.locationtech.geogig.plumbing.WalkGraphOpTest.testObjectDoesNotExist(WalkGraphOpTest.java:179)
	at sun.reflect.NativeMethodAccessorImpl.invoke0(Native Method)
	at sun.reflect.NativeMethodAccessorImpl.invoke(NativeMethodAccessorImpl.java:62)
	at sun.reflect.DelegatingMethodAccessorImpl.invoke(DelegatingMethodAccessorImpl.java:43)
	at java.lang.reflect.Method.invoke(Method.java:498)
	at org.junit.runners.model.FrameworkMethod$1.runReflectiveCall(FrameworkMethod.java:50)
	at org.junit.internal.runners.model.ReflectiveCallable.run(ReflectiveCallable.java:12)
	at org.junit.runners.model.FrameworkMethod.invokeExplosively(FrameworkMethod.java:47)
	at org.junit.internal.runners.statements.InvokeMethod.evaluate(InvokeMethod.java:17)
	at org.junit.internal.runners.statements.RunBefores.evaluate(RunBefores.java:26)
	at org.junit.internal.runners.statements.RunAfters.evaluate(RunAfters.java:27)
	at org.junit.rules.ExpectedException$ExpectedExceptionStatement.evaluate(ExpectedException.java:239)
	at org.junit.rules.ExternalResource$1.evaluate(ExternalResource.java:48)
	at org.junit.rules.RunRules.evaluate(RunRules.java:20)
	at org.junit.runners.ParentRunner.runLeaf(ParentRunner.java:325)
	at org.junit.runners.BlockJUnit4ClassRunner.runChild(BlockJUnit4ClassRunner.java:78)
	at org.junit.runners.BlockJUnit4ClassRunner.runChild(BlockJUnit4ClassRunner.java:57)
	at org.junit.runners.ParentRunner$3.run(ParentRunner.java:290)
	at org.junit.runners.ParentRunner$1.schedule(ParentRunner.java:71)
	at org.junit.runners.ParentRunner.runChildren(ParentRunner.java:288)
	at org.junit.runners.ParentRunner.access$000(ParentRunner.java:58)
	at org.junit.runners.ParentRunner$2.evaluate(ParentRunner.java:268)
	at org.junit.runners.ParentRunner.run(ParentRunner.java:363)
	at org.apache.maven.surefire.junit4.JUnit4Provider.execute(JUnit4Provider.java:264)
	at org.apache.maven.surefire.junit4.JUnit4Provider.executeTestSet(JUnit4Provider.java:153)
	at org.apache.maven.surefire.junit4.JUnit4Provider.invoke(JUnit4Provider.java:124)
	at org.apache.maven.surefire.booter.ForkedBooter.invokeProviderInSameClassLoader(ForkedBooter.java:200)
	at org.apache.maven.surefire.booter.ForkedBooter.runSuitesInProcess(ForkedBooter.java:153)
	at org.apache.maven.surefire.booter.ForkedBooter.main(ForkedBooter.java:103)
Caused by: java.lang.IllegalStateException: Object NodeRef[Points/Points.1 -> a47ca38e5c3e92c94dec9e8ea597c642003ec878] not found.
	at org.locationtech.geogig.plumbing.WalkGraphOp$1.checkExists(WalkGraphOp.java:155)
	at org.locationtech.geogig.plumbing.WalkGraphOp$1.feature(WalkGraphOp.java:128)
	at org.locationtech.geogig.plumbing.diff.PreOrderDiffWalk$CancellableConsumer.feature(PreOrderDiffWalk.java:1369)
	at org.locationtech.geogig.plumbing.diff.PreOrderDiffWalk$WalkAction.node(PreOrderDiffWalk.java:684)
	at org.locationtech.geogig.plumbing.diff.PreOrderDiffWalk$TraverseLeafLeaf.compute(PreOrderDiffWalk.java:891)
	at org.locationtech.geogig.plumbing.diff.PreOrderDiffWalk$TraverseTreeContents.compute(PreOrderDiffWalk.java:797)
	at org.locationtech.geogig.plumbing.diff.PreOrderDiffWalk$TraverseTree.compute(PreOrderDiffWalk.java:751)
	at java.util.concurrent.RecursiveAction.exec(RecursiveAction.java:189)
	at java.util.concurrent.ForkJoinTask.doExec(ForkJoinTask.java:289)
	at java.util.concurrent.ForkJoinTask.doInvoke(ForkJoinTask.java:401)
	at java.util.concurrent.ForkJoinTask.invokeAll(ForkJoinTask.java:843)
	at org.locationtech.geogig.plumbing.diff.PreOrderDiffWalk$TraverseLeafLeaf.compute(PreOrderDiffWalk.java:898)
	at org.locationtech.geogig.plumbing.diff.PreOrderDiffWalk$TraverseTreeContents.compute(PreOrderDiffWalk.java:797)
	at org.locationtech.geogig.plumbing.diff.PreOrderDiffWalk$TraverseTree.compute(PreOrderDiffWalk.java:751)
	at java.util.concurrent.RecursiveAction.exec(RecursiveAction.java:189)
	at java.util.concurrent.ForkJoinTask.doExec(ForkJoinTask.java:289)
	at java.util.concurrent.ForkJoinPool$WorkQueue.runTask(ForkJoinPool.java:1056)
	at java.util.concurrent.ForkJoinPool.runWorker(ForkJoinPool.java:1692)
	at java.util.concurrent.ForkJoinWorkerThread.run(ForkJoinWorkerThread.java:157)
Tests run: 4, Failures: 0, Errors: 0, Skipped: 0, Time elapsed: 4.384 sec - in org.locationtech.geogig.plumbing.DiffFeatureTest
Tests run: 4, Failures: 0, Errors: 0, Skipped: 0, Time elapsed: 2.27 sec - in org.locationtech.geogig.porcelain.InitOpTest
Tests run: 19, Failures: 0, Errors: 0, Skipped: 0, Time elapsed: 19.929 sec - in org.locationtech.geogig.test.integration.LogOpTest
Tests run: 12, Failures: 0, Errors: 0, Skipped: 0, Time elapsed: 11.478 sec - in org.locationtech.geogig.test.integration.RebaseOpTest
Tests run: 21, Failures: 0, Errors: 0, Skipped: 0, Time elapsed: 16.927 sec - in org.locationtech.geogig.test.integration.DiffOpTest
Running org.locationtech.geogig.data.retrieve.BackgroundingIteratorTest
Running org.locationtech.geogig.data.EPSGBoundsYXTest
Tests run: 1, Failures: 0, Errors: 0, Skipped: 1, Time elapsed: 0 sec - in org.locationtech.geogig.data.EPSGBoundsYXTest
Running org.locationtech.geogig.data.retrieve.IteratorBackedFeatureReaderTest
Tests run: 7, Failures: 0, Errors: 0, Skipped: 0, Time elapsed: 5.411 sec - in org.locationtech.geogig.plumbing.UpdateTreeTest
Tests run: 1, Failures: 0, Errors: 0, Skipped: 0, Time elapsed: 0 sec - in org.locationtech.geogig.data.retrieve.IteratorBackedFeatureReaderTest
Running org.locationtech.geogig.data.retrieve.BulkGeoGigFeatureRetrieverTest
Running org.locationtech.geogig.data.retrieve.MultiFeatureTypeBuilderTest
Running org.locationtech.geogig.data.EPSGBoundsXYTest
Running org.locationtech.geogig.data.PrimitiveArrayToStringConverterFactoryTest
Tests run: 1, Failures: 0, Errors: 0, Skipped: 1, Time elapsed: 0 sec - in org.locationtech.geogig.data.EPSGBoundsXYTest
Running org.locationtech.geogig.data.retrieve.BulkFeatureRetrieverTest
Running org.locationtech.geogig.data.FeatureBuilderTest
Tests run: 8, Failures: 0, Errors: 0, Skipped: 0, Time elapsed: 0.014 sec - in org.locationtech.geogig.data.PrimitiveArrayToStringConverterFactoryTest
Tests run: 1, Failures: 0, Errors: 0, Skipped: 0, Time elapsed: 0.024 sec - in org.locationtech.geogig.data.retrieve.BulkFeatureRetrieverTest
Running org.locationtech.geogig.repository.impl.DepthSearchTest
Running org.locationtech.geogig.repository.impl.RepositoryResolverTest
testMergeMultiple
Tests run: 3, Failures: 0, Errors: 0, Skipped: 0, Time elapsed: 0.06 sec - in org.locationtech.geogig.repository.impl.RepositoryResolverTest
Running org.locationtech.geogig.repository.impl.SpatialOpsTest
Tests run: 21, Failures: 0, Errors: 0, Skipped: 0, Time elapsed: 20.312 sec - in org.locationtech.geogig.test.integration.CheckoutOpTest
Running org.locationtech.geogig.repository.impl.RevFeatureBuilderTest
Tests run: 1, Failures: 0, Errors: 0, Skipped: 0, Time elapsed: 0.299 sec - in org.locationtech.geogig.data.FeatureBuilderTest
Tests run: 2, Failures: 0, Errors: 0, Skipped: 0, Time elapsed: 0.358 sec - in org.locationtech.geogig.data.retrieve.BulkGeoGigFeatureRetrieverTest
Tests run: 2, Failures: 0, Errors: 0, Skipped: 0, Time elapsed: 0.446 sec - in org.locationtech.geogig.data.retrieve.MultiFeatureTypeBuilderTest
Tests run: 7, Failures: 0, Errors: 0, Skipped: 0, Time elapsed: 5.489 sec - in org.locationtech.geogig.plumbing.WalkGraphOpTest
testMergeConflictingPolygon
Tests run: 9, Failures: 0, Errors: 0, Skipped: 0, Time elapsed: 1.47 sec - in org.locationtech.geogig.data.retrieve.BackgroundingIteratorTest
Tests run: 15, Failures: 0, Errors: 0, Skipped: 0, Time elapsed: 11.197 sec - in org.locationtech.geogig.plumbing.WriteTree2Test
testMergeConflictingBranchesTheirs
testMergeWithFeatureMerge
Tests run: 8, Failures: 0, Errors: 0, Skipped: 0, Time elapsed: 2.099 sec - in org.locationtech.geogig.repository.impl.RevFeatureBuilderTest
testMergeNoCommitMessage
Tests run: 6, Failures: 0, Errors: 0, Skipped: 0, Time elapsed: 8.603 sec - in org.locationtech.geogig.plumbing.DiffBoundsTest
Tests run: 5, Failures: 0, Errors: 0, Skipped: 0, Time elapsed: 5.575 sec - in org.locationtech.geogig.porcelain.index.DropIndexOpTest
testMergeTwoBranchesWithNewFeatureType
Tests run: 10, Failures: 0, Errors: 0, Skipped: 0, Time elapsed: 8.653 sec - in org.locationtech.geogig.plumbing.RevParseTest
testCancelScenario1
Tests run: 9, Failures: 0, Errors: 0, Skipped: 0, Time elapsed: 11.138 sec - in org.locationtech.geogig.plumbing.index.BuildIndexOpTest
testCancelScenario2
Tests run: 2, Failures: 0, Errors: 0, Skipped: 0, Time elapsed: 4.206 sec - in org.locationtech.geogig.repository.impl.SpatialOpsTest
Tests run: 7, Failures: 0, Errors: 0, Skipped: 0, Time elapsed: 12.529 sec - in org.locationtech.geogig.plumbing.diff.DepthTreeIteratorTest
testCancelScenario3
Tests run: 7, Failures: 0, Errors: 0, Skipped: 0, Time elapsed: 12.029 sec - in org.locationtech.geogig.plumbing.index.BuildFullHistoryIndexOpTest
testCancelScenario4
testNoFastForward
testMergeConflictingBranches
testMergeConflictingBranchesOurs
Tests run: 30, Failures: 0, Errors: 0, Skipped: 0, Time elapsed: 19.811 sec - in org.locationtech.geogig.test.integration.MergeOpTest
Tests run: 5, Failures: 0, Errors: 0, Skipped: 0, Time elapsed: 7.203 sec - in org.locationtech.geogig.data.EPSGBoundsCalcTest
Tests run: 9, Failures: 0, Errors: 0, Skipped: 0, Time elapsed: 7.65 sec - in org.locationtech.geogig.porcelain.index.CreateIndexOpTest
Tests run: 16, Failures: 0, Errors: 0, Skipped: 0, Time elapsed: 10.04 sec - in org.locationtech.geogig.porcelain.index.UpdateIndexOpTest
Tests run: 9, Failures: 0, Errors: 0, Skipped: 0, Time elapsed: 9.926 sec - in org.locationtech.geogig.porcelain.index.UpdateIndexesOpTest
PreOrderDiffWalkTest: walked 524,288 vs 262144 trees in 101.5 ms
PreOrderDiffWalkTest: walked 1,024 vs 512 trees in 11.24 ms
PreOrderDiffWalkTest: walked 16,384 vs 512 trees in 127.4 ms
Tests run: 24, Failures: 0, Errors: 0, Skipped: 0, Time elapsed: 21.292 sec - in org.locationtech.geogig.plumbing.diff.PreOrderDiffWalkTest
Tests run: 1, Failures: 0, Errors: 0, Skipped: 0, Time elapsed: 122.818 sec - in org.locationtech.geogig.plumbing.ResolveGeogigURITest
Tests run: 1, Failures: 0, Errors: 0, Skipped: 0, Time elapsed: 368.523 sec - in org.locationtech.geogig.repository.impl.DepthSearchTest
Tests run: 2, Failures: 0, Errors: 0, Skipped: 0, Time elapsed: 728.262 sec - in org.locationtech.geogig.plumbing.ParseTimestampTest
[Finalizer] WARN org.locationtech.geogig.repository.impl.RepositoryImpl - Repository instance being finalized without having been closed: file:/opt/public/hipp/ramdisk/geogig/junit1687756966845507366/mockWorkingDir/.geogig/
[Finalizer] WARN org.locationtech.geogig.repository.impl.RepositoryImpl - Repository instance being finalized without having been closed: file:/opt/public/hipp/ramdisk/geogig/junit1668123067438385509/mockWorkingDir/.geogig/
[Finalizer] WARN org.locationtech.geogig.repository.impl.RepositoryImpl - Repository instance being finalized without having been closed: file:/opt/public/hipp/ramdisk/geogig/junit1604771877940002553/mockWorkingDir/.geogig/
[Finalizer] WARN org.locationtech.geogig.repository.impl.RepositoryImpl - Repository instance being finalized without having been closed: file:/opt/public/hipp/ramdisk/geogig/junit1147564917757509078/mockWorkingDir/.geogig/
[Finalizer] WARN org.locationtech.geogig.repository.impl.RepositoryImpl - Repository instance being finalized without having been closed: file:/opt/public/hipp/ramdisk/geogig/junit5998373041795277804/mockWorkingDir/.geogig/
[Finalizer] WARN org.locationtech.geogig.repository.impl.RepositoryImpl - Repository instance being finalized without having been closed: file:/opt/public/hipp/ramdisk/geogig/junit7934810984466375697/mockWorkingDir/.geogig/
Tests run: 11, Failures: 0, Errors: 0, Skipped: 0, Time elapsed: 4,019.21 sec - in org.locationtech.geogig.plumbing.DiffTreeTest

Results :

Tests run: 1249, Failures: 0, Errors: 0, Skipped: 17

[JENKINS] Recording test results
[INFO] 
[INFO] --- maven-jar-plugin:2.4:jar (default-jar) @ geogig-core ---
[INFO] Building jar: /home/hudson/genie.geogig/.jenkins/jobs/geogig-1.2.x/workspace/src/core/target/geogig-core-1.2-SNAPSHOT.jar
[INFO] 
[INFO] --- maven-jar-plugin:2.4:test-jar (default) @ geogig-core ---
[INFO] Building jar: /home/hudson/genie.geogig/.jenkins/jobs/geogig-1.2.x/workspace/src/core/target/geogig-core-1.2-SNAPSHOT-tests.jar
[INFO] 
[INFO] >>> maven-source-plugin:2.2.1:jar (attach-sources) > generate-sources @ geogig-core >>>
[INFO] 
[INFO] --- git-commit-id-plugin:2.2.2:revision (default) @ geogig-core ---
[WARNING] Failed to getClass for org.apache.maven.plugin.source.SourceJarMojo
[INFO] 
[INFO] <<< maven-source-plugin:2.2.1:jar (attach-sources) < generate-sources @ geogig-core <<<
[INFO] 
[INFO] 
[INFO] --- maven-source-plugin:2.2.1:jar (attach-sources) @ geogig-core ---
[INFO] Building jar: /home/hudson/genie.geogig/.jenkins/jobs/geogig-1.2.x/workspace/src/core/target/geogig-core-1.2-SNAPSHOT-sources.jar
[INFO] 
[INFO] >>> maven-source-plugin:2.2.1:test-jar (attach-sources) > generate-sources @ geogig-core >>>
[INFO] 
[INFO] --- git-commit-id-plugin:2.2.2:revision (default) @ geogig-core ---
[WARNING] Failed to getClass for org.apache.maven.plugin.source.TestSourceJarMojo
[INFO] 
[INFO] <<< maven-source-plugin:2.2.1:test-jar (attach-sources) < generate-sources @ geogig-core <<<
[INFO] 
[INFO] 
[INFO] --- maven-source-plugin:2.2.1:test-jar (attach-sources) @ geogig-core ---
[INFO] Building jar: /home/hudson/genie.geogig/.jenkins/jobs/geogig-1.2.x/workspace/src/core/target/geogig-core-1.2-SNAPSHOT-test-sources.jar
[INFO] 
[INFO] --- maven-install-plugin:2.4:install (default-install) @ geogig-core ---
[INFO] Installing /home/hudson/genie.geogig/.jenkins/jobs/geogig-1.2.x/workspace/src/core/target/geogig-core-1.2-SNAPSHOT.jar to /home/hudson/genie.geogig/.jenkins/jobs/geogig-1.2.x/workspace/.repository/org/locationtech/geogig/geogig-core/1.2-SNAPSHOT/geogig-core-1.2-SNAPSHOT.jar
[INFO] Installing /home/hudson/genie.geogig/.jenkins/jobs/geogig-1.2.x/workspace/src/core/pom.xml to /home/hudson/genie.geogig/.jenkins/jobs/geogig-1.2.x/workspace/.repository/org/locationtech/geogig/geogig-core/1.2-SNAPSHOT/geogig-core-1.2-SNAPSHOT.pom
[INFO] Installing /home/hudson/genie.geogig/.jenkins/jobs/geogig-1.2.x/workspace/src/core/target/geogig-core-1.2-SNAPSHOT-tests.jar to /home/hudson/genie.geogig/.jenkins/jobs/geogig-1.2.x/workspace/.repository/org/locationtech/geogig/geogig-core/1.2-SNAPSHOT/geogig-core-1.2-SNAPSHOT-tests.jar
[INFO] Installing /home/hudson/genie.geogig/.jenkins/jobs/geogig-1.2.x/workspace/src/core/target/geogig-core-1.2-SNAPSHOT-sources.jar to /home/hudson/genie.geogig/.jenkins/jobs/geogig-1.2.x/workspace/.repository/org/locationtech/geogig/geogig-core/1.2-SNAPSHOT/geogig-core-1.2-SNAPSHOT-sources.jar
[INFO] Installing /home/hudson/genie.geogig/.jenkins/jobs/geogig-1.2.x/workspace/src/core/target/geogig-core-1.2-SNAPSHOT-test-sources.jar to /home/hudson/genie.geogig/.jenkins/jobs/geogig-1.2.x/workspace/.repository/org/locationtech/geogig/geogig-core/1.2-SNAPSHOT/geogig-core-1.2-SNAPSHOT-test-sources.jar
[JENKINS] Archiving disabled
Started calculate disk usage of build
Finished Calculation of disk usage of build in 0 seconds
Started calculate disk usage of workspace
Finished Calculation of disk usage of workspace in 0 seconds
[INFO] 
[INFO] --------------< org.locationtech.geogig:geogig-remoting >---------------
[INFO] Building Replication and synchronization 1.2-SNAPSHOT             [4/17]
[INFO] --------------------------------[ jar ]---------------------------------
[INFO] 
[INFO] --- maven-clean-plugin:2.5:clean (default-clean) @ geogig-remoting ---
[INFO] Deleting /home/hudson/genie.geogig/.jenkins/jobs/geogig-1.2.x/workspace/src/remoting/target
[INFO] 
[INFO] --- git-commit-id-plugin:2.2.2:revision (default) @ geogig-remoting ---
[INFO] 
[INFO] --- maven-resources-plugin:2.6:resources (default-resources) @ geogig-remoting ---
[INFO] Using 'UTF-8' encoding to copy filtered resources.
[INFO] Copying 3 resources
[INFO] 
[INFO] --- maven-compiler-plugin:3.1:compile (default-compile) @ geogig-remoting ---
[INFO] Changes detected - recompiling the module!
[INFO] Compiling 55 source files to /home/hudson/genie.geogig/.jenkins/jobs/geogig-1.2.x/workspace/src/remoting/target/classes
[WARNING] /home/hudson/genie.geogig/.jenkins/jobs/geogig-1.2.x/workspace/src/remoting/src/main/java/org/locationtech/geogig/remotes/FetchOp.java: /home/hudson/genie.geogig/.jenkins/jobs/geogig-1.2.x/workspace/src/remoting/src/main/java/org/locationtech/geogig/remotes/FetchOp.java uses or overrides a deprecated API.
[WARNING] /home/hudson/genie.geogig/.jenkins/jobs/geogig-1.2.x/workspace/src/remoting/src/main/java/org/locationtech/geogig/remotes/FetchOp.java: Recompile with -Xlint:deprecation for details.
[INFO] 
[INFO] --- maven-resources-plugin:2.6:testResources (default-testResources) @ geogig-remoting ---
[INFO] Using 'UTF-8' encoding to copy filtered resources.
[INFO] Copying 1 resource
[INFO] 
[INFO] --- maven-compiler-plugin:3.1:testCompile (default-testCompile) @ geogig-remoting ---
[INFO] Changes detected - recompiling the module!
[INFO] Compiling 12 source files to /home/hudson/genie.geogig/.jenkins/jobs/geogig-1.2.x/workspace/src/remoting/target/test-classes
[WARNING] /home/hudson/genie.geogig/.jenkins/jobs/geogig-1.2.x/workspace/src/remoting/src/test/java/org/locationtech/geogig/test/integration/remoting/RemoteRepositoryTestCase.java: /home/hudson/genie.geogig/.jenkins/jobs/geogig-1.2.x/workspace/src/remoting/src/test/java/org/locationtech/geogig/test/integration/remoting/RemoteRepositoryTestCase.java uses unchecked or unsafe operations.
[WARNING] /home/hudson/genie.geogig/.jenkins/jobs/geogig-1.2.x/workspace/src/remoting/src/test/java/org/locationtech/geogig/test/integration/remoting/RemoteRepositoryTestCase.java: Recompile with -Xlint:unchecked for details.
[INFO] 
[INFO] --- maven-surefire-plugin:2.17:test (default-test) @ geogig-remoting ---
[INFO] Surefire report directory: /home/hudson/genie.geogig/.jenkins/jobs/geogig-1.2.x/workspace/src/remoting/target/surefire-reports

-------------------------------------------------------
 T E S T S
-------------------------------------------------------

-------------------------------------------------------
 T E S T S
-------------------------------------------------------
Picked up JAVA_TOOL_OPTIONS: -Xmx2G -Djava.io.tmpdir=/tmp/genie.geogig
Picked up JAVA_TOOL_OPTIONS: -Xmx2G -Djava.io.tmpdir=/tmp/genie.geogig
Picked up JAVA_TOOL_OPTIONS: -Xmx2G -Djava.io.tmpdir=/tmp/genie.geogig
Picked up JAVA_TOOL_OPTIONS: -Xmx2G -Djava.io.tmpdir=/tmp/genie.geogig
Picked up JAVA_TOOL_OPTIONS: -Xmx2G -Djava.io.tmpdir=/tmp/genie.geogig
Picked up JAVA_TOOL_OPTIONS: -Xmx2G -Djava.io.tmpdir=/tmp/genie.geogig
Picked up JAVA_TOOL_OPTIONS: -Xmx2G -Djava.io.tmpdir=/tmp/genie.geogig
Picked up JAVA_TOOL_OPTIONS: -Xmx2G -Djava.io.tmpdir=/tmp/genie.geogig
Picked up JAVA_TOOL_OPTIONS: -Xmx2G -Djava.io.tmpdir=/tmp/genie.geogig
Picked up JAVA_TOOL_OPTIONS: -Xmx2G -Djava.io.tmpdir=/tmp/genie.geogig
Picked up JAVA_TOOL_OPTIONS: -Xmx2G -Djava.io.tmpdir=/tmp/genie.geogig
Running org.locationtech.geogig.test.integration.remoting.PushOpTest
Running org.locationtech.geogig.test.integration.remoting.RemoteListOpTest
Running org.locationtech.geogig.test.integration.remoting.RemoteAddOpTest
Running org.locationtech.geogig.test.integration.remoting.FetchOpTest
Running org.locationtech.geogig.test.integration.remoting.BranchListOpTest
Running org.locationtech.geogig.test.integration.remoting.CloneOpTest
Running org.locationtech.geogig.test.integration.remoting.PullOpTest
Running org.locationtech.geogig.test.integration.remoting.RemoveOpTest
Running org.locationtech.geogig.test.integration.remoting.ShallowCloneTest
Running org.locationtech.geogig.test.integration.remoting.SparseCloneTest
Running org.locationtech.geogig.test.integration.remoting.RemoteRemoveOpTest
Tests run: 4, Failures: 0, Errors: 0, Skipped: 0, Time elapsed: 2.486 sec - in org.locationtech.geogig.test.integration.remoting.RemoteListOpTest
Tests run: 10, Failures: 0, Errors: 0, Skipped: 0, Time elapsed: 2.695 sec - in org.locationtech.geogig.test.integration.remoting.RemoteAddOpTest
Tests run: 8, Failures: 0, Errors: 0, Skipped: 0, Time elapsed: 2.692 sec - in org.locationtech.geogig.test.integration.remoting.RemoteRemoveOpTest
Tests run: 10, Failures: 0, Errors: 0, Skipped: 1, Time elapsed: 3.274 sec - in org.locationtech.geogig.test.integration.remoting.RemoveOpTest
[main] INFO org.locationtech.geogig.remotes.SendPack - Pushing Ref[refs/heads/master -> d13557ae0d974dbbc25eb1e98414ea3a2455cc3c] to refs/remotes/origin/refs/heads/master(refs/heads/master)
TransferSummary{{file:/opt/public/hipp/ramdisk/geogig/junit6373112925458898554/remotetestrepository/=[RefDiff{CHANGED_REF, Ref[refs/heads/master -> d13557ae0d974dbbc25eb1e98414ea3a2455cc3c], Ref[refs/remotes/origin/refs/heads/master -> d13557ae0d974dbbc25eb1e98414ea3a2455cc3c]}]}}
Checking for possible conflicts...
Merging commit efae0cc048ada0f9252348d78ef596c2810ee6a5
Conflicts: 0, merged: 0, unconflicted: 501
Staging changes...
Building final tree Points
Done.
Checking for possible conflicts...
Possible conflicts. Creating intermediate merge status...
Staging 250 unconflicted and 0 merged differences...
Building final tree Points
Done.
Applying changes of refs/heads/deletes_branch
Objects inserted: 1,798, repeated: 0, time: 33.03 ms
Applying changes of refs/heads/master
Objects inserted: 731, repeated: 0, time: 15.70 ms
Applying changes of refs/heads/updates_branch
Applying changes of refs/heads/updates_branch2
Build was aborted
Aborted by groldan@boundlessgeo.com
channel stopped
Started calculate disk usage of build
Finished Calculation of disk usage of build in 0 seconds
Started calculate disk usage of workspace
Finished Calculation of disk usage of workspace in 0 seconds
Finished: ABORTED