SuccessConsole Output

Started calculate disk usage of build
Finished Calculation of disk usage of build in 0 seconds
Started calculate disk usage of workspace
Finished Calculation of disk usage of workspace in 0 seconds
[INFO]                                                                         
[INFO] ------------------------------------------------------------------------
[INFO] Building GeoGig Core 1.1-SNAPSHOT
[INFO] ------------------------------------------------------------------------
[INFO] 
[INFO] --- maven-clean-plugin:2.5:clean (default-clean) @ geogig-core ---
[INFO] Deleting /home/hudson/genie.geogig/.jenkins/jobs/geogig-1.1.x/workspace/src/core/target
[INFO] 
[INFO] --- git-commit-id-plugin:2.1.8:revision (default) @ geogig-core ---
[INFO] 
[INFO] --- maven-resources-plugin:2.6:resources (default-resources) @ geogig-core ---
[INFO] Using 'UTF-8' encoding to copy filtered resources.
[INFO] Copying 5 resources
[INFO] 
[INFO] --- maven-compiler-plugin:3.1:compile (default-compile) @ geogig-core ---
[INFO] Changes detected - recompiling the module!
[INFO] Compiling 335 source files to /home/hudson/genie.geogig/.jenkins/jobs/geogig-1.1.x/workspace/src/core/target/classes
[WARNING] /home/hudson/genie.geogig/.jenkins/jobs/geogig-1.1.x/workspace/src/core/src/main/java/org/locationtech/geogig/storage/datastream/v2_3/DataStreamValueSerializerV2_3.java: Some input files use or override a deprecated API.
[WARNING] /home/hudson/genie.geogig/.jenkins/jobs/geogig-1.1.x/workspace/src/core/src/main/java/org/locationtech/geogig/storage/datastream/v2_3/DataStreamValueSerializerV2_3.java: Recompile with -Xlint:deprecation for details.
[WARNING] /home/hudson/genie.geogig/.jenkins/jobs/geogig-1.1.x/workspace/src/core/src/main/java/org/locationtech/geogig/model/internal/NodeId.java: Some input files use unchecked or unsafe operations.
[WARNING] /home/hudson/genie.geogig/.jenkins/jobs/geogig-1.1.x/workspace/src/core/src/main/java/org/locationtech/geogig/model/internal/NodeId.java: Recompile with -Xlint:unchecked for details.
[INFO] 
[INFO] --- maven-resources-plugin:2.6:testResources (default-testResources) @ geogig-core ---
[INFO] Using 'UTF-8' encoding to copy filtered resources.
[INFO] Copying 3 resources
[INFO] 
[INFO] --- maven-compiler-plugin:3.1:testCompile (default-testCompile) @ geogig-core ---
[INFO] Changes detected - recompiling the module!
[INFO] Compiling 187 source files to /home/hudson/genie.geogig/.jenkins/jobs/geogig-1.1.x/workspace/src/core/target/test-classes
[WARNING] /home/hudson/genie.geogig/.jenkins/jobs/geogig-1.1.x/workspace/src/core/src/test/java/org/locationtech/geogig/test/integration/HooksTest.java: Some input files use or override a deprecated API.
[WARNING] /home/hudson/genie.geogig/.jenkins/jobs/geogig-1.1.x/workspace/src/core/src/test/java/org/locationtech/geogig/test/integration/HooksTest.java: Recompile with -Xlint:deprecation for details.
[WARNING] /home/hudson/genie.geogig/.jenkins/jobs/geogig-1.1.x/workspace/src/core/src/test/java/org/locationtech/geogig/data/retrieve/BulkFeatureRetrieverTest.java: Some input files use unchecked or unsafe operations.
[WARNING] /home/hudson/genie.geogig/.jenkins/jobs/geogig-1.1.x/workspace/src/core/src/test/java/org/locationtech/geogig/data/retrieve/BulkFeatureRetrieverTest.java: Recompile with -Xlint:unchecked for details.
[INFO] 
[INFO] --- maven-surefire-plugin:2.17:test (default-test) @ geogig-core ---
[INFO] Surefire report directory: /home/hudson/genie.geogig/.jenkins/jobs/geogig-1.1.x/workspace/src/core/target/surefire-reports

-------------------------------------------------------
 T E S T S
-------------------------------------------------------

-------------------------------------------------------
 T E S T S
-------------------------------------------------------
Running org.locationtech.geogig.storage.cache.CacheManagerTest
Running org.locationtech.geogig.storage.cache.KeyTest
Running org.locationtech.geogig.storage.cache.SharedCacheTest
Running org.locationtech.geogig.storage.cache.ObjectCacheTest
Running org.locationtech.geogig.storage.datastream.v2_3.StringTableTest
Running org.locationtech.geogig.storage.datastream.v2_3.RevTreeFormatTest
Running org.locationtech.geogig.storage.datastream.v2_3.RevTreeFormatPrefTest
Running org.locationtech.geogig.storage.datastream.v2_3.NodeSetTest
Running org.locationtech.geogig.storage.datastream.Float32BoundsSerializationTest
Running org.locationtech.geogig.storage.datastream.v2_3.TailTest
Running org.locationtech.geogig.storage.datastream.LZFSerializationFactoryTest
Running org.locationtech.geogig.storage.datastream.DataStreamSerializationFactoryV1Test
Running org.locationtech.geogig.storage.datastream.LZ4SerializationFactoryTest
Running org.locationtech.geogig.storage.datastream.FormatCommonV2_1Test
Running org.locationtech.geogig.storage.datastream.v2_3.DataStreamSerializationFactoryV2_3Test
Running org.locationtech.geogig.storage.datastream.DataStreamSerializationFactoryV2_2Test
Running org.locationtech.geogig.storage.datastream.DataStreamSerializationFactoryV2_1Test
Running org.locationtech.geogig.storage.datastream.DataStreamSerializationFactoryV2Test
Running org.locationtech.geogig.storage.datastream.VarintTest
Running org.locationtech.geogig.storage.datastream.FloatPackedCoordinateSequenceTest
Running org.locationtech.geogig.storage.memory.HeapBlobStoreTest
Running org.locationtech.geogig.storage.memory.HeapRefDatabaseTest
Running org.locationtech.geogig.storage.memory.HeapConflictsDatabaseConformanceTest
Running org.locationtech.geogig.storage.memory.HeapIndexDatabaseConformanceTest
[main] INFO org.locationtech.geogig.test.performance.EnablePerformanceTestRule - org.locationtech.geogig.storage.datastream.v2_3.RevTreeFormatPrefTest ignored, run with -Dgeogig.runPerformanceTests=true to enable it.
[main] INFO org.locationtech.geogig.test.performance.EnablePerformanceTestRule - org.locationtech.geogig.storage.datastream.v2_3.RevTreeFormatPrefTest ignored, run with -Dgeogig.runPerformanceTests=true to enable it.
[main] INFO org.locationtech.geogig.test.performance.EnablePerformanceTestRule - org.locationtech.geogig.storage.datastream.v2_3.RevTreeFormatPrefTest ignored, run with -Dgeogig.runPerformanceTests=true to enable it.
[main] INFO org.locationtech.geogig.test.performance.EnablePerformanceTestRule - org.locationtech.geogig.storage.datastream.v2_3.RevTreeFormatPrefTest ignored, run with -Dgeogig.runPerformanceTests=true to enable it.
[main] INFO org.locationtech.geogig.test.performance.EnablePerformanceTestRule - org.locationtech.geogig.storage.datastream.v2_3.RevTreeFormatPrefTest ignored, run with -Dgeogig.runPerformanceTests=true to enable it.
[main] INFO org.locationtech.geogig.test.performance.EnablePerformanceTestRule - org.locationtech.geogig.storage.datastream.v2_3.RevTreeFormatPrefTest ignored, run with -Dgeogig.runPerformanceTests=true to enable it.
Tests run: 6, Failures: 0, Errors: 0, Skipped: 0, Time elapsed: 0.235 sec - in org.locationtech.geogig.storage.datastream.v2_3.RevTreeFormatPrefTest
Running org.locationtech.geogig.storage.memory.HeapObjectStoreConformanceTest
Tests run: 1, Failures: 0, Errors: 0, Skipped: 0, Time elapsed: 0.237 sec - in org.locationtech.geogig.storage.datastream.v2_3.TailTest
Tests run: 2, Failures: 0, Errors: 0, Skipped: 0, Time elapsed: 0.249 sec - in org.locationtech.geogig.storage.datastream.Float32BoundsSerializationTest
Running org.locationtech.geogig.storage.memory.HeapGraphDatabaseTest
Running org.locationtech.geogig.storage.impl.INIBlobTest
Tests run: 2, Failures: 0, Errors: 0, Skipped: 0, Time elapsed: 0.417 sec - in org.locationtech.geogig.storage.cache.KeyTest
Running org.locationtech.geogig.storage.impl.PersistedIterableTest
Tests run: 2, Failures: 0, Errors: 0, Skipped: 0, Time elapsed: 0.341 sec - in org.locationtech.geogig.storage.datastream.v2_3.StringTableTest
Tests run: 3, Failures: 0, Errors: 0, Skipped: 0, Time elapsed: 0.297 sec - in org.locationtech.geogig.storage.datastream.FloatPackedCoordinateSequenceTest
Running org.locationtech.geogig.storage.fs.FileRefDatabaseTest
Running org.locationtech.geogig.storage.fs.FileConflictsDatabaseConformanceTest
[main] INFO org.locationtech.geogig.storage.cache.CacheManager - Registered GeoGig cache manager MBean as org.geogig:type=shared-cache
Tests run: 4, Failures: 0, Errors: 0, Skipped: 0, Time elapsed: 0.43 sec - in org.locationtech.geogig.storage.datastream.VarintTest
Running org.locationtech.geogig.storage.fs.FileBlobStoreTest
Tests run: 7, Failures: 0, Errors: 0, Skipped: 0, Time elapsed: 0.504 sec - in org.locationtech.geogig.storage.memory.HeapBlobStoreTest
Running org.locationtech.geogig.storage.fs.IniFileConfigDatabaseTest
Tests run: 2, Failures: 0, Errors: 0, Skipped: 0, Time elapsed: 0.256 sec - in org.locationtech.geogig.storage.impl.PersistedIterableTest
Running org.locationtech.geogig.storage.text.TextSerializationFactoryTest
Tests run: 7, Failures: 0, Errors: 0, Skipped: 0, Time elapsed: 0.246 sec - in org.locationtech.geogig.storage.fs.FileBlobStoreTest
Running org.locationtech.geogig.test.integration.CleanOpTest
Tests run: 11, Failures: 0, Errors: 0, Skipped: 0, Time elapsed: 0.508 sec - in org.locationtech.geogig.storage.fs.FileRefDatabaseTest
Running org.locationtech.geogig.test.integration.HooksTest
Tests run: 13, Failures: 0, Errors: 0, Skipped: 0, Time elapsed: 0.686 sec - in org.locationtech.geogig.storage.memory.HeapGraphDatabaseTest
Running org.locationtech.geogig.test.integration.ConfigOpTest
[main] INFO org.locationtech.geogig.storage.cache.CacheManager - Configuring GeoGig shared object cache maximum size to the default of 2,500 bytes as given by the default 0.250000 percent of available heap. Use the GEOGIG_CACHE_MAX_SIZE System property or environmentvariable to set a different maximum size at runtime
[main] INFO org.locationtech.geogig.storage.cache.CacheManager - Configuring GeoGig shared object cache maximum size to 1,025 bytes as given by the System property GEOGIG_CACHE_MAX_SIZE=1025
[main] WARN org.locationtech.geogig.storage.cache.CacheManager - cache size is too big: 1025, maximum allowed: 921
[main] INFO org.locationtech.geogig.storage.cache.CacheManager - Configuring GeoGig shared object cache maximum size to the default of 256 bytes as given by the default 0.250000 percent of available heap. Use the GEOGIG_CACHE_MAX_SIZE System property or environmentvariable to set a different maximum size at runtime
[main] INFO org.locationtech.geogig.storage.cache.CacheManager - Configuring GeoGig shared object cache maximum size to the default of 119,406,592 bytes as given by the default 0.250000 percent of available heap. Use the GEOGIG_CACHE_MAX_SIZE System property or environmentvariable to set a different maximum size at runtime
Tests run: 11, Failures: 0, Errors: 0, Skipped: 0, Time elapsed: 1.181 sec - in org.locationtech.geogig.storage.memory.HeapRefDatabaseTest
Running org.locationtech.geogig.test.integration.CheckoutOpTest
Tests run: 4, Failures: 0, Errors: 0, Skipped: 0, Time elapsed: 1.358 sec - in org.locationtech.geogig.storage.datastream.FormatCommonV2_1Test
Running org.locationtech.geogig.test.integration.ReportMergeConflictsOpTest
Tests run: 6, Failures: 0, Errors: 0, Skipped: 0, Time elapsed: 1.484 sec - in org.locationtech.geogig.storage.cache.ObjectCacheTest
Running org.locationtech.geogig.test.integration.repository.IndexTest
[main] INFO org.locationtech.geogig.storage.cache.CacheManager - Configuring GeoGig shared object cache maximum size to 1,048,576 bytes as given by the System property GEOGIG_CACHE_MAX_SIZE=1M
[main] INFO org.locationtech.geogig.storage.cache.CacheManager - Configuring GeoGig shared object cache maximum size to 102,400 bytes as given by the System property GEOGIG_CACHE_MAX_SIZE=100K
[main] INFO org.locationtech.geogig.storage.cache.CacheManager - Configuring GeoGig shared object cache maximum size to 5,000 bytes as given by the System property GEOGIG_CACHE_MAX_SIZE=0.5
Tests run: 23, Failures: 0, Errors: 0, Skipped: 0, Time elapsed: 1.26 sec - in org.locationtech.geogig.storage.fs.IniFileConfigDatabaseTest
Tests run: 14, Failures: 0, Errors: 0, Skipped: 0, Time elapsed: 1.765 sec - in org.locationtech.geogig.storage.memory.HeapConflictsDatabaseConformanceTest
[main] WARN org.locationtech.geogig.storage.cache.CacheManager - Unable to parse System property GEOGIG_CACHE_MAX_SIZE=-1G. Falling back to default value
java.lang.IllegalArgumentException: Value must be a positive number or zeroRunning org.locationtech.geogig.test.integration.repository.WorkingTreeTest

	at com.google.common.base.Preconditions.checkArgument(Preconditions.java:122)
	at org.locationtech.geogig.storage.cache.CacheManager.parseCacheSizeArgument(CacheManager.java:257)
	at org.locationtech.geogig.storage.cache.CacheManagerTest.assertDefaultMaxSizeDefaultValue(CacheManagerTest.java:188)
	at org.locationtech.geogig.storage.cache.CacheManagerTest.resolveDefaultMaxSizeSystemPropertyInvalidValue(CacheManagerTest.java:207)
	at sun.reflect.NativeMethodAccessorImpl.invoke0(Native Method)
	at sun.reflect.NativeMethodAccessorImpl.invoke(NativeMethodAccessorImpl.java:62)
	at sun.reflect.DelegatingMethodAccessorImpl.invoke(DelegatingMethodAccessorImpl.java:43)
	at java.lang.reflect.Method.invoke(Method.java:498)
	at org.junit.runners.model.FrameworkMethod$1.runReflectiveCall(FrameworkMethod.java:50)
	at org.junit.internal.runners.model.ReflectiveCallable.run(ReflectiveCallable.java:12)
	at org.junit.runners.model.FrameworkMethod.invokeExplosively(FrameworkMethod.java:47)
	at org.junit.internal.runners.statements.InvokeMethod.evaluate(InvokeMethod.java:17)
	at org.junit.internal.runners.statements.RunBefores.evaluate(RunBefores.java:26)
	at org.junit.internal.runners.statements.RunAfters.evaluate(RunAfters.java:27)
	at org.junit.rules.ExpectedException$ExpectedExceptionStatement.evaluate(ExpectedException.java:239)
	at org.junit.rules.RunRules.evaluate(RunRules.java:20)
	at org.junit.runners.ParentRunner.runLeaf(ParentRunner.java:325)
	at org.junit.runners.BlockJUnit4ClassRunner.runChild(BlockJUnit4ClassRunner.java:78)
	at org.junit.runners.BlockJUnit4ClassRunner.runChild(BlockJUnit4ClassRunner.java:57)
	at org.junit.runners.ParentRunner$3.run(ParentRunner.java:290)
	at org.junit.runners.ParentRunner$1.schedule(ParentRunner.java:71)
	at org.junit.runners.ParentRunner.runChildren(ParentRunner.java:288)
	at org.junit.runners.ParentRunner.access$000(ParentRunner.java:58)
	at org.junit.runners.ParentRunner$2.evaluate(ParentRunner.java:268)
	at org.junit.runners.ParentRunner.run(ParentRunner.java:363)
	at org.apache.maven.surefire.junit4.JUnit4Provider.execute(JUnit4Provider.java:264)
	at org.apache.maven.surefire.junit4.JUnit4Provider.executeTestSet(JUnit4Provider.java:153)
	at org.apache.maven.surefire.junit4.JUnit4Provider.invoke(JUnit4Provider.java:124)
	at org.apache.maven.surefire.booter.ForkedBooter.invokeProviderInSameClassLoader(ForkedBooter.java:200)
	at org.apache.maven.surefire.booter.ForkedBooter.runSuitesInProcess(ForkedBooter.java:153)
	at org.apache.maven.surefire.booter.ForkedBooter.main(ForkedBooter.java:103)
[main] INFO org.locationtech.geogig.storage.cache.CacheManager - Configuring GeoGig shared object cache maximum size to the default of 2,500 bytes as given by the default 0.250000 percent of available heap. Use the GEOGIG_CACHE_MAX_SIZE System property or environmentvariable to set a different maximum size at runtime
Running org.locationtech.geogig.test.integration.RemoveOpTest
[main] WARN org.locationtech.geogig.storage.cache.CacheManager - Unable to parse System property GEOGIG_CACHE_MAX_SIZE=. Falling back to default value
java.lang.IllegalArgumentException: Invalid format (), expected <float>[B|K|M|G]
	at org.locationtech.geogig.storage.cache.CacheManager.parseCacheSizeArgument(CacheManager.java:269)
	at org.locationtech.geogig.storage.cache.CacheManagerTest.getDefaultSizeMB(CacheManagerTest.java:270)
	at sun.reflect.NativeMethodAccessorImpl.invoke0(Native Method)
	at sun.reflect.NativeMethodAccessorImpl.invoke(NativeMethodAccessorImpl.java:62)
	at sun.reflect.DelegatingMethodAccessorImpl.invoke(DelegatingMethodAccessorImpl.java:43)
	at java.lang.reflect.Method.invoke(Method.java:498)
	at org.junit.runners.model.FrameworkMethod$1.runReflectiveCall(FrameworkMethod.java:50)
	at org.junit.internal.runners.model.ReflectiveCallable.run(ReflectiveCallable.java:12)
	at org.junit.runners.model.FrameworkMethod.invokeExplosively(FrameworkMethod.java:47)
	at org.junit.internal.runners.statements.InvokeMethod.evaluate(InvokeMethod.java:17)
	at org.junit.internal.runners.statements.RunBefores.evaluate(RunBefores.java:26)
	at org.junit.internal.runners.statements.RunAfters.evaluate(RunAfters.java:27)
	at org.junit.rules.ExpectedException$ExpectedExceptionStatement.evaluate(ExpectedException.java:239)
	at org.junit.rules.RunRules.evaluate(RunRules.java:20)
	at org.junit.runners.ParentRunner.runLeaf(ParentRunner.java:325)
	at org.junit.runners.BlockJUnit4ClassRunner.runChild(BlockJUnit4ClassRunner.java:78)
	at org.junit.runners.BlockJUnit4ClassRunner.runChild(BlockJUnit4ClassRunner.java:57)
	at org.junit.runners.ParentRunner$3.run(ParentRunner.java:290)
	at org.junit.runners.ParentRunner$1.schedule(ParentRunner.java:71)
	at org.junit.runners.ParentRunner.runChildren(ParentRunner.java:288)
	at org.junit.runners.ParentRunner.access$000(ParentRunner.java:58)
	at org.junit.runners.ParentRunner$2.evaluate(ParentRunner.java:268)
	at org.junit.runners.ParentRunner.run(ParentRunner.java:363)
	at org.apache.maven.surefire.junit4.JUnit4Provider.execute(JUnit4Provider.java:264)
	at org.apache.maven.surefire.junit4.JUnit4Provider.executeTestSet(JUnit4Provider.java:153)
	at org.apache.maven.surefire.junit4.JUnit4Provider.invoke(JUnit4Provider.java:124)
	at org.apache.maven.surefire.booter.ForkedBooter.invokeProviderInSameClassLoader(ForkedBooter.java:200)
	at org.apache.maven.surefire.booter.ForkedBooter.runSuitesInProcess(ForkedBooter.java:153)
	at org.apache.maven.surefire.booter.ForkedBooter.main(ForkedBooter.java:103)
[main] WARN org.locationtech.geogig.storage.cache.CacheManager - Unable to parse environment variable GEOGIG_CACHE_MAX_SIZE=
java.lang.IllegalArgumentException: Invalid format (), expected <float>[B|K|M|G]
	at org.locationtech.geogig.storage.cache.CacheManager.parseCacheSizeArgument(CacheManager.java:269)
	at org.locationtech.geogig.storage.cache.CacheManagerTest.getDefaultSizeMB(CacheManagerTest.java:270)
	at sun.reflect.NativeMethodAccessorImpl.invoke0(Native Method)
	at sun.reflect.NativeMethodAccessorImpl.invoke(NativeMethodAccessorImpl.java:62)
	at sun.reflect.DelegatingMethodAccessorImpl.invoke(DelegatingMethodAccessorImpl.java:43)
	at java.lang.reflect.Method.invoke(Method.java:498)
	at org.junit.runners.model.FrameworkMethod$1.runReflectiveCall(FrameworkMethod.java:50)
	at org.junit.internal.runners.model.ReflectiveCallable.run(ReflectiveCallable.java:12)
	at org.junit.runners.model.FrameworkMethod.invokeExplosively(FrameworkMethod.java:47)
	at org.junit.internal.runners.statements.InvokeMethod.evaluate(InvokeMethod.java:17)
	at org.junit.internal.runners.statements.RunBefores.evaluate(RunBefores.java:26)
	at org.junit.internal.runners.statements.RunAfters.evaluate(RunAfters.java:27)
	at org.junit.rules.ExpectedException$ExpectedExceptionStatement.evaluate(ExpectedException.java:239)
	at org.junit.rules.RunRules.evaluate(RunRules.java:20)
	at org.junit.runners.ParentRunner.runLeaf(ParentRunner.java:325)
	at org.junit.runners.BlockJUnit4ClassRunner.runChild(BlockJUnit4ClassRunner.java:78)
	at org.junit.runners.BlockJUnit4ClassRunner.runChild(BlockJUnit4ClassRunner.java:57)
	at org.junit.runners.ParentRunner$3.run(ParentRunner.java:290)
	at org.junit.runners.ParentRunner$1.schedule(ParentRunner.java:71)
	at org.junit.runners.ParentRunner.runChildren(ParentRunner.java:288)
	at org.junit.runners.ParentRunner.access$000(ParentRunner.java:58)
	at org.junit.runners.ParentRunner$2.evaluate(ParentRunner.java:268)
	at org.junit.runners.ParentRunner.run(ParentRunner.java:363)
	at org.apache.maven.surefire.junit4.JUnit4Provider.execute(JUnit4Provider.java:264)
	at org.apache.maven.surefire.junit4.JUnit4Provider.executeTestSet(JUnit4Provider.java:153)
	at org.apache.maven.surefire.junit4.JUnit4Provider.invoke(JUnit4Provider.java:124)
	at org.apache.maven.surefire.booter.ForkedBooter.invokeProviderInSameClassLoader(ForkedBooter.java:200)
	at org.apache.maven.surefire.booter.ForkedBooter.runSuitesInProcess(ForkedBooter.java:153)
	at org.apache.maven.surefire.booter.ForkedBooter.main(ForkedBooter.java:103)
[main] INFO org.locationtech.geogig.storage.cache.CacheManager - Configuring GeoGig shared object cache maximum size to the default of 2,621,440 bytes as given by the default 0.250000 percent of available heap. Use the GEOGIG_CACHE_MAX_SIZE System property or environmentvariable to set a different maximum size at runtime
[main] WARN org.locationtech.geogig.storage.cache.CacheManager - Unable to parse System property GEOGIG_CACHE_MAX_SIZE=-1G. Falling back to environment variable
java.lang.IllegalArgumentException: Value must be a positive number or zero
	at com.google.common.base.Preconditions.checkArgument(Preconditions.java:122)
	at org.locationtech.geogig.storage.cache.CacheManager.parseCacheSizeArgument(CacheManager.java:257)
	at org.locationtech.geogig.storage.cache.CacheManagerTest.resolveDefaultMaxSizeInvalidSysPropFallsBackToEnvVariable(CacheManagerTest.java:235)
	at sun.reflect.NativeMethodAccessorImpl.invoke0(Native Method)
	at sun.reflect.NativeMethodAccessorImpl.invoke(NativeMethodAccessorImpl.java:62)
	at sun.reflect.DelegatingMethodAccessorImpl.invoke(DelegatingMethodAccessorImpl.java:43)
	at java.lang.reflect.Method.invoke(Method.java:498)
	at org.junit.runners.model.FrameworkMethod$1.runReflectiveCall(FrameworkMethod.java:50)
	at org.junit.internal.runners.model.ReflectiveCallable.run(ReflectiveCallable.java:12)
	at org.junit.runners.model.FrameworkMethod.invokeExplosively(FrameworkMethod.java:47)
	at org.junit.internal.runners.statements.InvokeMethod.evaluate(InvokeMethod.java:17)
	at org.junit.internal.runners.statements.RunBefores.evaluate(RunBefores.java:26)
	at org.junit.internal.runners.statements.RunAfters.evaluate(RunAfters.java:27)
	at org.junit.rules.ExpectedException$ExpectedExceptionStatement.evaluate(ExpectedException.java:239)
	at org.junit.rules.RunRules.evaluate(RunRules.java:20)
	at org.junit.runners.ParentRunner.runLeaf(ParentRunner.java:325)
	at org.junit.runners.BlockJUnit4ClassRunner.runChild(BlockJUnit4ClassRunner.java:78)
	at org.junit.runners.BlockJUnit4ClassRunner.runChild(BlockJUnit4ClassRunner.java:57)
	at org.junit.runners.ParentRunner$3.run(ParentRunner.java:290)
	at org.junit.runners.ParentRunner$1.schedule(ParentRunner.java:71)
	at org.junit.runners.ParentRunner.runChildren(ParentRunner.java:288)
	at org.junit.runners.ParentRunner.access$000(ParentRunner.java:58)
	at org.junit.runners.ParentRunner$2.evaluate(ParentRunner.java:268)
	at org.junit.runners.ParentRunner.run(ParentRunner.java:363)
	at org.apache.maven.surefire.junit4.JUnit4Provider.execute(JUnit4Provider.java:264)
	at org.apache.maven.surefire.junit4.JUnit4Provider.executeTestSet(JUnit4Provider.java:153)
	at org.apache.maven.surefire.junit4.JUnit4Provider.invoke(JUnit4Provider.java:124)
	at org.apache.maven.surefire.booter.ForkedBooter.invokeProviderInSameClassLoader(ForkedBooter.java:200)
	at org.apache.maven.surefire.booter.ForkedBooter.runSuitesInProcess(ForkedBooter.java:153)
	at org.apache.maven.surefire.booter.ForkedBooter.main(ForkedBooter.java:103)
[main] INFO org.locationtech.geogig.storage.cache.CacheManager - Configuring GeoGig shared object cache maximum size to 1,024 bytes as given by the environment variable GEOGIG_CACHE_MAX_SIZE=1024
[main] WARN org.locationtech.geogig.storage.cache.CacheManager - Unable to parse System property GEOGIG_CACHE_MAX_SIZE=. Falling back to environment variable
java.lang.IllegalArgumentException: Invalid format (), expected <float>[B|K|M|G]
	at org.locationtech.geogig.storage.cache.CacheManager.parseCacheSizeArgument(CacheManager.java:269)
	at org.locationtech.geogig.storage.cache.CacheManagerTest.resolveDefaultMaxSizeEnvironmantVariable(CacheManagerTest.java:214)
	at sun.reflect.NativeMethodAccessorImpl.invoke0(Native Method)
	at sun.reflect.NativeMethodAccessorImpl.invoke(NativeMethodAccessorImpl.java:62)
	at sun.reflect.DelegatingMethodAccessorImpl.invoke(DelegatingMethodAccessorImpl.java:43)
	at java.lang.reflect.Method.invoke(Method.java:498)
	at org.junit.runners.model.FrameworkMethod$1.runReflectiveCall(FrameworkMethod.java:50)
	at org.junit.internal.runners.model.ReflectiveCallable.run(ReflectiveCallable.java:12)
	at org.junit.runners.model.FrameworkMethod.invokeExplosively(FrameworkMethod.java:47)
	at org.junit.internal.runners.statements.InvokeMethod.evaluate(InvokeMethod.java:17)
	at org.junit.internal.runners.statements.RunBefores.evaluate(RunBefores.java:26)
	at org.junit.internal.runners.statements.RunAfters.evaluate(RunAfters.java:27)
	at org.junit.rules.ExpectedException$ExpectedExceptionStatement.evaluate(ExpectedException.java:239)
	at org.junit.rules.RunRules.evaluate(RunRules.java:20)
	at org.junit.runners.ParentRunner.runLeaf(ParentRunner.java:325)
	at org.junit.runners.BlockJUnit4ClassRunner.runChild(BlockJUnit4ClassRunner.java:78)
	at org.junit.runners.BlockJUnit4ClassRunner.runChild(BlockJUnit4ClassRunner.java:57)
	at org.junit.runners.ParentRunner$3.run(ParentRunner.java:290)
	at org.junit.runners.ParentRunner$1.schedule(ParentRunner.java:71)
	at org.junit.runners.ParentRunner.runChildren(ParentRunner.java:288)
	at org.junit.runners.ParentRunner.access$000(ParentRunner.java:58)
	at org.junit.runners.ParentRunner$2.evaluate(ParentRunner.java:268)
	at org.junit.runners.ParentRunner.run(ParentRunner.java:363)
	at org.apache.maven.surefire.junit4.JUnit4Provider.execute(JUnit4Provider.java:264)
	at org.apache.maven.surefire.junit4.JUnit4Provider.executeTestSet(JUnit4Provider.java:153)
	at org.apache.maven.surefire.junit4.JUnit4Provider.invoke(JUnit4Provider.java:124)
	at org.apache.maven.surefire.booter.ForkedBooter.invokeProviderInSameClassLoader(ForkedBooter.java:200)
	at org.apache.maven.surefire.booter.ForkedBooter.runSuitesInProcess(ForkedBooter.java:153)
	at org.apache.maven.surefire.booter.ForkedBooter.main(ForkedBooter.java:103)
[main] INFO org.locationtech.geogig.storage.cache.CacheManager - Configuring GeoGig shared object cache maximum size to 1,048,576 bytes as given by the environment variable GEOGIG_CACHE_MAX_SIZE=1M
[main] WARN org.locationtech.geogig.storage.cache.CacheManager - Unable to parse System property GEOGIG_CACHE_MAX_SIZE=. Falling back to environment variable
java.lang.IllegalArgumentException: Invalid format (), expected <float>[B|K|M|G]
	at org.locationtech.geogig.storage.cache.CacheManager.parseCacheSizeArgument(CacheManager.java:269)
	at org.locationtech.geogig.storage.cache.CacheManagerTest.resolveDefaultMaxSizeEnvironmantVariable(CacheManagerTest.java:217)
	at sun.reflect.NativeMethodAccessorImpl.invoke0(Native Method)
	at sun.reflect.NativeMethodAccessorImpl.invoke(NativeMethodAccessorImpl.java:62)
	at sun.reflect.DelegatingMethodAccessorImpl.invoke(DelegatingMethodAccessorImpl.java:43)
	at java.lang.reflect.Method.invoke(Method.java:498)
	at org.junit.runners.model.FrameworkMethod$1.runReflectiveCall(FrameworkMethod.java:50)
	at org.junit.internal.runners.model.ReflectiveCallable.run(ReflectiveCallable.java:12)
	at org.junit.runners.model.FrameworkMethod.invokeExplosively(FrameworkMethod.java:47)
	at org.junit.internal.runners.statements.InvokeMethod.evaluate(InvokeMethod.java:17)
	at org.junit.internal.runners.statements.RunBefores.evaluate(RunBefores.java:26)
	at org.junit.internal.runners.statements.RunAfters.evaluate(RunAfters.java:27)
	at org.junit.rules.ExpectedException$ExpectedExceptionStatement.evaluate(ExpectedException.java:239)
	at org.junit.rules.RunRules.evaluate(RunRules.java:20)
	at org.junit.runners.ParentRunner.runLeaf(ParentRunner.java:325)
	at org.junit.runners.BlockJUnit4ClassRunner.runChild(BlockJUnit4ClassRunner.java:78)
	at org.junit.runners.BlockJUnit4ClassRunner.runChild(BlockJUnit4ClassRunner.java:57)
	at org.junit.runners.ParentRunner$3.run(ParentRunner.java:290)
	at org.junit.runners.ParentRunner$1.schedule(ParentRunner.java:71)
	at org.junit.runners.ParentRunner.runChildren(ParentRunner.java:288)
	at org.junit.runners.ParentRunner.access$000(ParentRunner.java:58)
	at org.junit.runners.ParentRunner$2.evaluate(ParentRunner.java:268)
	at org.junit.runners.ParentRunner.run(ParentRunner.java:363)
	at org.apache.maven.surefire.junit4.JUnit4Provider.execute(JUnit4Provider.java:264)
	at org.apache.maven.surefire.junit4.JUnit4Provider.executeTestSet(JUnit4Provider.java:153)
	at org.apache.maven.surefire.junit4.JUnit4Provider.invoke(JUnit4Provider.java:124)
	at org.apache.maven.surefire.booter.ForkedBooter.invokeProviderInSameClassLoader(ForkedBooter.java:200)
	at org.apache.maven.surefire.booter.ForkedBooter.runSuitesInProcess(ForkedBooter.java:153)
	at org.apache.maven.surefire.booter.ForkedBooter.main(ForkedBooter.java:103)
[main] INFO org.locationtech.geogig.storage.cache.CacheManager - Configuring GeoGig shared object cache maximum size to 102,400 bytes as given by the environment variable GEOGIG_CACHE_MAX_SIZE=100K
[main] WARN org.locationtech.geogig.storage.cache.CacheManager - Unable to parse System property GEOGIG_CACHE_MAX_SIZE=. Falling back to environment variable
java.lang.IllegalArgumentException: Invalid format (), expected <float>[B|K|M|G]
	at org.locationtech.geogig.storage.cache.CacheManager.parseCacheSizeArgument(CacheManager.java:269)
	at org.locationtech.geogig.storage.cache.CacheManagerTest.resolveDefaultMaxSizeEnvironmantVariable(CacheManagerTest.java:223)
	at sun.reflect.NativeMethodAccessorImpl.invoke0(Native Method)
	at sun.reflect.NativeMethodAccessorImpl.invoke(NativeMethodAccessorImpl.java:62)
	at sun.reflect.DelegatingMethodAccessorImpl.invoke(DelegatingMethodAccessorImpl.java:43)
	at java.lang.reflect.Method.invoke(Method.java:498)
	at org.junit.runners.model.FrameworkMethod$1.runReflectiveCall(FrameworkMethod.java:50)
	at org.junit.internal.runners.model.ReflectiveCallable.run(ReflectiveCallable.java:12)
	at org.junit.runners.model.FrameworkMethod.invokeExplosively(FrameworkMethod.java:47)
	at org.junit.internal.runners.statements.InvokeMethod.evaluate(InvokeMethod.java:17)
	at org.junit.internal.runners.statements.RunBefores.evaluate(RunBefores.java:26)
	at org.junit.internal.runners.statements.RunAfters.evaluate(RunAfters.java:27)
	at org.junit.rules.ExpectedException$ExpectedExceptionStatement.evaluate(ExpectedException.java:239)
	at org.junit.rules.RunRules.evaluate(RunRules.java:20)
	at org.junit.runners.ParentRunner.runLeaf(ParentRunner.java:325)
	at org.junit.runners.BlockJUnit4ClassRunner.runChild(BlockJUnit4ClassRunner.java:78)
	at org.junit.runners.BlockJUnit4ClassRunner.runChild(BlockJUnit4ClassRunner.java:57)
	at org.junit.runners.ParentRunner$3.run(ParentRunner.java:290)
	at org.junit.runners.ParentRunner$1.schedule(ParentRunner.java:71)
	at org.junit.runners.ParentRunner.runChildren(ParentRunner.java:288)
	at org.junit.runners.ParentRunner.access$000(ParentRunner.java:58)
	at org.junit.runners.ParentRunner$2.evaluate(ParentRunner.java:268)
	at org.junit.runners.ParentRunner.run(ParentRunner.java:363)
	at org.apache.maven.surefire.junit4.JUnit4Provider.execute(JUnit4Provider.java:264)
	at org.apache.maven.surefire.junit4.JUnit4Provider.executeTestSet(JUnit4Provider.java:153)
	at org.apache.maven.surefire.junit4.JUnit4Provider.invoke(JUnit4Provider.java:124)
	at org.apache.maven.surefire.booter.ForkedBooter.invokeProviderInSameClassLoader(ForkedBooter.java:200)
	at org.apache.maven.surefire.booter.ForkedBooter.runSuitesInProcess(ForkedBooter.java:153)
	at org.apache.maven.surefire.booter.ForkedBooter.main(ForkedBooter.java:103)
[main] INFO org.locationtech.geogig.storage.cache.CacheManager - Configuring GeoGig shared object cache maximum size to 5,000 bytes as given by the environment variable GEOGIG_CACHE_MAX_SIZE=0.5
[main] WARN org.locationtech.geogig.storage.cache.CacheManager - Unable to parse System property GEOGIG_CACHE_MAX_SIZE=. Falling back to environment variable
java.lang.IllegalArgumentException: Invalid format (), expected <float>[B|K|M|G]
	at org.locationtech.geogig.storage.cache.CacheManager.parseCacheSizeArgument(CacheManager.java:269)
	at org.locationtech.geogig.storage.cache.CacheManagerTest.assertDefaultMaxSizeDefaultValue(CacheManagerTest.java:188)
	at org.locationtech.geogig.storage.cache.CacheManagerTest.resolveDefaultMaxSizeEnvironmantVariableInvalidValue(CacheManagerTest.java:229)
	at sun.reflect.NativeMethodAccessorImpl.invoke0(Native Method)
	at sun.reflect.NativeMethodAccessorImpl.invoke(NativeMethodAccessorImpl.java:62)
	at sun.reflect.DelegatingMethodAccessorImpl.invoke(DelegatingMethodAccessorImpl.java:43)
	at java.lang.reflect.Method.invoke(Method.java:498)
	at org.junit.runners.model.FrameworkMethod$1.runReflectiveCall(FrameworkMethod.java:50)
	at org.junit.internal.runners.model.ReflectiveCallable.run(ReflectiveCallable.java:12)
	at org.junit.runners.model.FrameworkMethod.invokeExplosively(FrameworkMethod.java:47)
	at org.junit.internal.runners.statements.InvokeMethod.evaluate(InvokeMethod.java:17)
	at org.junit.internal.runners.statements.RunBefores.evaluate(RunBefores.java:26)
	at org.junit.internal.runners.statements.RunAfters.evaluate(RunAfters.java:27)
	at org.junit.rules.ExpectedException$ExpectedExceptionStatement.evaluate(ExpectedException.java:239)
	at org.junit.rules.RunRules.evaluate(RunRules.java:20)
	at org.junit.runners.ParentRunner.runLeaf(ParentRunner.java:325)
	at org.junit.runners.BlockJUnit4ClassRunner.runChild(BlockJUnit4ClassRunner.java:78)
	at org.junit.runners.BlockJUnit4ClassRunner.runChild(BlockJUnit4ClassRunner.java:57)
	at org.junit.runners.ParentRunner$3.run(ParentRunner.java:290)
	at org.junit.runners.ParentRunner$1.schedule(ParentRunner.java:71)
	at org.junit.runners.ParentRunner.runChildren(ParentRunner.java:288)
	at org.junit.runners.ParentRunner.access$000(ParentRunner.java:58)
	at org.junit.runners.ParentRunner$2.evaluate(ParentRunner.java:268)
	at org.junit.runners.ParentRunner.run(ParentRunner.java:363)
	at org.apache.maven.surefire.junit4.JUnit4Provider.execute(JUnit4Provider.java:264)
	at org.apache.maven.surefire.junit4.JUnit4Provider.executeTestSet(JUnit4Provider.java:153)
	at org.apache.maven.surefire.junit4.JUnit4Provider.invoke(JUnit4Provider.java:124)
	at org.apache.maven.surefire.booter.ForkedBooter.invokeProviderInSameClassLoader(ForkedBooter.java:200)
	at org.apache.maven.surefire.booter.ForkedBooter.runSuitesInProcess(ForkedBooter.java:153)
	at org.apache.maven.surefire.booter.ForkedBooter.main(ForkedBooter.java:103)
[main] WARN org.locationtech.geogig.storage.cache.CacheManager - Unable to parse environment variable GEOGIG_CACHE_MAX_SIZE=-1G
java.lang.IllegalArgumentException: Value must be a positive number or zero
	at com.google.common.base.Preconditions.checkArgument(Preconditions.java:122)
	at org.locationtech.geogig.storage.cache.CacheManager.parseCacheSizeArgument(CacheManager.java:257)
	at org.locationtech.geogig.storage.cache.CacheManagerTest.assertDefaultMaxSizeDefaultValue(CacheManagerTest.java:188)
	at org.locationtech.geogig.storage.cache.CacheManagerTest.resolveDefaultMaxSizeEnvironmantVariableInvalidValue(CacheManagerTest.java:229)
	at sun.reflect.NativeMethodAccessorImpl.invoke0(Native Method)
	at sun.reflect.NativeMethodAccessorImpl.invoke(NativeMethodAccessorImpl.java:62)
	at sun.reflect.DelegatingMethodAccessorImpl.invoke(DelegatingMethodAccessorImpl.java:43)
	at java.lang.reflect.Method.invoke(Method.java:498)
	at org.junit.runners.model.FrameworkMethod$1.runReflectiveCall(FrameworkMethod.java:50)
	at org.junit.internal.runners.model.ReflectiveCallable.run(ReflectiveCallable.java:12)
	at org.junit.runners.model.FrameworkMethod.invokeExplosively(FrameworkMethod.java:47)
	at org.junit.internal.runners.statements.InvokeMethod.evaluate(InvokeMethod.java:17)
	at org.junit.internal.runners.statements.RunBefores.evaluate(RunBefores.java:26)
	at org.junit.internal.runners.statements.RunAfters.evaluate(RunAfters.java:27)
	at org.junit.rules.ExpectedException$ExpectedExceptionStatement.evaluate(ExpectedException.java:239)
	at org.junit.rules.RunRules.evaluate(RunRules.java:20)
	at org.junit.runners.ParentRunner.runLeaf(ParentRunner.java:325)
	at org.junit.runners.BlockJUnit4ClassRunner.runChild(BlockJUnit4ClassRunner.java:78)
	at org.junit.runners.BlockJUnit4ClassRunner.runChild(BlockJUnit4ClassRunner.java:57)
	at org.junit.runners.ParentRunner$3.run(ParentRunner.java:290)
	at org.junit.runners.ParentRunner$1.schedule(ParentRunner.java:71)
	at org.junit.runners.ParentRunner.runChildren(ParentRunner.java:288)
	at org.junit.runners.ParentRunner.access$000(ParentRunner.java:58)
	at org.junit.runners.ParentRunner$2.evaluate(ParentRunner.java:268)
	at org.junit.runners.ParentRunner.run(ParentRunner.java:363)
	at org.apache.maven.surefire.junit4.JUnit4Provider.execute(JUnit4Provider.java:264)
	at org.apache.maven.surefire.junit4.JUnit4Provider.executeTestSet(JUnit4Provider.java:153)
	at org.apache.maven.surefire.junit4.JUnit4Provider.invoke(JUnit4Provider.java:124)
	at org.apache.maven.surefire.booter.ForkedBooter.invokeProviderInSameClassLoader(ForkedBooter.java:200)
	at org.apache.maven.surefire.booter.ForkedBooter.runSuitesInProcess(ForkedBooter.java:153)
	at org.apache.maven.surefire.booter.ForkedBooter.main(ForkedBooter.java:103)
[main] INFO org.locationtech.geogig.storage.cache.CacheManager - Configuring GeoGig shared object cache maximum size to the default of 2,500 bytes as given by the default 0.250000 percent of available heap. Use the GEOGIG_CACHE_MAX_SIZE System property or environmentvariable to set a different maximum size at runtime
[main] INFO org.locationtech.geogig.storage.cache.CacheManager - Configuring GeoGig shared object cache maximum size to the default of 119,406,592 bytes as given by the default 0.250000 percent of available heap. Use the GEOGIG_CACHE_MAX_SIZE System property or environmentvariable to set a different maximum size at runtime
[main] WARN org.locationtech.geogig.storage.cache.CacheManager - Unable to parse System property GEOGIG_CACHE_MAX_SIZE=0.91. Falling back to environment variable
java.lang.IllegalArgumentException: percent must be between zero and 90% (0.9)
	at com.google.common.base.Preconditions.checkArgument(Preconditions.java:122)
	at org.locationtech.geogig.storage.cache.CacheManager.getCacheSizePercent(CacheManager.java:203)
	at org.locationtech.geogig.storage.cache.CacheManagerTest.assertDefaultMaxSizeDefaultValue(CacheManagerTest.java:188)
	at org.locationtech.geogig.storage.cache.CacheManagerTest.resolveDefaultMaxSizeInvalidSysPropAndEnvVarFallsBackToDefaultPercent(CacheManagerTest.java:242)
	at sun.reflect.NativeMethodAccessorImpl.invoke0(Native Method)
	at sun.reflect.NativeMethodAccessorImpl.invoke(NativeMethodAccessorImpl.java:62)
	at sun.reflect.DelegatingMethodAccessorImpl.invoke(DelegatingMethodAccessorImpl.java:43)
	at java.lang.reflect.Method.invoke(Method.java:498)
	at org.junit.runners.model.FrameworkMethod$1.runReflectiveCall(FrameworkMethod.java:50)
	at org.junit.internal.runners.model.ReflectiveCallable.run(ReflectiveCallable.java:12)
	at org.junit.runners.model.FrameworkMethod.invokeExplosively(FrameworkMethod.java:47)
	at org.junit.internal.runners.statements.InvokeMethod.evaluate(InvokeMethod.java:17)
	at org.junit.internal.runners.statements.RunBefores.evaluate(RunBefores.java:26)
	at org.junit.internal.runners.statements.RunAfters.evaluate(RunAfters.java:27)
	at org.junit.rules.ExpectedException$ExpectedExceptionStatement.evaluate(ExpectedException.java:239)
	at org.junit.rules.RunRules.evaluate(RunRules.java:20)
	at org.junit.runners.ParentRunner.runLeaf(ParentRunner.java:325)
	at org.junit.runners.BlockJUnit4ClassRunner.runChild(BlockJUnit4ClassRunner.java:78)
	at org.junit.runners.BlockJUnit4ClassRunner.runChild(BlockJUnit4ClassRunner.java:57)
	at org.junit.runners.ParentRunner$3.run(ParentRunner.java:290)
	at org.junit.runners.ParentRunner$1.schedule(ParentRunner.java:71)
	at org.junit.runners.ParentRunner.runChildren(ParentRunner.java:288)
	at org.junit.runners.ParentRunner.access$000(ParentRunner.java:58)
	at org.junit.runners.ParentRunner$2.evaluate(ParentRunner.java:268)
	at org.junit.runners.ParentRunner.run(ParentRunner.java:363)
	at org.apache.maven.surefire.junit4.JUnit4Provider.execute(JUnit4Provider.java:264)
	at org.apache.maven.surefire.junit4.JUnit4Provider.executeTestSet(JUnit4Provider.java:153)
	at org.apache.maven.surefire.junit4.JUnit4Provider.invoke(JUnit4Provider.java:124)
	at org.apache.maven.surefire.booter.ForkedBooter.invokeProviderInSameClassLoader(ForkedBooter.java:200)
	at org.apache.maven.surefire.booter.ForkedBooter.runSuitesInProcess(ForkedBooter.java:153)
	at org.apache.maven.surefire.booter.ForkedBooter.main(ForkedBooter.java:103)
[main] WARN org.locationtech.geogig.storage.cache.CacheManager - Unable to parse environment variable GEOGIG_CACHE_MAX_SIZE=alsoInvalid
java.lang.IllegalArgumentException: Invalid format (ALSOINVALID), expected <float>[B|K|M|G]
	at org.locationtech.geogig.storage.cache.CacheManager.parseCacheSizeArgument(CacheManager.java:269)
	at org.locationtech.geogig.storage.cache.CacheManagerTest.assertDefaultMaxSizeDefaultValue(CacheManagerTest.java:188)
	at org.locationtech.geogig.storage.cache.CacheManagerTest.resolveDefaultMaxSizeInvalidSysPropAndEnvVarFallsBackToDefaultPercent(CacheManagerTest.java:242)
	at sun.reflect.NativeMethodAccessorImpl.invoke0(Native Method)
	at sun.reflect.NativeMethodAccessorImpl.invoke(NativeMethodAccessorImpl.java:62)
	at sun.reflect.DelegatingMethodAccessorImpl.invoke(DelegatingMethodAccessorImpl.java:43)
	at java.lang.reflect.Method.invoke(Method.java:498)
	at org.junit.runners.model.FrameworkMethod$1.runReflectiveCall(FrameworkMethod.java:50)
	at org.junit.internal.runners.model.ReflectiveCallable.run(ReflectiveCallable.java:12)
	at org.junit.runners.model.FrameworkMethod.invokeExplosively(FrameworkMethod.java:47)
	at org.junit.internal.runners.statements.InvokeMethod.evaluate(InvokeMethod.java:17)
	at org.junit.internal.runners.statements.RunBefores.evaluate(RunBefores.java:26)
	at org.junit.internal.runners.statements.RunAfters.evaluate(RunAfters.java:27)
	at org.junit.rules.ExpectedException$ExpectedExceptionStatement.evaluate(ExpectedException.java:239)
	at org.junit.rules.RunRules.evaluate(RunRules.java:20)
	at org.junit.runners.ParentRunner.runLeaf(ParentRunner.java:325)
	at org.junit.runners.BlockJUnit4ClassRunner.runChild(BlockJUnit4ClassRunner.java:78)
	at org.junit.runners.BlockJUnit4ClassRunner.runChild(BlockJUnit4ClassRunner.java:57)
	at org.junit.runners.ParentRunner$3.run(ParentRunner.java:290)
	at org.junit.runners.ParentRunner$1.schedule(ParentRunner.java:71)
	at org.junit.runners.ParentRunner.runChildren(ParentRunner.java:288)
	at org.junit.runners.ParentRunner.access$000(ParentRunner.java:58)
	at org.junit.runners.ParentRunner$2.evaluate(ParentRunner.java:268)
	at org.junit.runners.ParentRunner.run(ParentRunner.java:363)
	at org.apache.maven.surefire.junit4.JUnit4Provider.execute(JUnit4Provider.java:264)
	at org.apache.maven.surefire.junit4.JUnit4Provider.executeTestSet(JUnit4Provider.java:153)
	at org.apache.maven.surefire.junit4.JUnit4Provider.invoke(JUnit4Provider.java:124)
	at org.apache.maven.surefire.booter.ForkedBooter.invokeProviderInSameClassLoader(ForkedBooter.java:200)
	at org.apache.maven.surefire.booter.ForkedBooter.runSuitesInProcess(ForkedBooter.java:153)
	at org.apache.maven.surefire.booter.ForkedBooter.main(ForkedBooter.java:103)
[main] INFO org.locationtech.geogig.storage.cache.CacheManager - Configuring GeoGig shared object cache maximum size to the default of 2,500 bytes as given by the default 0.250000 percent of available heap. Use the GEOGIG_CACHE_MAX_SIZE System property or environmentvariable to set a different maximum size at runtime
Tests run: 31, Failures: 0, Errors: 0, Skipped: 0, Time elapsed: 2.494 sec - in org.locationtech.geogig.storage.cache.CacheManagerTest
Running org.locationtech.geogig.test.integration.RevParseIntegrationTest
Tests run: 24, Failures: 0, Errors: 0, Skipped: 0, Time elapsed: 3.981 sec - in org.locationtech.geogig.storage.memory.HeapObjectStoreConformanceTest
Running org.locationtech.geogig.test.integration.ApplyPatchOpTest
Tests run: 39, Failures: 0, Errors: 0, Skipped: 0, Time elapsed: 4.773 sec - in org.locationtech.geogig.storage.memory.HeapIndexDatabaseConformanceTest
Tests run: 7, Failures: 0, Errors: 0, Skipped: 0, Time elapsed: 4.874 sec - in org.locationtech.geogig.storage.datastream.v2_3.NodeSetTest
Running org.locationtech.geogig.test.integration.RemoteRemoveOpTest
Running org.locationtech.geogig.test.integration.BranchRenameOpTest
Tests run: 14, Failures: 0, Errors: 0, Skipped: 0, Time elapsed: 4.678 sec - in org.locationtech.geogig.storage.fs.FileConflictsDatabaseConformanceTest
Running org.locationtech.geogig.test.integration.LogOpTest
Tests run: 21, Failures: 0, Errors: 0, Skipped: 0, Time elapsed: 5.349 sec - in org.locationtech.geogig.storage.datastream.DataStreamSerializationFactoryV2_1Test
Running org.locationtech.geogig.test.integration.GeogigTransactionTest
Tests run: 21, Failures: 0, Errors: 0, Skipped: 0, Time elapsed: 5.363 sec - in org.locationtech.geogig.storage.datastream.DataStreamSerializationFactoryV2Test
Running org.locationtech.geogig.test.integration.PushOpTest
Tests run: 21, Failures: 0, Errors: 0, Skipped: 0, Time elapsed: 5.434 sec - in org.locationtech.geogig.storage.datastream.LZFSerializationFactoryTest
Running org.locationtech.geogig.test.integration.RevertOpTest
Tests run: 22, Failures: 0, Errors: 0, Skipped: 0, Time elapsed: 4.92 sec - in org.locationtech.geogig.storage.text.TextSerializationFactoryTest
Running org.locationtech.geogig.test.integration.BranchListOpTest
Tests run: 21, Failures: 0, Errors: 0, Skipped: 0, Time elapsed: 5.515 sec - in org.locationtech.geogig.storage.datastream.LZ4SerializationFactoryTest
Running org.locationtech.geogig.test.integration.BranchCreateOpTest
Tests run: 21, Failures: 0, Errors: 0, Skipped: 0, Time elapsed: 5.64 sec - in org.locationtech.geogig.storage.datastream.v2_3.DataStreamSerializationFactoryV2_3Test
Running org.locationtech.geogig.test.integration.RebaseOpTest
Tests run: 21, Failures: 0, Errors: 0, Skipped: 0, Time elapsed: 5.653 sec - in org.locationtech.geogig.storage.datastream.DataStreamSerializationFactoryV2_2Test
Running org.locationtech.geogig.test.integration.TagTest
Tests run: 21, Failures: 0, Errors: 0, Skipped: 0, Time elapsed: 5.798 sec - in org.locationtech.geogig.storage.datastream.DataStreamSerializationFactoryV1Test
Running org.locationtech.geogig.test.integration.MergeOpTest
Tests run: 1, Failures: 0, Errors: 0, Skipped: 0, Time elapsed: 5.615 sec - in org.locationtech.geogig.storage.impl.INIBlobTest
Running org.locationtech.geogig.test.integration.CloneOpTest
testMergeNoCommits
testOctopusMerge
[main] INFO org.locationtech.geogig.hooks.Scripting - Running jvm script /opt/public/hipp/ramdisk/geogig/junit2125162085574534972/repo1891855986/.geogig/hooks/pre_commit.js
Tests run: 3, Failures: 0, Errors: 0, Skipped: 0, Time elapsed: 2.35 sec - in org.locationtech.geogig.test.integration.TagTest
Running org.locationtech.geogig.test.integration.FetchOpTest
Tests run: 8, Failures: 0, Errors: 0, Skipped: 0, Time elapsed: 8.45 sec - in org.locationtech.geogig.storage.datastream.v2_3.RevTreeFormatTest
Running org.locationtech.geogig.test.integration.FindCommonAncestorTest
[main] INFO org.locationtech.geogig.hooks.Scripting - Running jvm script /opt/public/hipp/ramdisk/geogig/junit2125162085574534972/repo1891855986/.geogig/hooks/pre_commit.js
Tests run: 21, Failures: 0, Errors: 0, Skipped: 0, Time elapsed: 7.894 sec - in org.locationtech.geogig.test.integration.ConfigOpTest
Running org.locationtech.geogig.test.integration.AddOpTest
Tests run: 3, Failures: 0, Errors: 0, Skipped: 0, Time elapsed: 8.23 sec - in org.locationtech.geogig.test.integration.CleanOpTest
Running org.locationtech.geogig.test.integration.ReportCommitConflictsOpTest
Tests run: 7, Failures: 0, Errors: 0, Skipped: 0, Time elapsed: 6.872 sec - in org.locationtech.geogig.test.integration.RevParseIntegrationTest
Running org.locationtech.geogig.test.integration.BlameOpTest
[main] INFO org.locationtech.geogig.hooks.Scripting - Running jvm script /opt/public/hipp/ramdisk/geogig/junit7211391383921385921/repo110403742/.geogig/hooks/post_commit.js
[main] WARN org.locationtech.geogig.hooks.CommandHookChain - Post-command hook org.locationtech.geogig.hooks.JVMScriptHook@1a15b789 for command org.locationtech.geogig.porcelain.CommitOp threw an exception that will not be propagated
java.lang.NullPointerException
	at org.locationtech.geogig.hooks.Scripting.runJVMScript(Scripting.java:93)
	at org.locationtech.geogig.hooks.JVMScriptHook.post(JVMScriptHook.java:52)
	at org.locationtech.geogig.hooks.CommandHookChain.runPostHooks(CommandHookChain.java:65)
	at org.locationtech.geogig.hooks.CommandHooksDecorator$HooksListener.postCall(CommandHooksDecorator.java:60)
	at org.locationtech.geogig.repository.AbstractGeoGigOp.notifyPost(AbstractGeoGigOp.java:179)
	at org.locationtech.geogig.repository.AbstractGeoGigOp.call(AbstractGeoGigOp.java:155)
	at org.locationtech.geogig.test.integration.HooksTest.testFailingPostPostProcessHook(HooksTest.java:148)
	at sun.reflect.NativeMethodAccessorImpl.invoke0(Native Method)
	at sun.reflect.NativeMethodAccessorImpl.invoke(NativeMethodAccessorImpl.java:62)
	at sun.reflect.DelegatingMethodAccessorImpl.invoke(DelegatingMethodAccessorImpl.java:43)
	at java.lang.reflect.Method.invoke(Method.java:498)
	at org.junit.runners.model.FrameworkMethod$1.runReflectiveCall(FrameworkMethod.java:50)
	at org.junit.internal.runners.model.ReflectiveCallable.run(ReflectiveCallable.java:12)
	at org.junit.runners.model.FrameworkMethod.invokeExplosively(FrameworkMethod.java:47)
	at org.junit.internal.runners.statements.InvokeMethod.evaluate(InvokeMethod.java:17)
	at org.junit.internal.runners.statements.RunBefores.evaluate(RunBefores.java:26)
	at org.junit.internal.runners.statements.RunAfters.evaluate(RunAfters.java:27)
	at org.junit.rules.ExternalResource$1.evaluate(ExternalResource.java:48)
	at org.junit.rules.RunRules.evaluate(RunRules.java:20)
	at org.junit.runners.ParentRunner.runLeaf(ParentRunner.java:325)
	at org.junit.runners.BlockJUnit4ClassRunner.runChild(BlockJUnit4ClassRunner.java:78)
	at org.junit.runners.BlockJUnit4ClassRunner.runChild(BlockJUnit4ClassRunner.java:57)
	at org.junit.runners.ParentRunner$3.run(ParentRunner.java:290)
	at org.junit.runners.ParentRunner$1.schedule(ParentRunner.java:71)
	at org.junit.runners.ParentRunner.runChildren(ParentRunner.java:288)
	at org.junit.runners.ParentRunner.access$000(ParentRunner.java:58)
	at org.junit.runners.ParentRunner$2.evaluate(ParentRunner.java:268)
	at org.junit.runners.ParentRunner.run(ParentRunner.java:363)
	at org.apache.maven.surefire.junit4.JUnit4Provider.execute(JUnit4Provider.java:264)
	at org.apache.maven.surefire.junit4.JUnit4Provider.executeTestSet(JUnit4Provider.java:153)
	at org.apache.maven.surefire.junit4.JUnit4Provider.invoke(JUnit4Provider.java:124)
	at org.apache.maven.surefire.booter.ForkedBooter.invokeProviderInSameClassLoader(ForkedBooter.java:200)
	at org.apache.maven.surefire.booter.ForkedBooter.runSuitesInProcess(ForkedBooter.java:153)
	at org.apache.maven.surefire.booter.ForkedBooter.main(ForkedBooter.java:103)
testMergeTwice
[main] WARN org.locationtech.geogig.hooks.CommandHookChain - Post-command hook org.locationtech.geogig.test.integration.HooksTest$ClasspathHookTest@3113a37 for command org.locationtech.geogig.porcelain.AddOp threw an exception that will not be propagated
java.lang.RuntimeException: expected
	at org.locationtech.geogig.test.integration.HooksTest$ClasspathHookTest.post(HooksTest.java:266)
	at org.locationtech.geogig.hooks.CommandHookChain.runPostHooks(CommandHookChain.java:65)
	at org.locationtech.geogig.hooks.CommandHooksDecorator$HooksListener.postCall(CommandHooksDecorator.java:60)
	at org.locationtech.geogig.repository.AbstractGeoGigOp.notifyPost(AbstractGeoGigOp.java:179)
	at org.locationtech.geogig.repository.AbstractGeoGigOp.call(AbstractGeoGigOp.java:155)
	at org.locationtech.geogig.test.integration.RepositoryTestCase.insertAndAdd(RepositoryTestCase.java:377)
	at org.locationtech.geogig.test.integration.RepositoryTestCase.insertAndAdd(RepositoryTestCase.java:365)
	at org.locationtech.geogig.test.integration.HooksTest.testClasspathHookPostFail(HooksTest.java:191)
	at sun.reflect.NativeMethodAccessorImpl.invoke0(Native Method)
	at sun.reflect.NativeMethodAccessorImpl.invoke(NativeMethodAccessorImpl.java:62)
	at sun.reflect.DelegatingMethodAccessorImpl.invoke(DelegatingMethodAccessorImpl.java:43)
	at java.lang.reflect.Method.invoke(Method.java:498)
	at org.junit.runners.model.FrameworkMethod$1.runReflectiveCall(FrameworkMethod.java:50)
	at org.junit.internal.runners.model.ReflectiveCallable.run(ReflectiveCallable.java:12)
	at org.junit.runners.model.FrameworkMethod.invokeExplosively(FrameworkMethod.java:47)
	at org.junit.internal.runners.statements.InvokeMethod.evaluate(InvokeMethod.java:17)
	at org.junit.internal.runners.statements.RunBefores.evaluate(RunBefores.java:26)
	at org.junit.internal.runners.statements.RunAfters.evaluate(RunAfters.java:27)
	at org.junit.rules.ExternalResource$1.evaluate(ExternalResource.java:48)
	at org.junit.rules.RunRules.evaluate(RunRules.java:20)
	at org.junit.runners.ParentRunner.runLeaf(ParentRunner.java:325)
	at org.junit.runners.BlockJUnit4ClassRunner.runChild(BlockJUnit4ClassRunner.java:78)
	at org.junit.runners.BlockJUnit4ClassRunner.runChild(BlockJUnit4ClassRunner.java:57)
	at org.junit.runners.ParentRunner$3.run(ParentRunner.java:290)
	at org.junit.runners.ParentRunner$1.schedule(ParentRunner.java:71)
	at org.junit.runners.ParentRunner.runChildren(ParentRunner.java:288)
	at org.junit.runners.ParentRunner.access$000(ParentRunner.java:58)
	at org.junit.runners.ParentRunner$2.evaluate(ParentRunner.java:268)
	at org.junit.runners.ParentRunner.run(ParentRunner.java:363)
	at org.apache.maven.surefire.junit4.JUnit4Provider.execute(JUnit4Provider.java:264)
	at org.apache.maven.surefire.junit4.JUnit4Provider.executeTestSet(JUnit4Provider.java:153)
	at org.apache.maven.surefire.junit4.JUnit4Provider.invoke(JUnit4Provider.java:124)
	at org.apache.maven.surefire.booter.ForkedBooter.invokeProviderInSameClassLoader(ForkedBooter.java:200)
	at org.apache.maven.surefire.booter.ForkedBooter.runSuitesInProcess(ForkedBooter.java:153)
	at org.apache.maven.surefire.booter.ForkedBooter.main(ForkedBooter.java:103)
Tests run: 11, Failures: 0, Errors: 0, Skipped: 0, Time elapsed: 4.177 sec - in org.locationtech.geogig.test.integration.BranchCreateOpTest
Running org.locationtech.geogig.test.integration.PullOpTest
[main] INFO org.locationtech.geogig.hooks.Scripting - Running shell script /opt/public/hipp/ramdisk/geogig/junit2185347890056486267/repo1966411483/.geogig/hooks/pre_commit.bat
[main] INFO org.locationtech.geogig.hooks.Scripting - Running shell script /opt/public/hipp/ramdisk/geogig/junit2185347890056486267/repo1966411483/.geogig/hooks/pre_commit.bat
[main] INFO org.locationtech.geogig.plumbing.SendPack - Pushing Ref[refs/heads/master -> a3ad4dd3b550a1215e3001faf8071e3448956105] to refs/remotes/origin/NewRemoteBranch(NewRemoteBranch)
[main] INFO org.locationtech.geogig.plumbing.SendPack - Pushing Ref[refs/heads/Branch1 -> 43a3e480cf2de155a4a8a7b4a9030df9a23ab671] to refs/remotes/origin/NewRemoteBranch2(NewRemoteBranch2)
testNoFastForwardSpecifyAuthor
[main] INFO org.locationtech.geogig.hooks.Scripting - Running jvm script /opt/public/hipp/ramdisk/geogig/junit3176430581804814150/repo1032198431/.geogig/hooks/pre_commit.js
Tests run: 7, Failures: 0, Errors: 0, Skipped: 0, Time elapsed: 9.686 sec - in org.locationtech.geogig.test.integration.HooksTest
Running org.locationtech.geogig.test.integration.CheckSparsePathTest
Tests run: 8, Failures: 0, Errors: 0, Skipped: 0, Time elapsed: 5.712 sec - in org.locationtech.geogig.test.integration.RemoteRemoveOpTest
Running org.locationtech.geogig.test.integration.CreatePatchOpTest
Tests run: 6, Failures: 0, Errors: 0, Skipped: 0, Time elapsed: 1.884 sec - in org.locationtech.geogig.test.integration.BlameOpTest
Running org.locationtech.geogig.test.integration.SquashOpTest
Tests run: 2, Failures: 0, Errors: 0, Skipped: 0, Time elapsed: 5.718 sec - in org.locationtech.geogig.test.integration.BranchListOpTest
Running org.locationtech.geogig.test.integration.SparseCloneTest
testBothBranchesSameGeometryChange
Tests run: 9, Failures: 0, Errors: 0, Skipped: 0, Time elapsed: 10.01 sec - in org.locationtech.geogig.test.integration.repository.IndexTest
Running org.locationtech.geogig.test.integration.DiffOpTest
testMergeFastForwardSecondCase
Tests run: 20, Failures: 0, Errors: 0, Skipped: 0, Time elapsed: 10.241 sec - in org.locationtech.geogig.test.integration.repository.WorkingTreeTest
Running org.locationtech.geogig.test.integration.CleanRefsOpTest
Tests run: 9, Failures: 0, Errors: 0, Skipped: 0, Time elapsed: 12.247 sec - in org.locationtech.geogig.storage.cache.SharedCacheTest
Running org.locationtech.geogig.test.integration.LsTreeOpTest
Tests run: 1, Failures: 0, Errors: 0, Skipped: 0, Time elapsed: 0.084 sec - in org.locationtech.geogig.test.integration.CleanRefsOpTest
Tests run: 15, Failures: 0, Errors: 0, Skipped: 0, Time elapsed: 6.739 sec - in org.locationtech.geogig.test.integration.RevertOpTest
Running org.locationtech.geogig.test.integration.GeogigAPITest
Running org.locationtech.geogig.test.integration.BranchDeleteOpTest
testOctopusMergeWithAutomerge
[main] INFO org.locationtech.geogig.plumbing.SendPack - Pushing Ref[refs/heads/master -> a3ad4dd3b550a1215e3001faf8071e3448956105] to refs/remotes/origin/NewRemoteBranch(NewRemoteBranch)
Tests run: 12, Failures: 0, Errors: 0, Skipped: 0, Time elapsed: 7.105 sec - in org.locationtech.geogig.test.integration.RebaseOpTest
Running org.locationtech.geogig.test.integration.CherryPickOpTest
Tests run: 5, Failures: 0, Errors: 0, Skipped: 0, Time elapsed: 0.662 sec - in org.locationtech.geogig.test.integration.BranchDeleteOpTest
Running org.locationtech.geogig.test.integration.RemoteListOpTest
Tests run: 10, Failures: 0, Errors: 0, Skipped: 0, Time elapsed: 3.851 sec - in org.locationtech.geogig.test.integration.ReportCommitConflictsOpTest
Running org.locationtech.geogig.test.integration.CommitOpTest
Tests run: 3, Failures: 0, Errors: 0, Skipped: 0, Time elapsed: 0.705 sec - in org.locationtech.geogig.test.integration.GeogigAPITest
Running org.locationtech.geogig.test.integration.ConflictsReadWriteOpTest
Tests run: 8, Failures: 0, Errors: 0, Skipped: 0, Time elapsed: 8.115 sec - in org.locationtech.geogig.test.integration.BranchRenameOpTest
Tests run: 4, Failures: 0, Errors: 0, Skipped: 0, Time elapsed: 0.134 sec - in org.locationtech.geogig.test.integration.RemoteListOpTest
Running org.locationtech.geogig.test.integration.RemoteAddOpTest
Running org.locationtech.geogig.test.integration.RebuildGraphOpTest
testConflictingMergeInterceptor
Tests run: 1, Failures: 0, Errors: 0, Skipped: 0, Time elapsed: 0.121 sec - in org.locationtech.geogig.test.integration.ConflictsReadWriteOpTest
Running org.locationtech.geogig.test.integration.StatusOpTest
[main] INFO org.locationtech.geogig.plumbing.SendPack - Pushing Ref[refs/heads/master -> d13557ae0d974dbbc25eb1e98414ea3a2455cc3c] to refs/remotes/origin/refs/heads/master(refs/heads/master)
Tests run: 15, Failures: 0, Errors: 0, Skipped: 0, Time elapsed: 8.274 sec - in org.locationtech.geogig.test.integration.GeogigTransactionTest
Running org.locationtech.geogig.test.integration.ResetOpTest
Tests run: 10, Failures: 0, Errors: 0, Skipped: 1, Time elapsed: 11.972 sec - in org.locationtech.geogig.test.integration.RemoveOpTest
Running org.locationtech.geogig.test.performance.LogOpPerformanceTest
[main] INFO org.locationtech.geogig.test.performance.EnablePerformanceTestRule - org.locationtech.geogig.test.performance.LogOpPerformanceTest ignored, run with -Dgeogig.runPerformanceTests=true to enable it.
Tests run: 0, Failures: 0, Errors: 0, Skipped: 0, Time elapsed: 0.024 sec - in org.locationtech.geogig.test.performance.LogOpPerformanceTest
Running org.locationtech.geogig.test.performance.HeapGraphDatabaseStressTest
[main] INFO org.locationtech.geogig.test.performance.EnablePerformanceTestRule - org.locationtech.geogig.test.performance.HeapGraphDatabaseStressTest ignored, run with -Dgeogig.runPerformanceTests=true to enable it.
Tests run: 0, Failures: 0, Errors: 0, Skipped: 0, Time elapsed: 0.003 sec - in org.locationtech.geogig.test.performance.HeapGraphDatabaseStressTest
Running org.locationtech.geogig.test.performance.RevTreeBuilderPerformanceTest
[main] INFO org.locationtech.geogig.test.performance.EnablePerformanceTestRule - org.locationtech.geogig.test.performance.RevTreeBuilderPerformanceTest ignored, run with -Dgeogig.runPerformanceTests=true to enable it.
Tests run: 0, Failures: 0, Errors: 0, Skipped: 0, Time elapsed: 0.01 sec - in org.locationtech.geogig.test.performance.RevTreeBuilderPerformanceTest
Running org.locationtech.geogig.model.impl.RevPersonTest
Tests run: 3, Failures: 0, Errors: 0, Skipped: 0, Time elapsed: 0.009 sec - in org.locationtech.geogig.model.impl.RevPersonTest
Running org.locationtech.geogig.model.impl.RevFeatureTest
Tests run: 2, Failures: 0, Errors: 0, Skipped: 0, Time elapsed: 0.011 sec - in org.locationtech.geogig.model.impl.RevFeatureTest
Running org.locationtech.geogig.model.impl.RevFeatureTypeTest
Tests run: 7, Failures: 0, Errors: 0, Skipped: 1, Time elapsed: 1.258 sec - in org.locationtech.geogig.test.integration.CherryPickOpTest
Running org.locationtech.geogig.model.impl.RevCommitImplTest
Tests run: 4, Failures: 0, Errors: 0, Skipped: 0, Time elapsed: 1.023 sec - in org.locationtech.geogig.test.integration.StatusOpTest
Running org.locationtech.geogig.model.impl.QuadTreeBuilderExpandCollapseTest
Tests run: 1, Failures: 0, Errors: 0, Skipped: 0, Time elapsed: 0 sec - in org.locationtech.geogig.model.impl.QuadTreeBuilderExpandCollapseTest
Running org.locationtech.geogig.model.impl.LegacyTreeBuilderTest
Tests run: 3, Failures: 0, Errors: 0, Skipped: 0, Time elapsed: 1.128 sec - in org.locationtech.geogig.test.integration.RebuildGraphOpTest
Running org.locationtech.geogig.model.impl.CanonicalTreeBuilderTest
Tests run: 2, Failures: 0, Errors: 0, Skipped: 0, Time elapsed: 0.261 sec - in org.locationtech.geogig.model.impl.RevFeatureTypeTest
Running org.locationtech.geogig.model.impl.CommitBuilderTest
Tests run: 6, Failures: 0, Errors: 0, Skipped: 0, Time elapsed: 0.03 sec - in org.locationtech.geogig.model.impl.CommitBuilderTest
Running org.locationtech.geogig.model.internal.QuadTreeClusteringStrategyTest
Tests run: 12, Failures: 0, Errors: 0, Skipped: 12, Time elapsed: 0.058 sec - in org.locationtech.geogig.model.internal.QuadTreeClusteringStrategyTest
Tests run: 18, Failures: 0, Errors: 0, Skipped: 0, Time elapsed: 10.124 sec - in org.locationtech.geogig.test.integration.ApplyPatchOpTest
Running org.locationtech.geogig.model.internal.CanonicalClusteringStrategyRocksdbStorageTest
Tests run: 2, Failures: 0, Errors: 0, Skipped: 0, Time elapsed: 0.312 sec - in org.locationtech.geogig.model.impl.RevCommitImplTest
testMerge
Running org.locationtech.geogig.model.internal.CanonicalClusteringStrategyHeapStorageTest
Running org.locationtech.geogig.model.internal.QuadTreeClusteringStrategy_putTest
Tests run: 10, Failures: 0, Errors: 0, Skipped: 0, Time elapsed: 1.392 sec - in org.locationtech.geogig.test.integration.RemoteAddOpTest
Running org.locationtech.geogig.model.internal.DAGNodeTest
Tests run: 8, Failures: 0, Errors: 0, Skipped: 0, Time elapsed: 3.841 sec - in org.locationtech.geogig.test.integration.CreatePatchOpTest
Running org.locationtech.geogig.model.internal.QuadTreeClusteringStrategy_computeIdTest
Tests run: 2, Failures: 0, Errors: 0, Skipped: 0, Time elapsed: 3.966 sec - in org.locationtech.geogig.test.integration.CheckSparsePathTest
Running org.locationtech.geogig.model.internal.NodeIdTest
Tests run: 3, Failures: 0, Errors: 0, Skipped: 0, Time elapsed: 0 sec - in org.locationtech.geogig.model.internal.NodeIdTest
Running org.locationtech.geogig.model.internal.QuadrantTest
Tests run: 8, Failures: 0, Errors: 0, Skipped: 0, Time elapsed: 0.116 sec - in org.locationtech.geogig.model.internal.QuadTreeClusteringStrategy_computeIdTest
Running org.locationtech.geogig.data.retrieve.IteratorBackedFeatureReaderTest
Tests run: 9, Failures: 0, Errors: 0, Skipped: 0, Time elapsed: 0.123 sec - in org.locationtech.geogig.model.internal.QuadrantTest
Running org.locationtech.geogig.data.retrieve.BulkFeatureRetrieverTest
Tests run: 1, Failures: 0, Errors: 0, Skipped: 0, Time elapsed: 0.05 sec - in org.locationtech.geogig.data.retrieve.IteratorBackedFeatureReaderTest
Running org.locationtech.geogig.data.retrieve.MultiFeatureTypeBuilderTest
Tests run: 13, Failures: 0, Errors: 0, Skipped: 0, Time elapsed: 13.345 sec - in org.locationtech.geogig.test.integration.ReportMergeConflictsOpTest
Running org.locationtech.geogig.data.retrieve.BulkGeoGigFeatureRetrieverTest
Tests run: 12, Failures: 0, Errors: 0, Skipped: 0, Time elapsed: 5.899 sec - in org.locationtech.geogig.test.integration.AddOpTest
Running org.locationtech.geogig.data.retrieve.BackgroundingIteratorTest
testConflictingOctopusMerge
[main] INFO org.locationtech.geogig.plumbing.SendPack - Pushing Ref[refs/heads/master -> a3ad4dd3b550a1215e3001faf8071e3448956105] to refs/remotes/origin/master(null)
DAG[id:[], orig:EMPTY, status: CHANGED, size: 129, children: 0, buckets: 1)[children: {}, buckets: [[2]]]
 DAG[id:[2], orig:EMPTY, status: CHANGED, size: 129, children: 0, buckets: 2)[children: {}, buckets: [[2, 0], [2, 3]]]
  DAG[id:[2, 0], orig:EMPTY, status: CHANGED, size: 90, children: 90, buckets: 0)[children: {node # 2=NodeId[node # 2, Env[2.0 : 2.0, 1.0 : 1.0]], node # 1=NodeId[node # 1, Env[1.0 : 1.0, 1.0 : 1.0]], node # 18=NodeId[node # 18, Env[18.0 : 18.0, 1.0 : 1.0]], node # 19=NodeId[node # 19, Env[19.0 : 19.0, 1.0 : 1.0]], node # 16=NodeId[node # 16, Env[16.0 : 16.0, 1.0 : 1.0]], node # 17=NodeId[node # 17, Env[17.0 : 17.0, 1.0 : 1.0]], node # 9=NodeId[node # 9, Env[9.0 : 9.0, 1.0 : 1.0]], node # 8=NodeId[node # 8, Env[8.0 : 8.0, 1.0 : 1.0]], node # 7=NodeId[node # 7, Env[7.0 : 7.0, 1.0 : 1.0]], node # 6=NodeId[node # 6, Env[6.0 : 6.0, 1.0 : 1.0]], node # 5=NodeId[node # 5, Env[5.0 : 5.0, 1.0 : 1.0]], node # 4=NodeId[node # 4, Env[4.0 : 4.0, 1.0 : 1.0]], node # 3=NodeId[node # 3, Env[3.0 : 3.0, 1.0 : 1.0]], node # 61=NodeId[node # 61, Env[61.0 : 61.0, 1.0 : 1.0]], node # 62=NodeId[node # 62, Env[62.0 : 62.0, 1.0 : 1.0]], node # 60=NodeId[node # 60, Env[60.0 : 60.0, 1.0 : 1.0]], node # 69=NodeId[node # 69, Env[69.0 : 69.0, 1.0 : 1.0]], node # 25=NodeId[node # 25, Env[25.0 : 25.0, 1.0 : 1.0]], node # 26=NodeId[node # 26, Env[26.0 : 26.0, 1.0 : 1.0]], node # 67=NodeId[node # 67, Env[67.0 : 67.0, 1.0 : 1.0]], node # 23=NodeId[node # 23, Env[23.0 : 23.0, 1.0 : 1.0]], node # 68=NodeId[node # 68, Env[68.0 : 68.0, 1.0 : 1.0]], node # 24=NodeId[node # 24, Env[24.0 : 24.0, 1.0 : 1.0]], node # 65=NodeId[node # 65, Env[65.0 : 65.0, 1.0 : 1.0]], node # 21=NodeId[node # 21, Env[21.0 : 21.0, 1.0 : 1.0]], node # 66=NodeId[node # 66, Env[66.0 : 66.0, 1.0 : 1.0]], node # 22=NodeId[node # 22, Env[22.0 : 22.0, 1.0 : 1.0]], node # 63=NodeId[node # 63, Env[63.0 : 63.0, 1.0 : 1.0]], node # 64=NodeId[node # 64, Env[64.0 : 64.0, 1.0 : 1.0]], node # 20=NodeId[node # 20, Env[20.0 : 20.0, 1.0 : 1.0]], node # 49=NodeId[node # 49, Env[49.0 : 49.0, 1.0 : 1.0]], node # 50=NodeId[node # 50, Env[50.0 : 50.0, 1.0 : 1.0]], node # 51=NodeId[node # 51, Env[51.0 : 51.0, 1.0 : 1.0]], node # 90=NodeId[node # 90, Env[90.0 : 90.0, 1.0 : 1.0]], node # 58=NodeId[node # 58, Env[58.0 : 58.0, 1.0 : 1.0]], node # 14=NodeId[node # 14, Env[14.0 : 14.0, 1.0 : 1.0]], node # 59=NodeId[node # 59, Env[59.0 : 59.0, 1.0 : 1.0]], node # 15=NodeId[node # 15, Env[15.0 : 15.0, 1.0 : 1.0]], node # 56=NodeId[node # 56, Env[56.0 : 56.0, 1.0 : 1.0]], node # 12=NodeId[node # 12, Env[12.0 : 12.0, 1.0 : 1.0]], node # 57=NodeId[node # 57, Env[57.0 : 57.0, 1.0 : 1.0]], node # 13=NodeId[node # 13, Env[13.0 : 13.0, 1.0 : 1.0]], node # 54=NodeId[node # 54, Env[54.0 : 54.0, 1.0 : 1.0]], node # 10=NodeId[node # 10, Env[10.0 : 10.0, 1.0 : 1.0]], node # 55=NodeId[node # 55, Env[55.0 : 55.0, 1.0 : 1.0]], node # 11=NodeId[node # 11, Env[11.0 : 11.0, 1.0 : 1.0]], node # 52=NodeId[node # 52, Env[52.0 : 52.0, 1.0 : 1.0]], node # 53=NodeId[node # 53, Env[53.0 : 53.0, 1.0 : 1.0]], node # 38=NodeId[node # 38, Env[38.0 : 38.0, 1.0 : 1.0]], node # 39=NodeId[node # 39, Env[39.0 : 39.0, 1.0 : 1.0]], node # 83=NodeId[node # 83, Env[83.0 : 83.0, 1.0 : 1.0]], node # 84=NodeId[node # 84, Env[84.0 : 84.0, 1.0 : 1.0]], node # 40=NodeId[node # 40, Env[40.0 : 40.0, 1.0 : 1.0]], node # 81=NodeId[node # 81, Env[81.0 : 81.0, 1.0 : 1.0]], node # 82=NodeId[node # 82, Env[82.0 : 82.0, 1.0 : 1.0]], node # 80=NodeId[node # 80, Env[80.0 : 80.0, 1.0 : 1.0]], node # 47=NodeId[node # 47, Env[47.0 : 47.0, 1.0 : 1.0]], node # 48=NodeId[node # 48, Env[48.0 : 48.0, 1.0 : 1.0]], node # 89=NodeId[node # 89, Env[89.0 : 89.0, 1.0 : 1.0]], node # 45=NodeId[node # 45, Env[45.0 : 45.0, 1.0 : 1.0]], node # 46=NodeId[node # 46, Env[46.0 : 46.0, 1.0 : 1.0]], node # 87=NodeId[node # 87, Env[87.0 : 87.0, 1.0 : 1.0]], node # 43=NodeId[node # 43, Env[43.0 : 43.0, 1.0 : 1.0]], node # 88=NodeId[node # 88, Env[88.0 : 88.0, 1.0 : 1.0]], node # 44=NodeId[node # 44, Env[44.0 : 44.0, 1.0 : 1.0]], node # 85=NodeId[node # 85, Env[85.0 : 85.0, 1.0 : 1.0]], node # 41=NodeId[node # 41, Env[41.0 : 41.0, 1.0 : 1.0]], node # 86=NodeId[node # 86, Env[86.0 : 86.0, 1.0 : 1.0]], node # 42=NodeId[node # 42, Env[42.0 : 42.0, 1.0 : 1.0]], node # 29=NodeId[node # 29, Env[29.0 : 29.0, 1.0 : 1.0]], node # 27=NodeId[node # 27, Env[27.0 : 27.0, 1.0 : 1.0]], node # 28=NodeId[node # 28, Env[28.0 : 28.0, 1.0 : 1.0]], node # 72=NodeId[node # 72, Env[72.0 : 72.0, 1.0 : 1.0]], node # 73=NodeId[node # 73, Env[73.0 : 73.0, 1.0 : 1.0]], node # 70=NodeId[node # 70, Env[70.0 : 70.0, 1.0 : 1.0]], node # 71=NodeId[node # 71, Env[71.0 : 71.0, 1.0 : 1.0]], node # 36=NodeId[node # 36, Env[36.0 : 36.0, 1.0 : 1.0]], node # 37=NodeId[node # 37, Env[37.0 : 37.0, 1.0 : 1.0]], node # 78=NodeId[node # 78, Env[78.0 : 78.0, 1.0 : 1.0]], node # 34=NodeId[node # 34, Env[34.0 : 34.0, 1.0 : 1.0]], node # 79=NodeId[node # 79, Env[79.0 : 79.0, 1.0 : 1.0]], node # 35=NodeId[node # 35, Env[35.0 : 35.0, 1.0 : 1.0]], node # 76=NodeId[node # 76, Env[76.0 : 76.0, 1.0 : 1.0]], node # 32=NodeId[node # 32, Env[32.0 : 32.0, 1.0 : 1.0]], node # 77=NodeId[node # 77, Env[77.0 : 77.0, 1.0 : 1.0]], node # 33=NodeId[node # 33, Env[33.0 : 33.0, 1.0 : 1.0]], node # 74=NodeId[node # 74, Env[74.0 : 74.0, 1.0 : 1.0]], node # 30=NodeId[node # 30, Env[30.0 : 30.0, 1.0 : 1.0]], node # 75=NodeId[node # 75, Env[75.0 : 75.0, 1.0 : 1.0]], node # 31=NodeId[node # 31, Env[31.0 : 31.0, 1.0 : 1.0]]}, buckets: []]
  DAG[id:[2, 3], orig:EMPTY, status: CHANGED, size: 39, children: 39, buckets: 0)[children: {node # 107=NodeId[node # 107, Env[107.0 : 107.0, 1.0 : 1.0]], node # 129=NodeId[node # 129, Env[129.0 : 129.0, 1.0 : 1.0]], node # 106=NodeId[node # 106, Env[106.0 : 106.0, 1.0 : 1.0]], node # 128=NodeId[node # 128, Env[128.0 : 128.0, 1.0 : 1.0]], node # 109=NodeId[node # 109, Env[109.0 : 109.0, 1.0 : 1.0]], node # 108=NodeId[node # 108, Env[108.0 : 108.0, 1.0 : 1.0]], node # 103=NodeId[node # 103, Env[103.0 : 103.0, 1.0 : 1.0]], node # 125=NodeId[node # 125, Env[125.0 : 125.0, 1.0 : 1.0]], node # 102=NodeId[node # 102, Env[102.0 : 102.0, 1.0 : 1.0]], node # 124=NodeId[node # 124, Env[124.0 : 124.0, 1.0 : 1.0]], node # 105=NodeId[node # 105, Env[105.0 : 105.0, 1.0 : 1.0]], node # 127=NodeId[node # 127, Env[127.0 : 127.0, 1.0 : 1.0]], node # 104=NodeId[node # 104, Env[104.0 : 104.0, 1.0 : 1.0]], node # 126=NodeId[node # 126, Env[126.0 : 126.0, 1.0 : 1.0]], node # 121=NodeId[node # 121, Env[121.0 : 121.0, 1.0 : 1.0]], node # 120=NodeId[node # 120, Env[120.0 : 120.0, 1.0 : 1.0]], node # 101=NodeId[node # 101, Env[101.0 : 101.0, 1.0 : 1.0]], node # 123=NodeId[node # 123, Env[123.0 : 123.0, 1.0 : 1.0]], node # 100=NodeId[node # 100, Env[100.0 : 100.0, 1.0 : 1.0]], node # 122=NodeId[node # 122, Env[122.0 : 122.0, 1.0 : 1.0]], node # 118=NodeId[node # 118, Env[118.0 : 118.0, 1.0 : 1.0]], node # 117=NodeId[node # 117, Env[117.0 : 117.0, 1.0 : 1.0]], node # 119=NodeId[node # 119, Env[119.0 : 119.0, 1.0 : 1.0]], node # 114=NodeId[node # 114, Env[114.0 : 114.0, 1.0 : 1.0]], node # 113=NodeId[node # 113, Env[113.0 : 113.0, 1.0 : 1.0]], node # 116=NodeId[node # 116, Env[116.0 : 116.0, 1.0 : 1.0]], node # 115=NodeId[node # 115, Env[115.0 : 115.0, 1.0 : 1.0]], node # 110=NodeId[node # 110, Env[110.0 : 110.0, 1.0 : 1.0]], node # 112=NodeId[node # 112, Env[112.0 : 112.0, 1.0 : 1.0]], node # 111=NodeId[node # 111, Env[111.0 : 111.0, 1.0 : 1.0]], node # 94=NodeId[node # 94, Env[94.0 : 94.0, 1.0 : 1.0]], node # 95=NodeId[node # 95, Env[95.0 : 95.0, 1.0 : 1.0]], node # 92=NodeId[node # 92, Env[92.0 : 92.0, 1.0 : 1.0]], node # 93=NodeId[node # 93, Env[93.0 : 93.0, 1.0 : 1.0]], node # 91=NodeId[node # 91, Env[91.0 : 91.0, 1.0 : 1.0]], node # 98=NodeId[node # 98, Env[98.0 : 98.0, 1.0 : 1.0]], node # 99=NodeId[node # 99, Env[99.0 : 99.0, 1.0 : 1.0]], node # 96=NodeId[node # 96, Env[96.0 : 96.0, 1.0 : 1.0]], node # 97=NodeId[node # 97, Env[97.0 : 97.0, 1.0 : 1.0]]}, buckets: []]
testFastForwardOnly
testSpecifyAuthor
Tests run: 2, Failures: 0, Errors: 0, Skipped: 0, Time elapsed: 0.962 sec - in org.locationtech.geogig.data.retrieve.MultiFeatureTypeBuilderTest
Running org.locationtech.geogig.data.EPSGBoundsCalcTest
Tests run: 2, Failures: 0, Errors: 0, Skipped: 0, Time elapsed: 0.939 sec - in org.locationtech.geogig.data.retrieve.BulkGeoGigFeatureRetrieverTest
Running org.locationtech.geogig.data.EPSGBoundsXYTest
Tests run: 1, Failures: 0, Errors: 0, Skipped: 1, Time elapsed: 0.016 sec - in org.locationtech.geogig.data.EPSGBoundsXYTest
Running org.locationtech.geogig.data.MapToStringConverterFactoryTest
Tests run: 2, Failures: 0, Errors: 0, Skipped: 0, Time elapsed: 0.079 sec - in org.locationtech.geogig.data.MapToStringConverterFactoryTest
Running org.locationtech.geogig.data.PrimitiveArrayToStringConverterFactoryTest
Tests run: 21, Failures: 0, Errors: 0, Skipped: 0, Time elapsed: 14.549 sec - in org.locationtech.geogig.test.integration.CheckoutOpTest
Running org.locationtech.geogig.data.EPSGBoundsYXTest
Tests run: 1, Failures: 0, Errors: 0, Skipped: 1, Time elapsed: 0 sec - in org.locationtech.geogig.data.EPSGBoundsYXTest
Running org.locationtech.geogig.data.FeatureBuilderTest
Tests run: 8, Failures: 0, Errors: 0, Skipped: 0, Time elapsed: 0.074 sec - in org.locationtech.geogig.data.PrimitiveArrayToStringConverterFactoryTest
Running org.locationtech.geogig.plumbing.ResolveRepositoryNameTest
Tests run: 1, Failures: 0, Errors: 0, Skipped: 0, Time elapsed: 1.195 sec - in org.locationtech.geogig.data.retrieve.BulkFeatureRetrieverTest
Running org.locationtech.geogig.plumbing.merge.MergeFeaturesOpTest
Tests run: 1, Failures: 0, Errors: 0, Skipped: 0, Time elapsed: 0.082 sec - in org.locationtech.geogig.data.FeatureBuilderTest
Running org.locationtech.geogig.plumbing.merge.MergeStatusBuilderDiffEntrySerializerTest
Tests run: 5, Failures: 0, Errors: 0, Skipped: 0, Time elapsed: 0.173 sec - in org.locationtech.geogig.plumbing.merge.MergeStatusBuilderDiffEntrySerializerTest
Running org.locationtech.geogig.plumbing.index.BuildIndexOpTest
Tests run: 1, Failures: 0, Errors: 0, Skipped: 0, Time elapsed: 0.314 sec - in org.locationtech.geogig.plumbing.merge.MergeFeaturesOpTest
Running org.locationtech.geogig.plumbing.index.BuildFullHistoryIndexOpTest
Tests run: 4, Failures: 0, Errors: 0, Skipped: 0, Time elapsed: 1.861 sec - in org.locationtech.geogig.model.internal.DAGNodeTest
Tests run: 2, Failures: 0, Errors: 0, Skipped: 0, Time elapsed: 0.476 sec - in org.locationtech.geogig.plumbing.ResolveRepositoryNameTest
Running org.locationtech.geogig.plumbing.diff.MutableTreeTest
Running org.locationtech.geogig.plumbing.diff.DepthTreeIteratorTest
Tests run: 9, Failures: 0, Errors: 0, Skipped: 0, Time elapsed: 1.55 sec - in org.locationtech.geogig.data.retrieve.BackgroundingIteratorTest
Running org.locationtech.geogig.plumbing.diff.PostOrderDiffWalkTest
Tests run: 7, Failures: 0, Errors: 0, Skipped: 0, Time elapsed: 0.104 sec - in org.locationtech.geogig.plumbing.diff.MutableTreeTest
Running org.locationtech.geogig.plumbing.diff.TreeDifferenceTest
Tests run: 7, Failures: 0, Errors: 0, Skipped: 0, Time elapsed: 0.039 sec - in org.locationtech.geogig.plumbing.diff.TreeDifferenceTest
Running org.locationtech.geogig.plumbing.diff.GeometryDiffTest
testOursAndTheirs
Tests run: 14, Failures: 0, Errors: 0, Skipped: 0, Time elapsed: 5.472 sec - in org.locationtech.geogig.test.integration.SquashOpTest
Running org.locationtech.geogig.plumbing.diff.PreOrderDiffWalkTest
Tests run: 14, Failures: 0, Errors: 0, Skipped: 0, Time elapsed: 0.285 sec - in org.locationtech.geogig.plumbing.diff.GeometryDiffTest
Running org.locationtech.geogig.plumbing.diff.PatchSerializationTest
testNoCommitMerge
Tests run: 5, Failures: 0, Errors: 0, Skipped: 0, Time elapsed: 2.45 sec - in org.locationtech.geogig.model.internal.QuadTreeClusteringStrategy_putTest
Running org.locationtech.geogig.plumbing.diff.DiffCountConsumerTest
[main] INFO org.locationtech.geogig.plumbing.SendPack - Pushing Ref[refs/heads/master -> a3ad4dd3b550a1215e3001faf8071e3448956105] to refs/remotes/origin/master(null)
[main] INFO org.locationtech.geogig.plumbing.SendPack - Pushing Ref[refs/heads/Branch1 -> e4d10fce0f71850b8e201763343ebde1c71aa5f6] to refs/remotes/origin/Branch1(null)
Tests run: 8, Failures: 0, Errors: 0, Skipped: 0, Time elapsed: 11.326 sec - in org.locationtech.geogig.test.integration.CloneOpTest
Running org.locationtech.geogig.plumbing.diff.AttributeDiffTest
Tests run: 4, Failures: 0, Errors: 0, Skipped: 0, Time elapsed: 0.031 sec - in org.locationtech.geogig.plumbing.diff.AttributeDiffTest
testMergeFastForward
Running org.locationtech.geogig.plumbing.RevParseTest
Tests run: 17, Failures: 0, Errors: 0, Skipped: 0, Time elapsed: 12.769 sec - in org.locationtech.geogig.test.integration.LogOpTest
testOctopusMergeSameFeatureChanges
Running org.locationtech.geogig.plumbing.DiffTreeTest
Tests run: 8, Failures: 0, Errors: 0, Skipped: 0, Time elapsed: 1.09 sec - in org.locationtech.geogig.plumbing.diff.PatchSerializationTest
Running org.locationtech.geogig.plumbing.HashObjectTest
[main] INFO org.locationtech.geogig.plumbing.SendPack - Pushing Ref[refs/heads/master -> b2e392a358773a01efe3ec48a3580362a7fc83d0] to refs/remotes/origin/refs/heads/master(refs/heads/master)
testMergeNullCommit
testMergeMultiple
Tests run: 21, Failures: 0, Errors: 0, Skipped: 0, Time elapsed: 7.172 sec - in org.locationtech.geogig.test.integration.DiffOpTest
Running org.locationtech.geogig.plumbing.ResolveFeatureTypeTest
[main] INFO org.locationtech.geogig.plumbing.SendPack - Pushing Ref[refs/heads/Branch1 -> b9ffcf8d172b8905500e906f2218c55b58cf2c44] to refs/remotes/origin/Branch1(Branch1)
Tests run: 7, Failures: 0, Errors: 0, Skipped: 0, Time elapsed: 1.365 sec - in org.locationtech.geogig.plumbing.HashObjectTest
Tests run: 5, Failures: 0, Errors: 0, Skipped: 0, Time elapsed: 0.563 sec - in org.locationtech.geogig.plumbing.ResolveFeatureTypeTest
Running org.locationtech.geogig.plumbing.RefParseTest
Running org.locationtech.geogig.plumbing.ParseTimestampTest
testMergeConflictingPolygon
Tests run: 5, Failures: 0, Errors: 0, Skipped: 0, Time elapsed: 0.435 sec - in org.locationtech.geogig.plumbing.RefParseTest
Running org.locationtech.geogig.plumbing.WriteTree2Test
Tests run: 13, Failures: 0, Errors: 0, Skipped: 0, Time elapsed: 6.189 sec - in org.locationtech.geogig.test.integration.ResetOpTest
Running org.locationtech.geogig.plumbing.UpdateRefTest
testMergeConflictingBranchesTheirs
Tests run: 2, Failures: 0, Errors: 0, Skipped: 0, Time elapsed: 0.753 sec - in org.locationtech.geogig.plumbing.ParseTimestampTest
Running org.locationtech.geogig.plumbing.DescribeFeatureTypeTest
Tests run: 2, Failures: 0, Errors: 0, Skipped: 0, Time elapsed: 0.224 sec - in org.locationtech.geogig.plumbing.DescribeFeatureTypeTest
Running org.locationtech.geogig.plumbing.ResolveGeogigURITest
Tests run: 1, Failures: 0, Errors: 0, Skipped: 0, Time elapsed: 0.114 sec - in org.locationtech.geogig.plumbing.ResolveGeogigURITest
Running org.locationtech.geogig.plumbing.CatObjectTest
testMergeWithFeatureMerge
Tests run: 5, Failures: 0, Errors: 0, Skipped: 0, Time elapsed: 0.737 sec - in org.locationtech.geogig.plumbing.UpdateRefTest
Running org.locationtech.geogig.plumbing.UpdateSymRefTest
left : Tree[c932cbd11ec75bcc145e2a362a3199bb85eb3abc; size=7; subtrees=2, buckets=0, features=0]
	[TreeNode[buildings -> a400000000000000000000000000000000000000], TreeNode[roads -> ff488999ad51848c7850ffd4d12568a3125172b0]]
	[]
right: Tree[8996d6e4437a8d8ea41ffc1f32cfaab9bf9de384; size=5; subtrees=1, buckets=0, features=0]
	[TreeNode[roads -> 72e2f547f3adc30edd55733abb885e8e6de1f1a4]]
	[]
Tests run: 26, Failures: 0, Errors: 0, Skipped: 0, Time elapsed: 8.204 sec - in org.locationtech.geogig.test.integration.CommitOpTest
Running org.locationtech.geogig.plumbing.UpdateTreeTest
Tests run: 3, Failures: 0, Errors: 0, Skipped: 0, Time elapsed: 0.855 sec - in org.locationtech.geogig.plumbing.CatObjectTest
testMergeNoCommitMessage
Running org.locationtech.geogig.plumbing.DiffBoundsTest
Tests run: 5, Failures: 0, Errors: 0, Skipped: 0, Time elapsed: 0.809 sec - in org.locationtech.geogig.plumbing.UpdateSymRefTest
Running org.locationtech.geogig.plumbing.CheckRefFormatTest
Tests run: 5, Failures: 0, Errors: 0, Skipped: 0, Time elapsed: 13.245 sec - in org.locationtech.geogig.test.integration.FindCommonAncestorTest
Running org.locationtech.geogig.plumbing.DiffFeatureTest
Tests run: 2, Failures: 0, Errors: 0, Skipped: 0, Time elapsed: 0.336 sec - in org.locationtech.geogig.plumbing.CheckRefFormatTest
Running org.locationtech.geogig.plumbing.WalkGraphOpTest
Removed 32,600 nodes in 3.457 s
Removed 32,600 nodes in 3.201 s
testMergeTwoBranchesWithNewFeatureType
Tests run: 7, Failures: 0, Errors: 0, Skipped: 0, Time elapsed: 1.064 sec - in org.locationtech.geogig.plumbing.UpdateTreeTest
Running org.locationtech.geogig.porcelain.index.UpdateIndexesOpTest
[main] INFO org.locationtech.geogig.plumbing.SendPack - Pushing Ref[refs/heads/Branch1 -> b9ffcf8d172b8905500e906f2218c55b58cf2c44] to refs/remotes/origin/Branch1(Branch1)
Tests run: 8, Failures: 0, Errors: 0, Skipped: 0, Time elapsed: 12.615 sec - in org.locationtech.geogig.test.integration.PullOpTest
Running org.locationtech.geogig.porcelain.index.UpdateIndexOpTest
Added 7,000 nodes in 151.0 ms

testCancelScenario1
Exception caught executing task: 
java.lang.IllegalStateException: java.lang.IllegalStateException: Object NodeRef[Points/Points.1 -> a47ca38e5c3e92c94dec9e8ea597c642003ec878] not found.
	at sun.reflect.NativeConstructorAccessorImpl.newInstance0(Native Method)
	at sun.reflect.NativeConstructorAccessorImpl.newInstance(NativeConstructorAccessorImpl.java:62)
	at sun.reflect.DelegatingConstructorAccessorImpl.newInstance(DelegatingConstructorAccessorImpl.java:45)
	at java.lang.reflect.Constructor.newInstance(Constructor.java:423)
	at java.util.concurrent.ForkJoinTask.getThrowableException(ForkJoinTask.java:593)
	at java.util.concurrent.ForkJoinTask.reportException(ForkJoinTask.java:677)
	at java.util.concurrent.ForkJoinTask.join(ForkJoinTask.java:720)
	at java.util.concurrent.ForkJoinPool.invoke(ForkJoinPool.java:2616)
	at org.locationtech.geogig.plumbing.diff.PreOrderDiffWalk.walk(PreOrderDiffWalk.java:322)
	at org.locationtech.geogig.plumbing.WalkGraphOp._call(WalkGraphOp.java:160)
	at org.locationtech.geogig.plumbing.WalkGraphOp._call(WalkGraphOp.java:32)
	at org.locationtech.geogig.repository.AbstractGeoGigOp.call(AbstractGeoGigOp.java:154)
	at org.locationtech.geogig.plumbing.WalkGraphOpTest.testObjectDoesNotExist(WalkGraphOpTest.java:179)
	at sun.reflect.NativeMethodAccessorImpl.invoke0(Native Method)
	at sun.reflect.NativeMethodAccessorImpl.invoke(NativeMethodAccessorImpl.java:62)
	at sun.reflect.DelegatingMethodAccessorImpl.invoke(DelegatingMethodAccessorImpl.java:43)
	at java.lang.reflect.Method.invoke(Method.java:498)
	at org.junit.runners.model.FrameworkMethod$1.runReflectiveCall(FrameworkMethod.java:50)
	at org.junit.internal.runners.model.ReflectiveCallable.run(ReflectiveCallable.java:12)
	at org.junit.runners.model.FrameworkMethod.invokeExplosively(FrameworkMethod.java:47)
	at org.junit.internal.runners.statements.InvokeMethod.evaluate(InvokeMethod.java:17)
	at org.junit.internal.runners.statements.RunBefores.evaluate(RunBefores.java:26)
	at org.junit.internal.runners.statements.RunAfters.evaluate(RunAfters.java:27)
	at org.junit.rules.ExpectedException$ExpectedExceptionStatement.evaluate(ExpectedException.java:239)
	at org.junit.rules.ExternalResource$1.evaluate(ExternalResource.java:48)
	at org.junit.rules.RunRules.evaluate(RunRules.java:20)
	at org.junit.runners.ParentRunner.runLeaf(ParentRunner.java:325)
	at org.junit.runners.BlockJUnit4ClassRunner.runChild(BlockJUnit4ClassRunner.java:78)
	at org.junit.runners.BlockJUnit4ClassRunner.runChild(BlockJUnit4ClassRunner.java:57)
	at org.junit.runners.ParentRunner$3.run(ParentRunner.java:290)
	at org.junit.runners.ParentRunner$1.schedule(ParentRunner.java:71)
	at org.junit.runners.ParentRunner.runChildren(ParentRunner.java:288)
	at org.junit.runners.ParentRunner.access$000(ParentRunner.java:58)
	at org.junit.runners.ParentRunner$2.evaluate(ParentRunner.java:268)
	at org.junit.runners.ParentRunner.run(ParentRunner.java:363)
	at org.apache.maven.surefire.junit4.JUnit4Provider.execute(JUnit4Provider.java:264)
	at org.apache.maven.surefire.junit4.JUnit4Provider.executeTestSet(JUnit4Provider.java:153)
	at org.apache.maven.surefire.junit4.JUnit4Provider.invoke(JUnit4Provider.java:124)
	at org.apache.maven.surefire.booter.ForkedBooter.invokeProviderInSameClassLoader(ForkedBooter.java:200)
	at org.apache.maven.surefire.booter.ForkedBooter.runSuitesInProcess(ForkedBooter.java:153)
	at org.apache.maven.surefire.booter.ForkedBooter.main(ForkedBooter.java:103)
Caused by: java.lang.IllegalStateException: Object NodeRef[Points/Points.1 -> a47ca38e5c3e92c94dec9e8ea597c642003ec878] not found.
	at org.locationtech.geogig.plumbing.WalkGraphOp$1.checkExists(WalkGraphOp.java:155)
	at org.locationtech.geogig.plumbing.WalkGraphOp$1.feature(WalkGraphOp.java:128)
	at org.locationtech.geogig.plumbing.diff.PreOrderDiffWalk$CancellableConsumer.feature(PreOrderDiffWalk.java:1303)
	at org.locationtech.geogig.plumbing.diff.PreOrderDiffWalk$WalkAction.node(PreOrderDiffWalk.java:627)
	at org.locationtech.geogig.plumbing.diff.PreOrderDiffWalk$TraverseLeafLeaf.compute(PreOrderDiffWalk.java:830)
	at org.locationtech.geogig.plumbing.diff.PreOrderDiffWalk$TraverseTreeContents.compute(PreOrderDiffWalk.java:736)
	at org.locationtech.geogig.plumbing.diff.PreOrderDiffWalk$TraverseTree.compute(PreOrderDiffWalk.java:692)
	at java.util.concurrent.RecursiveAction.exec(RecursiveAction.java:189)
	at java.util.concurrent.ForkJoinTask.doExec(ForkJoinTask.java:289)
	at java.util.concurrent.ForkJoinTask.doInvoke(ForkJoinTask.java:401)
	at java.util.concurrent.ForkJoinTask.invokeAll(ForkJoinTask.java:843)
	at org.locationtech.geogig.plumbing.diff.PreOrderDiffWalk$TraverseLeafLeaf.compute(PreOrderDiffWalk.java:837)
	at org.locationtech.geogig.plumbing.diff.PreOrderDiffWalk$TraverseTreeContents.compute(PreOrderDiffWalk.java:736)
	at org.locationtech.geogig.plumbing.diff.PreOrderDiffWalk$TraverseTree.compute(PreOrderDiffWalk.java:692)
	at java.util.concurrent.RecursiveAction.exec(RecursiveAction.java:189)
	at java.util.concurrent.ForkJoinTask.doExec(ForkJoinTask.java:289)
	at java.util.concurrent.ForkJoinPool$WorkQueue.runTask(ForkJoinPool.java:1056)
	at java.util.concurrent.ForkJoinPool.runWorker(ForkJoinPool.java:1692)
	at java.util.concurrent.ForkJoinWorkerThread.run(ForkJoinWorkerThread.java:157)
Tests run: 9, Failures: 0, Errors: 0, Skipped: 0, Time elapsed: 6.263 sec - in org.locationtech.geogig.plumbing.diff.DiffCountConsumerTest
Running org.locationtech.geogig.porcelain.index.DropIndexOpTest
Added 7,000 nodes in 536.6 ms
Tests run: 7, Failures: 0, Errors: 0, Skipped: 0, Time elapsed: 1.404 sec - in org.locationtech.geogig.plumbing.WalkGraphOpTest
Running org.locationtech.geogig.porcelain.index.CreateIndexOpTest
Tests run: 15, Failures: 0, Errors: 0, Skipped: 0, Time elapsed: 3.583 sec - in org.locationtech.geogig.plumbing.WriteTree2Test
Running org.locationtech.geogig.porcelain.InitOpTest
pp	0 point(s) deleted, 0 new point(s) added, 1 point(s) moved
sp	StringProp1_1 -> StringProp1_1a
ip	1000 -> 1001

Tests run: 4, Failures: 0, Errors: 0, Skipped: 0, Time elapsed: 1.76 sec - in org.locationtech.geogig.plumbing.DiffFeatureTest
Running org.locationtech.geogig.repository.impl.SpatialOpsTest
Tests run: 7, Failures: 0, Errors: 0, Skipped: 0, Time elapsed: 7.325 sec - in org.locationtech.geogig.plumbing.diff.PostOrderDiffWalkTest
Running org.locationtech.geogig.repository.impl.RepositoryResolverTest
Tests run: 2, Failures: 0, Errors: 0, Skipped: 0, Time elapsed: 0 sec - in org.locationtech.geogig.repository.impl.RepositoryResolverTest
Running org.locationtech.geogig.repository.impl.DepthSearchTest
Tests run: 1, Failures: 0, Errors: 0, Skipped: 0, Time elapsed: 0.309 sec - in org.locationtech.geogig.repository.impl.DepthSearchTest
Running org.locationtech.geogig.repository.impl.RevFeatureBuilderTest
Tests run: 4, Failures: 0, Errors: 0, Skipped: 0, Time elapsed: 0.878 sec - in org.locationtech.geogig.porcelain.InitOpTest
testCancelScenario2
testCancelScenario3
[main] INFO org.locationtech.geogig.plumbing.SendPack - Pushing Ref[refs/heads/master -> a3ad4dd3b550a1215e3001faf8071e3448956105] to refs/remotes/origin/master(null)
Added 5,000 nodes in 71.36 ms
Added 1,024 nodes in 3.614 ms
Removed 400 nodes in 1.942 ms
Tests run: 8, Failures: 0, Errors: 0, Skipped: 0, Time elapsed: 1.278 sec - in org.locationtech.geogig.repository.impl.RevFeatureBuilderTest
testCancelScenario4
Tests run: 11, Failures: 0, Errors: 0, Skipped: 0, Time elapsed: 11.411 sec - in org.locationtech.geogig.model.impl.LegacyTreeBuilderTest
testNoFastForward
[main] INFO org.locationtech.geogig.plumbing.SendPack - Pushing Ref[refs/heads/master -> a3ad4dd3b550a1215e3001faf8071e3448956105] to refs/remotes/origin/master(null)
Added 10,000 nodes in 131.6 ms
Tests run: 11, Failures: 0, Errors: 0, Skipped: 0, Time elapsed: 11.87 sec - in org.locationtech.geogig.model.internal.CanonicalClusteringStrategyHeapStorageTest
Tests run: 15, Failures: 0, Errors: 0, Skipped: 0, Time elapsed: 18.318 sec - in org.locationtech.geogig.test.integration.FetchOpTest
testMergeConflictingBranches
Tests run: 11, Failures: 0, Errors: 0, Skipped: 0, Time elapsed: 21.074 sec - in org.locationtech.geogig.test.integration.PushOpTest
testMergeConflictingBranchesOurs
Tests run: 30, Failures: 0, Errors: 0, Skipped: 0, Time elapsed: 21.679 sec - in org.locationtech.geogig.test.integration.MergeOpTest
Tests run: 10, Failures: 0, Errors: 0, Skipped: 0, Time elapsed: 10.449 sec - in org.locationtech.geogig.plumbing.RevParseTest
Added 5,000 nodes in 260.2 ms
Added 1,024 nodes in 43.02 ms
[main] INFO org.locationtech.geogig.plumbing.SendPack - Pushing Ref[refs/heads/master -> 32b4e258bf8026e45ba1c2ace4a1f36e15b862a1] to refs/remotes/origin/master(null)
Tests run: 11, Failures: 0, Errors: 0, Skipped: 0, Time elapsed: 10.56 sec - in org.locationtech.geogig.plumbing.DiffTreeTest
Removed 400 nodes in 4.783 ms
Tests run: 11, Failures: 0, Errors: 0, Skipped: 0, Time elapsed: 14.623 sec - in org.locationtech.geogig.model.impl.CanonicalTreeBuilderTest
Tests run: 10, Failures: 0, Errors: 0, Skipped: 0, Time elapsed: 16.796 sec - in org.locationtech.geogig.test.integration.LsTreeOpTest
Added 10,000 nodes in 149.3 ms
Tests run: 11, Failures: 0, Errors: 0, Skipped: 0, Time elapsed: 15.228 sec - in org.locationtech.geogig.model.internal.CanonicalClusteringStrategyRocksdbStorageTest
Tests run: 12, Failures: 0, Errors: 0, Skipped: 0, Time elapsed: 18.368 sec - in org.locationtech.geogig.test.integration.SparseCloneTest
Tests run: 5, Failures: 0, Errors: 0, Skipped: 0, Time elapsed: 6.985 sec - in org.locationtech.geogig.porcelain.index.DropIndexOpTest
Tests run: 6, Failures: 0, Errors: 0, Skipped: 0, Time elapsed: 9.425 sec - in org.locationtech.geogig.plumbing.DiffBoundsTest
Tests run: 9, Failures: 0, Errors: 0, Skipped: 0, Time elapsed: 16.95 sec - in org.locationtech.geogig.plumbing.index.BuildIndexOpTest
Tests run: 7, Failures: 0, Errors: 0, Skipped: 0, Time elapsed: 17.455 sec - in org.locationtech.geogig.plumbing.index.BuildFullHistoryIndexOpTest
Tests run: 9, Failures: 0, Errors: 0, Skipped: 0, Time elapsed: 11.762 sec - in org.locationtech.geogig.porcelain.index.CreateIndexOpTest
Tests run: 16, Failures: 0, Errors: 0, Skipped: 0, Time elapsed: 13.939 sec - in org.locationtech.geogig.porcelain.index.UpdateIndexOpTest
Tests run: 9, Failures: 0, Errors: 0, Skipped: 0, Time elapsed: 14.867 sec - in org.locationtech.geogig.porcelain.index.UpdateIndexesOpTest
PreOrderDiffWalkTest: walked 524,288 vs 262144 trees in 236.9 ms
Tests run: 2, Failures: 0, Errors: 0, Skipped: 0, Time elapsed: 29.405 sec - in org.locationtech.geogig.repository.impl.SpatialOpsTest
Tests run: 5, Failures: 0, Errors: 0, Skipped: 0, Time elapsed: 37.215 sec - in org.locationtech.geogig.data.EPSGBoundsCalcTest
PreOrderDiffWalkTest: walked 1,024 vs 512 trees in 9.389 ms
PreOrderDiffWalkTest: walked 16,384 vs 512 trees in 110.1 ms
Tests run: 7, Failures: 0, Errors: 0, Skipped: 0, Time elapsed: 23.012 sec - in org.locationtech.geogig.plumbing.diff.DepthTreeIteratorTest
Tests run: 24, Failures: 0, Errors: 0, Skipped: 0, Time elapsed: 36.258 sec - in org.locationtech.geogig.plumbing.diff.PreOrderDiffWalkTest

Results :

Tests run: 1287, Failures: 0, Errors: 0, Skipped: 16

[JENKINS] Recording test results
[INFO] 
[INFO] --- maven-jar-plugin:2.4:jar (default-jar) @ geogig-core ---
[INFO] Building jar: /home/hudson/genie.geogig/.jenkins/jobs/geogig-1.1.x/workspace/src/core/target/geogig-core-1.1-SNAPSHOT.jar
[INFO] 
[INFO] --- maven-jar-plugin:2.4:test-jar (default) @ geogig-core ---
[INFO] Building jar: /home/hudson/genie.geogig/.jenkins/jobs/geogig-1.1.x/workspace/src/core/target/geogig-core-1.1-SNAPSHOT-tests.jar
[INFO] 
[INFO] >>> maven-source-plugin:2.2.1:jar (attach-sources) > generate-sources @ geogig-core >>>
[INFO] 
[INFO] --- git-commit-id-plugin:2.1.8:revision (default) @ geogig-core ---
[WARNING] Failed to getClass for org.apache.maven.plugin.source.SourceJarMojo
[INFO] 
[INFO] <<< maven-source-plugin:2.2.1:jar (attach-sources) < generate-sources @ geogig-core <<<
[INFO] 
[INFO] --- maven-source-plugin:2.2.1:jar (attach-sources) @ geogig-core ---
[INFO] Building jar: /home/hudson/genie.geogig/.jenkins/jobs/geogig-1.1.x/workspace/src/core/target/geogig-core-1.1-SNAPSHOT-sources.jar
[INFO] 
[INFO] >>> maven-source-plugin:2.2.1:test-jar (attach-sources) > generate-sources @ geogig-core >>>
[INFO] 
[INFO] --- git-commit-id-plugin:2.1.8:revision (default) @ geogig-core ---
[WARNING] Failed to getClass for org.apache.maven.plugin.source.TestSourceJarMojo
[INFO] 
[INFO] <<< maven-source-plugin:2.2.1:test-jar (attach-sources) < generate-sources @ geogig-core <<<
[INFO] 
[INFO] --- maven-source-plugin:2.2.1:test-jar (attach-sources) @ geogig-core ---
[INFO] Building jar: /home/hudson/genie.geogig/.jenkins/jobs/geogig-1.1.x/workspace/src/core/target/geogig-core-1.1-SNAPSHOT-test-sources.jar
[INFO] 
[INFO] --- maven-install-plugin:2.4:install (default-install) @ geogig-core ---
[INFO] Installing /home/hudson/genie.geogig/.jenkins/jobs/geogig-1.1.x/workspace/src/core/target/geogig-core-1.1-SNAPSHOT.jar to /home/hudson/genie.geogig/.jenkins/jobs/geogig-1.1.x/workspace/.repository/org/locationtech/geogig/geogig-core/1.1-SNAPSHOT/geogig-core-1.1-SNAPSHOT.jar
[INFO] Installing /home/hudson/genie.geogig/.jenkins/jobs/geogig-1.1.x/workspace/src/core/pom.xml to /home/hudson/genie.geogig/.jenkins/jobs/geogig-1.1.x/workspace/.repository/org/locationtech/geogig/geogig-core/1.1-SNAPSHOT/geogig-core-1.1-SNAPSHOT.pom
[INFO] Installing /home/hudson/genie.geogig/.jenkins/jobs/geogig-1.1.x/workspace/src/core/target/geogig-core-1.1-SNAPSHOT-tests.jar to /home/hudson/genie.geogig/.jenkins/jobs/geogig-1.1.x/workspace/.repository/org/locationtech/geogig/geogig-core/1.1-SNAPSHOT/geogig-core-1.1-SNAPSHOT-tests.jar
[INFO] Installing /home/hudson/genie.geogig/.jenkins/jobs/geogig-1.1.x/workspace/src/core/target/geogig-core-1.1-SNAPSHOT-sources.jar to /home/hudson/genie.geogig/.jenkins/jobs/geogig-1.1.x/workspace/.repository/org/locationtech/geogig/geogig-core/1.1-SNAPSHOT/geogig-core-1.1-SNAPSHOT-sources.jar
[INFO] Installing /home/hudson/genie.geogig/.jenkins/jobs/geogig-1.1.x/workspace/src/core/target/geogig-core-1.1-SNAPSHOT-test-sources.jar to /home/hudson/genie.geogig/.jenkins/jobs/geogig-1.1.x/workspace/.repository/org/locationtech/geogig/geogig-core/1.1-SNAPSHOT/geogig-core-1.1-SNAPSHOT-test-sources.jar
[JENKINS] Archiving disabled