UnstableConsole Output

Started calculate disk usage of build
Finished Calculation of disk usage of build in 0 seconds
Started calculate disk usage of workspace
Finished Calculation of disk usage of workspace in 0 seconds
[INFO]                                                                         
[INFO] ------------------------------------------------------------------------
[INFO] Building GeoGig Core 1.1-SNAPSHOT
[INFO] ------------------------------------------------------------------------
[INFO] Downloading: https://repo.boundlessgeo.com/main/org/rocksdb/rocksdbjni/4.13.4/rocksdbjni-4.13.4.pom
[INFO] Downloading: http://download.osgeo.org/webdav/geotools/org/rocksdb/rocksdbjni/4.13.4/rocksdbjni-4.13.4.pom
[INFO] Downloading: http://dev.mapfish.org/maven/repository/org/rocksdb/rocksdbjni/4.13.4/rocksdbjni-4.13.4.pom
[INFO] Downloading: https://repo.eclipse.org/content/repositories/maven_central/org/rocksdb/rocksdbjni/4.13.4/rocksdbjni-4.13.4.pom
[INFO] Downloaded: https://repo.eclipse.org/content/repositories/maven_central/org/rocksdb/rocksdbjni/4.13.4/rocksdbjni-4.13.4.pom (7 KB at 168.5 KB/sec)
[INFO] Downloading: https://repo.boundlessgeo.com/main/org/geotools/gt-epsg-hsql/15.4/gt-epsg-hsql-15.4.pom
[INFO] Downloaded: https://repo.boundlessgeo.com/main/org/geotools/gt-epsg-hsql/15.4/gt-epsg-hsql-15.4.pom (6 KB at 71.7 KB/sec)
[INFO] Downloading: https://repo.boundlessgeo.com/main/org/geotools/plugin/15.4/plugin-15.4.pom
[INFO] Downloaded: https://repo.boundlessgeo.com/main/org/geotools/plugin/15.4/plugin-15.4.pom (3 KB at 33.6 KB/sec)
[INFO] Downloading: https://repo.boundlessgeo.com/main/jgridshift/jgridshift/1.0/jgridshift-1.0.pom
[INFO] Downloading: http://download.osgeo.org/webdav/geotools/jgridshift/jgridshift/1.0/jgridshift-1.0.pom
[INFO] Downloaded: http://download.osgeo.org/webdav/geotools/jgridshift/jgridshift/1.0/jgridshift-1.0.pom (391 B at 1.0 KB/sec)
[INFO] Downloading: https://repo.boundlessgeo.com/main/org/hsqldb/hsqldb/2.3.0/hsqldb-2.3.0.pom
[INFO] Downloading: http://download.osgeo.org/webdav/geotools/org/hsqldb/hsqldb/2.3.0/hsqldb-2.3.0.pom
[INFO] Downloading: http://dev.mapfish.org/maven/repository/org/hsqldb/hsqldb/2.3.0/hsqldb-2.3.0.pom
[INFO] Downloading: https://repo.eclipse.org/content/repositories/maven_central/org/hsqldb/hsqldb/2.3.0/hsqldb-2.3.0.pom
[INFO] Downloaded: https://repo.eclipse.org/content/repositories/maven_central/org/hsqldb/hsqldb/2.3.0/hsqldb-2.3.0.pom (2 KB at 31.8 KB/sec)
[INFO] Downloading: https://repo.boundlessgeo.com/main/org/geotools/gt-cql/15.4/gt-cql-15.4.pom
[INFO] Downloaded: https://repo.boundlessgeo.com/main/org/geotools/gt-cql/15.4/gt-cql-15.4.pom (5 KB at 31.5 KB/sec)
[INFO] Downloading: https://repo.boundlessgeo.com/main/com/google/inject/guice/4.0/guice-4.0.pom
[INFO] Downloading: http://download.osgeo.org/webdav/geotools/com/google/inject/guice/4.0/guice-4.0.pom
[INFO] Downloading: http://dev.mapfish.org/maven/repository/com/google/inject/guice/4.0/guice-4.0.pom
[INFO] Downloading: https://repo.eclipse.org/content/repositories/maven_central/com/google/inject/guice/4.0/guice-4.0.pom
[INFO] Downloaded: https://repo.eclipse.org/content/repositories/maven_central/com/google/inject/guice/4.0/guice-4.0.pom (11 KB at 253.3 KB/sec)
[INFO] Downloading: https://repo.boundlessgeo.com/main/com/google/inject/guice-parent/4.0/guice-parent-4.0.pom
[INFO] Downloading: http://download.osgeo.org/webdav/geotools/com/google/inject/guice-parent/4.0/guice-parent-4.0.pom
[INFO] Downloading: http://dev.mapfish.org/maven/repository/com/google/inject/guice-parent/4.0/guice-parent-4.0.pom
[INFO] Downloading: https://repo.eclipse.org/content/repositories/maven_central/com/google/inject/guice-parent/4.0/guice-parent-4.0.pom
[INFO] Downloaded: https://repo.eclipse.org/content/repositories/maven_central/com/google/inject/guice-parent/4.0/guice-parent-4.0.pom (16 KB at 369.0 KB/sec)
[INFO] Downloading: https://repo.boundlessgeo.com/main/com/google/google/5/google-5.pom
[INFO] Downloading: http://download.osgeo.org/webdav/geotools/com/google/google/5/google-5.pom
[INFO] Downloading: http://dev.mapfish.org/maven/repository/com/google/google/5/google-5.pom
[INFO] Downloading: https://repo.eclipse.org/content/repositories/maven_central/com/google/google/5/google-5.pom
[INFO] Downloaded: https://repo.eclipse.org/content/repositories/maven_central/com/google/google/5/google-5.pom (3 KB at 104.4 KB/sec)
[INFO] Downloading: https://repo.boundlessgeo.com/main/javax/inject/javax.inject/1/javax.inject-1.pom
[INFO] Downloading: http://download.osgeo.org/webdav/geotools/javax/inject/javax.inject/1/javax.inject-1.pom
[INFO] Downloading: http://dev.mapfish.org/maven/repository/javax/inject/javax.inject/1/javax.inject-1.pom
[INFO] Downloading: https://repo.eclipse.org/content/repositories/maven_central/javax/inject/javax.inject/1/javax.inject-1.pom
[INFO] Downloaded: https://repo.eclipse.org/content/repositories/maven_central/javax/inject/javax.inject/1/javax.inject-1.pom (612 B at 37.4 KB/sec)
[INFO] Downloading: https://repo.boundlessgeo.com/main/com/google/inject/extensions/guice-multibindings/4.0/guice-multibindings-4.0.pom
[INFO] Downloading: http://download.osgeo.org/webdav/geotools/com/google/inject/extensions/guice-multibindings/4.0/guice-multibindings-4.0.pom
[INFO] Downloading: http://dev.mapfish.org/maven/repository/com/google/inject/extensions/guice-multibindings/4.0/guice-multibindings-4.0.pom
[INFO] Downloading: https://repo.eclipse.org/content/repositories/maven_central/com/google/inject/extensions/guice-multibindings/4.0/guice-multibindings-4.0.pom
[INFO] Downloaded: https://repo.eclipse.org/content/repositories/maven_central/com/google/inject/extensions/guice-multibindings/4.0/guice-multibindings-4.0.pom (547 B at 16.7 KB/sec)
[INFO] Downloading: https://repo.boundlessgeo.com/main/com/google/inject/extensions/extensions-parent/4.0/extensions-parent-4.0.pom
[INFO] Downloading: http://download.osgeo.org/webdav/geotools/com/google/inject/extensions/extensions-parent/4.0/extensions-parent-4.0.pom
[INFO] Downloading: http://dev.mapfish.org/maven/repository/com/google/inject/extensions/extensions-parent/4.0/extensions-parent-4.0.pom
[INFO] Downloading: https://repo.eclipse.org/content/repositories/maven_central/com/google/inject/extensions/extensions-parent/4.0/extensions-parent-4.0.pom
[INFO] Downloaded: https://repo.eclipse.org/content/repositories/maven_central/com/google/inject/extensions/extensions-parent/4.0/extensions-parent-4.0.pom (4 KB at 91.3 KB/sec)
[INFO] Downloading: https://repo.boundlessgeo.com/main/com/google/code/gson/gson/2.4/gson-2.4.pom
[INFO] Downloading: http://download.osgeo.org/webdav/geotools/com/google/code/gson/gson/2.4/gson-2.4.pom
[INFO] Downloading: http://dev.mapfish.org/maven/repository/com/google/code/gson/gson/2.4/gson-2.4.pom
[INFO] Downloading: https://repo.eclipse.org/content/repositories/maven_central/com/google/code/gson/gson/2.4/gson-2.4.pom
[INFO] Downloaded: https://repo.eclipse.org/content/repositories/maven_central/com/google/code/gson/gson/2.4/gson-2.4.pom (9 KB at 240.5 KB/sec)
[INFO] Downloading: https://repo.boundlessgeo.com/main/org/sonatype/oss/oss-parent/9/oss-parent-9.pom
[INFO] Downloading: http://download.osgeo.org/webdav/geotools/org/sonatype/oss/oss-parent/9/oss-parent-9.pom
[INFO] Downloading: http://dev.mapfish.org/maven/repository/org/sonatype/oss/oss-parent/9/oss-parent-9.pom
[INFO] Downloading: https://repo.eclipse.org/content/repositories/maven_central/org/sonatype/oss/oss-parent/9/oss-parent-9.pom
[INFO] Downloaded: https://repo.eclipse.org/content/repositories/maven_central/org/sonatype/oss/oss-parent/9/oss-parent-9.pom (7 KB at 377.4 KB/sec)
[INFO] Downloading: https://repo.boundlessgeo.com/main/com/ning/compress-lzf/1.0.3/compress-lzf-1.0.3.pom
[INFO] Downloading: http://download.osgeo.org/webdav/geotools/com/ning/compress-lzf/1.0.3/compress-lzf-1.0.3.pom
[INFO] Downloading: http://dev.mapfish.org/maven/repository/com/ning/compress-lzf/1.0.3/compress-lzf-1.0.3.pom
[INFO] Downloading: https://repo.eclipse.org/content/repositories/maven_central/com/ning/compress-lzf/1.0.3/compress-lzf-1.0.3.pom
[INFO] Downloaded: https://repo.eclipse.org/content/repositories/maven_central/com/ning/compress-lzf/1.0.3/compress-lzf-1.0.3.pom (8 KB at 196.7 KB/sec)
[INFO] Downloading: https://repo.boundlessgeo.com/main/net/jpountz/lz4/lz4/1.3.0/lz4-1.3.0.pom
[INFO] Downloading: http://download.osgeo.org/webdav/geotools/net/jpountz/lz4/lz4/1.3.0/lz4-1.3.0.pom
[INFO] Downloading: http://dev.mapfish.org/maven/repository/net/jpountz/lz4/lz4/1.3.0/lz4-1.3.0.pom
[INFO] Downloading: https://repo.eclipse.org/content/repositories/maven_central/net/jpountz/lz4/lz4/1.3.0/lz4-1.3.0.pom
[INFO] Downloaded: https://repo.eclipse.org/content/repositories/maven_central/net/jpountz/lz4/lz4/1.3.0/lz4-1.3.0.pom (2 KB at 44.8 KB/sec)
[INFO] Downloading: https://repo.boundlessgeo.com/main/org/geotools/gt-data/15.4/gt-data-15.4.pom
[INFO] Downloaded: https://repo.boundlessgeo.com/main/org/geotools/gt-data/15.4/gt-data-15.4.pom (4 KB at 22.6 KB/sec)
[INFO] Downloading: https://repo.boundlessgeo.com/main/org/rocksdb/rocksdbjni/4.13.4/rocksdbjni-4.13.4.jar
[INFO] Downloading: https://repo.boundlessgeo.com/main/org/geotools/gt-epsg-hsql/15.4/gt-epsg-hsql-15.4.jar
[INFO] Downloading: https://repo.boundlessgeo.com/main/org/hsqldb/hsqldb/2.3.0/hsqldb-2.3.0.jar
[INFO] Downloading: https://repo.boundlessgeo.com/main/org/geotools/gt-cql/15.4/gt-cql-15.4.jar
[INFO] Downloading: https://repo.boundlessgeo.com/main/com/google/inject/guice/4.0/guice-4.0-no_aop.jar
[INFO] Downloading: https://repo.boundlessgeo.com/main/javax/inject/javax.inject/1/javax.inject-1.jar
[INFO] Downloading: https://repo.boundlessgeo.com/main/com/google/inject/extensions/guice-multibindings/4.0/guice-multibindings-4.0.jar
[INFO] Downloaded: https://repo.boundlessgeo.com/main/org/geotools/gt-cql/15.4/gt-cql-15.4.jar (193 KB at 406.6 KB/sec)
[INFO] Downloading: https://repo.boundlessgeo.com/main/com/google/code/gson/gson/2.4/gson-2.4.jar
[INFO] Downloading: https://repo.boundlessgeo.com/main/com/ning/compress-lzf/1.0.3/compress-lzf-1.0.3.jar
[INFO] Downloading: https://repo.boundlessgeo.com/main/net/jpountz/lz4/lz4/1.3.0/lz4-1.3.0.jar
[INFO] Downloading: https://repo.boundlessgeo.com/main/org/geotools/gt-data/15.4/gt-data-15.4.jar
[INFO] Downloaded: https://repo.boundlessgeo.com/main/org/geotools/gt-data/15.4/gt-data-15.4.jar (87 KB at 88.4 KB/sec)
[INFO] Downloaded: https://repo.boundlessgeo.com/main/org/geotools/gt-epsg-hsql/15.4/gt-epsg-hsql-15.4.jar (2276 KB at 1277.7 KB/sec)
[INFO] Downloading: http://download.osgeo.org/webdav/geotools/org/rocksdb/rocksdbjni/4.13.4/rocksdbjni-4.13.4.jar
[INFO] Downloading: http://download.osgeo.org/webdav/geotools/org/hsqldb/hsqldb/2.3.0/hsqldb-2.3.0.jar
[INFO] Downloading: http://download.osgeo.org/webdav/geotools/com/google/inject/guice/4.0/guice-4.0-no_aop.jar
[INFO] Downloading: http://download.osgeo.org/webdav/geotools/javax/inject/javax.inject/1/javax.inject-1.jar
[INFO] Downloading: http://download.osgeo.org/webdav/geotools/com/google/inject/extensions/guice-multibindings/4.0/guice-multibindings-4.0.jar
[INFO] Downloading: http://download.osgeo.org/webdav/geotools/com/google/code/gson/gson/2.4/gson-2.4.jar
[INFO] Downloading: http://download.osgeo.org/webdav/geotools/com/ning/compress-lzf/1.0.3/compress-lzf-1.0.3.jar
[INFO] Downloading: http://download.osgeo.org/webdav/geotools/net/jpountz/lz4/lz4/1.3.0/lz4-1.3.0.jar
[INFO] Downloading: http://dev.mapfish.org/maven/repository/org/rocksdb/rocksdbjni/4.13.4/rocksdbjni-4.13.4.jar
[INFO] Downloading: http://dev.mapfish.org/maven/repository/org/hsqldb/hsqldb/2.3.0/hsqldb-2.3.0.jar
[INFO] Downloading: http://dev.mapfish.org/maven/repository/com/google/inject/guice/4.0/guice-4.0-no_aop.jar
[INFO] Downloading: http://dev.mapfish.org/maven/repository/javax/inject/javax.inject/1/javax.inject-1.jar
[INFO] Downloading: http://dev.mapfish.org/maven/repository/com/google/inject/extensions/guice-multibindings/4.0/guice-multibindings-4.0.jar
[INFO] Downloading: http://dev.mapfish.org/maven/repository/com/google/code/gson/gson/2.4/gson-2.4.jar
[INFO] Downloading: http://dev.mapfish.org/maven/repository/com/ning/compress-lzf/1.0.3/compress-lzf-1.0.3.jar
[INFO] Downloading: http://dev.mapfish.org/maven/repository/net/jpountz/lz4/lz4/1.3.0/lz4-1.3.0.jar
[INFO] Downloading: https://repo.eclipse.org/content/repositories/maven_central/org/rocksdb/rocksdbjni/4.13.4/rocksdbjni-4.13.4.jar
[INFO] Downloading: https://repo.eclipse.org/content/repositories/maven_central/org/hsqldb/hsqldb/2.3.0/hsqldb-2.3.0.jar
[INFO] Downloading: https://repo.eclipse.org/content/repositories/maven_central/com/google/inject/guice/4.0/guice-4.0-no_aop.jar
[INFO] Downloading: https://repo.eclipse.org/content/repositories/maven_central/javax/inject/javax.inject/1/javax.inject-1.jar
[INFO] Downloading: https://repo.eclipse.org/content/repositories/maven_central/com/google/inject/extensions/guice-multibindings/4.0/guice-multibindings-4.0.jar
[INFO] Downloaded: https://repo.eclipse.org/content/repositories/maven_central/javax/inject/javax.inject/1/javax.inject-1.jar (3 KB at 93.8 KB/sec)
[INFO] Downloading: https://repo.eclipse.org/content/repositories/maven_central/com/google/code/gson/gson/2.4/gson-2.4.jar
[INFO] Downloaded: https://repo.eclipse.org/content/repositories/maven_central/com/google/inject/extensions/guice-multibindings/4.0/guice-multibindings-4.0.jar (80 KB at 1499.6 KB/sec)
[INFO] Downloading: https://repo.eclipse.org/content/repositories/maven_central/com/ning/compress-lzf/1.0.3/compress-lzf-1.0.3.jar
[INFO] Downloaded: https://repo.eclipse.org/content/repositories/maven_central/com/google/code/gson/gson/2.4/gson-2.4.jar (208 KB at 2276.8 KB/sec)
[INFO] Downloading: https://repo.eclipse.org/content/repositories/maven_central/net/jpountz/lz4/lz4/1.3.0/lz4-1.3.0.jar
[INFO] Downloaded: https://repo.eclipse.org/content/repositories/maven_central/com/google/inject/guice/4.0/guice-4.0-no_aop.jar (414 KB at 3596.8 KB/sec)
[INFO] Downloaded: https://repo.eclipse.org/content/repositories/maven_central/org/hsqldb/hsqldb/2.3.0/hsqldb-2.3.0.jar (1433 KB at 9183.1 KB/sec)
[INFO] Downloaded: https://repo.eclipse.org/content/repositories/maven_central/net/jpountz/lz4/lz4/1.3.0/lz4-1.3.0.jar (232 KB at 1086.0 KB/sec)
[INFO] Downloaded: https://repo.eclipse.org/content/repositories/maven_central/com/ning/compress-lzf/1.0.3/compress-lzf-1.0.3.jar (78 KB at 366.1 KB/sec)
[INFO] Downloaded: https://repo.eclipse.org/content/repositories/maven_central/org/rocksdb/rocksdbjni/4.13.4/rocksdbjni-4.13.4.jar (7039 KB at 22134.8 KB/sec)
[INFO] 
[INFO] --- maven-clean-plugin:2.5:clean (default-clean) @ geogig-core ---
[INFO] 
[INFO] --- git-commit-id-plugin:2.1.8:revision (default) @ geogig-core ---
[INFO] 
[INFO] --- maven-resources-plugin:2.6:resources (default-resources) @ geogig-core ---
[INFO] Using 'UTF-8' encoding to copy filtered resources.
[INFO] Copying 5 resources
[INFO] 
[INFO] --- maven-compiler-plugin:3.1:compile (default-compile) @ geogig-core ---
[INFO] Changes detected - recompiling the module!
[INFO] Compiling 340 source files to /home/hudson/genie.geogig/.hudson/jobs/geogig-1.1.x/workspace/src/core/target/classes
[WARNING] /home/hudson/genie.geogig/.hudson/jobs/geogig-1.1.x/workspace/src/core/src/main/java/org/locationtech/geogig/storage/impl/TransactionConflictsDatabase.java: Some input files use or override a deprecated API.
[WARNING] /home/hudson/genie.geogig/.hudson/jobs/geogig-1.1.x/workspace/src/core/src/main/java/org/locationtech/geogig/storage/impl/TransactionConflictsDatabase.java: Recompile with -Xlint:deprecation for details.
[WARNING] /home/hudson/genie.geogig/.hudson/jobs/geogig-1.1.x/workspace/src/core/src/main/java/org/locationtech/geogig/storage/datastream/ValueSerializer.java: Some input files use unchecked or unsafe operations.
[WARNING] /home/hudson/genie.geogig/.hudson/jobs/geogig-1.1.x/workspace/src/core/src/main/java/org/locationtech/geogig/storage/datastream/ValueSerializer.java: Recompile with -Xlint:unchecked for details.
[INFO] 
[INFO] --- maven-resources-plugin:2.6:testResources (default-testResources) @ geogig-core ---
[INFO] Using 'UTF-8' encoding to copy filtered resources.
[INFO] Copying 3 resources
[INFO] 
[INFO] --- maven-compiler-plugin:3.1:testCompile (default-testCompile) @ geogig-core ---
[INFO] Changes detected - recompiling the module!
[INFO] Compiling 171 source files to /home/hudson/genie.geogig/.hudson/jobs/geogig-1.1.x/workspace/src/core/target/test-classes
[WARNING] /home/hudson/genie.geogig/.hudson/jobs/geogig-1.1.x/workspace/src/core/src/test/java/org/locationtech/geogig/model/internal/CanonicalClusteringStrategyTest.java: Some input files use or override a deprecated API.
[WARNING] /home/hudson/genie.geogig/.hudson/jobs/geogig-1.1.x/workspace/src/core/src/test/java/org/locationtech/geogig/model/internal/CanonicalClusteringStrategyTest.java: Recompile with -Xlint:deprecation for details.
[WARNING] /home/hudson/genie.geogig/.hudson/jobs/geogig-1.1.x/workspace/src/core/src/test/java/org/locationtech/geogig/data/retrieve/BackgroundingIteratorTest.java: Some input files use unchecked or unsafe operations.
[WARNING] /home/hudson/genie.geogig/.hudson/jobs/geogig-1.1.x/workspace/src/core/src/test/java/org/locationtech/geogig/data/retrieve/BackgroundingIteratorTest.java: Recompile with -Xlint:unchecked for details.
[INFO] 
[INFO] --- maven-surefire-plugin:2.17:test (default-test) @ geogig-core ---
[INFO] Surefire report directory: /home/hudson/genie.geogig/.hudson/jobs/geogig-1.1.x/workspace/src/core/target/surefire-reports

-------------------------------------------------------
 T E S T S
-------------------------------------------------------

-------------------------------------------------------
 T E S T S
-------------------------------------------------------
Running org.locationtech.geogig.storage.memory.HeapBlobStoreTest
Running org.locationtech.geogig.storage.memory.HeapGraphDatabaseTest
Running org.locationtech.geogig.storage.memory.HeapIndexDatabaseConformanceTest
Running org.locationtech.geogig.storage.impl.PersistedIterableTest
Running org.locationtech.geogig.storage.memory.HeapRefDatabaseTest
Running org.locationtech.geogig.storage.memory.HeapConflictsDatabaseConformanceTest
Running org.locationtech.geogig.storage.memory.HeapObjectStoreConformanceTest
Running org.locationtech.geogig.storage.impl.INIBlobTest
Running org.locationtech.geogig.storage.datastream.v2_3.NodeSetTest
Running org.locationtech.geogig.storage.datastream.v2_3.TailTest
Running org.locationtech.geogig.storage.datastream.v2_3.RevTreeFormatPrefTest
Running org.locationtech.geogig.storage.datastream.v2_3.DataStreamSerializationFactoryV2_3Test
Running org.locationtech.geogig.storage.datastream.v2_3.StringTableTest
Running org.locationtech.geogig.storage.datastream.v2_3.RevTreeFormatTest
Running org.locationtech.geogig.storage.datastream.DataStreamSerializationFactoryV2_1Test
Running org.locationtech.geogig.storage.datastream.DataStreamSerializationFactoryV1Test
Running org.locationtech.geogig.storage.datastream.DataStreamSerializationFactoryV2_2Test
Running org.locationtech.geogig.storage.datastream.FloatPackedCoordinateSequenceTest
Running org.locationtech.geogig.storage.datastream.Float32BoundsSerializationTest
Running org.locationtech.geogig.storage.datastream.LZ4SerializationFactoryTest
Running org.locationtech.geogig.storage.datastream.FormatCommonV2_1Test
Running org.locationtech.geogig.storage.datastream.LZFSerializationFactoryTest
Running org.locationtech.geogig.storage.datastream.DataStreamSerializationFactoryV2Test
Running org.locationtech.geogig.storage.datastream.VarintTest
Tests run: 1, Failures: 0, Errors: 0, Skipped: 0, Time elapsed: 0.18 sec - in org.locationtech.geogig.storage.datastream.v2_3.TailTest
Running org.locationtech.geogig.storage.fs.IniFileConfigDatabaseTest
[main] INFO org.locationtech.geogig.test.performance.EnablePerformanceTestRule - org.locationtech.geogig.storage.datastream.v2_3.RevTreeFormatPrefTest ignored, run with -Dgeogig.runPerformanceTests=true to enable it.
[main] INFO org.locationtech.geogig.test.performance.EnablePerformanceTestRule - org.locationtech.geogig.storage.datastream.v2_3.RevTreeFormatPrefTest ignored, run with -Dgeogig.runPerformanceTests=true to enable it.
[main] INFO org.locationtech.geogig.test.performance.EnablePerformanceTestRule - org.locationtech.geogig.storage.datastream.v2_3.RevTreeFormatPrefTest ignored, run with -Dgeogig.runPerformanceTests=true to enable it.
[main] INFO org.locationtech.geogig.test.performance.EnablePerformanceTestRule - org.locationtech.geogig.storage.datastream.v2_3.RevTreeFormatPrefTest ignored, run with -Dgeogig.runPerformanceTests=true to enable it.
[main] INFO org.locationtech.geogig.test.performance.EnablePerformanceTestRule - org.locationtech.geogig.storage.datastream.v2_3.RevTreeFormatPrefTest ignored, run with -Dgeogig.runPerformanceTests=true to enable it.
[main] INFO org.locationtech.geogig.test.performance.EnablePerformanceTestRule - org.locationtech.geogig.storage.datastream.v2_3.RevTreeFormatPrefTest ignored, run with -Dgeogig.runPerformanceTests=true to enable it.
Tests run: 6, Failures: 0, Errors: 0, Skipped: 0, Time elapsed: 0.2 sec - in org.locationtech.geogig.storage.datastream.v2_3.RevTreeFormatPrefTest
Running org.locationtech.geogig.storage.fs.FileConflictsDatabaseConformanceTest
Tests run: 2, Failures: 0, Errors: 0, Skipped: 0, Time elapsed: 0.366 sec - in org.locationtech.geogig.storage.datastream.v2_3.StringTableTest
Tests run: 2, Failures: 0, Errors: 0, Skipped: 0, Time elapsed: 0.348 sec - in org.locationtech.geogig.storage.datastream.Float32BoundsSerializationTest
Running org.locationtech.geogig.storage.fs.FileRefDatabaseTest
Running org.locationtech.geogig.storage.fs.FileBlobStoreTest
Tests run: 3, Failures: 0, Errors: 0, Skipped: 0, Time elapsed: 0.437 sec - in org.locationtech.geogig.storage.datastream.FloatPackedCoordinateSequenceTest
Running org.locationtech.geogig.storage.text.TextSerializationFactoryTest
Tests run: 7, Failures: 0, Errors: 0, Skipped: 0, Time elapsed: 0.643 sec - in org.locationtech.geogig.storage.memory.HeapBlobStoreTest
Running org.locationtech.geogig.data.EPSGBoundsYXTest
Tests run: 1, Failures: 0, Errors: 0, Skipped: 1, Time elapsed: 0 sec - in org.locationtech.geogig.data.EPSGBoundsYXTest
Tests run: 4, Failures: 0, Errors: 0, Skipped: 0, Time elapsed: 0.362 sec - in org.locationtech.geogig.storage.datastream.VarintTest
Running org.locationtech.geogig.data.retrieve.BackgroundingIteratorTest
Running org.locationtech.geogig.data.EPSGBoundsXYTest
Tests run: 1, Failures: 0, Errors: 0, Skipped: 1, Time elapsed: 0 sec - in org.locationtech.geogig.data.EPSGBoundsXYTest
Tests run: 2, Failures: 0, Errors: 0, Skipped: 0, Time elapsed: 0.602 sec - in org.locationtech.geogig.storage.impl.PersistedIterableTest
Running org.locationtech.geogig.data.retrieve.BulkGeoGigFeatureRetrieverTest
Running org.locationtech.geogig.data.retrieve.IteratorBackedFeatureReaderTest
Tests run: 13, Failures: 0, Errors: 1, Skipped: 0, Time elapsed: 0.884 sec <<< FAILURE! - in org.locationtech.geogig.storage.memory.HeapGraphDatabaseTest
testPutConcurrency(org.locationtech.geogig.storage.memory.HeapGraphDatabaseTest)  Time elapsed: 0.022 sec  <<< ERROR!
java.util.concurrent.ExecutionException: java.lang.IllegalStateException
	at java.util.concurrent.FutureTask.report(FutureTask.java:122)
	at java.util.concurrent.FutureTask.get(FutureTask.java:192)
	at org.locationtech.geogig.storage.impl.GraphDatabaseTest.testPutConcurrency(GraphDatabaseTest.java:390)
	at sun.reflect.NativeMethodAccessorImpl.invoke0(Native Method)
	at sun.reflect.NativeMethodAccessorImpl.invoke(NativeMethodAccessorImpl.java:62)
	at sun.reflect.DelegatingMethodAccessorImpl.invoke(DelegatingMethodAccessorImpl.java:43)
	at java.lang.reflect.Method.invoke(Method.java:498)
	at org.junit.runners.model.FrameworkMethod$1.runReflectiveCall(FrameworkMethod.java:50)
	at org.junit.internal.runners.model.ReflectiveCallable.run(ReflectiveCallable.java:12)
	at org.junit.runners.model.FrameworkMethod.invokeExplosively(FrameworkMethod.java:47)
	at org.junit.internal.runners.statements.InvokeMethod.evaluate(InvokeMethod.java:17)
	at org.junit.internal.runners.statements.RunBefores.evaluate(RunBefores.java:26)
	at org.junit.internal.runners.statements.RunAfters.evaluate(RunAfters.java:27)
	at org.junit.rules.ExternalResource$1.evaluate(ExternalResource.java:48)
	at org.junit.rules.RunRules.evaluate(RunRules.java:20)
	at org.junit.runners.ParentRunner.runLeaf(ParentRunner.java:325)
	at org.junit.runners.BlockJUnit4ClassRunner.runChild(BlockJUnit4ClassRunner.java:78)
	at org.junit.runners.BlockJUnit4ClassRunner.runChild(BlockJUnit4ClassRunner.java:57)
	at org.junit.runners.ParentRunner$3.run(ParentRunner.java:290)
	at org.junit.runners.ParentRunner$1.schedule(ParentRunner.java:71)
	at org.junit.runners.ParentRunner.runChildren(ParentRunner.java:288)
	at org.junit.runners.ParentRunner.access$000(ParentRunner.java:58)
	at org.junit.runners.ParentRunner$2.evaluate(ParentRunner.java:268)
	at org.junit.runners.ParentRunner.run(ParentRunner.java:363)
	at org.apache.maven.surefire.junit4.JUnit4Provider.execute(JUnit4Provider.java:264)
	at org.apache.maven.surefire.junit4.JUnit4Provider.executeTestSet(JUnit4Provider.java:153)
	at org.apache.maven.surefire.junit4.JUnit4Provider.invoke(JUnit4Provider.java:124)
	at org.apache.maven.surefire.booter.ForkedBooter.invokeProviderInSameClassLoader(ForkedBooter.java:200)
	at org.apache.maven.surefire.booter.ForkedBooter.runSuitesInProcess(ForkedBooter.java:153)
	at org.apache.maven.surefire.booter.ForkedBooter.main(ForkedBooter.java:103)
Caused by: java.lang.IllegalStateException: null
	at com.google.common.base.Preconditions.checkState(Preconditions.java:158)
	at org.locationtech.geogig.storage.memory.Graph.newNode(Graph.java:65)
	at org.locationtech.geogig.storage.memory.Graph.getOrAdd(Graph.java:48)
	at org.locationtech.geogig.storage.memory.HeapGraphDatabase.put(HeapGraphDatabase.java:141)
	at org.locationtech.geogig.storage.impl.GraphDatabaseTest$1.run(GraphDatabaseTest.java:383)
	at java.util.concurrent.Executors$RunnableAdapter.call(Executors.java:511)
	at java.util.concurrent.FutureTask.run(FutureTask.java:266)
	at java.util.concurrent.ThreadPoolExecutor.runWorker(ThreadPoolExecutor.java:1142)
	at java.util.concurrent.ThreadPoolExecutor$Worker.run(ThreadPoolExecutor.java:617)
	at java.lang.Thread.run(Thread.java:745)

Running org.locationtech.geogig.data.retrieve.MultiFeatureTypeBuilderTest
Tests run: 7, Failures: 0, Errors: 0, Skipped: 0, Time elapsed: 0.383 sec - in org.locationtech.geogig.storage.fs.FileBlobStoreTest
Running org.locationtech.geogig.data.retrieve.BulkFeatureRetrieverTest
Tests run: 11, Failures: 0, Errors: 0, Skipped: 0, Time elapsed: 0.501 sec - in org.locationtech.geogig.storage.fs.FileRefDatabaseTest
Running org.locationtech.geogig.data.PrimitiveArrayToStringConverterFactoryTest
Tests run: 11, Failures: 0, Errors: 0, Skipped: 0, Time elapsed: 1.173 sec - in org.locationtech.geogig.storage.memory.HeapRefDatabaseTest
Running org.locationtech.geogig.data.MapToStringConverterFactoryTest
Tests run: 14, Failures: 0, Errors: 0, Skipped: 0, Time elapsed: 1.386 sec - in org.locationtech.geogig.storage.memory.HeapConflictsDatabaseConformanceTest
Running org.locationtech.geogig.data.EPSGBoundsCalcTest
Tests run: 4, Failures: 0, Errors: 0, Skipped: 0, Time elapsed: 1.311 sec - in org.locationtech.geogig.storage.datastream.FormatCommonV2_1Test
Running org.locationtech.geogig.data.FeatureBuilderTest
Tests run: 7, Failures: 0, Errors: 0, Skipped: 0, Time elapsed: 0.473 sec - in org.locationtech.geogig.data.PrimitiveArrayToStringConverterFactoryTest
Running org.locationtech.geogig.test.integration.ConfigOpTest
Tests run: 2, Failures: 0, Errors: 0, Skipped: 0, Time elapsed: 0.887 sec - in org.locationtech.geogig.data.retrieve.BulkGeoGigFeatureRetrieverTest
Running org.locationtech.geogig.test.integration.BranchRenameOpTest
Tests run: 1, Failures: 0, Errors: 0, Skipped: 0, Time elapsed: 0.404 sec - in org.locationtech.geogig.data.MapToStringConverterFactoryTest
Running org.locationtech.geogig.test.integration.ReportCommitConflictsOpTest
Tests run: 23, Failures: 0, Errors: 0, Skipped: 0, Time elapsed: 1.43 sec - in org.locationtech.geogig.storage.fs.IniFileConfigDatabaseTest
Running org.locationtech.geogig.test.integration.CloneOpTest
Tests run: 9, Failures: 0, Errors: 0, Skipped: 0, Time elapsed: 1.864 sec - in org.locationtech.geogig.data.retrieve.BackgroundingIteratorTest
Running org.locationtech.geogig.test.integration.FetchOpTest
Tests run: 1, Failures: 0, Errors: 0, Skipped: 0, Time elapsed: 2.941 sec - in org.locationtech.geogig.data.retrieve.IteratorBackedFeatureReaderTest
Running org.locationtech.geogig.test.integration.BranchListOpTest
Tests run: 24, Failures: 0, Errors: 0, Skipped: 0, Time elapsed: 3.876 sec - in org.locationtech.geogig.storage.memory.HeapObjectStoreConformanceTest
Tests run: 39, Failures: 0, Errors: 0, Skipped: 0, Time elapsed: 3.988 sec - in org.locationtech.geogig.storage.memory.HeapIndexDatabaseConformanceTest
Running org.locationtech.geogig.test.integration.RebaseOpTest
Running org.locationtech.geogig.test.integration.GeogigTransactionTest
Tests run: 14, Failures: 0, Errors: 0, Skipped: 0, Time elapsed: 4.267 sec - in org.locationtech.geogig.storage.fs.FileConflictsDatabaseConformanceTest
Running org.locationtech.geogig.test.integration.TagTest
Tests run: 2, Failures: 0, Errors: 0, Skipped: 0, Time elapsed: 3.789 sec - in org.locationtech.geogig.data.retrieve.MultiFeatureTypeBuilderTest
Running org.locationtech.geogig.test.integration.RemoveOpTest
Tests run: 1, Failures: 0, Errors: 0, Skipped: 0, Time elapsed: 3.893 sec - in org.locationtech.geogig.data.retrieve.BulkFeatureRetrieverTest
Running org.locationtech.geogig.test.integration.CheckSparsePathTest
Tests run: 7, Failures: 0, Errors: 0, Skipped: 0, Time elapsed: 4.881 sec - in org.locationtech.geogig.storage.datastream.v2_3.NodeSetTest
Tests run: 21, Failures: 0, Errors: 0, Skipped: 0, Time elapsed: 4.939 sec - in org.locationtech.geogig.storage.datastream.DataStreamSerializationFactoryV2_2Test
Running org.locationtech.geogig.test.integration.AddOpTest
Running org.locationtech.geogig.test.integration.ConflictsReadWriteOpTest
Tests run: 21, Failures: 0, Errors: 0, Skipped: 0, Time elapsed: 4.987 sec - in org.locationtech.geogig.storage.datastream.DataStreamSerializationFactoryV2_1Test
Running org.locationtech.geogig.test.integration.repository.IndexTest
Tests run: 21, Failures: 0, Errors: 0, Skipped: 0, Time elapsed: 5.112 sec - in org.locationtech.geogig.storage.datastream.LZFSerializationFactoryTest
Running org.locationtech.geogig.test.integration.repository.WorkingTreeTest
Tests run: 1, Failures: 0, Errors: 0, Skipped: 0, Time elapsed: 3.962 sec - in org.locationtech.geogig.data.FeatureBuilderTest
Running org.locationtech.geogig.test.integration.GeogigAPITest
Tests run: 21, Failures: 0, Errors: 0, Skipped: 0, Time elapsed: 5.456 sec - in org.locationtech.geogig.storage.datastream.DataStreamSerializationFactoryV1Test
Running org.locationtech.geogig.test.integration.BranchCreateOpTest
Tests run: 21, Failures: 0, Errors: 0, Skipped: 0, Time elapsed: 5.479 sec - in org.locationtech.geogig.storage.datastream.LZ4SerializationFactoryTest
Running org.locationtech.geogig.test.integration.FindCommonAncestorTest
Tests run: 21, Failures: 0, Errors: 0, Skipped: 0, Time elapsed: 5.473 sec - in org.locationtech.geogig.storage.datastream.DataStreamSerializationFactoryV2Test
Tests run: 1, Failures: 0, Errors: 0, Skipped: 0, Time elapsed: 5.679 sec - in org.locationtech.geogig.storage.impl.INIBlobTest
Running org.locationtech.geogig.test.integration.RevertOpTest
Running org.locationtech.geogig.test.integration.HooksTest
Tests run: 21, Failures: 0, Errors: 0, Skipped: 0, Time elapsed: 5.781 sec - in org.locationtech.geogig.storage.datastream.v2_3.DataStreamSerializationFactoryV2_3Test
Running org.locationtech.geogig.test.integration.RemoteRemoveOpTest
Tests run: 22, Failures: 0, Errors: 0, Skipped: 0, Time elapsed: 5.502 sec - in org.locationtech.geogig.storage.text.TextSerializationFactoryTest
Running org.locationtech.geogig.test.integration.RevParseIntegrationTest
Tests run: 3, Failures: 0, Errors: 0, Skipped: 0, Time elapsed: 1.181 sec - in org.locationtech.geogig.test.integration.GeogigAPITest
Running org.locationtech.geogig.test.integration.CherryPickOpTest
[main] INFO org.locationtech.geogig.hooks.Scripting - Running jvm script /opt/public/hipp/ramdisk/geogig/junit7449063497286703546/repo1885346028/.geogig/hooks/pre_commit.js
Tests run: 8, Failures: 0, Errors: 0, Skipped: 0, Time elapsed: 2.335 sec - in org.locationtech.geogig.test.integration.RemoteRemoveOpTest
Running org.locationtech.geogig.test.integration.CleanOpTest
Tests run: 8, Failures: 0, Errors: 0, Skipped: 0, Time elapsed: 6.897 sec - in org.locationtech.geogig.test.integration.BranchRenameOpTest
Running org.locationtech.geogig.test.integration.BlameOpTest
Tests run: 8, Failures: 0, Errors: 0, Skipped: 0, Time elapsed: 8.629 sec - in org.locationtech.geogig.storage.datastream.v2_3.RevTreeFormatTest
Running org.locationtech.geogig.test.integration.BranchDeleteOpTest
[main] INFO org.locationtech.geogig.hooks.Scripting - Running jvm script /opt/public/hipp/ramdisk/geogig/junit7449063497286703546/repo1885346028/.geogig/hooks/pre_commit.js
Tests run: 7, Failures: 0, Errors: 0, Skipped: 0, Time elapsed: 3.047 sec - in org.locationtech.geogig.test.integration.RevParseIntegrationTest
Running org.locationtech.geogig.test.integration.PushOpTest
Tests run: 2, Failures: 0, Errors: 0, Skipped: 0, Time elapsed: 4.79 sec - in org.locationtech.geogig.test.integration.CheckSparsePathTest
[main] INFO org.locationtech.geogig.hooks.Scripting - Running jvm script /opt/public/hipp/ramdisk/geogig/junit2635580670564596034/repo-270965477/.geogig/hooks/post_commit.js
Tests run: 7, Failures: 0, Errors: 0, Skipped: 1, Time elapsed: 2.957 sec - in org.locationtech.geogig.test.integration.CherryPickOpTest
Running org.locationtech.geogig.test.integration.StatusOpTest
Running org.locationtech.geogig.test.integration.SquashOpTest
Tests run: 21, Failures: 0, Errors: 0, Skipped: 0, Time elapsed: 8.156 sec - in org.locationtech.geogig.test.integration.ConfigOpTest
Running org.locationtech.geogig.test.integration.CommitOpTest
[main] WARN org.locationtech.geogig.hooks.CommandHookChain - Post-command hook org.locationtech.geogig.hooks.JVMScriptHook@2ad3a1bb for command org.locationtech.geogig.porcelain.CommitOp threw an exception that will not be propagated
java.lang.NullPointerException
	at org.locationtech.geogig.hooks.Scripting.runJVMScript(Scripting.java:93)
	at org.locationtech.geogig.hooks.JVMScriptHook.post(JVMScriptHook.java:52)
	at org.locationtech.geogig.hooks.CommandHookChain.runPostHooks(CommandHookChain.java:65)
	at org.locationtech.geogig.hooks.CommandHooksDecorator$HooksListener.postCall(CommandHooksDecorator.java:60)
	at org.locationtech.geogig.repository.AbstractGeoGigOp.notifyPost(AbstractGeoGigOp.java:179)
	at org.locationtech.geogig.repository.AbstractGeoGigOp.call(AbstractGeoGigOp.java:155)
	at org.locationtech.geogig.test.integration.HooksTest.testFailingPostPostProcessHook(HooksTest.java:148)
	at sun.reflect.NativeMethodAccessorImpl.invoke0(Native Method)
	at sun.reflect.NativeMethodAccessorImpl.invoke(NativeMethodAccessorImpl.java:62)
	at sun.reflect.DelegatingMethodAccessorImpl.invoke(DelegatingMethodAccessorImpl.java:43)
	at java.lang.reflect.Method.invoke(Method.java:498)
Tests run: 1, Failures: 0, Errors: 0, Skipped: 0, Time elapsed: 4.609 sec - in org.locationtech.geogig.test.integration.ConflictsReadWriteOpTest
Running org.locationtech.geogig.test.integration.LogOpTest
	at org.junit.runners.model.FrameworkMethod$1.runReflectiveCall(FrameworkMethod.java:50)
	at org.junit.internal.runners.model.ReflectiveCallable.run(ReflectiveCallable.java:12)
	at org.junit.runners.model.FrameworkMethod.invokeExplosively(FrameworkMethod.java:47)
	at org.junit.internal.runners.statements.InvokeMethod.evaluate(InvokeMethod.java:17)
	at org.junit.internal.runners.statements.RunBefores.evaluate(RunBefores.java:26)
	at org.junit.internal.runners.statements.RunAfters.evaluate(RunAfters.java:27)
	at org.junit.rules.ExternalResource$1.evaluate(ExternalResource.java:48)
	at org.junit.rules.RunRules.evaluate(RunRules.java:20)
	at org.junit.runners.ParentRunner.runLeaf(ParentRunner.java:325)
	at org.junit.runners.BlockJUnit4ClassRunner.runChild(BlockJUnit4ClassRunner.java:78)
	at org.junit.runners.BlockJUnit4ClassRunner.runChild(BlockJUnit4ClassRunner.java:57)
	at org.junit.runners.ParentRunner$3.run(ParentRunner.java:290)
	at org.junit.runners.ParentRunner$1.schedule(ParentRunner.java:71)
	at org.junit.runners.ParentRunner.runChildren(ParentRunner.java:288)
	at org.junit.runners.ParentRunner.access$000(ParentRunner.java:58)
	at org.junit.runners.ParentRunner$2.evaluate(ParentRunner.java:268)
	at org.junit.runners.ParentRunner.run(ParentRunner.java:363)
	at org.apache.maven.surefire.junit4.JUnit4Provider.execute(JUnit4Provider.java:264)
	at org.apache.maven.surefire.junit4.JUnit4Provider.executeTestSet(JUnit4Provider.java:153)
	at org.apache.maven.surefire.junit4.JUnit4Provider.invoke(JUnit4Provider.java:124)
	at org.apache.maven.surefire.booter.ForkedBooter.invokeProviderInSameClassLoader(ForkedBooter.java:200)
	at org.apache.maven.surefire.booter.ForkedBooter.runSuitesInProcess(ForkedBooter.java:153)
	at org.apache.maven.surefire.booter.ForkedBooter.main(ForkedBooter.java:103)
Tests run: 11, Failures: 0, Errors: 0, Skipped: 0, Time elapsed: 4.209 sec - in org.locationtech.geogig.test.integration.BranchCreateOpTest
[main] WARN org.locationtech.geogig.hooks.CommandHookChain - Post-command hook org.locationtech.geogig.test.integration.HooksTest$ClasspathHookTest@63fd4873 for command org.locationtech.geogig.porcelain.AddOp threw an exception that will not be propagated
java.lang.RuntimeException: expected
	at org.locationtech.geogig.test.integration.HooksTest$ClasspathHookTest.post(HooksTest.java:266)
	at org.locationtech.geogig.hooks.CommandHookChain.runPostHooks(CommandHookChain.java:65)
	at org.locationtech.geogig.hooks.CommandHooksDecorator$HooksListener.postCall(CommandHooksDecorator.java:60)
	at org.locationtech.geogig.repository.AbstractGeoGigOp.notifyPost(AbstractGeoGigOp.java:179)
	at org.locationtech.geogig.repository.AbstractGeoGigOp.call(AbstractGeoGigOp.java:155)
	at org.locationtech.geogig.test.integration.RepositoryTestCase.insertAndAdd(RepositoryTestCase.java:377)
	at org.locationtech.geogig.test.integration.RepositoryTestCase.insertAndAdd(RepositoryTestCase.java:365)
	at org.locationtech.geogig.test.integration.HooksTest.testClasspathHookPostFail(HooksTest.java:191)Running org.locationtech.geogig.test.integration.ResetOpTest

	at sun.reflect.NativeMethodAccessorImpl.invoke0(Native Method)
	at sun.reflect.NativeMethodAccessorImpl.invoke(NativeMethodAccessorImpl.java:62)
	at sun.reflect.DelegatingMethodAccessorImpl.invoke(DelegatingMethodAccessorImpl.java:43)
	at java.lang.reflect.Method.invoke(Method.java:498)
	at org.junit.runners.model.FrameworkMethod$1.runReflectiveCall(FrameworkMethod.java:50)
	at org.junit.internal.runners.model.ReflectiveCallable.run(ReflectiveCallable.java:12)
	at org.junit.runners.model.FrameworkMethod.invokeExplosively(FrameworkMethod.java:47)
	at org.junit.internal.runners.statements.InvokeMethod.evaluate(InvokeMethod.java:17)
	at org.junit.internal.runners.statements.RunBefores.evaluate(RunBefores.java:26)
	at org.junit.internal.runners.statements.RunAfters.evaluate(RunAfters.java:27)
	at org.junit.rules.ExternalResource$1.evaluate(ExternalResource.java:48)
	at org.junit.rules.RunRules.evaluate(RunRules.java:20)
	at org.junit.runners.ParentRunner.runLeaf(ParentRunner.java:325)
	at org.junit.runners.BlockJUnit4ClassRunner.runChild(BlockJUnit4ClassRunner.java:78)
	at org.junit.runners.BlockJUnit4ClassRunner.runChild(BlockJUnit4ClassRunner.java:57)
	at org.junit.runners.ParentRunner$3.run(ParentRunner.java:290)
	at org.junit.runners.ParentRunner$1.schedule(ParentRunner.java:71)
	at org.junit.runners.ParentRunner.runChildren(ParentRunner.java:288)
	at org.junit.runners.ParentRunner.access$000(ParentRunner.java:58)
	at org.junit.runners.ParentRunner$2.evaluate(ParentRunner.java:268)
	at org.junit.runners.ParentRunner.run(ParentRunner.java:363)
	at org.apache.maven.surefire.junit4.JUnit4Provider.execute(JUnit4Provider.java:264)
	at org.apache.maven.surefire.junit4.JUnit4Provider.executeTestSet(JUnit4Provider.java:153)
	at org.apache.maven.surefire.junit4.JUnit4Provider.invoke(JUnit4Provider.java:124)
	at org.apache.maven.surefire.booter.ForkedBooter.invokeProviderInSameClassLoader(ForkedBooter.java:200)
	at org.apache.maven.surefire.booter.ForkedBooter.runSuitesInProcess(ForkedBooter.java:153)
	at org.apache.maven.surefire.booter.ForkedBooter.main(ForkedBooter.java:103)
Tests run: 6, Failures: 0, Errors: 0, Skipped: 0, Time elapsed: 1.464 sec - in org.locationtech.geogig.test.integration.BlameOpTest
Running org.locationtech.geogig.test.integration.DiffOpTest
Tests run: 4, Failures: 0, Errors: 0, Skipped: 0, Time elapsed: 0.478 sec - in org.locationtech.geogig.test.integration.StatusOpTest
Running org.locationtech.geogig.test.integration.SparseCloneTest
Tests run: 3, Failures: 0, Errors: 0, Skipped: 0, Time elapsed: 1.953 sec - in org.locationtech.geogig.test.integration.CleanOpTest
Running org.locationtech.geogig.test.integration.MergeOpTest
[main] INFO org.locationtech.geogig.hooks.Scripting - Running shell script /opt/public/hipp/ramdisk/geogig/junit6554607757055937849/repo-1695160205/.geogig/hooks/pre_commit.bat
[main] INFO org.locationtech.geogig.hooks.Scripting - Running shell script /opt/public/hipp/ramdisk/geogig/junit6554607757055937849/repo-1695160205/.geogig/hooks/pre_commit.bat
Tests run: 10, Failures: 0, Errors: 0, Skipped: 1, Time elapsed: 5.735 sec - in org.locationtech.geogig.test.integration.RemoveOpTest
testMergeNoCommits
Running org.locationtech.geogig.test.integration.ReportMergeConflictsOpTest
Tests run: 2, Failures: 0, Errors: 0, Skipped: 0, Time elapsed: 6.879 sec - in org.locationtech.geogig.test.integration.BranchListOpTest
Running org.locationtech.geogig.test.integration.CreatePatchOpTest
testOctopusMerge
[main] INFO org.locationtech.geogig.hooks.Scripting - Running jvm script /opt/public/hipp/ramdisk/geogig/junit8929911755552372407/repo-973868264/.geogig/hooks/pre_commit.js
Tests run: 7, Failures: 0, Errors: 0, Skipped: 0, Time elapsed: 5.018 sec - in org.locationtech.geogig.test.integration.HooksTest
Running org.locationtech.geogig.test.integration.PullOpTest
Tests run: 3, Failures: 0, Errors: 0, Skipped: 0, Time elapsed: 6.38 sec - in org.locationtech.geogig.test.integration.TagTest
Running org.locationtech.geogig.test.integration.ApplyPatchOpTest
Tests run: 10, Failures: 0, Errors: 0, Skipped: 0, Time elapsed: 9.491 sec - in org.locationtech.geogig.test.integration.ReportCommitConflictsOpTest
Running org.locationtech.geogig.test.integration.CleanRefsOpTest
Tests run: 9, Failures: 0, Errors: 0, Skipped: 0, Time elapsed: 6.02 sec - in org.locationtech.geogig.test.integration.repository.IndexTest
Running org.locationtech.geogig.test.integration.RemoteListOpTest
Tests run: 20, Failures: 0, Errors: 0, Skipped: 0, Time elapsed: 5.95 sec - in org.locationtech.geogig.test.integration.repository.WorkingTreeTest
Running org.locationtech.geogig.test.integration.CheckoutOpTest
Tests run: 1, Failures: 0, Errors: 0, Skipped: 0, Time elapsed: 0.258 sec - in org.locationtech.geogig.test.integration.CleanRefsOpTest
Running org.locationtech.geogig.test.integration.LsTreeOpTest
Tests run: 4, Failures: 0, Errors: 0, Skipped: 0, Time elapsed: 0.356 sec - in org.locationtech.geogig.test.integration.RemoteListOpTest
Running org.locationtech.geogig.test.integration.RemoteAddOpTest
Tests run: 12, Failures: 0, Errors: 0, Skipped: 0, Time elapsed: 6.567 sec - in org.locationtech.geogig.test.integration.AddOpTest
Running org.locationtech.geogig.test.integration.RebuildGraphOpTest
Tests run: 15, Failures: 0, Errors: 0, Skipped: 0, Time elapsed: 6.177 sec - in org.locationtech.geogig.test.integration.RevertOpTest
Running org.locationtech.geogig.test.performance.HeapGraphDatabaseStressTest
[main] INFO org.locationtech.geogig.test.performance.EnablePerformanceTestRule - org.locationtech.geogig.test.performance.HeapGraphDatabaseStressTest ignored, run with -Dgeogig.runPerformanceTests=true to enable it.
Tests run: 0, Failures: 0, Errors: 0, Skipped: 0, Time elapsed: 0.008 sec - in org.locationtech.geogig.test.performance.HeapGraphDatabaseStressTest
Running org.locationtech.geogig.test.performance.LogOpPerformanceTest
[main] INFO org.locationtech.geogig.test.performance.EnablePerformanceTestRule - org.locationtech.geogig.test.performance.LogOpPerformanceTest ignored, run with -Dgeogig.runPerformanceTests=true to enable it.
Tests run: 0, Failures: 0, Errors: 0, Skipped: 0, Time elapsed: 0.005 sec - in org.locationtech.geogig.test.performance.LogOpPerformanceTest
Running org.locationtech.geogig.test.performance.RevTreeBuilderPerformanceTest
[main] INFO org.locationtech.geogig.test.performance.EnablePerformanceTestRule - org.locationtech.geogig.test.performance.RevTreeBuilderPerformanceTest ignored, run with -Dgeogig.runPerformanceTests=true to enable it.
Tests run: 0, Failures: 0, Errors: 0, Skipped: 0, Time elapsed: 0.01 sec - in org.locationtech.geogig.test.performance.RevTreeBuilderPerformanceTest
[main] INFO org.locationtech.geogig.plumbing.SendPack - Pushing Ref[refs/heads/master -> a3ad4dd3b550a1215e3001faf8071e3448956105] to refs/remotes/origin/NewRemoteBranch(NewRemoteBranch)
[main] INFO org.locationtech.geogig.plumbing.SendPack - Pushing Ref[refs/heads/Branch1 -> 43a3e480cf2de155a4a8a7b4a9030df9a23ab671] to refs/remotes/origin/NewRemoteBranch2(NewRemoteBranch2)
Running org.locationtech.geogig.model.internal.CanonicalClusteringStrategyRocksdbStorageTest
[main] INFO org.locationtech.geogig.plumbing.SendPack - Pushing Ref[refs/heads/master -> d13557ae0d974dbbc25eb1e98414ea3a2455cc3c] to refs/remotes/origin/refs/heads/master(refs/heads/master)
testMergeTwice
Tests run: 5, Failures: 0, Errors: 0, Skipped: 0, Time elapsed: 6.747 sec - in org.locationtech.geogig.test.integration.FindCommonAncestorTest
Running org.locationtech.geogig.model.internal.NodeIdTest
Tests run: 3, Failures: 0, Errors: 0, Skipped: 0, Time elapsed: 0.012 sec - in org.locationtech.geogig.model.internal.NodeIdTest
Running org.locationtech.geogig.model.internal.QuadTreeClusteringStrategy_putTest
Tests run: 10, Failures: 0, Errors: 0, Skipped: 0, Time elapsed: 1.194 sec - in org.locationtech.geogig.test.integration.RemoteAddOpTest
Running org.locationtech.geogig.model.internal.QuadTreeClusteringStrategyTest
Tests run: 12, Failures: 0, Errors: 0, Skipped: 12, Time elapsed: 0.06 sec - in org.locationtech.geogig.model.internal.QuadTreeClusteringStrategyTest
Running org.locationtech.geogig.model.internal.CanonicalClusteringStrategyHeapStorageTest
testNoFastForwardSpecifyAuthor
Tests run: 8, Failures: 0, Errors: 0, Skipped: 0, Time elapsed: 2.517 sec - in org.locationtech.geogig.test.integration.CreatePatchOpTest
Running org.locationtech.geogig.model.internal.QuadrantTest
Tests run: 9, Failures: 0, Errors: 0, Skipped: 0, Time elapsed: 0.081 sec - in org.locationtech.geogig.model.internal.QuadrantTest
Running org.locationtech.geogig.model.internal.DAGNodeTest
Tests run: 15, Failures: 0, Errors: 0, Skipped: 0, Time elapsed: 9.215 sec - in org.locationtech.geogig.test.integration.GeogigTransactionTest
Running org.locationtech.geogig.model.internal.QuadTreeClusteringStrategy_computeIdTest
testBothBranchesSameGeometryChange
DAG[id:[], orig:EMPTY, status: CHANGED, size: 129, children: 0, buckets: 1)[children: {}, buckets: [[2]]]
 DAG[id:[2], orig:EMPTY, status: CHANGED, size: 129, children: 0, buckets: 2)[children: {}, buckets: [[2, 0], [2, 3]]]
  Tests run: 3, Failures: 0, Errors: 0, Skipped: 0, Time elapsed: 1.738 sec - in org.locationtech.geogig.test.integration.RebuildGraphOpTest
Running org.locationtech.geogig.model.impl.RevPersonTest
Tests run: 3, Failures: 0, Errors: 0, Skipped: 0, Time elapsed: 0.004 sec - in org.locationtech.geogig.model.impl.RevPersonTest
Running org.locationtech.geogig.model.impl.QuadTreeBuilderExpandCollapseTest
Tests run: 1, Failures: 0, Errors: 0, Skipped: 0, Time elapsed: 0.006 sec - in org.locationtech.geogig.model.impl.QuadTreeBuilderExpandCollapseTest
Running org.locationtech.geogig.model.impl.RevFeatureTest
Tests run: 2, Failures: 0, Errors: 0, Skipped: 0, Time elapsed: 0.006 sec - in org.locationtech.geogig.model.impl.RevFeatureTest
Running org.locationtech.geogig.model.impl.CommitBuilderTest
Tests run: 8, Failures: 0, Errors: 0, Skipped: 0, Time elapsed: 0.144 sec - in org.locationtech.geogig.model.internal.QuadTreeClusteringStrategy_computeIdTest
Running org.locationtech.geogig.model.impl.RevCommitImplTest
Tests run: 2, Failures: 0, Errors: 0, Skipped: 0, Time elapsed: 0 sec - in org.locationtech.geogig.model.impl.RevCommitImplTest
Tests run: 6, Failures: 0, Errors: 0, Skipped: 0, Time elapsed: 0.033 sec - in org.locationtech.geogig.model.impl.CommitBuilderTest
Running org.locationtech.geogig.model.impl.CanonicalTreeBuilderTest
DAG[id:[2, 0], orig:EMPTY, status: CHANGED, size: 90, children: 90, buckets: 0)[children: {node # 2=NodeId[node # 2, Env[2.0 : 2.0, 1.0 : 1.0]], node # 1=NodeId[node # 1, Env[1.0 : 1.0, 1.0 : 1.0]], node # 18=NodeId[node # 18, Env[18.0 : 18.0, 1.0 : 1.0]], node # 19=NodeId[node # 19, Env[19.0 : 19.0, 1.0 : 1.0]], node # 16=NodeId[node # 16, Env[16.0 : 16.0, 1.0 : 1.0]], node # 17=NodeId[node # 17, Env[17.0 : 17.0, 1.0 : 1.0]], node # 9=NodeId[node # 9, Env[9.0 : 9.0, 1.0 : 1.0]], node # 8=NodeId[node # 8, Env[8.0 : 8.0, 1.0 : 1.0]], node # 7=NodeId[node # 7, Env[7.0 : 7.0, 1.0 : 1.0]], node # 6=NodeId[node # 6, Env[6.0 : 6.0, 1.0 : 1.0]], node # 5=NodeId[node # 5, Env[5.0 : 5.0, 1.0 : 1.0]], node # 4=NodeId[node # 4, Env[4.0 : 4.0, 1.0 : 1.0]], node # 3=NodeId[node # 3, Env[3.0 : 3.0, 1.0 : 1.0]], node # 61=NodeId[node # 61, Env[61.0 : 61.0, 1.0 : 1.0]], node # 62=NodeId[node # 62, Env[62.0 : 62.0, 1.0 : 1.0]], node # 60=NodeId[node # 60, Env[60.0 : 60.0, 1.0 : 1.0]], node # 69=NodeId[node # 69, Env[69.0 : 69.0, 1.0 : 1.0]], node # 25=NodeId[node # 25, Env[25.0 : 25.0, 1.0 : 1.0]], node # 26=NodeId[node # 26, Env[26.0 : 26.0, 1.0 : 1.0]], node # 67=NodeId[node # 67, Env[67.0 : 67.0, 1.0 : 1.0]], node # 23=NodeId[node # 23, Env[23.0 : 23.0, 1.0 : 1.0]], node # 68=NodeId[node # 68, Env[68.0 : 68.0, 1.0 : 1.0]], node # 24=NodeId[node # 24, Env[24.0 : 24.0, 1.0 : 1.0]], node # 65=NodeId[node # 65, Env[65.0 : 65.0, 1.0 : 1.0]], node # 21=NodeId[node # 21, Env[21.0 : 21.0, 1.0 : 1.0]], node # 66=NodeId[node # 66, Env[66.0 : 66.0, 1.0 : 1.0]], node # 22=NodeId[node # 22, Env[22.0 : 22.0, 1.0 : 1.0]], node # 63=NodeId[node # 63, Env[63.0 : 63.0, 1.0 : 1.0]], node # 64=NodeId[node # 64, Env[64.0 : 64.0, 1.0 : 1.0]], node # 20=NodeId[node # 20, Env[20.0 : 20.0, 1.0 : 1.0]], node # 49=NodeId[node # 49, Env[49.0 : 49.0, 1.0 : 1.0]], node # 50=NodeId[node # 50, Env[50.0 : 50.0, 1.0 : 1.0]], node # 51=NodeId[node # 51, Env[51.0 : 51.0, 1.0 : 1.0]], node # 90=NodeId[node # 90, Env[90.0 : 90.0, 1.0 : 1.0]], node # 58=NodeId[node # 58, Env[58.0 : 58.0, 1.0 : 1.0]], node # 14=NodeId[node # 14, Env[14.0 : 14.0, 1.0 : 1.0]], node # 59=NodeId[node # 59, Env[59.0 : 59.0, 1.0 : 1.0]], node # 15=NodeId[node # 15, Env[15.0 : 15.0, 1.0 : 1.0]], node # 56=NodeId[node # 56, Env[56.0 : 56.0, 1.0 : 1.0]], node # 12=NodeId[node # 12, Env[12.0 : 12.0, 1.0 : 1.0]], node # 57=NodeId[node # 57, Env[57.0 : 57.0, 1.0 : 1.0]], node # 13=NodeId[node # 13, Env[13.0 : 13.0, 1.0 : 1.0]], node # 54=NodeId[node # 54, Env[54.0 : 54.0, 1.0 : 1.0]], node # 10=NodeId[node # 10, Env[10.0 : 10.0, 1.0 : 1.0]], node # 55=NodeId[node # 55, Env[55.0 : 55.0, 1.0 : 1.0]], node # 11=NodeId[node # 11, Env[11.0 : 11.0, 1.0 : 1.0]], node # 52=NodeId[node # 52, Env[52.0 : 52.0, 1.0 : 1.0]], node # 53=NodeId[node # 53, Env[53.0 : 53.0, 1.0 : 1.0]], node # 38=NodeId[node # 38, Env[38.0 : 38.0, 1.0 : 1.0]], node # 39=NodeId[node # 39, Env[39.0 : 39.0, 1.0 : 1.0]], node # 83=NodeId[node # 83, Env[83.0 : 83.0, 1.0 : 1.0]], node # 84=NodeId[node # 84, Env[84.0 : 84.0, 1.0 : 1.0]], node # 40=NodeId[node # 40, Env[40.0 : 40.0, 1.0 : 1.0]], node # 81=NodeId[node # 81, Env[81.0 : 81.0, 1.0 : 1.0]], node # 82=NodeId[node # 82, Env[82.0 : 82.0, 1.0 : 1.0]], node # 80=NodeId[node # 80, Env[80.0 : 80.0, 1.0 : 1.0]], node # 47=NodeId[node # 47, Env[47.0 : 47.0, 1.0 : 1.0]], node # 48=NodeId[node # 48, Env[48.0 : 48.0, 1.0 : 1.0]], node # 89=NodeId[node # 89, Env[89.0 : 89.0, 1.0 : 1.0]], node # 45=NodeId[node # 45, Env[45.0 : 45.0, 1.0 : 1.0]], node # 46=NodeId[node # 46, Env[46.0 : 46.0, 1.0 : 1.0]], node # 87=NodeId[node # 87, Env[87.0 : 87.0, 1.0 : 1.0]], node # 43=NodeId[node # 43, Env[43.0 : 43.0, 1.0 : 1.0]], node # 88=NodeId[node # 88, Env[88.0 : 88.0, 1.0 : 1.0]], node # 44=NodeId[node # 44, Env[44.0 : 44.0, 1.0 : 1.0]], node # 85=NodeId[node # 85, Env[85.0 : 85.0, 1.0 : 1.0]], node # 41=NodeId[node # 41, Env[41.0 : 41.0, 1.0 : 1.0]], node # 86=NodeId[node # 86, Env[86.0 : 86.0, 1.0 : 1.0]], node # 42=NodeId[node # 42, Env[42.0 : 42.0, 1.0 : 1.0]], node # 29=NodeId[node # 29, Env[29.0 : 29.0, 1.0 : 1.0]], node # 27=NodeId[node # 27, Env[27.0 : 27.0, 1.0 : 1.0]], node # 28=NodeId[node # 28, Env[28.0 : 28.0, 1.0 : 1.0]], node # 72=NodeId[node # 72, Env[72.0 : 72.0, 1.0 : 1.0]], node # 73=NodeId[node # 73, Env[73.0 : 73.0, 1.0 : 1.0]], node # 70=NodeId[node # 70, Env[70.0 : 70.0, 1.0 : 1.0]], node # 71=NodeId[node # 71, Env[71.0 : 71.0, 1.0 : 1.0]], node # 36=NodeId[node # 36, Env[36.0 : 36.0, 1.0 : 1.0]], node # 37=NodeId[node # 37, Env[37.0 : 37.0, 1.0 : 1.0]], node # 78=NodeId[node # 78, Env[78.0 : 78.0, 1.0 : 1.0]], node # 34=NodeId[node # 34, Env[34.0 : 34.0, 1.0 : 1.0]], node # 79=NodeId[node # 79, Env[79.0 : 79.0, 1.0 : 1.0]], node # 35=NodeId[node # 35, Env[35.0 : 35.0, 1.0 : 1.0]], node # 76=NodeId[node # 76, Env[76.0 : 76.0, 1.0 : 1.0]], node # 32=NodeId[node # 32, Env[32.0 : 32.0, 1.0 : 1.0]], node # 77=NodeId[node # 77, Env[77.0 : 77.0, 1.0 : 1.0]], node # 33=NodeId[node # 33, Env[33.0 : 33.0, 1.0 : 1.0]], node # 74=NodeId[node # 74, Env[74.0 : 74.0, 1.0 : 1.0]], node # 30=NodeId[node # 30, Env[30.0 : 30.0, 1.0 : 1.0]], node # 75=NodeId[node # 75, Env[75.0 : 75.0, 1.0 : 1.0]], node # 31=NodeId[node # 31, Env[31.0 : 31.0, 1.0 : 1.0]]}, buckets: []]
  DAG[id:[2, 3], orig:EMPTY, status: CHANGED, size: 39, children: 39, buckets: 0)[children: {node # 107=NodeId[node # 107, Env[107.0 : 107.0, 1.0 : 1.0]], node # 129=NodeId[node # 129, Env[129.0 : 129.0, 1.0 : 1.0]], node # 106=NodeId[node # 106, Env[106.0 : 106.0, 1.0 : 1.0]], node # 128=NodeId[node # 128, Env[128.0 : 128.0, 1.0 : 1.0]], node # 109=NodeId[node # 109, Env[109.0 : 109.0, 1.0 : 1.0]], node # 108=NodeId[node # 108, Env[108.0 : 108.0, 1.0 : 1.0]], node # 103=NodeId[node # 103, Env[103.0 : 103.0, 1.0 : 1.0]], node # 125=NodeId[node # 125, Env[125.0 : 125.0, 1.0 : 1.0]], node # 102=NodeId[node # 102, Env[102.0 : 102.0, 1.0 : 1.0]], node # 124=NodeId[node # 124, Env[124.0 : 124.0, 1.0 : 1.0]], node # 105=NodeId[node # 105, Env[105.0 : 105.0, 1.0 : 1.0]], node # 127=NodeId[node # 127, Env[127.0 : 127.0, 1.0 : 1.0]], node # 104=NodeId[node # 104, Env[104.0 : 104.0, 1.0 : 1.0]], node # 126=NodeId[node # 126, Env[126.0 : 126.0, 1.0 : 1.0]], node # 121=NodeId[node # 121, Env[121.0 : 121.0, 1.0 : 1.0]], node # 120=NodeId[node # 120, Env[120.0 : 120.0, 1.0 : 1.0]], node # 101=NodeId[node # 101, Env[101.0 : 101.0, 1.0 : 1.0]], node # 123=NodeId[node # 123, Env[123.0 : 123.0, 1.0 : 1.0]], node # 100=NodeId[node # 100, Env[100.0 : 100.0, 1.0 : 1.0]], node # 122=NodeId[node # 122, Env[122.0 : 122.0, 1.0 : 1.0]], node # 118=NodeId[node # 118, Env[118.0 : 118.0, 1.0 : 1.0]], node # 117=NodeId[node # 117, Env[117.0 : 117.0, 1.0 : 1.0]], node # 119=NodeId[node # 119, Env[119.0 : 119.0, 1.0 : 1.0]], node # 114=NodeId[node # 114, Env[114.0 : 114.0, 1.0 : 1.0]], node # 113=NodeId[node # 113, Env[113.0 : 113.0, 1.0 : 1.0]], node # 116=NodeId[node # 116, Env[116.0 : 116.0, 1.0 : 1.0]], node # 115=NodeId[node # 115, Env[115.0 : 115.0, 1.0 : 1.0]], node # 110=NodeId[node # 110, Env[110.0 : 110.0, 1.0 : 1.0]], node # 112=NodeId[node # 112, Env[112.0 : 112.0, 1.0 : 1.0]], node # 111=NodeId[node # 111, Env[111.0 : 111.0, 1.0 : 1.0]], node # 94=NodeId[node # 94, Env[94.0 : 94.0, 1.0 : 1.0]], node # 95=NodeId[node # 95, Env[95.0 : 95.0, 1.0 : 1.0]], node # 92=NodeId[node # 92, Env[92.0 : 92.0, 1.0 : 1.0]], node # 93=NodeId[node # 93, Env[93.0 : 93.0, 1.0 : 1.0]], node # 91=NodeId[node # 91, Env[91.0 : 91.0, 1.0 : 1.0]], node # 98=NodeId[node # 98, Env[98.0 : 98.0, 1.0 : 1.0]], node # 99=NodeId[node # 99, Env[99.0 : 99.0, 1.0 : 1.0]], node # 96=NodeId[node # 96, Env[96.0 : 96.0, 1.0 : 1.0]], node # 97=NodeId[node # 97, Env[97.0 : 97.0, 1.0 : 1.0]]}, buckets: []]
Running org.locationtech.geogig.model.impl.LegacyTreeBuilderTest
Tests run: 4, Failures: 0, Errors: 0, Skipped: 0, Time elapsed: 1.044 sec - in org.locationtech.geogig.model.internal.QuadTreeClusteringStrategy_putTest
Running org.locationtech.geogig.model.impl.RevFeatureTypeTest
[main] INFO org.locationtech.geogig.plumbing.SendPack - Pushing Ref[refs/heads/master -> a3ad4dd3b550a1215e3001faf8071e3448956105] to refs/remotes/origin/NewRemoteBranch(NewRemoteBranch)
Tests run: 4, Failures: 0, Errors: 0, Skipped: 0, Time elapsed: 0.636 sec - in org.locationtech.geogig.model.internal.DAGNodeTest
Running org.locationtech.geogig.plumbing.index.BuildFullHistoryIndexOpTest
Tests run: 2, Failures: 0, Errors: 0, Skipped: 0, Time elapsed: 0.391 sec - in org.locationtech.geogig.model.impl.RevFeatureTypeTest
Running org.locationtech.geogig.plumbing.index.BuildIndexOpTest
Tests run: 21, Failures: 0, Errors: 0, Skipped: 0, Time elapsed: 4.573 sec - in org.locationtech.geogig.test.integration.DiffOpTest
Running org.locationtech.geogig.plumbing.merge.MergeFeaturesOpTest
Tests run: 1, Failures: 0, Errors: 0, Skipped: 0, Time elapsed: 0.048 sec - in org.locationtech.geogig.plumbing.merge.MergeFeaturesOpTest
Running org.locationtech.geogig.plumbing.merge.MergeStatusBuilderDiffEntrySerializerTest
testMergeFastForwardSecondCase
testOctopusMergeWithAutomerge
Tests run: 12, Failures: 0, Errors: 0, Skipped: 0, Time elapsed: 10.981 sec - in org.locationtech.geogig.test.integration.RebaseOpTest
Tests run: 5, Failures: 0, Errors: 0, Skipped: 0, Time elapsed: 0.516 sec - in org.locationtech.geogig.plumbing.merge.MergeStatusBuilderDiffEntrySerializerTest
Running org.locationtech.geogig.plumbing.HashObjectTest
Running org.locationtech.geogig.plumbing.ResolveFeatureTypeTest
Tests run: 14, Failures: 0, Errors: 0, Skipped: 0, Time elapsed: 5.59 sec - in org.locationtech.geogig.test.integration.SquashOpTest
Running org.locationtech.geogig.plumbing.diff.DiffCountConsumerTest
Tests run: 18, Failures: 0, Errors: 0, Skipped: 0, Time elapsed: 4.409 sec - in org.locationtech.geogig.test.integration.ApplyPatchOpTest
Running org.locationtech.geogig.plumbing.diff.DepthTreeIteratorTest
Tests run: 8, Failures: 0, Errors: 0, Skipped: 0, Time elapsed: 13.792 sec - in org.locationtech.geogig.test.integration.CloneOpTest
testConflictingMergeInterceptor
Running org.locationtech.geogig.plumbing.diff.PostOrderDiffWalkTest
Tests run: 5, Failures: 0, Errors: 0, Skipped: 0, Time elapsed: 0.462 sec - in org.locationtech.geogig.plumbing.ResolveFeatureTypeTest
Running org.locationtech.geogig.plumbing.diff.PatchSerializationTest
[main] INFO org.locationtech.geogig.plumbing.SendPack - Pushing Ref[refs/heads/master -> b2e392a358773a01efe3ec48a3580362a7fc83d0] to refs/remotes/origin/refs/heads/master(refs/heads/master)
testMerge
Tests run: 8, Failures: 0, Errors: 0, Skipped: 0, Time elapsed: 1.128 sec - in org.locationtech.geogig.plumbing.diff.PatchSerializationTest
Running org.locationtech.geogig.plumbing.diff.AttributeDiffTest
Tests run: 4, Failures: 0, Errors: 0, Skipped: 0, Time elapsed: 0.029 sec - in org.locationtech.geogig.plumbing.diff.AttributeDiffTest
Running org.locationtech.geogig.plumbing.diff.GeometryDiffTest
[main] INFO org.locationtech.geogig.plumbing.SendPack - Pushing Ref[refs/heads/master -> a3ad4dd3b550a1215e3001faf8071e3448956105] to refs/remotes/origin/master(null)
testConflictingOctopusMerge
Tests run: 5, Failures: 0, Errors: 0, Skipped: 0, Time elapsed: 8.125 sec - in org.locationtech.geogig.test.integration.BranchDeleteOpTest
Tests run: 13, Failures: 0, Errors: 0, Skipped: 0, Time elapsed: 7.025 sec - in org.locationtech.geogig.test.integration.ResetOpTest
Running org.locationtech.geogig.plumbing.diff.TreeDifferenceTest
Running org.locationtech.geogig.plumbing.diff.MutableTreeTest
Tests run: 7, Failures: 0, Errors: 0, Skipped: 0, Time elapsed: 0.027 sec - in org.locationtech.geogig.plumbing.diff.MutableTreeTest
Running org.locationtech.geogig.plumbing.diff.PreOrderDiffWalkTest
Tests run: 7, Failures: 0, Errors: 0, Skipped: 0, Time elapsed: 0.1 sec - in org.locationtech.geogig.plumbing.diff.TreeDifferenceTest
Tests run: 7, Failures: 0, Errors: 0, Skipped: 0, Time elapsed: 1.932 sec - in org.locationtech.geogig.plumbing.HashObjectTest
Running org.locationtech.geogig.plumbing.DiffFeatureTest
Running org.locationtech.geogig.plumbing.CatObjectTest
Tests run: 14, Failures: 0, Errors: 0, Skipped: 0, Time elapsed: 0.49 sec - in org.locationtech.geogig.plumbing.diff.GeometryDiffTest
Running org.locationtech.geogig.plumbing.UpdateSymRefTest
testFastForwardOnly

Tests run: 17, Failures: 0, Errors: 0, Skipped: 0, Time elapsed: 7.91 sec - in org.locationtech.geogig.test.integration.LogOpTest
Running org.locationtech.geogig.plumbing.WalkGraphOpTest
Tests run: 10, Failures: 0, Errors: 0, Skipped: 0, Time elapsed: 6.223 sec - in org.locationtech.geogig.test.integration.LsTreeOpTest
Running org.locationtech.geogig.plumbing.CheckRefFormatTest
ip	1000 -> 1001
pp	0 point(s) deleted, 0 new point(s) added, 1 point(s) moved
sp	StringProp1_1 -> StringProp1_1a

Tests run: 4, Failures: 0, Errors: 0, Skipped: 0, Time elapsed: 0.71 sec - in org.locationtech.geogig.plumbing.DiffFeatureTest
Tests run: 5, Failures: 0, Errors: 0, Skipped: 0, Time elapsed: 0.532 sec - in org.locationtech.geogig.plumbing.UpdateSymRefTest
testSpecifyAuthor
Running org.locationtech.geogig.plumbing.ResolveGeogigURITest
Running org.locationtech.geogig.plumbing.DescribeFeatureTypeTest
Tests run: 26, Failures: 0, Errors: 0, Skipped: 0, Time elapsed: 8.143 sec - in org.locationtech.geogig.test.integration.CommitOpTest
Running org.locationtech.geogig.plumbing.WriteTree2Test
Tests run: 1, Failures: 0, Errors: 0, Skipped: 0, Time elapsed: 0.083 sec - in org.locationtech.geogig.plumbing.ResolveGeogigURITest
Running org.locationtech.geogig.plumbing.UpdateRefTest
Tests run: 2, Failures: 0, Errors: 0, Skipped: 0, Time elapsed: 0.194 sec - in org.locationtech.geogig.plumbing.CheckRefFormatTest
Running org.locationtech.geogig.plumbing.DiffBoundsTest
Tests run: 2, Failures: 0, Errors: 0, Skipped: 0, Time elapsed: 0.131 sec - in org.locationtech.geogig.plumbing.DescribeFeatureTypeTest
Running org.locationtech.geogig.plumbing.RefParseTest
Tests run: 5, Failures: 0, Errors: 0, Skipped: 0, Time elapsed: 0.382 sec - in org.locationtech.geogig.plumbing.RefParseTest
Running org.locationtech.geogig.plumbing.UpdateTreeTest
Tests run: 5, Failures: 0, Errors: 0, Skipped: 0, Time elapsed: 0.691 sec - in org.locationtech.geogig.plumbing.UpdateRefTest
Running org.locationtech.geogig.plumbing.DiffTreeTest
Tests run: 7, Failures: 0, Errors: 0, Skipped: 0, Time elapsed: 0.286 sec - in org.locationtech.geogig.plumbing.UpdateTreeTest
Running org.locationtech.geogig.plumbing.RevParseTest
Tests run: 13, Failures: 0, Errors: 0, Skipped: 0, Time elapsed: 8.237 sec - in org.locationtech.geogig.test.integration.ReportMergeConflictsOpTest
Running org.locationtech.geogig.plumbing.ParseTimestampTest
[main] INFO org.locationtech.geogig.plumbing.SendPack - Pushing Ref[refs/heads/master -> a3ad4dd3b550a1215e3001faf8071e3448956105] to refs/remotes/origin/master(null)
Exception caught executing task: 
java.lang.IllegalStateException: java.lang.IllegalStateException: Object NodeRef[Points/Points.1 -> a47ca38e5c3e92c94dec9e8ea597c642003ec878] not found.
	at sun.reflect.NativeConstructorAccessorImpl.newInstance0(Native Method)
	at sun.reflect.NativeConstructorAccessorImpl.newInstance(NativeConstructorAccessorImpl.java:62)
	at sun.reflect.DelegatingConstructorAccessorImpl.newInstance(DelegatingConstructorAccessorImpl.java:45)
	at java.lang.reflect.Constructor.newInstance(Constructor.java:423)
	at java.util.concurrent.ForkJoinTask.getThrowableException(ForkJoinTask.java:593)
	at java.util.concurrent.ForkJoinTask.reportException(ForkJoinTask.java:677)
	at java.util.concurrent.ForkJoinTask.join(ForkJoinTask.java:720)
	at java.util.concurrent.ForkJoinPool.invoke(ForkJoinPool.java:2616)
	at org.locationtech.geogig.plumbing.diff.PreOrderDiffWalk.walk(PreOrderDiffWalk.java:322)
	at org.locationtech.geogig.plumbing.WalkGraphOp._call(WalkGraphOp.java:160)
	at org.locationtech.geogig.plumbing.WalkGraphOp._call(WalkGraphOp.java:32)
	at org.locationtech.geogig.repository.AbstractGeoGigOp.call(AbstractGeoGigOp.java:154)
	at org.locationtech.geogig.plumbing.WalkGraphOpTest.testObjectDoesNotExist(WalkGraphOpTest.java:179)
	at sun.reflect.NativeMethodAccessorImpl.invoke0(Native Method)
	at sun.reflect.NativeMethodAccessorImpl.invoke(NativeMethodAccessorImpl.java:62)
	at sun.reflect.DelegatingMethodAccessorImpl.invoke(DelegatingMethodAccessorImpl.java:43)
	at java.lang.reflect.Method.invoke(Method.java:498)
	at org.junit.runners.model.FrameworkMethod$1.runReflectiveCall(FrameworkMethod.java:50)
	at org.junit.internal.runners.model.ReflectiveCallable.run(ReflectiveCallable.java:12)
	at org.junit.runners.model.FrameworkMethod.invokeExplosively(FrameworkMethod.java:47)
	at org.junit.internal.runners.statements.InvokeMethod.evaluate(InvokeMethod.java:17)
	at org.junit.internal.runners.statements.RunBefores.evaluate(RunBefores.java:26)
	at org.junit.internal.runners.statements.RunAfters.evaluate(RunAfters.java:27)
	at org.junit.rules.ExpectedException$ExpectedExceptionStatement.evaluate(ExpectedException.java:239)
	at org.junit.rules.ExternalResource$1.evaluate(ExternalResource.java:48)
	at org.junit.rules.RunRules.evaluate(RunRules.java:20)
	at org.junit.runners.ParentRunner.runLeaf(ParentRunner.java:325)
	at org.junit.runners.BlockJUnit4ClassRunner.runChild(BlockJUnit4ClassRunner.java:78)
	at org.junit.runners.BlockJUnit4ClassRunner.runChild(BlockJUnit4ClassRunner.java:57)
	at org.junit.runners.ParentRunner$3.run(ParentRunner.java:290)
	at org.junit.runners.ParentRunner$1.schedule(ParentRunner.java:71)
	at org.junit.runners.ParentRunner.runChildren(ParentRunner.java:288)
	at org.junit.runners.ParentRunner.access$000(ParentRunner.java:58)
	at org.junit.runners.ParentRunner$2.evaluate(ParentRunner.java:268)
	at org.junit.runners.ParentRunner.run(ParentRunner.java:363)
	at org.apache.maven.surefire.junit4.JUnit4Provider.execute(JUnit4Provider.java:264)
	at org.apache.maven.surefire.junit4.JUnit4Provider.executeTestSet(JUnit4Provider.java:153)
	at org.apache.maven.surefire.junit4.JUnit4Provider.invoke(JUnit4Provider.java:124)
	at org.apache.maven.surefire.booter.ForkedBooter.invokeProviderInSameClassLoader(ForkedBooter.java:200)
	at org.apache.maven.surefire.booter.ForkedBooter.runSuitesInProcess(ForkedBooter.java:153)
	at org.apache.maven.surefire.booter.ForkedBooter.main(ForkedBooter.java:103)
Caused by: java.lang.IllegalStateException: Object NodeRef[Points/Points.1 -> a47ca38e5c3e92c94dec9e8ea597c642003ec878] not found.
	at org.locationtech.geogig.plumbing.WalkGraphOp$1.checkExists(WalkGraphOp.java:155)
	at org.locationtech.geogig.plumbing.WalkGraphOp$1.feature(WalkGraphOp.java:128)
	at org.locationtech.geogig.plumbing.diff.PreOrderDiffWalk$CancellableConsumer.feature(PreOrderDiffWalk.java:1303)
	at org.locationtech.geogig.plumbing.diff.PreOrderDiffWalk$WalkAction.node(PreOrderDiffWalk.java:627)
	at org.locationtech.geogig.plumbing.diff.PreOrderDiffWalk$TraverseLeafLeaf.compute(PreOrderDiffWalk.java:830)
	at org.locationtech.geogig.plumbing.diff.PreOrderDiffWalk$TraverseTreeContents.compute(PreOrderDiffWalk.java:736)
	at org.locationtech.geogig.plumbing.diff.PreOrderDiffWalk$TraverseTree.compute(PreOrderDiffWalk.java:692)
	at java.util.concurrent.RecursiveAction.exec(RecursiveAction.java:189)
	at java.util.concurrent.ForkJoinTask.doExec(ForkJoinTask.java:289)
	at java.util.concurrent.ForkJoinTask.doInvoke(ForkJoinTask.java:401)
	at java.util.concurrent.ForkJoinTask.invokeAll(ForkJoinTask.java:843)
	at org.locationtech.geogig.plumbing.diff.PreOrderDiffWalk$TraverseLeafLeaf.compute(PreOrderDiffWalk.java:837)
	at org.locationtech.geogig.plumbing.diff.PreOrderDiffWalk$TraverseTreeContents.compute(PreOrderDiffWalk.java:736)
	at org.locationtech.geogig.plumbing.diff.PreOrderDiffWalk$TraverseTree.compute(PreOrderDiffWalk.java:692)
	at java.util.concurrent.RecursiveAction.exec(RecursiveAction.java:189)
	at java.util.concurrent.ForkJoinTask.doExec(ForkJoinTask.java:289)
	at java.util.concurrent.ForkJoinPool$WorkQueue.runTask(ForkJoinPool.java:1056)
	at java.util.concurrent.ForkJoinPool.runWorker(ForkJoinPool.java:1692)
	at java.util.concurrent.ForkJoinWorkerThread.run(ForkJoinWorkerThread.java:157)
Removed 32,600 nodes in 2.450 s
[main] INFO org.locationtech.geogig.plumbing.SendPack - Pushing Ref[refs/heads/Branch1 -> e4d10fce0f71850b8e201763343ebde1c71aa5f6] to refs/remotes/origin/Branch1(null)
Tests run: 7, Failures: 0, Errors: 0, Skipped: 0, Time elapsed: 1.174 sec - in org.locationtech.geogig.plumbing.WalkGraphOpTest
Running org.locationtech.geogig.plumbing.ResolveRepositoryNameTest
left : Tree[c932cbd11ec75bcc145e2a362a3199bb85eb3abc; size=7; subtrees=2, buckets=0, features=0]
	[TreeNode[buildings -> a400000000000000000000000000000000000000], TreeNode[roads -> ff488999ad51848c7850ffd4d12568a3125172b0]]
	[]
right: Tree[8996d6e4437a8d8ea41ffc1f32cfaab9bf9de384; size=5; subtrees=1, buckets=0, features=0]
	[TreeNode[roads -> 72e2f547f3adc30edd55733abb885e8e6de1f1a4]]
	[]
Tests run: 2, Failures: 0, Errors: 0, Skipped: 0, Time elapsed: 0.278 sec - in org.locationtech.geogig.plumbing.ParseTimestampTest
Tests run: 3, Failures: 0, Errors: 0, Skipped: 0, Time elapsed: 1.995 sec - in org.locationtech.geogig.plumbing.CatObjectTest
Running org.locationtech.geogig.porcelain.index.CreateIndexOpTest
Running org.locationtech.geogig.porcelain.index.UpdateIndexesOpTest
Tests run: 2, Failures: 0, Errors: 0, Skipped: 0, Time elapsed: 0.369 sec - in org.locationtech.geogig.plumbing.ResolveRepositoryNameTest
Running org.locationtech.geogig.porcelain.index.UpdateIndexOpTest
testOursAndTheirs
Added 7,000 nodes in 169.8 ms
testNoCommitMerge
[main] INFO org.locationtech.geogig.plumbing.SendPack - Pushing Ref[refs/heads/Branch1 -> b9ffcf8d172b8905500e906f2218c55b58cf2c44] to refs/remotes/origin/Branch1(Branch1)
testMergeFastForward
Removed 32,600 nodes in 3.964 s
Tests run: 7, Failures: 0, Errors: 0, Skipped: 0, Time elapsed: 4.79 sec - in org.locationtech.geogig.plumbing.diff.PostOrderDiffWalkTest
Running org.locationtech.geogig.porcelain.index.DropIndexOpTest
testOctopusMergeSameFeatureChanges
Tests run: 21, Failures: 0, Errors: 0, Skipped: 0, Time elapsed: 9.347 sec - in org.locationtech.geogig.test.integration.CheckoutOpTest
Running org.locationtech.geogig.porcelain.InitOpTest
Tests run: 15, Failures: 0, Errors: 0, Skipped: 0, Time elapsed: 3.29 sec - in org.locationtech.geogig.plumbing.WriteTree2Test
Running org.locationtech.geogig.repository.impl.DepthSearchTest
Tests run: 1, Failures: 0, Errors: 0, Skipped: 0, Time elapsed: 0.248 sec - in org.locationtech.geogig.repository.impl.DepthSearchTest
Tests run: 9, Failures: 0, Errors: 0, Skipped: 0, Time elapsed: 6.155 sec - in org.locationtech.geogig.plumbing.diff.DiffCountConsumerTest
Running org.locationtech.geogig.repository.impl.RevFeatureBuilderTest
Running org.locationtech.geogig.repository.impl.RepositoryResolverTest
Tests run: 1, Failures: 0, Errors: 0, Skipped: 0, Time elapsed: 0.003 sec - in org.locationtech.geogig.repository.impl.RepositoryResolverTest
Running org.locationtech.geogig.repository.impl.SpatialOpsTest
testMergeNullCommit
testMergeMultiple
Added 7,000 nodes in 594.4 ms
testMergeConflictingPolygon
Tests run: 4, Failures: 0, Errors: 0, Skipped: 0, Time elapsed: 1.375 sec - in org.locationtech.geogig.porcelain.InitOpTest
Tests run: 8, Failures: 0, Errors: 0, Skipped: 0, Time elapsed: 0.753 sec - in org.locationtech.geogig.repository.impl.RevFeatureBuilderTest
testMergeConflictingBranchesTheirs
testMergeWithFeatureMerge
[main] INFO org.locationtech.geogig.plumbing.SendPack - Pushing Ref[refs/heads/Branch1 -> b9ffcf8d172b8905500e906f2218c55b58cf2c44] to refs/remotes/origin/Branch1(Branch1)
Tests run: 8, Failures: 0, Errors: 0, Skipped: 0, Time elapsed: 4.357 sec - in org.locationtech.geogig.plumbing.RevParseTest
Added 5,000 nodes in 117.2 ms
Added 1,024 nodes in 4.082 ms
Removed 400 nodes in 3.182 ms
testMergeNoCommitMessage
testMergeTwoBranchesWithNewFeatureType
Added 10,000 nodes in 166.9 ms
Tests run: 11, Failures: 0, Errors: 0, Skipped: 0, Time elapsed: 11.648 sec - in org.locationtech.geogig.model.internal.CanonicalClusteringStrategyHeapStorageTest
testCancelScenario1
[main] INFO org.locationtech.geogig.plumbing.SendPack - Pushing Ref[refs/heads/master -> a3ad4dd3b550a1215e3001faf8071e3448956105] to refs/remotes/origin/master(null)
[main] INFO org.locationtech.geogig.plumbing.SendPack - Pushing Ref[refs/heads/master -> 32b4e258bf8026e45ba1c2ace4a1f36e15b862a1] to refs/remotes/origin/master(null)
Tests run: 11, Failures: 0, Errors: 0, Skipped: 0, Time elapsed: 12.051 sec - in org.locationtech.geogig.model.impl.LegacyTreeBuilderTest
[main] INFO org.locationtech.geogig.plumbing.SendPack - Pushing Ref[refs/heads/master -> a3ad4dd3b550a1215e3001faf8071e3448956105] to refs/remotes/origin/master(null)
Tests run: 11, Failures: 0, Errors: 0, Skipped: 0, Time elapsed: 17.076 sec - in org.locationtech.geogig.test.integration.PushOpTest
Tests run: 8, Failures: 0, Errors: 0, Skipped: 0, Time elapsed: 15.409 sec - in org.locationtech.geogig.test.integration.PullOpTest
Tests run: 12, Failures: 0, Errors: 0, Skipped: 0, Time elapsed: 16.665 sec - in org.locationtech.geogig.test.integration.SparseCloneTest
testCancelScenario2
testCancelScenario3
Tests run: 11, Failures: 0, Errors: 0, Skipped: 0, Time elapsed: 13.741 sec - in org.locationtech.geogig.model.impl.CanonicalTreeBuilderTest
testCancelScenario4
Added 5,000 nodes in 246.6 ms
Added 1,024 nodes in 17.79 ms
Tests run: 15, Failures: 0, Errors: 0, Skipped: 0, Time elapsed: 25.076 sec - in org.locationtech.geogig.test.integration.FetchOpTest
Tests run: 11, Failures: 0, Errors: 0, Skipped: 0, Time elapsed: 9.077 sec - in org.locationtech.geogig.plumbing.DiffTreeTest
Removed 400 nodes in 4.894 ms
testNoFastForward
testMergeConflictingBranches
testMergeConflictingBranchesOurs
Tests run: 6, Failures: 0, Errors: 0, Skipped: 0, Time elapsed: 10.447 sec - in org.locationtech.geogig.plumbing.DiffBoundsTest
Added 10,000 nodes in 292.7 ms
Tests run: 11, Failures: 0, Errors: 0, Skipped: 0, Time elapsed: 16.47 sec - in org.locationtech.geogig.model.internal.CanonicalClusteringStrategyRocksdbStorageTest
Tests run: 30, Failures: 0, Errors: 0, Skipped: 0, Time elapsed: 18.409 sec - in org.locationtech.geogig.test.integration.MergeOpTest
Tests run: 5, Failures: 0, Errors: 0, Skipped: 0, Time elapsed: 8.345 sec - in org.locationtech.geogig.porcelain.index.DropIndexOpTest
Tests run: 9, Failures: 0, Errors: 0, Skipped: 0, Time elapsed: 16.352 sec - in org.locationtech.geogig.plumbing.index.BuildIndexOpTest
Tests run: 7, Failures: 0, Errors: 0, Skipped: 0, Time elapsed: 16.988 sec - in org.locationtech.geogig.plumbing.index.BuildFullHistoryIndexOpTest
Tests run: 9, Failures: 0, Errors: 0, Skipped: 0, Time elapsed: 13.471 sec - in org.locationtech.geogig.porcelain.index.CreateIndexOpTest
Tests run: 16, Failures: 0, Errors: 0, Skipped: 0, Time elapsed: 13.812 sec - in org.locationtech.geogig.porcelain.index.UpdateIndexOpTest
Tests run: 9, Failures: 0, Errors: 0, Skipped: 0, Time elapsed: 14.959 sec - in org.locationtech.geogig.porcelain.index.UpdateIndexesOpTest
Tests run: 7, Failures: 0, Errors: 0, Skipped: 0, Time elapsed: 20.253 sec - in org.locationtech.geogig.plumbing.diff.DepthTreeIteratorTest
Tests run: 2, Failures: 0, Errors: 0, Skipped: 0, Time elapsed: 14.413 sec - in org.locationtech.geogig.repository.impl.SpatialOpsTest
Tests run: 5, Failures: 0, Errors: 0, Skipped: 0, Time elapsed: 35.407 sec - in org.locationtech.geogig.data.EPSGBoundsCalcTest
PreOrderDiffWalkTest: walked 524,288 vs 262144 trees in 264.1 ms
PreOrderDiffWalkTest: walked 1,024 vs 512 trees in 11.87 ms
PreOrderDiffWalkTest: walked 16,384 vs 512 trees in 119.9 ms
Tests run: 24, Failures: 0, Errors: 0, Skipped: 0, Time elapsed: 23.364 sec - in org.locationtech.geogig.plumbing.diff.PreOrderDiffWalkTest

Results :

Tests in error: 
  HeapGraphDatabaseTest>GraphDatabaseTest.testPutConcurrency:390 » Execution jav...

Tests run: 1233, Failures: 0, Errors: 1, Skipped: 16

[ERROR] There are test failures.

Please refer to /home/hudson/genie.geogig/.hudson/jobs/geogig-1.1.x/workspace/src/core/target/surefire-reports for the individual test results.
[JENKINS] Recording test results
[INFO] 
[INFO] --- maven-jar-plugin:2.4:jar (default-jar) @ geogig-core ---
[INFO] Building jar: /home/hudson/genie.geogig/.hudson/jobs/geogig-1.1.x/workspace/src/core/target/geogig-core-1.1-SNAPSHOT.jar
[INFO] 
[INFO] --- maven-jar-plugin:2.4:test-jar (default) @ geogig-core ---
[INFO] Building jar: /home/hudson/genie.geogig/.hudson/jobs/geogig-1.1.x/workspace/src/core/target/geogig-core-1.1-SNAPSHOT-tests.jar
[INFO] 
[INFO] >>> maven-source-plugin:2.2.1:jar (attach-sources) > generate-sources @ geogig-core >>>
[INFO] 
[INFO] --- git-commit-id-plugin:2.1.8:revision (default) @ geogig-core ---
[WARNING] Failed to getClass for org.apache.maven.plugin.source.SourceJarMojo
[INFO] 
[INFO] <<< maven-source-plugin:2.2.1:jar (attach-sources) < generate-sources @ geogig-core <<<
[INFO] 
[INFO] --- maven-source-plugin:2.2.1:jar (attach-sources) @ geogig-core ---
[INFO] Building jar: /home/hudson/genie.geogig/.hudson/jobs/geogig-1.1.x/workspace/src/core/target/geogig-core-1.1-SNAPSHOT-sources.jar
[INFO] 
[INFO] >>> maven-source-plugin:2.2.1:test-jar (attach-sources) > generate-sources @ geogig-core >>>
[INFO] 
[INFO] --- git-commit-id-plugin:2.1.8:revision (default) @ geogig-core ---
[WARNING] Failed to getClass for org.apache.maven.plugin.source.TestSourceJarMojo
[INFO] 
[INFO] <<< maven-source-plugin:2.2.1:test-jar (attach-sources) < generate-sources @ geogig-core <<<
[INFO] 
[INFO] --- maven-source-plugin:2.2.1:test-jar (attach-sources) @ geogig-core ---
[INFO] Building jar: /home/hudson/genie.geogig/.hudson/jobs/geogig-1.1.x/workspace/src/core/target/geogig-core-1.1-SNAPSHOT-test-sources.jar
[INFO] 
[INFO] --- maven-install-plugin:2.4:install (default-install) @ geogig-core ---
[INFO] Installing /home/hudson/genie.geogig/.hudson/jobs/geogig-1.1.x/workspace/src/core/target/geogig-core-1.1-SNAPSHOT.jar to /home/hudson/genie.geogig/.hudson/jobs/geogig-1.1.x/workspace/.repository/org/locationtech/geogig/geogig-core/1.1-SNAPSHOT/geogig-core-1.1-SNAPSHOT.jar
[INFO] Installing /home/hudson/genie.geogig/.hudson/jobs/geogig-1.1.x/workspace/src/core/pom.xml to /home/hudson/genie.geogig/.hudson/jobs/geogig-1.1.x/workspace/.repository/org/locationtech/geogig/geogig-core/1.1-SNAPSHOT/geogig-core-1.1-SNAPSHOT.pom
[INFO] Installing /home/hudson/genie.geogig/.hudson/jobs/geogig-1.1.x/workspace/src/core/target/geogig-core-1.1-SNAPSHOT-tests.jar to /home/hudson/genie.geogig/.hudson/jobs/geogig-1.1.x/workspace/.repository/org/locationtech/geogig/geogig-core/1.1-SNAPSHOT/geogig-core-1.1-SNAPSHOT-tests.jar
[INFO] Installing /home/hudson/genie.geogig/.hudson/jobs/geogig-1.1.x/workspace/src/core/target/geogig-core-1.1-SNAPSHOT-sources.jar to /home/hudson/genie.geogig/.hudson/jobs/geogig-1.1.x/workspace/.repository/org/locationtech/geogig/geogig-core/1.1-SNAPSHOT/geogig-core-1.1-SNAPSHOT-sources.jar
[INFO] Installing /home/hudson/genie.geogig/.hudson/jobs/geogig-1.1.x/workspace/src/core/target/geogig-core-1.1-SNAPSHOT-test-sources.jar to /home/hudson/genie.geogig/.hudson/jobs/geogig-1.1.x/workspace/.repository/org/locationtech/geogig/geogig-core/1.1-SNAPSHOT/geogig-core-1.1-SNAPSHOT-test-sources.jar
[JENKINS] Archiving disabled