SuccessConsole Output

Started calculate disk usage of build
Finished Calculation of disk usage of build in 0 seconds
Started calculate disk usage of workspace
Finished Calculation of disk usage of workspace in 0 seconds
[INFO]                                                                         
[INFO] ------------------------------------------------------------------------
[INFO] Building GeoGig Core 1.0-SNAPSHOT
[INFO] ------------------------------------------------------------------------
[INFO] 
[INFO] --- maven-clean-plugin:2.5:clean (default-clean) @ geogig-core ---
[INFO] Deleting /home/hudson/genie.geogig/.jenkins/jobs/geogig-1.0.x/workspace/src/core/target
[INFO] 
[INFO] --- git-commit-id-plugin:2.1.8:revision (default) @ geogig-core ---
[INFO] 
[INFO] --- maven-resources-plugin:2.6:resources (default-resources) @ geogig-core ---
[INFO] Using 'UTF-8' encoding to copy filtered resources.
[INFO] Copying 4 resources
[INFO] 
[INFO] --- maven-compiler-plugin:3.1:compile (default-compile) @ geogig-core ---
[INFO] Changes detected - recompiling the module!
[INFO] Compiling 305 source files to /home/hudson/genie.geogig/.jenkins/jobs/geogig-1.0.x/workspace/src/core/target/classes
[WARNING] /home/hudson/genie.geogig/.jenkins/jobs/geogig-1.0.x/workspace/src/core/src/main/java/org/locationtech/geogig/storage/impl/TransactionConflictsDatabase.java: Some input files use or override a deprecated API.
[WARNING] /home/hudson/genie.geogig/.jenkins/jobs/geogig-1.0.x/workspace/src/core/src/main/java/org/locationtech/geogig/storage/impl/TransactionConflictsDatabase.java: Recompile with -Xlint:deprecation for details.
[WARNING] /home/hudson/genie.geogig/.jenkins/jobs/geogig-1.0.x/workspace/src/core/src/main/java/org/locationtech/geogig/di/ConflictInterceptor.java: Some input files use unchecked or unsafe operations.
[WARNING] /home/hudson/genie.geogig/.jenkins/jobs/geogig-1.0.x/workspace/src/core/src/main/java/org/locationtech/geogig/di/ConflictInterceptor.java: Recompile with -Xlint:unchecked for details.
[INFO] 
[INFO] --- maven-resources-plugin:2.6:testResources (default-testResources) @ geogig-core ---
[INFO] Using 'UTF-8' encoding to copy filtered resources.
[INFO] Copying 3 resources
[INFO] 
[INFO] --- maven-compiler-plugin:3.1:testCompile (default-testCompile) @ geogig-core ---
[INFO] Changes detected - recompiling the module!
[INFO] Compiling 145 source files to /home/hudson/genie.geogig/.jenkins/jobs/geogig-1.0.x/workspace/src/core/target/test-classes
[WARNING] /home/hudson/genie.geogig/.jenkins/jobs/geogig-1.0.x/workspace/src/core/src/test/java/org/locationtech/geogig/model/internal/CanonicalClusteringStrategyTest.java: Some input files use or override a deprecated API.
[WARNING] /home/hudson/genie.geogig/.jenkins/jobs/geogig-1.0.x/workspace/src/core/src/test/java/org/locationtech/geogig/model/internal/CanonicalClusteringStrategyTest.java: Recompile with -Xlint:deprecation for details.
[WARNING] /home/hudson/genie.geogig/.jenkins/jobs/geogig-1.0.x/workspace/src/core/src/test/java/org/locationtech/geogig/di/caching/CachingModuleTest.java: /home/hudson/genie.geogig/.jenkins/jobs/geogig-1.0.x/workspace/src/core/src/test/java/org/locationtech/geogig/di/caching/CachingModuleTest.java uses unchecked or unsafe operations.
[WARNING] /home/hudson/genie.geogig/.jenkins/jobs/geogig-1.0.x/workspace/src/core/src/test/java/org/locationtech/geogig/di/caching/CachingModuleTest.java: Recompile with -Xlint:unchecked for details.
[INFO] 
[INFO] --- maven-surefire-plugin:2.17:test (default-test) @ geogig-core ---
[INFO] Surefire report directory: /home/hudson/genie.geogig/.jenkins/jobs/geogig-1.0.x/workspace/src/core/target/surefire-reports

-------------------------------------------------------
 T E S T S
-------------------------------------------------------

-------------------------------------------------------
 T E S T S
-------------------------------------------------------
Running org.locationtech.geogig.porcelain.InitOpTest
Running org.locationtech.geogig.storage.impl.INIBlobTest
Running org.locationtech.geogig.storage.impl.PersistedIterableTest
Running org.locationtech.geogig.storage.datastream.DataStreamV2CommitSerializationTest
Running org.locationtech.geogig.storage.datastream.DataStreamCommitSerializationTest
Running org.locationtech.geogig.storage.datastream.VarintTest
Running org.locationtech.geogig.storage.datastream.DataStreamRevTreeSerializationTest
Running org.locationtech.geogig.storage.datastream.DataStreamFeatureV2_1SerializationTest
Running org.locationtech.geogig.storage.datastream.DataStreamV2RevTreeSerializationTest
Running org.locationtech.geogig.storage.datastream.DataStreamFeatureSerializationTest
Running org.locationtech.geogig.storage.datastream.DataStreamFeatureV2SerializationTest
Running org.locationtech.geogig.storage.memory.HeapBlobStoreTest
Running org.locationtech.geogig.storage.memory.HeapConflictsDatabaseConformanceTest
Running org.locationtech.geogig.storage.memory.HeapGraphDatabaseTest
Running org.locationtech.geogig.storage.memory.HeapRefDatabaseTest
Running org.locationtech.geogig.storage.memory.HeapObjectStoreConformanceTest
Running org.locationtech.geogig.storage.text.RevTreeTextSerialiationTest
Running org.locationtech.geogig.storage.text.RevFeatureTypeTextSerializationTest
Running org.locationtech.geogig.storage.text.RevFeatureTextSerializationTest
Running org.locationtech.geogig.storage.text.RevCommitTextSerializationTest
Running org.locationtech.geogig.storage.fs.FileConflictsDatabaseConformanceTest
Running org.locationtech.geogig.storage.fs.FileRefDatabaseTest
Running org.locationtech.geogig.storage.fs.FileBlobStoreTest
Running org.locationtech.geogig.storage.fs.IniFileConfigDatabaseTest
Tests run: 4, Failures: 0, Errors: 0, Skipped: 0, Time elapsed: 0.341 sec - in org.locationtech.geogig.storage.datastream.VarintTest
Running org.locationtech.geogig.model.internal.CanonicalClusteringStrategyHeapStorageTest
Tests run: 2, Failures: 0, Errors: 0, Skipped: 0, Time elapsed: 0.654 sec - in org.locationtech.geogig.storage.impl.PersistedIterableTest
Running org.locationtech.geogig.model.internal.DAGNodeTest
Tests run: 7, Failures: 0, Errors: 0, Skipped: 0, Time elapsed: 0.678 sec - in org.locationtech.geogig.storage.memory.HeapBlobStoreTest
Running org.locationtech.geogig.model.internal.CanonicalClusteringStrategyRocksdbStorageTest
Tests run: 10, Failures: 0, Errors: 0, Skipped: 0, Time elapsed: 0.813 sec - in org.locationtech.geogig.storage.memory.HeapGraphDatabaseTest
Running org.locationtech.geogig.model.internal.QuadTreeBuilderTest
Tests run: 1, Failures: 0, Errors: 0, Skipped: 1, Time elapsed: 0.005 sec - in org.locationtech.geogig.model.internal.QuadTreeBuilderTest
Running org.locationtech.geogig.model.impl.RevFeatureTypeTest
Tests run: 7, Failures: 0, Errors: 0, Skipped: 0, Time elapsed: 0.734 sec - in org.locationtech.geogig.storage.fs.FileBlobStoreTest
Running org.locationtech.geogig.model.impl.CommitBuilderTest
Tests run: 11, Failures: 0, Errors: 0, Skipped: 0, Time elapsed: 0.95 sec - in org.locationtech.geogig.storage.memory.HeapRefDatabaseTest
Running org.locationtech.geogig.model.impl.RevCommitImplTest
Tests run: 2, Failures: 0, Errors: 0, Skipped: 0, Time elapsed: 0.033 sec - in org.locationtech.geogig.model.impl.RevCommitImplTest
Running org.locationtech.geogig.model.impl.CanonicalTreeBuilderTest
Tests run: 8, Failures: 0, Errors: 0, Skipped: 0, Time elapsed: 1.137 sec - in org.locationtech.geogig.storage.datastream.DataStreamV2CommitSerializationTest
Running org.locationtech.geogig.model.impl.RevFeatureTest
Tests run: 6, Failures: 0, Errors: 0, Skipped: 0, Time elapsed: 0.245 sec - in org.locationtech.geogig.model.impl.CommitBuilderTest
Tests run: 8, Failures: 0, Errors: 0, Skipped: 0, Time elapsed: 1.23 sec - in org.locationtech.geogig.storage.datastream.DataStreamCommitSerializationTest
Running org.locationtech.geogig.model.impl.LegacyTreeBuilderTest
Tests run: 7, Failures: 0, Errors: 0, Skipped: 0, Time elapsed: 1.156 sec - in org.locationtech.geogig.storage.text.RevTreeTextSerialiationTest
Running org.locationtech.geogig.model.impl.RevPersonTest
Tests run: 3, Failures: 0, Errors: 0, Skipped: 0, Time elapsed: 0.001 sec - in org.locationtech.geogig.model.impl.RevPersonTest
Running org.locationtech.geogig.test.integration.MergeOpTest
Running org.locationtech.geogig.test.integration.GeogigAPITest
Tests run: 7, Failures: 0, Errors: 0, Skipped: 0, Time elapsed: 1.271 sec - in org.locationtech.geogig.storage.datastream.DataStreamV2RevTreeSerializationTest
Running org.locationtech.geogig.test.integration.RemoveOpTest
Tests run: 9, Failures: 0, Errors: 0, Skipped: 0, Time elapsed: 1.252 sec - in org.locationtech.geogig.storage.text.RevCommitTextSerializationTest
Running org.locationtech.geogig.test.integration.PushOpTest
Tests run: 11, Failures: 0, Errors: 0, Skipped: 0, Time elapsed: 1.239 sec - in org.locationtech.geogig.storage.fs.FileRefDatabaseTest
Running org.locationtech.geogig.test.integration.ConfigOpTest
Tests run: 2, Failures: 0, Errors: 0, Skipped: 0, Time elapsed: 0.256 sec - in org.locationtech.geogig.model.impl.RevFeatureTest
Running org.locationtech.geogig.test.integration.ConflictsReadWriteOpTest
Tests run: 7, Failures: 0, Errors: 0, Skipped: 0, Time elapsed: 1.588 sec - in org.locationtech.geogig.storage.datastream.DataStreamRevTreeSerializationTest
Running org.locationtech.geogig.test.integration.BranchDeleteOpTest
Tests run: 4, Failures: 0, Errors: 0, Skipped: 0, Time elapsed: 1.94 sec - in org.locationtech.geogig.porcelain.InitOpTest
Running org.locationtech.geogig.test.integration.ApplyPatchOpTest
Tests run: 14, Failures: 0, Errors: 0, Skipped: 0, Time elapsed: 1.872 sec - in org.locationtech.geogig.storage.memory.HeapConflictsDatabaseConformanceTest
Running org.locationtech.geogig.test.integration.HooksTest
Tests run: 23, Failures: 0, Errors: 0, Skipped: 0, Time elapsed: 2.386 sec - in org.locationtech.geogig.storage.memory.HeapObjectStoreConformanceTest
Running org.locationtech.geogig.test.integration.LogOpTest
Tests run: 23, Failures: 0, Errors: 0, Skipped: 0, Time elapsed: 2.212 sec - in org.locationtech.geogig.storage.fs.IniFileConfigDatabaseTest
Running org.locationtech.geogig.test.integration.LsTreeOpTest
Tests run: 4, Failures: 0, Errors: 0, Skipped: 0, Time elapsed: 2.404 sec - in org.locationtech.geogig.model.internal.DAGNodeTest
Running org.locationtech.geogig.test.integration.RemoteRemoveOpTest
Tests run: 2, Failures: 0, Errors: 0, Skipped: 0, Time elapsed: 4.722 sec - in org.locationtech.geogig.storage.text.RevFeatureTypeTextSerializationTest
Running org.locationtech.geogig.test.integration.CommitOpTest
Tests run: 3, Failures: 0, Errors: 0, Skipped: 0, Time elapsed: 4.816 sec - in org.locationtech.geogig.storage.datastream.DataStreamFeatureSerializationTest
Running org.locationtech.geogig.test.integration.RemoteAddOpTest
Tests run: 3, Failures: 0, Errors: 0, Skipped: 0, Time elapsed: 4.868 sec - in org.locationtech.geogig.storage.datastream.DataStreamFeatureV2SerializationTest
Running org.locationtech.geogig.test.integration.TagTest
Tests run: 3, Failures: 0, Errors: 0, Skipped: 0, Time elapsed: 4.901 sec - in org.locationtech.geogig.storage.datastream.DataStreamFeatureV2_1SerializationTest
Running org.locationtech.geogig.test.integration.CleanOpTest
Tests run: 1, Failures: 0, Errors: 0, Skipped: 0, Time elapsed: 5.623 sec - in org.locationtech.geogig.storage.impl.INIBlobTest
Running org.locationtech.geogig.test.integration.repository.WorkingTreeTest
Tests run: 2, Failures: 0, Errors: 0, Skipped: 0, Time elapsed: 4.847 sec - in org.locationtech.geogig.model.impl.RevFeatureTypeTest
Running org.locationtech.geogig.test.integration.repository.IndexTest
Tests run: 5, Failures: 0, Errors: 0, Skipped: 0, Time elapsed: 5.869 sec - in org.locationtech.geogig.storage.text.RevFeatureTextSerializationTest
Running org.locationtech.geogig.test.integration.RebuildGraphOpTest
testMergeNoCommits
testOctopusMerge
Removed 32,600 nodes in 2.454 s
Removed 32,600 nodes in 2.056 s
Tests run: 1, Failures: 0, Errors: 0, Skipped: 0, Time elapsed: 4.919 sec - in org.locationtech.geogig.test.integration.ConflictsReadWriteOpTest
Running org.locationtech.geogig.test.integration.DiffOpTest
Added 7,000 nodes in 93.21 ms
Tests run: 14, Failures: 0, Errors: 0, Skipped: 0, Time elapsed: 7.099 sec - in org.locationtech.geogig.storage.fs.FileConflictsDatabaseConformanceTest
Running org.locationtech.geogig.test.integration.RemoteListOpTest
Tests run: 3, Failures: 0, Errors: 0, Skipped: 0, Time elapsed: 2.536 sec - in org.locationtech.geogig.test.integration.TagTest
Running org.locationtech.geogig.test.integration.AddOpTest
Tests run: 3, Failures: 0, Errors: 0, Skipped: 0, Time elapsed: 6.28 sec - in org.locationtech.geogig.test.integration.GeogigAPITest
Running org.locationtech.geogig.test.integration.CleanRefsOpTest
Tests run: 1, Failures: 0, Errors: 0, Skipped: 0, Time elapsed: 0.082 sec - in org.locationtech.geogig.test.integration.CleanRefsOpTest
Running org.locationtech.geogig.test.integration.CloneOpTest
Added 7,000 nodes in 563.1 ms
Tests run: 10, Failures: 0, Errors: 0, Skipped: 0, Time elapsed: 2.914 sec - in org.locationtech.geogig.test.integration.RemoteAddOpTest
Running org.locationtech.geogig.test.integration.ResetOpTest
Tests run: 5, Failures: 0, Errors: 0, Skipped: 0, Time elapsed: 6.507 sec - in org.locationtech.geogig.test.integration.BranchDeleteOpTest
Running org.locationtech.geogig.test.integration.FetchOpTest
Tests run: 8, Failures: 0, Errors: 0, Skipped: 0, Time elapsed: 5.176 sec - in org.locationtech.geogig.test.integration.RemoteRemoveOpTest
Running org.locationtech.geogig.test.integration.StatusOpTest
testMergeTwice
Tests run: 3, Failures: 0, Errors: 0, Skipped: 0, Time elapsed: 3.547 sec - in org.locationtech.geogig.test.integration.CleanOpTest
Running org.locationtech.geogig.test.integration.SparseCloneTest
Added 5,000 nodes in 68.92 ms
Added 1,024 nodes in 3.970 ms
Removed 400 nodes in 15.54 ms
Tests run: 3, Failures: 0, Errors: 0, Skipped: 0, Time elapsed: 2.843 sec - in org.locationtech.geogig.test.integration.RebuildGraphOpTest
Running org.locationtech.geogig.test.integration.ReportCommitConflictsOpTest
[main] INFO org.locationtech.geogig.hooks.Scripting - Running jvm script /opt/public/hipp/ramdisk/geogig/junit7009350079654683165/repo361641417/.geogig/hooks/pre_commit.js
Tests run: 21, Failures: 0, Errors: 0, Skipped: 0, Time elapsed: 7.906 sec - in org.locationtech.geogig.test.integration.ConfigOpTest
Running org.locationtech.geogig.test.integration.ReportMergeConflictsOpTest
Added 10,000 nodes in 115.0 ms
Tests run: 11, Failures: 0, Errors: 0, Skipped: 0, Time elapsed: 9.176 sec - in org.locationtech.geogig.model.internal.CanonicalClusteringStrategyHeapStorageTest
Running org.locationtech.geogig.test.integration.BlameOpTest
testNoFastForwardSpecifyAuthor
[main] INFO org.locationtech.geogig.plumbing.SendPack - Pushing Ref[refs/heads/master -> a3ad4dd3b550a1215e3001faf8071e3448956105] to refs/remotes/origin/NewRemoteBranch(NewRemoteBranch)
[main] INFO org.locationtech.geogig.plumbing.SendPack - Pushing Ref[refs/heads/Branch1 -> 43a3e480cf2de155a4a8a7b4a9030df9a23ab671] to refs/remotes/origin/NewRemoteBranch2(NewRemoteBranch2)
[main] INFO org.locationtech.geogig.hooks.Scripting - Running jvm script /opt/public/hipp/ramdisk/geogig/junit7009350079654683165/repo361641417/.geogig/hooks/pre_commit.js
Tests run: 4, Failures: 0, Errors: 0, Skipped: 0, Time elapsed: 1.969 sec - in org.locationtech.geogig.test.integration.StatusOpTest
Running org.locationtech.geogig.test.integration.PullOpTest
testBothBranchesSameGeometryChange
[main] INFO org.locationtech.geogig.hooks.Scripting - Running jvm script /opt/public/hipp/ramdisk/geogig/junit5911586636380962102/repo-219627645/.geogig/hooks/post_commit.js
[main] WARN org.locationtech.geogig.hooks.CommandHookChain - Post-command hook org.locationtech.geogig.hooks.JVMScriptHook@f713686 for command org.locationtech.geogig.porcelain.CommitOp threw an exception that will not be propagated
java.lang.NullPointerException
	at org.locationtech.geogig.hooks.Scripting.runJVMScript(Scripting.java:93)
	at org.locationtech.geogig.hooks.JVMScriptHook.post(JVMScriptHook.java:52)
	at org.locationtech.geogig.hooks.CommandHookChain.runPostHooks(CommandHookChain.java:65)
	at org.locationtech.geogig.hooks.CommandHooksDecorator$HooksListener.postCall(CommandHooksDecorator.java:60)
	at org.locationtech.geogig.repository.AbstractGeoGigOp.notifyPost(AbstractGeoGigOp.java:178)
	at org.locationtech.geogig.repository.AbstractGeoGigOp.call(AbstractGeoGigOp.java:154)
	at org.locationtech.geogig.test.integration.HooksTest.testFailingPostPostProcessHook(HooksTest.java:148)
	at sun.reflect.NativeMethodAccessorImpl.invoke0(Native Method)
	at sun.reflect.NativeMethodAccessorImpl.invoke(NativeMethodAccessorImpl.java:62)
	at sun.reflect.DelegatingMethodAccessorImpl.invoke(DelegatingMethodAccessorImpl.java:43)
	at java.lang.reflect.Method.invoke(Method.java:498)
	at org.junit.runners.model.FrameworkMethod$1.runReflectiveCall(FrameworkMethod.java:50)
	at org.junit.internal.runners.model.ReflectiveCallable.run(ReflectiveCallable.java:12)
	at org.junit.runners.model.FrameworkMethod.invokeExplosively(FrameworkMethod.java:47)
	at org.junit.internal.runners.statements.InvokeMethod.evaluate(InvokeMethod.java:17)
	at org.junit.internal.runners.statements.RunBefores.evaluate(RunBefores.java:26)
	at org.junit.internal.runners.statements.RunAfters.evaluate(RunAfters.java:27)
	at org.junit.rules.ExternalResource$1.evaluate(ExternalResource.java:48)
	at org.junit.rules.RunRules.evaluate(RunRules.java:20)
	at org.junit.runners.ParentRunner.runLeaf(ParentRunner.java:325)
	at org.junit.runners.BlockJUnit4ClassRunner.runChild(BlockJUnit4ClassRunner.java:78)
	at org.junit.runners.BlockJUnit4ClassRunner.runChild(BlockJUnit4ClassRunner.java:57)
	at org.junit.runners.ParentRunner$3.run(ParentRunner.java:290)
	at org.junit.runners.ParentRunner$1.schedule(ParentRunner.java:71)
	at org.junit.runners.ParentRunner.runChildren(ParentRunner.java:288)
	at org.junit.runners.ParentRunner.access$000(ParentRunner.java:58)
	at org.junit.runners.ParentRunner$2.evaluate(ParentRunner.java:268)
	at org.junit.runners.ParentRunner.run(ParentRunner.java:363)
	at org.apache.maven.surefire.junit4.JUnit4Provider.execute(JUnit4Provider.java:264)
	at org.apache.maven.surefire.junit4.JUnit4Provider.executeTestSet(JUnit4Provider.java:153)
	at org.apache.maven.surefire.junit4.JUnit4Provider.invoke(JUnit4Provider.java:124)
	at org.apache.maven.surefire.booter.ForkedBooter.invokeProviderInSameClassLoader(ForkedBooter.java:200)
	at org.apache.maven.surefire.booter.ForkedBooter.runSuitesInProcess(ForkedBooter.java:153)
	at org.apache.maven.surefire.booter.ForkedBooter.main(ForkedBooter.java:103)
Tests run: 9, Failures: 0, Errors: 0, Skipped: 0, Time elapsed: 5.044 sec - in org.locationtech.geogig.test.integration.repository.IndexTest
Running org.locationtech.geogig.test.integration.SquashOpTest
Tests run: 18, Failures: 0, Errors: 0, Skipped: 0, Time elapsed: 8.922 sec - in org.locationtech.geogig.test.integration.ApplyPatchOpTest
Running org.locationtech.geogig.test.integration.BranchRenameOpTest
[main] WARN org.locationtech.geogig.hooks.CommandHookChain - Post-command hook org.locationtech.geogig.test.integration.HooksTest$ClasspathHookTest@6d511b5f for command org.locationtech.geogig.porcelain.AddOp threw an exception that will not be propagated
java.lang.RuntimeException: expected
	at org.locationtech.geogig.test.integration.HooksTest$ClasspathHookTest.post(HooksTest.java:266)
	at org.locationtech.geogig.hooks.CommandHookChain.runPostHooks(CommandHookChain.java:65)
	at org.locationtech.geogig.hooks.CommandHooksDecorator$HooksListener.postCall(CommandHooksDecorator.java:60)
	at org.locationtech.geogig.repository.AbstractGeoGigOp.notifyPost(AbstractGeoGigOp.java:178)
	at org.locationtech.geogig.repository.AbstractGeoGigOp.call(AbstractGeoGigOp.java:154)
	at org.locationtech.geogig.test.integration.RepositoryTestCase.insertAndAdd(RepositoryTestCase.java:367)
	at org.locationtech.geogig.test.integration.RepositoryTestCase.insertAndAdd(RepositoryTestCase.java:355)
	at org.locationtech.geogig.test.integration.HooksTest.testClasspathHookPostFail(HooksTest.java:191)
	at sun.reflect.NativeMethodAccessorImpl.invoke0(Native Method)
	at sun.reflect.NativeMethodAccessorImpl.invoke(NativeMethodAccessorImpl.java:62)
	at sun.reflect.DelegatingMethodAccessorImpl.invoke(DelegatingMethodAccessorImpl.java:43)
	at java.lang.reflect.Method.invoke(Method.java:498)
	at org.junit.runners.model.FrameworkMethod$1.runReflectiveCall(FrameworkMethod.java:50)
	at org.junit.internal.runners.model.ReflectiveCallable.run(ReflectiveCallable.java:12)
	at org.junit.runners.model.FrameworkMethod.invokeExplosively(FrameworkMethod.java:47)
	at org.junit.internal.runners.statements.InvokeMethod.evaluate(InvokeMethod.java:17)
	at org.junit.internal.runners.statements.RunBefores.evaluate(RunBefores.java:26)
	at org.junit.internal.runners.statements.RunAfters.evaluate(RunAfters.java:27)
	at org.junit.rules.ExternalResource$1.evaluate(ExternalResource.java:48)
	at org.junit.rules.RunRules.evaluate(RunRules.java:20)
	at org.junit.runners.ParentRunner.runLeaf(ParentRunner.java:325)
	at org.junit.runners.BlockJUnit4ClassRunner.runChild(BlockJUnit4ClassRunner.java:78)
	at org.junit.runners.BlockJUnit4ClassRunner.runChild(BlockJUnit4ClassRunner.java:57)
	at org.junit.runners.ParentRunner$3.run(ParentRunner.java:290)
	at org.junit.runners.ParentRunner$1.schedule(ParentRunner.java:71)
	at org.junit.runners.ParentRunner.runChildren(ParentRunner.java:288)
	at org.junit.runners.ParentRunner.access$000(ParentRunner.java:58)
	at org.junit.runners.ParentRunner$2.evaluate(ParentRunner.java:268)
	at org.junit.runners.ParentRunner.run(ParentRunner.java:363)
	at org.apache.maven.surefire.junit4.JUnit4Provider.execute(JUnit4Provider.java:264)
	at org.apache.maven.surefire.junit4.JUnit4Provider.executeTestSet(JUnit4Provider.java:153)
	at org.apache.maven.surefire.junit4.JUnit4Provider.invoke(JUnit4Provider.java:124)
	at org.apache.maven.surefire.booter.ForkedBooter.invokeProviderInSameClassLoader(ForkedBooter.java:200)
	at org.apache.maven.surefire.booter.ForkedBooter.runSuitesInProcess(ForkedBooter.java:153)
	at org.apache.maven.surefire.booter.ForkedBooter.main(ForkedBooter.java:103)
Tests run: 20, Failures: 0, Errors: 0, Skipped: 0, Time elapsed: 5.64 sec - in org.locationtech.geogig.test.integration.repository.WorkingTreeTest
Running org.locationtech.geogig.test.integration.CherryPickOpTest
[main] INFO org.locationtech.geogig.hooks.Scripting - Running shell script /opt/public/hipp/ramdisk/geogig/junit5648904229455657141/repo-2121897615/.geogig/hooks/pre_commit.bat
[main] INFO org.locationtech.geogig.plumbing.SendPack - Pushing Ref[refs/heads/master -> a3ad4dd3b550a1215e3001faf8071e3448956105] to refs/remotes/origin/NewRemoteBranch(NewRemoteBranch)
testMergeFastForwardSecondCase
[main] INFO org.locationtech.geogig.hooks.Scripting - Running shell script /opt/public/hipp/ramdisk/geogig/junit5648904229455657141/repo-2121897615/.geogig/hooks/pre_commit.bat
Tests run: 10, Failures: 0, Errors: 0, Skipped: 1, Time elapsed: 10.644 sec - in org.locationtech.geogig.test.integration.RemoveOpTest
Running org.locationtech.geogig.test.integration.CheckSparsePathTest
Tests run: 8, Failures: 0, Errors: 0, Skipped: 0, Time elapsed: 1.173 sec - in org.locationtech.geogig.test.integration.BranchRenameOpTest
Tests run: 12, Failures: 0, Errors: 0, Skipped: 0, Time elapsed: 4.522 sec - in org.locationtech.geogig.test.integration.AddOpTest
Running org.locationtech.geogig.test.integration.CreatePatchOpTest
testOctopusMergeWithAutomerge
[main] INFO org.locationtech.geogig.hooks.Scripting - Running jvm script /opt/public/hipp/ramdisk/geogig/junit6251010883217079571/repo1584478498/.geogig/hooks/pre_commit.js
Tests run: 7, Failures: 0, Errors: 0, Skipped: 0, Time elapsed: 10.208 sec - in org.locationtech.geogig.test.integration.HooksTest
Running org.locationtech.geogig.test.integration.BranchListOpTest
Running org.locationtech.geogig.test.integration.RevertOpTest
testConflictingMergeInterceptor
Tests run: 10, Failures: 0, Errors: 0, Skipped: 0, Time elapsed: 3.801 sec - in org.locationtech.geogig.test.integration.ReportCommitConflictsOpTest
Running org.locationtech.geogig.test.integration.FindCommonAncestorTest
[main] INFO org.locationtech.geogig.plumbing.SendPack - Pushing Ref[refs/heads/master -> d13557ae0d974dbbc25eb1e98414ea3a2455cc3c] to refs/remotes/origin/refs/heads/master(refs/heads/master)
Tests run: 13, Failures: 0, Errors: 0, Skipped: 0, Time elapsed: 5.226 sec - in org.locationtech.geogig.test.integration.ResetOpTest
Running org.locationtech.geogig.test.integration.RevParseIntegrationTest
Tests run: 17, Failures: 0, Errors: 0, Skipped: 0, Time elapsed: 10.577 sec - in org.locationtech.geogig.test.integration.LogOpTest
Running org.locationtech.geogig.test.integration.BranchCreateOpTest
Added 5,000 nodes in 157.8 ms
Tests run: 21, Failures: 0, Errors: 0, Skipped: 0, Time elapsed: 6.348 sec - in org.locationtech.geogig.test.integration.DiffOpTest
Running org.locationtech.geogig.test.integration.GeogigTransactionTest
testMerge
Tests run: 10, Failures: 0, Errors: 0, Skipped: 0, Time elapsed: 10.84 sec - in org.locationtech.geogig.test.integration.LsTreeOpTest
Running org.locationtech.geogig.test.integration.CheckoutOpTest
Added 1,024 nodes in 38.99 ms
Removed 400 nodes in 108.9 ms
Tests run: 7, Failures: 0, Errors: 0, Skipped: 1, Time elapsed: 2.487 sec - in org.locationtech.geogig.test.integration.CherryPickOpTest
Running org.locationtech.geogig.test.integration.RebaseOpTest
Tests run: 4, Failures: 0, Errors: 0, Skipped: 0, Time elapsed: 6.514 sec - in org.locationtech.geogig.test.integration.RemoteListOpTest
Running org.locationtech.geogig.test.performance.LogOpPerformanceTest
Tests run: 8, Failures: 0, Errors: 0, Skipped: 0, Time elapsed: 1.77 sec - in org.locationtech.geogig.test.integration.CreatePatchOpTest
Running org.locationtech.geogig.test.performance.HeapGraphDatabaseStressTest
[main] INFO org.locationtech.geogig.test.performance.EnablePerformanceTestRule - org.locationtech.geogig.test.performance.HeapGraphDatabaseStressTest ignored, run with -Dgeogig.runPerformanceTests=true to enable it.
Tests run: 0, Failures: 0, Errors: 0, Skipped: 0, Time elapsed: 0.005 sec - in org.locationtech.geogig.test.performance.HeapGraphDatabaseStressTest
Running org.locationtech.geogig.test.performance.RevTreeBuilderPerformanceTest
[main] INFO org.locationtech.geogig.test.performance.EnablePerformanceTestRule - org.locationtech.geogig.test.performance.RevTreeBuilderPerformanceTest ignored, run with -Dgeogig.runPerformanceTests=true to enable it.
Tests run: 0, Failures: 0, Errors: 0, Skipped: 0, Time elapsed: 0 sec - in org.locationtech.geogig.test.performance.RevTreeBuilderPerformanceTest
Running org.locationtech.geogig.plumbing.UpdateRefTest
[main] INFO org.locationtech.geogig.test.performance.EnablePerformanceTestRule - org.locationtech.geogig.test.performance.LogOpPerformanceTest ignored, run with -Dgeogig.runPerformanceTests=true to enable it.
Tests run: 0, Failures: 0, Errors: 0, Skipped: 0, Time elapsed: 0.073 sec - in org.locationtech.geogig.test.performance.LogOpPerformanceTest
Running org.locationtech.geogig.plumbing.diff.PatchSerializationTest
testConflictingOctopusMerge
Tests run: 7, Failures: 0, Errors: 0, Skipped: 0, Time elapsed: 1.028 sec - in org.locationtech.geogig.test.integration.RevParseIntegrationTest
Running org.locationtech.geogig.plumbing.diff.AttributeDiffTest
Tests run: 4, Failures: 0, Errors: 0, Skipped: 0, Time elapsed: 0.005 sec - in org.locationtech.geogig.plumbing.diff.AttributeDiffTest
Running org.locationtech.geogig.plumbing.diff.DiffCountConsumerTest
Tests run: 2, Failures: 0, Errors: 0, Skipped: 0, Time elapsed: 2.26 sec - in org.locationtech.geogig.test.integration.CheckSparsePathTest
Running org.locationtech.geogig.plumbing.diff.PreOrderDiffWalkTest
testFastForwardOnly
Tests run: 26, Failures: 0, Errors: 0, Skipped: 0, Time elapsed: 9.472 sec - in org.locationtech.geogig.test.integration.CommitOpTest
Running org.locationtech.geogig.plumbing.diff.DepthTreeIteratorTest
Tests run: 5, Failures: 0, Errors: 0, Skipped: 0, Time elapsed: 0.572 sec - in org.locationtech.geogig.plumbing.UpdateRefTest
Running org.locationtech.geogig.plumbing.diff.GeometryDiffTest
[main] INFO org.locationtech.geogig.plumbing.SendPack - Pushing Ref[refs/heads/master -> a3ad4dd3b550a1215e3001faf8071e3448956105] to refs/remotes/origin/master(null)
Tests run: 14, Failures: 0, Errors: 0, Skipped: 0, Time elapsed: 0.2 sec - in org.locationtech.geogig.plumbing.diff.GeometryDiffTest
Running org.locationtech.geogig.plumbing.diff.TreeDifferenceTest
Tests run: 11, Failures: 0, Errors: 0, Skipped: 0, Time elapsed: 1.507 sec - in org.locationtech.geogig.test.integration.BranchCreateOpTest
Running org.locationtech.geogig.plumbing.diff.MutableTreeTest
Tests run: 7, Failures: 0, Errors: 0, Skipped: 0, Time elapsed: 0.021 sec - in org.locationtech.geogig.plumbing.diff.MutableTreeTest
Running org.locationtech.geogig.plumbing.diff.PostOrderDiffWalkTest
Tests run: 7, Failures: 0, Errors: 0, Skipped: 0, Time elapsed: 0.154 sec - in org.locationtech.geogig.plumbing.diff.TreeDifferenceTest
Running org.locationtech.geogig.plumbing.RefParseTest
testSpecifyAuthor
Tests run: 5, Failures: 0, Errors: 0, Skipped: 0, Time elapsed: 0.197 sec - in org.locationtech.geogig.plumbing.RefParseTest
Running org.locationtech.geogig.plumbing.merge.MergeFeaturesOpTest
testOursAndTheirs
Tests run: 1, Failures: 0, Errors: 0, Skipped: 0, Time elapsed: 0.229 sec - in org.locationtech.geogig.plumbing.merge.MergeFeaturesOpTest
Running org.locationtech.geogig.plumbing.merge.MergeStatusBuilderDiffEntrySerializerTest
testNoCommitMerge
Tests run: 14, Failures: 0, Errors: 0, Skipped: 0, Time elapsed: 4.573 sec - in org.locationtech.geogig.test.integration.SquashOpTest
Running org.locationtech.geogig.plumbing.HashObjectTest
testMergeFastForward
Tests run: 5, Failures: 0, Errors: 0, Skipped: 0, Time elapsed: 2.913 sec - in org.locationtech.geogig.test.integration.FindCommonAncestorTest
Added 10,000 nodes in 276.3 ms
Running org.locationtech.geogig.plumbing.UpdateSymRefTest
Tests run: 11, Failures: 0, Errors: 0, Skipped: 0, Time elapsed: 14.889 sec - in org.locationtech.geogig.model.internal.CanonicalClusteringStrategyRocksdbStorageTest
Running org.locationtech.geogig.plumbing.WriteTree2Test
Tests run: 5, Failures: 0, Errors: 0, Skipped: 0, Time elapsed: 0.43 sec - in org.locationtech.geogig.plumbing.merge.MergeStatusBuilderDiffEntrySerializerTest
Running org.locationtech.geogig.plumbing.ResolveRepositoryNameTest
[main] INFO org.locationtech.geogig.plumbing.SendPack - Pushing Ref[refs/heads/master -> a3ad4dd3b550a1215e3001faf8071e3448956105] to refs/remotes/origin/master(null)
[main] INFO org.locationtech.geogig.plumbing.SendPack - Pushing Ref[refs/heads/Branch1 -> e4d10fce0f71850b8e201763343ebde1c71aa5f6] to refs/remotes/origin/Branch1(null)
Tests run: 8, Failures: 0, Errors: 0, Skipped: 0, Time elapsed: 1.895 sec - in org.locationtech.geogig.plumbing.diff.PatchSerializationTest
Running org.locationtech.geogig.plumbing.ParseTimestampTest
testOctopusMergeSameFeatureChanges
Tests run: 2, Failures: 0, Errors: 0, Skipped: 0, Time elapsed: 0.115 sec - in org.locationtech.geogig.plumbing.ResolveRepositoryNameTest
Running org.locationtech.geogig.plumbing.RevParseTest
Tests run: 12, Failures: 0, Errors: 0, Skipped: 0, Time elapsed: 2.432 sec - in org.locationtech.geogig.test.integration.RebaseOpTest
Running org.locationtech.geogig.plumbing.DiffTreeTest
Tests run: 2, Failures: 0, Errors: 0, Skipped: 0, Time elapsed: 3.979 sec - in org.locationtech.geogig.test.integration.BranchListOpTest
Running org.locationtech.geogig.plumbing.CatObjectTest
Tests run: 5, Failures: 0, Errors: 0, Skipped: 0, Time elapsed: 0.559 sec - in org.locationtech.geogig.plumbing.UpdateSymRefTest
Running org.locationtech.geogig.plumbing.ResolveGeogigURITest
Tests run: 2, Failures: 0, Errors: 0, Skipped: 0, Time elapsed: 0.501 sec - in org.locationtech.geogig.plumbing.ParseTimestampTest
Running org.locationtech.geogig.plumbing.DescribeFeatureTypeTest
testMergeNullCommit
Tests run: 2, Failures: 0, Errors: 0, Skipped: 0, Time elapsed: 0.403 sec - in org.locationtech.geogig.plumbing.DescribeFeatureTypeTest
Running org.locationtech.geogig.plumbing.UpdateTreeTest
Tests run: 15, Failures: 0, Errors: 0, Skipped: 0, Time elapsed: 3.481 sec - in org.locationtech.geogig.test.integration.GeogigTransactionTest
Running org.locationtech.geogig.plumbing.DiffBoundsTest
testMergeMultiple
Tests run: 1, Failures: 0, Errors: 0, Skipped: 0, Time elapsed: 0.64 sec - in org.locationtech.geogig.plumbing.ResolveGeogigURITest
Running org.locationtech.geogig.plumbing.CheckRefFormatTest
Tests run: 2, Failures: 0, Errors: 0, Skipped: 0, Time elapsed: 0.085 sec - in org.locationtech.geogig.plumbing.CheckRefFormatTest
Running org.locationtech.geogig.plumbing.UpdateIndexTest
Tests run: 7, Failures: 0, Errors: 0, Skipped: 0, Time elapsed: 1.745 sec - in org.locationtech.geogig.plumbing.HashObjectTest
Running org.locationtech.geogig.plumbing.ResolveFeatureTypeTest
Tests run: 1, Failures: 0, Errors: 0, Skipped: 0, Time elapsed: 0.224 sec - in org.locationtech.geogig.plumbing.UpdateIndexTest
[main] INFO org.locationtech.geogig.plumbing.SendPack - Pushing Ref[refs/heads/Branch1 -> b9ffcf8d172b8905500e906f2218c55b58cf2c44] to refs/remotes/origin/Branch1(Branch1)
Running org.locationtech.geogig.plumbing.DiffFeatureTest

testMergeConflictingPolygon
Tests run: 3, Failures: 0, Errors: 0, Skipped: 0, Time elapsed: 1.379 sec - in org.locationtech.geogig.plumbing.CatObjectTest
Running org.locationtech.geogig.plumbing.WalkGraphOpTest
Tests run: 5, Failures: 0, Errors: 0, Skipped: 0, Time elapsed: 0.565 sec - in org.locationtech.geogig.plumbing.ResolveFeatureTypeTest
Tests run: 13, Failures: 0, Errors: 0, Skipped: 0, Time elapsed: 8.384 sec - in org.locationtech.geogig.test.integration.ReportMergeConflictsOpTest
Running org.locationtech.geogig.repository.impl.RevFeatureBuilderTest
Running org.locationtech.geogig.repository.impl.DepthSearchTest
[main] INFO org.locationtech.geogig.plumbing.SendPack - Pushing Ref[refs/heads/master -> b2e392a358773a01efe3ec48a3580362a7fc83d0] to refs/remotes/origin/refs/heads/master(refs/heads/master)
Tests run: 6, Failures: 0, Errors: 0, Skipped: 0, Time elapsed: 8.33 sec - in org.locationtech.geogig.test.integration.BlameOpTest
Running org.locationtech.geogig.repository.impl.RepositoryResolverTest
Tests run: 1, Failures: 0, Errors: 0, Skipped: 0, Time elapsed: 0 sec - in org.locationtech.geogig.repository.impl.RepositoryResolverTest
Running org.locationtech.geogig.data.MapToStringConverterFactoryTest
ip	1000 -> 1001
pp	0 point(s) deleted, 0 new point(s) added, 1 point(s) moved
sp	StringProp1_1 -> StringProp1_1a

Tests run: 4, Failures: 0, Errors: 0, Skipped: 0, Time elapsed: 0.69 sec - in org.locationtech.geogig.plumbing.DiffFeatureTest
Tests run: 1, Failures: 0, Errors: 0, Skipped: 0, Time elapsed: 0.22 sec - in org.locationtech.geogig.repository.impl.DepthSearchTest
Running org.locationtech.geogig.data.FeatureBuilderTest
testMergeConflictingBranchesTheirs
Running org.locationtech.geogig.data.PrimitiveArrayToStringConverterFactoryTest
Tests run: 7, Failures: 0, Errors: 0, Skipped: 0, Time elapsed: 0 sec - in org.locationtech.geogig.data.PrimitiveArrayToStringConverterFactoryTest
Tests run: 1, Failures: 0, Errors: 0, Skipped: 0, Time elapsed: 0.192 sec - in org.locationtech.geogig.data.MapToStringConverterFactoryTest
Running org.locationtech.geogig.di.caching.CachingModuleTest
Tests run: 1, Failures: 0, Errors: 0, Skipped: 0, Time elapsed: 0.14 sec - in org.locationtech.geogig.data.FeatureBuilderTest
Tests run: 8, Failures: 0, Errors: 0, Skipped: 0, Time elapsed: 2.511 sec - in org.locationtech.geogig.plumbing.RevParseTest
Excaption caught executing task: 
java.lang.IllegalStateException: java.lang.IllegalStateException: Object NodeRef[Points/Points.1 -> a47ca38e5c3e92c94dec9e8ea597c642003ec878] not found.
	at sun.reflect.NativeConstructorAccessorImpl.newInstance0(Native Method)
	at sun.reflect.NativeConstructorAccessorImpl.newInstance(NativeConstructorAccessorImpl.java:62)
	at sun.reflect.DelegatingConstructorAccessorImpl.newInstance(DelegatingConstructorAccessorImpl.java:45)
	at java.lang.reflect.Constructor.newInstance(Constructor.java:423)
	at java.util.concurrent.ForkJoinTask.getThrowableException(ForkJoinTask.java:593)
	at java.util.concurrent.ForkJoinTask.reportException(ForkJoinTask.java:677)
	at java.util.concurrent.ForkJoinTask.join(ForkJoinTask.java:720)
	at java.util.concurrent.ForkJoinPool.invoke(ForkJoinPool.java:2616)
	at org.locationtech.geogig.plumbing.diff.PreOrderDiffWalk.walk(PreOrderDiffWalk.java:304)
	at org.locationtech.geogig.plumbing.WalkGraphOp._call(WalkGraphOp.java:154)
	at org.locationtech.geogig.plumbing.WalkGraphOp._call(WalkGraphOp.java:33)
	at org.locationtech.geogig.repository.AbstractGeoGigOp.call(AbstractGeoGigOp.java:153)
	at org.locationtech.geogig.plumbing.WalkGraphOpTest.testObjectDoesNotExist(WalkGraphOpTest.java:179)
	at sun.reflect.NativeMethodAccessorImpl.invoke0(Native Method)
	at sun.reflect.NativeMethodAccessorImpl.invoke(NativeMethodAccessorImpl.java:62)
	at sun.reflect.DelegatingMethodAccessorImpl.invoke(DelegatingMethodAccessorImpl.java:43)
	at java.lang.reflect.Method.invoke(Method.java:498)
	at org.junit.runners.model.FrameworkMethod$1.runReflectiveCall(FrameworkMethod.java:50)
	at org.junit.internal.runners.model.ReflectiveCallable.run(ReflectiveCallable.java:12)
	at org.junit.runners.model.FrameworkMethod.invokeExplosively(FrameworkMethod.java:47)
	at org.junit.internal.runners.statements.InvokeMethod.evaluate(InvokeMethod.java:17)
	at org.junit.internal.runners.statements.RunBefores.evaluate(RunBefores.java:26)
	at org.junit.internal.runners.statements.RunAfters.evaluate(RunAfters.java:27)
	at org.junit.rules.ExpectedException$ExpectedExceptionStatement.evaluate(ExpectedException.java:239)
	at org.junit.rules.ExternalResource$1.evaluate(ExternalResource.java:48)
	at org.junit.rules.RunRules.evaluate(RunRules.java:20)
	at org.junit.runners.ParentRunner.runLeaf(ParentRunner.java:325)
	at org.junit.runners.BlockJUnit4ClassRunner.runChild(BlockJUnit4ClassRunner.java:78)
	at org.junit.runners.BlockJUnit4ClassRunner.runChild(BlockJUnit4ClassRunner.java:57)
	at org.junit.runners.ParentRunner$3.run(ParentRunner.java:290)
	at org.junit.runners.ParentRunner$1.schedule(ParentRunner.java:71)
	at org.junit.runners.ParentRunner.runChildren(ParentRunner.java:288)
	at org.junit.runners.ParentRunner.access$000(ParentRunner.java:58)
	at org.junit.runners.ParentRunner$2.evaluate(ParentRunner.java:268)
	at org.junit.runners.ParentRunner.run(ParentRunner.java:363)
	at org.apache.maven.surefire.junit4.JUnit4Provider.execute(JUnit4Provider.java:264)
	at org.apache.maven.surefire.junit4.JUnit4Provider.executeTestSet(JUnit4Provider.java:153)
	at org.apache.maven.surefire.junit4.JUnit4Provider.invoke(JUnit4Provider.java:124)
	at org.apache.maven.surefire.booter.ForkedBooter.invokeProviderInSameClassLoader(ForkedBooter.java:200)
	at org.apache.maven.surefire.booter.ForkedBooter.runSuitesInProcess(ForkedBooter.java:153)
	at org.apache.maven.surefire.booter.ForkedBooter.main(ForkedBooter.java:103)
Caused by: java.lang.IllegalStateException: Object NodeRef[Points/Points.1 -> a47ca38e5c3e92c94dec9e8ea597c642003ec878] not found.
	at org.locationtech.geogig.plumbing.WalkGraphOp$1.checkExists(WalkGraphOp.java:149)
	at org.locationtech.geogig.plumbing.WalkGraphOp$1.feature(WalkGraphOp.java:122)
	at org.locationtech.geogig.plumbing.diff.PreOrderDiffWalk$CancellableConsumer.feature(PreOrderDiffWalk.java:1277)
	at org.locationtech.geogig.plumbing.diff.PreOrderDiffWalk$WalkAction.node(PreOrderDiffWalk.java:601)
	at org.locationtech.geogig.plumbing.diff.PreOrderDiffWalk$TraverseLeafLeaf.compute(PreOrderDiffWalk.java:804)
	at org.locationtech.geogig.plumbing.diff.PreOrderDiffWalk$TraverseTreeContents.compute(PreOrderDiffWalk.java:710)
	at org.locationtech.geogig.plumbing.diff.PreOrderDiffWalk$TraverseTree.compute(PreOrderDiffWalk.java:666)
	at java.util.concurrent.RecursiveAction.exec(RecursiveAction.java:189)
	at java.util.concurrent.ForkJoinTask.doExec(ForkJoinTask.java:289)
	at java.util.concurrent.ForkJoinTask.doInvoke(ForkJoinTask.java:401)
	at java.util.concurrent.ForkJoinTask.invokeAll(ForkJoinTask.java:843)
	at org.locationtech.geogig.plumbing.diff.PreOrderDiffWalk$TraverseLeafLeaf.compute(PreOrderDiffWalk.java:811)
	at org.locationtech.geogig.plumbing.diff.PreOrderDiffWalk$TraverseTreeContents.compute(PreOrderDiffWalk.java:710)
	at org.locationtech.geogig.plumbing.diff.PreOrderDiffWalk$TraverseTree.compute(PreOrderDiffWalk.java:666)
	at java.util.concurrent.RecursiveAction.exec(RecursiveAction.java:189)
	at java.util.concurrent.ForkJoinTask.doExec(ForkJoinTask.java:289)
	at java.util.concurrent.ForkJoinPool$WorkQueue.runTask(ForkJoinPool.java:1056)
	at java.util.concurrent.ForkJoinPool.runWorker(ForkJoinPool.java:1692)
	at java.util.concurrent.ForkJoinWorkerThread.run(ForkJoinWorkerThread.java:157)
Tests run: 7, Failures: 0, Errors: 0, Skipped: 0, Time elapsed: 0.794 sec - in org.locationtech.geogig.plumbing.WalkGraphOpTest
Tests run: 8, Failures: 0, Errors: 0, Skipped: 0, Time elapsed: 0.707 sec - in org.locationtech.geogig.repository.impl.RevFeatureBuilderTest
Tests run: 3, Failures: 0, Errors: 0, Skipped: 0, Time elapsed: 0.403 sec - in org.locationtech.geogig.di.caching.CachingModuleTest
testMergeWithFeatureMerge
Tests run: 7, Failures: 0, Errors: 0, Skipped: 0, Time elapsed: 2.056 sec - in org.locationtech.geogig.plumbing.UpdateTreeTest
Tests run: 8, Failures: 0, Errors: 0, Skipped: 0, Time elapsed: 11.234 sec - in org.locationtech.geogig.test.integration.CloneOpTest
Tests run: 9, Failures: 0, Errors: 0, Skipped: 0, Time elapsed: 4.818 sec - in org.locationtech.geogig.plumbing.diff.DiffCountConsumerTest
Tests run: 7, Failures: 0, Errors: 0, Skipped: 0, Time elapsed: 4.418 sec - in org.locationtech.geogig.plumbing.diff.PostOrderDiffWalkTest
Tests run: 15, Failures: 0, Errors: 0, Skipped: 0, Time elapsed: 6.936 sec - in org.locationtech.geogig.test.integration.RevertOpTest
testMergeNoCommitMessage
[main] INFO org.locationtech.geogig.plumbing.SendPack - Pushing Ref[refs/heads/Branch1 -> b9ffcf8d172b8905500e906f2218c55b58cf2c44] to refs/remotes/origin/Branch1(Branch1)
testMergeTwoBranchesWithNewFeatureType
testCancelScenario1
Tests run: 21, Failures: 0, Errors: 0, Skipped: 0, Time elapsed: 6.723 sec - in org.locationtech.geogig.test.integration.CheckoutOpTest
testCancelScenario2
Tests run: 8, Failures: 0, Errors: 0, Skipped: 0, Time elapsed: 10.026 sec - in org.locationtech.geogig.test.integration.PullOpTest
testCancelScenario3
testCancelScenario4
[main] INFO org.locationtech.geogig.plumbing.SendPack - Pushing Ref[refs/heads/master -> a3ad4dd3b550a1215e3001faf8071e3448956105] to refs/remotes/origin/master(null)
testNoFastForward
testMergeConflictingBranches
[main] INFO org.locationtech.geogig.plumbing.SendPack - Pushing Ref[refs/heads/master -> a3ad4dd3b550a1215e3001faf8071e3448956105] to refs/remotes/origin/master(null)
testMergeConflictingBranchesOurs
Tests run: 30, Failures: 0, Errors: 0, Skipped: 0, Time elapsed: 19.922 sec - in org.locationtech.geogig.test.integration.MergeOpTest
Tests run: 11, Failures: 0, Errors: 0, Skipped: 0, Time elapsed: 19.928 sec - in org.locationtech.geogig.test.integration.PushOpTest
Tests run: 11, Failures: 0, Errors: 0, Skipped: 0, Time elapsed: 5.327 sec - in org.locationtech.geogig.plumbing.DiffTreeTest
left : Tree[c932cbd11ec75bcc145e2a362a3199bb85eb3abc; size=7; subtrees=2, buckets=0, features=0]
	[BoundedTreeNode[buildings -> a400000000000000000000000000000000000000], BoundedTreeNode[roads -> ff488999ad51848c7850ffd4d12568a3125172b0]]
	[]
right: Tree[8996d6e4437a8d8ea41ffc1f32cfaab9bf9de384; size=5; subtrees=1, buckets=0, features=0]
	[BoundedTreeNode[roads -> 72e2f547f3adc30edd55733abb885e8e6de1f1a4]]
	[]
[main] INFO org.locationtech.geogig.plumbing.SendPack - Pushing Ref[refs/heads/master -> 32b4e258bf8026e45ba1c2ace4a1f36e15b862a1] to refs/remotes/origin/master(null)
Tests run: 15, Failures: 0, Errors: 0, Skipped: 0, Time elapsed: 14.376 sec - in org.locationtech.geogig.test.integration.FetchOpTest
Tests run: 15, Failures: 0, Errors: 0, Skipped: 0, Time elapsed: 6.876 sec - in org.locationtech.geogig.plumbing.WriteTree2Test
Tests run: 12, Failures: 0, Errors: 0, Skipped: 0, Time elapsed: 14.268 sec - in org.locationtech.geogig.test.integration.SparseCloneTest
Tests run: 6, Failures: 0, Errors: 0, Skipped: 0, Time elapsed: 5.994 sec - in org.locationtech.geogig.plumbing.DiffBoundsTest
Tests run: 13, Failures: 0, Errors: 0, Skipped: 0, Time elapsed: 28.427 sec - in org.locationtech.geogig.model.impl.CanonicalTreeBuilderTest
Tests run: 13, Failures: 0, Errors: 0, Skipped: 0, Time elapsed: 28.565 sec - in org.locationtech.geogig.model.impl.LegacyTreeBuilderTest
Tests run: 7, Failures: 0, Errors: 0, Skipped: 0, Time elapsed: 15.499 sec - in org.locationtech.geogig.plumbing.diff.DepthTreeIteratorTest
PreOrderDiffWalkTest: walked 524,288 vs 262144 trees in 436.9 ms
PreOrderDiffWalkTest: walked 1,024 vs 512 trees in 14.65 ms
PreOrderDiffWalkTest: walked 16,384 vs 512 trees in 111.7 ms
Tests run: 24, Failures: 0, Errors: 0, Skipped: 0, Time elapsed: 17.738 sec - in org.locationtech.geogig.plumbing.diff.PreOrderDiffWalkTest

Results :

Tests run: 943, Failures: 0, Errors: 0, Skipped: 3

[JENKINS] Recording test results
[INFO] 
[INFO] --- maven-jar-plugin:2.4:jar (default-jar) @ geogig-core ---
[INFO] Building jar: /home/hudson/genie.geogig/.jenkins/jobs/geogig-1.0.x/workspace/src/core/target/geogig-core-1.0-SNAPSHOT.jar
[INFO] 
[INFO] --- maven-jar-plugin:2.4:test-jar (default) @ geogig-core ---
[INFO] Building jar: /home/hudson/genie.geogig/.jenkins/jobs/geogig-1.0.x/workspace/src/core/target/geogig-core-1.0-SNAPSHOT-tests.jar
[INFO] 
[INFO] >>> maven-source-plugin:2.2.1:jar (attach-sources) > generate-sources @ geogig-core >>>
[INFO] 
[INFO] --- git-commit-id-plugin:2.1.8:revision (default) @ geogig-core ---
[WARNING] Failed to getClass for org.apache.maven.plugin.source.SourceJarMojo
[INFO] 
[INFO] <<< maven-source-plugin:2.2.1:jar (attach-sources) < generate-sources @ geogig-core <<<
[INFO] 
[INFO] --- maven-source-plugin:2.2.1:jar (attach-sources) @ geogig-core ---
[INFO] Building jar: /home/hudson/genie.geogig/.jenkins/jobs/geogig-1.0.x/workspace/src/core/target/geogig-core-1.0-SNAPSHOT-sources.jar
[INFO] 
[INFO] >>> maven-source-plugin:2.2.1:test-jar (attach-sources) > generate-sources @ geogig-core >>>
[INFO] 
[INFO] --- git-commit-id-plugin:2.1.8:revision (default) @ geogig-core ---
[WARNING] Failed to getClass for org.apache.maven.plugin.source.TestSourceJarMojo
[INFO] 
[INFO] <<< maven-source-plugin:2.2.1:test-jar (attach-sources) < generate-sources @ geogig-core <<<
[INFO] 
[INFO] --- maven-source-plugin:2.2.1:test-jar (attach-sources) @ geogig-core ---
[INFO] Building jar: /home/hudson/genie.geogig/.jenkins/jobs/geogig-1.0.x/workspace/src/core/target/geogig-core-1.0-SNAPSHOT-test-sources.jar
[INFO] 
[INFO] --- maven-install-plugin:2.4:install (default-install) @ geogig-core ---
[INFO] Installing /home/hudson/genie.geogig/.jenkins/jobs/geogig-1.0.x/workspace/src/core/target/geogig-core-1.0-SNAPSHOT.jar to /home/hudson/genie.geogig/.jenkins/jobs/geogig-1.0.x/workspace/.repository/org/locationtech/geogig/geogig-core/1.0-SNAPSHOT/geogig-core-1.0-SNAPSHOT.jar
[INFO] Installing /home/hudson/genie.geogig/.jenkins/jobs/geogig-1.0.x/workspace/src/core/pom.xml to /home/hudson/genie.geogig/.jenkins/jobs/geogig-1.0.x/workspace/.repository/org/locationtech/geogig/geogig-core/1.0-SNAPSHOT/geogig-core-1.0-SNAPSHOT.pom
[INFO] Installing /home/hudson/genie.geogig/.jenkins/jobs/geogig-1.0.x/workspace/src/core/target/geogig-core-1.0-SNAPSHOT-tests.jar to /home/hudson/genie.geogig/.jenkins/jobs/geogig-1.0.x/workspace/.repository/org/locationtech/geogig/geogig-core/1.0-SNAPSHOT/geogig-core-1.0-SNAPSHOT-tests.jar
[INFO] Installing /home/hudson/genie.geogig/.jenkins/jobs/geogig-1.0.x/workspace/src/core/target/geogig-core-1.0-SNAPSHOT-sources.jar to /home/hudson/genie.geogig/.jenkins/jobs/geogig-1.0.x/workspace/.repository/org/locationtech/geogig/geogig-core/1.0-SNAPSHOT/geogig-core-1.0-SNAPSHOT-sources.jar
[INFO] Installing /home/hudson/genie.geogig/.jenkins/jobs/geogig-1.0.x/workspace/src/core/target/geogig-core-1.0-SNAPSHOT-test-sources.jar to /home/hudson/genie.geogig/.jenkins/jobs/geogig-1.0.x/workspace/.repository/org/locationtech/geogig/geogig-core/1.0-SNAPSHOT/geogig-core-1.0-SNAPSHOT-test-sources.jar
[JENKINS] Archiving disabled