SuccessConsole Output

Started calculate disk usage of build
Finished Calculation of disk usage of build in 0 seconds
Started calculate disk usage of workspace
Finished Calculation of disk usage of workspace in 0 seconds
[INFO]                                                                         
[INFO] ------------------------------------------------------------------------
[INFO] Building GeoGig Core 1.0-SNAPSHOT
[INFO] ------------------------------------------------------------------------
[INFO] 
[INFO] --- maven-clean-plugin:2.5:clean (default-clean) @ geogig-core ---
[INFO] Deleting /home/hudson/genie.geogig/.hudson/jobs/geogig-1.0.x/workspace/src/core/target
[INFO] 
[INFO] --- git-commit-id-plugin:2.1.8:revision (default) @ geogig-core ---
[INFO] 
[INFO] --- maven-resources-plugin:2.6:resources (default-resources) @ geogig-core ---
[INFO] Using 'UTF-8' encoding to copy filtered resources.
[INFO] Copying 4 resources
[INFO] 
[INFO] --- maven-compiler-plugin:3.1:compile (default-compile) @ geogig-core ---
[INFO] Changes detected - recompiling the module!
[INFO] Compiling 305 source files to /home/hudson/genie.geogig/.hudson/jobs/geogig-1.0.x/workspace/src/core/target/classes
[WARNING] /home/hudson/genie.geogig/.hudson/jobs/geogig-1.0.x/workspace/src/core/src/main/java/org/locationtech/geogig/hooks/Scripting.java: Some input files use or override a deprecated API.
[WARNING] /home/hudson/genie.geogig/.hudson/jobs/geogig-1.0.x/workspace/src/core/src/main/java/org/locationtech/geogig/hooks/Scripting.java: Recompile with -Xlint:deprecation for details.
[WARNING] /home/hudson/genie.geogig/.hudson/jobs/geogig-1.0.x/workspace/src/core/src/main/java/org/locationtech/geogig/data/PrimitiveArrayToStringConverterFactory.java: Some input files use unchecked or unsafe operations.
[WARNING] /home/hudson/genie.geogig/.hudson/jobs/geogig-1.0.x/workspace/src/core/src/main/java/org/locationtech/geogig/data/PrimitiveArrayToStringConverterFactory.java: Recompile with -Xlint:unchecked for details.
[INFO] 
[INFO] --- maven-resources-plugin:2.6:testResources (default-testResources) @ geogig-core ---
[INFO] Using 'UTF-8' encoding to copy filtered resources.
[INFO] Copying 3 resources
[INFO] 
[INFO] --- maven-compiler-plugin:3.1:testCompile (default-testCompile) @ geogig-core ---
[INFO] Changes detected - recompiling the module!
[INFO] Compiling 145 source files to /home/hudson/genie.geogig/.hudson/jobs/geogig-1.0.x/workspace/src/core/target/test-classes
[WARNING] /home/hudson/genie.geogig/.hudson/jobs/geogig-1.0.x/workspace/src/core/src/test/java/org/locationtech/geogig/test/integration/HooksTest.java: Some input files use or override a deprecated API.
[WARNING] /home/hudson/genie.geogig/.hudson/jobs/geogig-1.0.x/workspace/src/core/src/test/java/org/locationtech/geogig/test/integration/HooksTest.java: Recompile with -Xlint:deprecation for details.
[WARNING] /home/hudson/genie.geogig/.hudson/jobs/geogig-1.0.x/workspace/src/core/src/test/java/org/locationtech/geogig/di/caching/CachingModuleTest.java: /home/hudson/genie.geogig/.hudson/jobs/geogig-1.0.x/workspace/src/core/src/test/java/org/locationtech/geogig/di/caching/CachingModuleTest.java uses unchecked or unsafe operations.
[WARNING] /home/hudson/genie.geogig/.hudson/jobs/geogig-1.0.x/workspace/src/core/src/test/java/org/locationtech/geogig/di/caching/CachingModuleTest.java: Recompile with -Xlint:unchecked for details.
[INFO] 
[INFO] --- maven-surefire-plugin:2.17:test (default-test) @ geogig-core ---
[INFO] Surefire report directory: /home/hudson/genie.geogig/.hudson/jobs/geogig-1.0.x/workspace/src/core/target/surefire-reports

-------------------------------------------------------
 T E S T S
-------------------------------------------------------

-------------------------------------------------------
 T E S T S
-------------------------------------------------------
Running org.locationtech.geogig.test.integration.ReportMergeConflictsOpTest
Running org.locationtech.geogig.test.integration.HooksTest
Running org.locationtech.geogig.test.integration.ResetOpTest
Running org.locationtech.geogig.test.integration.repository.WorkingTreeTest
Running org.locationtech.geogig.test.integration.repository.IndexTest
Running org.locationtech.geogig.test.integration.BranchDeleteOpTest
Running org.locationtech.geogig.test.integration.ConfigOpTest
Running org.locationtech.geogig.test.integration.BranchListOpTest
Running org.locationtech.geogig.test.integration.AddOpTest
Running org.locationtech.geogig.test.integration.RemoveOpTest
Running org.locationtech.geogig.test.integration.TagTest
Running org.locationtech.geogig.test.integration.FindCommonAncestorTest
Running org.locationtech.geogig.test.integration.LsTreeOpTest
Running org.locationtech.geogig.test.integration.CreatePatchOpTest
Running org.locationtech.geogig.test.integration.RemoteAddOpTest
Running org.locationtech.geogig.test.integration.RebaseOpTest
Running org.locationtech.geogig.test.integration.PushOpTest
Running org.locationtech.geogig.test.integration.RemoteListOpTest
Running org.locationtech.geogig.test.integration.GeogigTransactionTest
Running org.locationtech.geogig.test.integration.CloneOpTest
Running org.locationtech.geogig.test.integration.CleanRefsOpTest
Running org.locationtech.geogig.test.integration.RebuildGraphOpTest
Running org.locationtech.geogig.test.integration.CheckoutOpTest
Running org.locationtech.geogig.test.integration.MergeOpTest
testMergeNoCommits
testOctopusMerge
Tests run: 1, Failures: 0, Errors: 0, Skipped: 0, Time elapsed: 5.421 sec - in org.locationtech.geogig.test.integration.CleanRefsOpTest
Running org.locationtech.geogig.test.integration.PullOpTest
Tests run: 4, Failures: 0, Errors: 0, Skipped: 0, Time elapsed: 5.464 sec - in org.locationtech.geogig.test.integration.RemoteListOpTest
Running org.locationtech.geogig.test.integration.FetchOpTest
Tests run: 10, Failures: 0, Errors: 0, Skipped: 0, Time elapsed: 6.167 sec - in org.locationtech.geogig.test.integration.RemoteAddOpTest
Running org.locationtech.geogig.test.integration.SparseCloneTest
Tests run: 5, Failures: 0, Errors: 0, Skipped: 0, Time elapsed: 6.469 sec - in org.locationtech.geogig.test.integration.BranchDeleteOpTest
Running org.locationtech.geogig.test.integration.ConflictsReadWriteOpTest
Tests run: 1, Failures: 0, Errors: 0, Skipped: 0, Time elapsed: 0.085 sec - in org.locationtech.geogig.test.integration.ConflictsReadWriteOpTest
Running org.locationtech.geogig.test.integration.RevParseIntegrationTest
Tests run: 3, Failures: 0, Errors: 0, Skipped: 0, Time elapsed: 6.71 sec - in org.locationtech.geogig.test.integration.TagTest
Running org.locationtech.geogig.test.integration.ApplyPatchOpTest
testMergeTwice
Tests run: 3, Failures: 0, Errors: 0, Skipped: 0, Time elapsed: 7.06 sec - in org.locationtech.geogig.test.integration.RebuildGraphOpTest
Running org.locationtech.geogig.test.integration.BranchRenameOpTest
[main] INFO org.locationtech.geogig.hooks.Scripting - Running jvm script /opt/public/hipp/ramdisk/geogig/junit4774845259122027378/repo316144109/.geogig/hooks/pre_commit.js
testNoFastForwardSpecifyAuthor
Tests run: 8, Failures: 0, Errors: 0, Skipped: 0, Time elapsed: 7.683 sec - in org.locationtech.geogig.test.integration.CreatePatchOpTest
Running org.locationtech.geogig.test.integration.CheckSparsePathTest
[main] INFO org.locationtech.geogig.plumbing.SendPack - Pushing Ref[refs/heads/master -> a3ad4dd3b550a1215e3001faf8071e3448956105] to refs/remotes/origin/NewRemoteBranch(NewRemoteBranch)
[main] INFO org.locationtech.geogig.plumbing.SendPack - Pushing Ref[refs/heads/Branch1 -> 43a3e480cf2de155a4a8a7b4a9030df9a23ab671] to refs/remotes/origin/NewRemoteBranch2(NewRemoteBranch2)
testBothBranchesSameGeometryChange
Tests run: 21, Failures: 0, Errors: 0, Skipped: 0, Time elapsed: 8.089 sec - in org.locationtech.geogig.test.integration.ConfigOpTest
Running org.locationtech.geogig.test.integration.BranchCreateOpTest
[main] INFO org.locationtech.geogig.hooks.Scripting - Running jvm script /opt/public/hipp/ramdisk/geogig/junit4774845259122027378/repo316144109/.geogig/hooks/pre_commit.js
Tests run: 7, Failures: 0, Errors: 0, Skipped: 0, Time elapsed: 1.707 sec - in org.locationtech.geogig.test.integration.RevParseIntegrationTest
Running org.locationtech.geogig.test.integration.RevertOpTest
[main] INFO org.locationtech.geogig.hooks.Scripting - Running jvm script /opt/public/hipp/ramdisk/geogig/junit8310506163252816011/repo-1358424744/.geogig/hooks/post_commit.js
Tests run: 8, Failures: 0, Errors: 0, Skipped: 0, Time elapsed: 1.296 sec - in org.locationtech.geogig.test.integration.BranchRenameOpTest
Running org.locationtech.geogig.test.integration.CommitOpTest
[main] WARN org.locationtech.geogig.hooks.CommandHookChain - Post-command hook org.locationtech.geogig.hooks.JVMScriptHook@63f34b70 for command org.locationtech.geogig.porcelain.CommitOp threw an exception that will not be propagated
java.lang.NullPointerException
	at org.locationtech.geogig.hooks.Scripting.runJVMScript(Scripting.java:93)
	at org.locationtech.geogig.hooks.JVMScriptHook.post(JVMScriptHook.java:52)
	at org.locationtech.geogig.hooks.CommandHookChain.runPostHooks(CommandHookChain.java:65)
	at org.locationtech.geogig.hooks.CommandHooksDecorator$HooksListener.postCall(CommandHooksDecorator.java:60)
	at org.locationtech.geogig.repository.AbstractGeoGigOp.notifyPost(AbstractGeoGigOp.java:178)
	at org.locationtech.geogig.repository.AbstractGeoGigOp.call(AbstractGeoGigOp.java:154)
	at org.locationtech.geogig.test.integration.HooksTest.testFailingPostPostProcessHook(HooksTest.java:148)
	at sun.reflect.NativeMethodAccessorImpl.invoke0(Native Method)
	at sun.reflect.NativeMethodAccessorImpl.invoke(NativeMethodAccessorImpl.java:62)
	at sun.reflect.DelegatingMethodAccessorImpl.invoke(DelegatingMethodAccessorImpl.java:43)
	at java.lang.reflect.Method.invoke(Method.java:498)
	at org.junit.runners.model.FrameworkMethod$1.runReflectiveCall(FrameworkMethod.java:50)
	at org.junit.internal.runners.model.ReflectiveCallable.run(ReflectiveCallable.java:12)
	at org.junit.runners.model.FrameworkMethod.invokeExplosively(FrameworkMethod.java:47)
	at org.junit.internal.runners.statements.InvokeMethod.evaluate(InvokeMethod.java:17)
	at org.junit.internal.runners.statements.RunBefores.evaluate(RunBefores.java:26)
	at org.junit.internal.runners.statements.RunAfters.evaluate(RunAfters.java:27)
	at org.junit.rules.ExternalResource$1.evaluate(ExternalResource.java:48)
	at org.junit.rules.RunRules.evaluate(RunRules.java:20)
	at org.junit.runners.ParentRunner.runLeaf(ParentRunner.java:325)
	at org.junit.runners.BlockJUnit4ClassRunner.runChild(BlockJUnit4ClassRunner.java:78)
	at org.junit.runners.BlockJUnit4ClassRunner.runChild(BlockJUnit4ClassRunner.java:57)
	at org.junit.runners.ParentRunner$3.run(ParentRunner.java:290)
	at org.junit.runners.ParentRunner$1.schedule(ParentRunner.java:71)
	at org.junit.runners.ParentRunner.runChildren(ParentRunner.java:288)
	at org.junit.runners.ParentRunner.access$000(ParentRunner.java:58)
	at org.junit.runners.ParentRunner$2.evaluate(ParentRunner.java:268)
	at org.junit.runners.ParentRunner.run(ParentRunner.java:363)
	at org.apache.maven.surefire.junit4.JUnit4Provider.execute(JUnit4Provider.java:264)
	at org.apache.maven.surefire.junit4.JUnit4Provider.executeTestSet(JUnit4Provider.java:153)
	at org.apache.maven.surefire.junit4.JUnit4Provider.invoke(JUnit4Provider.java:124)
	at org.apache.maven.surefire.booter.ForkedBooter.invokeProviderInSameClassLoader(ForkedBooter.java:200)
	at org.apache.maven.surefire.booter.ForkedBooter.runSuitesInProcess(ForkedBooter.java:153)
	at org.apache.maven.surefire.booter.ForkedBooter.main(ForkedBooter.java:103)
[main] WARN org.locationtech.geogig.hooks.CommandHookChain - Post-command hook org.locationtech.geogig.test.integration.HooksTest$ClasspathHookTest@5c77053b for command org.locationtech.geogig.porcelain.AddOp threw an exception that will not be propagated
java.lang.RuntimeException: expected
	at org.locationtech.geogig.test.integration.HooksTest$ClasspathHookTest.post(HooksTest.java:266)
	at org.locationtech.geogig.hooks.CommandHookChain.runPostHooks(CommandHookChain.java:65)
	at org.locationtech.geogig.hooks.CommandHooksDecorator$HooksListener.postCall(CommandHooksDecorator.java:60)
	at org.locationtech.geogig.repository.AbstractGeoGigOp.notifyPost(AbstractGeoGigOp.java:178)
	at org.locationtech.geogig.repository.AbstractGeoGigOp.call(AbstractGeoGigOp.java:154)
	at org.locationtech.geogig.test.integration.RepositoryTestCase.insertAndAdd(RepositoryTestCase.java:367)
	at org.locationtech.geogig.test.integration.RepositoryTestCase.insertAndAdd(RepositoryTestCase.java:355)
	at org.locationtech.geogig.test.integration.HooksTest.testClasspathHookPostFail(HooksTest.java:191)
	at sun.reflect.NativeMethodAccessorImpl.invoke0(Native Method)
	at sun.reflect.NativeMethodAccessorImpl.invoke(NativeMethodAccessorImpl.java:62)
	at sun.reflect.DelegatingMethodAccessorImpl.invoke(DelegatingMethodAccessorImpl.java:43)
	at java.lang.reflect.Method.invoke(Method.java:498)
	at org.junit.runners.model.FrameworkMethod$1.runReflectiveCall(FrameworkMethod.java:50)
	at org.junit.internal.runners.model.ReflectiveCallable.run(ReflectiveCallable.java:12)
	at org.junit.runners.model.FrameworkMethod.invokeExplosively(FrameworkMethod.java:47)
	at org.junit.internal.runners.statements.InvokeMethod.evaluate(InvokeMethod.java:17)
	at org.junit.internal.runners.statements.RunBefores.evaluate(RunBefores.java:26)
	at org.junit.internal.runners.statements.RunAfters.evaluate(RunAfters.java:27)
	at org.junit.rules.ExternalResource$1.evaluate(ExternalResource.java:48)
	at org.junit.rules.RunRules.evaluate(RunRules.java:20)
	at org.junit.runners.ParentRunner.runLeaf(ParentRunner.java:325)
	at org.junit.runners.BlockJUnit4ClassRunner.runChild(BlockJUnit4ClassRunner.java:78)
	at org.junit.runners.BlockJUnit4ClassRunner.runChild(BlockJUnit4ClassRunner.java:57)
	at org.junit.runners.ParentRunner$3.run(ParentRunner.java:290)
	at org.junit.runners.ParentRunner$1.schedule(ParentRunner.java:71)
	at org.junit.runners.ParentRunner.runChildren(ParentRunner.java:288)
	at org.junit.runners.ParentRunner.access$000(ParentRunner.java:58)
	at org.junit.runners.ParentRunner$2.evaluate(ParentRunner.java:268)
	at org.junit.runners.ParentRunner.run(ParentRunner.java:363)
	at org.apache.maven.surefire.junit4.JUnit4Provider.execute(JUnit4Provider.java:264)
	at org.apache.maven.surefire.junit4.JUnit4Provider.executeTestSet(JUnit4Provider.java:153)
	at org.apache.maven.surefire.junit4.JUnit4Provider.invoke(JUnit4Provider.java:124)
	at org.apache.maven.surefire.booter.ForkedBooter.invokeProviderInSameClassLoader(ForkedBooter.java:200)
	at org.apache.maven.surefire.booter.ForkedBooter.runSuitesInProcess(ForkedBooter.java:153)
	at org.apache.maven.surefire.booter.ForkedBooter.main(ForkedBooter.java:103)
testMergeFastForwardSecondCase
[main] INFO org.locationtech.geogig.plumbing.SendPack - Pushing Ref[refs/heads/master -> a3ad4dd3b550a1215e3001faf8071e3448956105] to refs/remotes/origin/NewRemoteBranch(NewRemoteBranch)
testOctopusMergeWithAutomerge
[main] INFO org.locationtech.geogig.hooks.Scripting - Running shell script /opt/public/hipp/ramdisk/geogig/junit5152340472198257433/repo1227865896/.geogig/hooks/pre_commit.bat
Tests run: 9, Failures: 0, Errors: 0, Skipped: 0, Time elapsed: 9.531 sec - in org.locationtech.geogig.test.integration.repository.IndexTest
[main] INFO org.locationtech.geogig.hooks.Scripting - Running shell script /opt/public/hipp/ramdisk/geogig/junit5152340472198257433/repo1227865896/.geogig/hooks/pre_commit.bat
Running org.locationtech.geogig.test.integration.BlameOpTest
Tests run: 15, Failures: 0, Errors: 0, Skipped: 0, Time elapsed: 9.535 sec - in org.locationtech.geogig.test.integration.GeogigTransactionTest
Running org.locationtech.geogig.test.integration.CherryPickOpTest
Tests run: 10, Failures: 0, Errors: 0, Skipped: 1, Time elapsed: 9.585 sec - in org.locationtech.geogig.test.integration.RemoveOpTest
Running org.locationtech.geogig.test.integration.RemoteRemoveOpTest
Tests run: 20, Failures: 0, Errors: 0, Skipped: 0, Time elapsed: 9.692 sec - in org.locationtech.geogig.test.integration.repository.WorkingTreeTest
Running org.locationtech.geogig.test.integration.SquashOpTest
Tests run: 2, Failures: 0, Errors: 0, Skipped: 0, Time elapsed: 9.782 sec - in org.locationtech.geogig.test.integration.BranchListOpTest
[main] INFO org.locationtech.geogig.hooks.Scripting - Running jvm script /opt/public/hipp/ramdisk/geogig/junit4273304226243813123/repo-803068459/.geogig/hooks/pre_commit.js
Running org.locationtech.geogig.test.integration.GeogigAPITest
testConflictingMergeInterceptor
Tests run: 7, Failures: 0, Errors: 0, Skipped: 0, Time elapsed: 9.895 sec - in org.locationtech.geogig.test.integration.HooksTest
Running org.locationtech.geogig.test.integration.DiffOpTest
Tests run: 5, Failures: 0, Errors: 0, Skipped: 0, Time elapsed: 9.888 sec - in org.locationtech.geogig.test.integration.FindCommonAncestorTest
Running org.locationtech.geogig.test.integration.ReportCommitConflictsOpTest
Tests run: 12, Failures: 0, Errors: 0, Skipped: 0, Time elapsed: 9.936 sec - in org.locationtech.geogig.test.integration.AddOpTest
Running org.locationtech.geogig.test.integration.LogOpTest
Tests run: 2, Failures: 0, Errors: 0, Skipped: 0, Time elapsed: 2.346 sec - in org.locationtech.geogig.test.integration.CheckSparsePathTest
Running org.locationtech.geogig.test.integration.StatusOpTest
testMerge
[main] INFO org.locationtech.geogig.plumbing.SendPack - Pushing Ref[refs/heads/master -> d13557ae0d974dbbc25eb1e98414ea3a2455cc3c] to refs/remotes/origin/refs/heads/master(refs/heads/master)
Tests run: 4, Failures: 0, Errors: 0, Skipped: 0, Time elapsed: 0.558 sec - in org.locationtech.geogig.test.integration.StatusOpTest
Running org.locationtech.geogig.test.integration.CleanOpTest
Tests run: 12, Failures: 0, Errors: 0, Skipped: 0, Time elapsed: 10.603 sec - in org.locationtech.geogig.test.integration.RebaseOpTest
Running org.locationtech.geogig.test.performance.LogOpPerformanceTest
[main] INFO org.locationtech.geogig.test.performance.EnablePerformanceTestRule - org.locationtech.geogig.test.performance.LogOpPerformanceTest ignored, run with -Dgeogig.runPerformanceTests=true to enable it.
testConflictingOctopusMerge
Tests run: 3, Failures: 0, Errors: 0, Skipped: 0, Time elapsed: 0.902 sec - in org.locationtech.geogig.test.integration.GeogigAPITest
Tests run: 0, Failures: 0, Errors: 0, Skipped: 0, Time elapsed: 0.025 sec - in org.locationtech.geogig.test.performance.LogOpPerformanceTest
Running org.locationtech.geogig.test.performance.HeapGraphDatabaseStressTest
[main] INFO org.locationtech.geogig.test.performance.EnablePerformanceTestRule - org.locationtech.geogig.test.performance.HeapGraphDatabaseStressTest ignored, run with -Dgeogig.runPerformanceTests=true to enable it.
Tests run: 0, Failures: 0, Errors: 0, Skipped: 0, Time elapsed: 0.006 sec - in org.locationtech.geogig.test.performance.HeapGraphDatabaseStressTest
Running org.locationtech.geogig.data.MapToStringConverterFactoryTest
Running org.locationtech.geogig.test.performance.RevTreeBuilderPerformanceTest
[main] INFO org.locationtech.geogig.test.performance.EnablePerformanceTestRule - org.locationtech.geogig.test.performance.RevTreeBuilderPerformanceTest ignored, run with -Dgeogig.runPerformanceTests=true to enable it.
Tests run: 0, Failures: 0, Errors: 0, Skipped: 0, Time elapsed: 0.011 sec - in org.locationtech.geogig.test.performance.RevTreeBuilderPerformanceTest
Running org.locationtech.geogig.data.FeatureBuilderTest
Tests run: 1, Failures: 0, Errors: 0, Skipped: 0, Time elapsed: 0.095 sec - in org.locationtech.geogig.data.MapToStringConverterFactoryTest
Tests run: 8, Failures: 0, Errors: 0, Skipped: 0, Time elapsed: 1.18 sec - in org.locationtech.geogig.test.integration.RemoteRemoveOpTest
Running org.locationtech.geogig.data.PrimitiveArrayToStringConverterFactoryTest
Tests run: 7, Failures: 0, Errors: 0, Skipped: 0, Time elapsed: 0.001 sec - in org.locationtech.geogig.data.PrimitiveArrayToStringConverterFactoryTest
Running org.locationtech.geogig.model.impl.LegacyTreeBuilderTest
Running org.locationtech.geogig.model.impl.CanonicalTreeBuilderTest
Tests run: 1, Failures: 0, Errors: 0, Skipped: 0, Time elapsed: 0.102 sec - in org.locationtech.geogig.data.FeatureBuilderTest
Tests run: 6, Failures: 0, Errors: 0, Skipped: 0, Time elapsed: 1.346 sec - in org.locationtech.geogig.test.integration.BlameOpTest
Running org.locationtech.geogig.model.impl.RevFeatureTest
Running org.locationtech.geogig.model.impl.RevFeatureTypeTest
Tests run: 2, Failures: 0, Errors: 0, Skipped: 0, Time elapsed: 0.022 sec - in org.locationtech.geogig.model.impl.RevFeatureTest
Running org.locationtech.geogig.model.impl.RevPersonTest
Tests run: 3, Failures: 0, Errors: 0, Skipped: 0, Time elapsed: 0 sec - in org.locationtech.geogig.model.impl.RevPersonTest
Running org.locationtech.geogig.model.impl.RevCommitImplTest
Tests run: 2, Failures: 0, Errors: 0, Skipped: 0, Time elapsed: 0.002 sec - in org.locationtech.geogig.model.impl.RevCommitImplTest
Running org.locationtech.geogig.model.impl.CommitBuilderTest
Tests run: 6, Failures: 0, Errors: 0, Skipped: 0, Time elapsed: 0.081 sec - in org.locationtech.geogig.model.impl.CommitBuilderTest
Running org.locationtech.geogig.model.internal.DAGNodeTest
Tests run: 11, Failures: 0, Errors: 0, Skipped: 0, Time elapsed: 3.046 sec - in org.locationtech.geogig.test.integration.BranchCreateOpTest
Running org.locationtech.geogig.model.internal.CanonicalClusteringStrategyRocksdbStorageTest
Tests run: 2, Failures: 0, Errors: 0, Skipped: 0, Time elapsed: 0.334 sec - in org.locationtech.geogig.model.impl.RevFeatureTypeTest
testFastForwardOnly
Running org.locationtech.geogig.model.internal.QuadTreeBuilderTest
Tests run: 1, Failures: 0, Errors: 0, Skipped: 1, Time elapsed: 0 sec - in org.locationtech.geogig.model.internal.QuadTreeBuilderTest
Tests run: 13, Failures: 0, Errors: 0, Skipped: 0, Time elapsed: 11.316 sec - in org.locationtech.geogig.test.integration.ResetOpTest
Running org.locationtech.geogig.model.internal.CanonicalClusteringStrategyHeapStorageTest
Running org.locationtech.geogig.plumbing.diff.GeometryDiffTest
[main] INFO org.locationtech.geogig.plumbing.SendPack - Pushing Ref[refs/heads/master -> a3ad4dd3b550a1215e3001faf8071e3448956105] to refs/remotes/origin/master(null)
Tests run: 3, Failures: 0, Errors: 0, Skipped: 0, Time elapsed: 0.73 sec - in org.locationtech.geogig.test.integration.CleanOpTest
testSpecifyAuthor
Running org.locationtech.geogig.plumbing.diff.DiffCountConsumerTest
Tests run: 7, Failures: 0, Errors: 0, Skipped: 1, Time elapsed: 1.869 sec - in org.locationtech.geogig.test.integration.CherryPickOpTest
Running org.locationtech.geogig.plumbing.diff.MutableTreeTest
Tests run: 14, Failures: 0, Errors: 0, Skipped: 0, Time elapsed: 0.276 sec - in org.locationtech.geogig.plumbing.diff.GeometryDiffTest
Running org.locationtech.geogig.plumbing.diff.TreeDifferenceTest
Tests run: 7, Failures: 0, Errors: 0, Skipped: 0, Time elapsed: 0.052 sec - in org.locationtech.geogig.plumbing.diff.MutableTreeTest
Running org.locationtech.geogig.plumbing.diff.PatchSerializationTest
Tests run: 13, Failures: 0, Errors: 0, Skipped: 0, Time elapsed: 11.753 sec - in org.locationtech.geogig.test.integration.ReportMergeConflictsOpTest
Running org.locationtech.geogig.plumbing.diff.DepthTreeIteratorTest
Tests run: 7, Failures: 0, Errors: 0, Skipped: 0, Time elapsed: 0.154 sec - in org.locationtech.geogig.plumbing.diff.TreeDifferenceTest
Running org.locationtech.geogig.plumbing.diff.AttributeDiffTest
Tests run: 4, Failures: 0, Errors: 0, Skipped: 0, Time elapsed: 0.005 sec - in org.locationtech.geogig.plumbing.diff.AttributeDiffTest
Running org.locationtech.geogig.plumbing.diff.PostOrderDiffWalkTest
Tests run: 18, Failures: 0, Errors: 0, Skipped: 0, Time elapsed: 5.146 sec - in org.locationtech.geogig.test.integration.ApplyPatchOpTest
testOursAndTheirs
Running org.locationtech.geogig.plumbing.diff.PreOrderDiffWalkTest
Tests run: 10, Failures: 0, Errors: 0, Skipped: 0, Time elapsed: 11.891 sec - in org.locationtech.geogig.test.integration.LsTreeOpTest
Running org.locationtech.geogig.plumbing.HashObjectTest
[main] INFO org.locationtech.geogig.plumbing.SendPack - Pushing Ref[refs/heads/master -> a3ad4dd3b550a1215e3001faf8071e3448956105] to refs/remotes/origin/master(null)
[main] INFO org.locationtech.geogig.plumbing.SendPack - Pushing Ref[refs/heads/Branch1 -> e4d10fce0f71850b8e201763343ebde1c71aa5f6] to refs/remotes/origin/Branch1(null)
testNoCommitMerge
Tests run: 10, Failures: 0, Errors: 0, Skipped: 0, Time elapsed: 2.371 sec - in org.locationtech.geogig.test.integration.ReportCommitConflictsOpTest
Tests run: 15, Failures: 0, Errors: 0, Skipped: 0, Time elapsed: 4.052 sec - in org.locationtech.geogig.test.integration.RevertOpTest
Running org.locationtech.geogig.plumbing.DiffTreeTest
Running org.locationtech.geogig.plumbing.DiffFeatureTest
Tests run: 8, Failures: 0, Errors: 0, Skipped: 0, Time elapsed: 0.799 sec - in org.locationtech.geogig.plumbing.diff.PatchSerializationTest
Running org.locationtech.geogig.plumbing.UpdateRefTest
Tests run: 4, Failures: 0, Errors: 0, Skipped: 0, Time elapsed: 1.308 sec - in org.locationtech.geogig.model.internal.DAGNodeTest
Running org.locationtech.geogig.plumbing.RevParseTest
testMergeFastForward
testOctopusMergeSameFeatureChanges

Tests run: 5, Failures: 0, Errors: 0, Skipped: 0, Time elapsed: 0.788 sec - in org.locationtech.geogig.plumbing.UpdateRefTest
pp	0 point(s) deleted, 0 new point(s) added, 1 point(s) moved
sp	StringProp1_1 -> StringProp1_1a
ip	1000 -> 1001

Running org.locationtech.geogig.plumbing.merge.MergeFeaturesOpTest
Tests run: 4, Failures: 0, Errors: 0, Skipped: 0, Time elapsed: 0.813 sec - in org.locationtech.geogig.plumbing.DiffFeatureTest
Running org.locationtech.geogig.plumbing.merge.MergeStatusBuilderDiffEntrySerializerTest
testMergeNullCommit
testMergeMultiple
Tests run: 21, Failures: 0, Errors: 0, Skipped: 0, Time elapsed: 13.474 sec - in org.locationtech.geogig.test.integration.CheckoutOpTest
Running org.locationtech.geogig.plumbing.WalkGraphOpTest
[main] INFO org.locationtech.geogig.plumbing.SendPack - Pushing Ref[refs/heads/Branch1 -> b9ffcf8d172b8905500e906f2218c55b58cf2c44] to refs/remotes/origin/Branch1(Branch1)
Tests run: 5, Failures: 0, Errors: 0, Skipped: 0, Time elapsed: 0.465 sec - in org.locationtech.geogig.plumbing.merge.MergeStatusBuilderDiffEntrySerializerTest
Running org.locationtech.geogig.plumbing.ResolveFeatureTypeTest
Tests run: 1, Failures: 0, Errors: 0, Skipped: 0, Time elapsed: 0.566 sec - in org.locationtech.geogig.plumbing.merge.MergeFeaturesOpTest
Running org.locationtech.geogig.plumbing.RefParseTest
testMergeConflictingPolygon
Tests run: 5, Failures: 0, Errors: 0, Skipped: 0, Time elapsed: 0.655 sec - in org.locationtech.geogig.plumbing.ResolveFeatureTypeTest
Running org.locationtech.geogig.plumbing.WriteTree2Test
Excaption caught executing task: 
java.lang.IllegalStateException: java.lang.IllegalStateException: Object NodeRef[Points/Points.1 -> a47ca38e5c3e92c94dec9e8ea597c642003ec878] not found.
	at sun.reflect.NativeConstructorAccessorImpl.newInstance0(Native Method)
	at sun.reflect.NativeConstructorAccessorImpl.newInstance(NativeConstructorAccessorImpl.java:62)
	at sun.reflect.DelegatingConstructorAccessorImpl.newInstance(DelegatingConstructorAccessorImpl.java:45)
	at java.lang.reflect.Constructor.newInstance(Constructor.java:423)
	at java.util.concurrent.ForkJoinTask.getThrowableException(ForkJoinTask.java:593)
	at java.util.concurrent.ForkJoinTask.reportException(ForkJoinTask.java:677)
	at java.util.concurrent.ForkJoinTask.join(ForkJoinTask.java:720)
	at java.util.concurrent.ForkJoinPool.invoke(ForkJoinPool.java:2616)
	at org.locationtech.geogig.plumbing.diff.PreOrderDiffWalk.walk(PreOrderDiffWalk.java:304)
	at org.locationtech.geogig.plumbing.WalkGraphOp._call(WalkGraphOp.java:154)
	at org.locationtech.geogig.plumbing.WalkGraphOp._call(WalkGraphOp.java:33)
	at org.locationtech.geogig.repository.AbstractGeoGigOp.call(AbstractGeoGigOp.java:153)
	at org.locationtech.geogig.plumbing.WalkGraphOpTest.testObjectDoesNotExist(WalkGraphOpTest.java:179)
	at sun.reflect.NativeMethodAccessorImpl.invoke0(Native Method)
	at sun.reflect.NativeMethodAccessorImpl.invoke(NativeMethodAccessorImpl.java:62)
	at sun.reflect.DelegatingMethodAccessorImpl.invoke(DelegatingMethodAccessorImpl.java:43)
	at java.lang.reflect.Method.invoke(Method.java:498)
	at org.junit.runners.model.FrameworkMethod$1.runReflectiveCall(FrameworkMethod.java:50)
	at org.junit.internal.runners.model.ReflectiveCallable.run(ReflectiveCallable.java:12)
	at org.junit.runners.model.FrameworkMethod.invokeExplosively(FrameworkMethod.java:47)
	at org.junit.internal.runners.statements.InvokeMethod.evaluate(InvokeMethod.java:17)
	at org.junit.internal.runners.statements.RunBefores.evaluate(RunBefores.java:26)
	at org.junit.internal.runners.statements.RunAfters.evaluate(RunAfters.java:27)
	at org.junit.rules.ExpectedException$ExpectedExceptionStatement.evaluate(ExpectedException.java:239)
	at org.junit.rules.ExternalResource$1.evaluate(ExternalResource.java:48)
	at org.junit.rules.RunRules.evaluate(RunRules.java:20)
	at org.junit.runners.ParentRunner.runLeaf(ParentRunner.java:325)
	at org.junit.runners.BlockJUnit4ClassRunner.runChild(BlockJUnit4ClassRunner.java:78)
	at org.junit.runners.BlockJUnit4ClassRunner.runChild(BlockJUnit4ClassRunner.java:57)
	at org.junit.runners.ParentRunner$3.run(ParentRunner.java:290)
	at org.junit.runners.ParentRunner$1.schedule(ParentRunner.java:71)
	at org.junit.runners.ParentRunner.runChildren(ParentRunner.java:288)
	at org.junit.runners.ParentRunner.access$000(ParentRunner.java:58)
	at org.junit.runners.ParentRunner$2.evaluate(ParentRunner.java:268)
	at org.junit.runners.ParentRunner.run(ParentRunner.java:363)
	at org.apache.maven.surefire.junit4.JUnit4Provider.execute(JUnit4Provider.java:264)
	at org.apache.maven.surefire.junit4.JUnit4Provider.executeTestSet(JUnit4Provider.java:153)
	at org.apache.maven.surefire.junit4.JUnit4Provider.invoke(JUnit4Provider.java:124)
	at org.apache.maven.surefire.booter.ForkedBooter.invokeProviderInSameClassLoader(ForkedBooter.java:200)
	at org.apache.maven.surefire.booter.ForkedBooter.runSuitesInProcess(ForkedBooter.java:153)
	at org.apache.maven.surefire.booter.ForkedBooter.main(ForkedBooter.java:103)
Caused by: java.lang.IllegalStateException: Object NodeRef[Points/Points.1 -> a47ca38e5c3e92c94dec9e8ea597c642003ec878] not found.
	at org.locationtech.geogig.plumbing.WalkGraphOp$1.checkExists(WalkGraphOp.java:149)
	at org.locationtech.geogig.plumbing.WalkGraphOp$1.feature(WalkGraphOp.java:122)
	at org.locationtech.geogig.plumbing.diff.PreOrderDiffWalk$CancellableConsumer.feature(PreOrderDiffWalk.java:1277)
	at org.locationtech.geogig.plumbing.diff.PreOrderDiffWalk$WalkAction.node(PreOrderDiffWalk.java:601)
	at org.locationtech.geogig.plumbing.diff.PreOrderDiffWalk$TraverseLeafLeaf.compute(PreOrderDiffWalk.java:804)
	at org.locationtech.geogig.plumbing.diff.PreOrderDiffWalk$TraverseTreeContents.compute(PreOrderDiffWalk.java:710)
	at org.locationtech.geogig.plumbing.diff.PreOrderDiffWalk$TraverseTree.compute(PreOrderDiffWalk.java:666)
	at java.util.concurrent.RecursiveAction.exec(RecursiveAction.java:189)
	at java.util.concurrent.ForkJoinTask.doExec(ForkJoinTask.java:289)
	at java.util.concurrent.ForkJoinTask.doInvoke(ForkJoinTask.java:401)
	at java.util.concurrent.ForkJoinTask.invokeAll(ForkJoinTask.java:843)
	at org.locationtech.geogig.plumbing.diff.PreOrderDiffWalk$TraverseLeafLeaf.compute(PreOrderDiffWalk.java:811)
	at org.locationtech.geogig.plumbing.diff.PreOrderDiffWalk$TraverseTreeContents.compute(PreOrderDiffWalk.java:710)
	at org.locationtech.geogig.plumbing.diff.PreOrderDiffWalk$TraverseTree.compute(PreOrderDiffWalk.java:666)
	at java.util.concurrent.RecursiveAction.exec(RecursiveAction.java:189)
	at java.util.concurrent.ForkJoinTask.doExec(ForkJoinTask.java:289)
	at java.util.concurrent.ForkJoinPool$WorkQueue.runTask(ForkJoinPool.java:1056)
	at java.util.concurrent.ForkJoinPool.runWorker(ForkJoinPool.java:1692)
	at java.util.concurrent.ForkJoinWorkerThread.run(ForkJoinWorkerThread.java:157)
Tests run: 7, Failures: 0, Errors: 0, Skipped: 0, Time elapsed: 0.846 sec - in org.locationtech.geogig.plumbing.WalkGraphOpTest
Running org.locationtech.geogig.plumbing.UpdateIndexTest
Tests run: 1, Failures: 0, Errors: 0, Skipped: 0, Time elapsed: 0.125 sec - in org.locationtech.geogig.plumbing.UpdateIndexTest
Running org.locationtech.geogig.plumbing.DiffBoundsTest
Tests run: 7, Failures: 0, Errors: 0, Skipped: 0, Time elapsed: 2.69 sec - in org.locationtech.geogig.plumbing.HashObjectTest
Running org.locationtech.geogig.plumbing.CheckRefFormatTest
testMergeConflictingBranchesTheirs
Tests run: 8, Failures: 0, Errors: 0, Skipped: 0, Time elapsed: 2.333 sec - in org.locationtech.geogig.plumbing.RevParseTest
Running org.locationtech.geogig.plumbing.UpdateSymRefTest
Tests run: 5, Failures: 0, Errors: 0, Skipped: 0, Time elapsed: 1.104 sec - in org.locationtech.geogig.plumbing.RefParseTest
Running org.locationtech.geogig.plumbing.ResolveGeogigURITest
Tests run: 1, Failures: 0, Errors: 0, Skipped: 0, Time elapsed: 0.089 sec - in org.locationtech.geogig.plumbing.ResolveGeogigURITest
Running org.locationtech.geogig.plumbing.UpdateTreeTest
[main] INFO org.locationtech.geogig.plumbing.SendPack - Pushing Ref[refs/heads/master -> b2e392a358773a01efe3ec48a3580362a7fc83d0] to refs/remotes/origin/refs/heads/master(refs/heads/master)
Tests run: 2, Failures: 0, Errors: 0, Skipped: 0, Time elapsed: 0.34 sec - in org.locationtech.geogig.plumbing.CheckRefFormatTest
Running org.locationtech.geogig.plumbing.CatObjectTest
testMergeWithFeatureMerge
testMergeNoCommitMessage
Tests run: 5, Failures: 0, Errors: 0, Skipped: 0, Time elapsed: 0.653 sec - in org.locationtech.geogig.plumbing.UpdateSymRefTest
Running org.locationtech.geogig.plumbing.ResolveRepositoryNameTest
Tests run: 7, Failures: 0, Errors: 0, Skipped: 0, Time elapsed: 0.489 sec - in org.locationtech.geogig.plumbing.UpdateTreeTest
Running org.locationtech.geogig.plumbing.DescribeFeatureTypeTest
Tests run: 26, Failures: 0, Errors: 0, Skipped: 0, Time elapsed: 6.794 sec - in org.locationtech.geogig.test.integration.CommitOpTest
Running org.locationtech.geogig.plumbing.ParseTimestampTest
Tests run: 14, Failures: 0, Errors: 0, Skipped: 0, Time elapsed: 5.807 sec - in org.locationtech.geogig.test.integration.SquashOpTest
left : Tree[c932cbd11ec75bcc145e2a362a3199bb85eb3abc; size=7; subtrees=2, buckets=0, features=0]
	[BoundedTreeNode[buildings -> a400000000000000000000000000000000000000], BoundedTreeNode[roads -> ff488999ad51848c7850ffd4d12568a3125172b0]]
	[]
right: Tree[8996d6e4437a8d8ea41ffc1f32cfaab9bf9de384; size=5; subtrees=1, buckets=0, features=0]
	[BoundedTreeNode[roads -> 72e2f547f3adc30edd55733abb885e8e6de1f1a4]]
	[]
Running org.locationtech.geogig.storage.memory.HeapBlobStoreTest
Tests run: 7, Failures: 0, Errors: 0, Skipped: 0, Time elapsed: 0.064 sec - in org.locationtech.geogig.storage.memory.HeapBlobStoreTest
Running org.locationtech.geogig.storage.memory.HeapConflictsDatabaseConformanceTest
Tests run: 2, Failures: 0, Errors: 0, Skipped: 0, Time elapsed: 0.174 sec - in org.locationtech.geogig.plumbing.DescribeFeatureTypeTest
Running org.locationtech.geogig.storage.memory.HeapRefDatabaseTest
Tests run: 8, Failures: 0, Errors: 0, Skipped: 0, Time elapsed: 15.559 sec - in org.locationtech.geogig.test.integration.CloneOpTest
Tests run: 2, Failures: 0, Errors: 0, Skipped: 0, Time elapsed: 0.184 sec - in org.locationtech.geogig.plumbing.ParseTimestampTest
Running org.locationtech.geogig.storage.memory.HeapObjectStoreConformanceTest
Running org.locationtech.geogig.storage.memory.HeapGraphDatabaseTest
Tests run: 11, Failures: 0, Errors: 0, Skipped: 0, Time elapsed: 0.11 sec - in org.locationtech.geogig.storage.memory.HeapRefDatabaseTest
Running org.locationtech.geogig.storage.impl.PersistedIterableTest
Tests run: 10, Failures: 0, Errors: 0, Skipped: 0, Time elapsed: 0.078 sec - in org.locationtech.geogig.storage.memory.HeapGraphDatabaseTest
Running org.locationtech.geogig.storage.impl.INIBlobTest
Tests run: 2, Failures: 0, Errors: 0, Skipped: 0, Time elapsed: 0.068 sec - in org.locationtech.geogig.storage.impl.PersistedIterableTest
Running org.locationtech.geogig.storage.datastream.VarintTest
Tests run: 2, Failures: 0, Errors: 0, Skipped: 0, Time elapsed: 0.368 sec - in org.locationtech.geogig.plumbing.ResolveRepositoryNameTest
Running org.locationtech.geogig.storage.datastream.DataStreamFeatureV2SerializationTest
Tests run: 1, Failures: 0, Errors: 0, Skipped: 0, Time elapsed: 0.125 sec - in org.locationtech.geogig.storage.impl.INIBlobTest
Running org.locationtech.geogig.storage.datastream.DataStreamV2RevTreeSerializationTest
Tests run: 3, Failures: 0, Errors: 0, Skipped: 0, Time elapsed: 0.078 sec - in org.locationtech.geogig.storage.datastream.DataStreamFeatureV2SerializationTest
Running org.locationtech.geogig.storage.datastream.DataStreamFeatureV2_1SerializationTest
Tests run: 4, Failures: 0, Errors: 0, Skipped: 0, Time elapsed: 0.182 sec - in org.locationtech.geogig.storage.datastream.VarintTest
Running org.locationtech.geogig.storage.datastream.DataStreamV2CommitSerializationTest
Tests run: 23, Failures: 0, Errors: 0, Skipped: 0, Time elapsed: 0.366 sec - in org.locationtech.geogig.storage.memory.HeapObjectStoreConformanceTest
Running org.locationtech.geogig.storage.datastream.DataStreamRevTreeSerializationTest
testMergeTwoBranchesWithNewFeatureType
Tests run: 7, Failures: 0, Errors: 0, Skipped: 0, Time elapsed: 0.177 sec - in org.locationtech.geogig.storage.datastream.DataStreamV2RevTreeSerializationTest
Running org.locationtech.geogig.storage.datastream.DataStreamCommitSerializationTest
Tests run: 8, Failures: 0, Errors: 0, Skipped: 0, Time elapsed: 0.115 sec - in org.locationtech.geogig.storage.datastream.DataStreamV2CommitSerializationTest
Running org.locationtech.geogig.storage.datastream.DataStreamFeatureSerializationTest
Tests run: 8, Failures: 0, Errors: 0, Skipped: 0, Time elapsed: 0.095 sec - in org.locationtech.geogig.storage.datastream.DataStreamCommitSerializationTest
Running org.locationtech.geogig.storage.fs.FileConflictsDatabaseConformanceTest
Tests run: 7, Failures: 0, Errors: 0, Skipped: 0, Time elapsed: 0.163 sec - in org.locationtech.geogig.storage.datastream.DataStreamRevTreeSerializationTest
Running org.locationtech.geogig.storage.fs.FileBlobStoreTest
Tests run: 9, Failures: 0, Errors: 0, Skipped: 0, Time elapsed: 4.827 sec - in org.locationtech.geogig.plumbing.diff.DiffCountConsumerTest
Running org.locationtech.geogig.storage.fs.FileRefDatabaseTest
Tests run: 3, Failures: 0, Errors: 0, Skipped: 0, Time elapsed: 0.343 sec - in org.locationtech.geogig.storage.datastream.DataStreamFeatureV2_1SerializationTest
Tests run: 7, Failures: 0, Errors: 0, Skipped: 0, Time elapsed: 0.104 sec - in org.locationtech.geogig.storage.fs.FileBlobStoreTest
Running org.locationtech.geogig.storage.fs.IniFileConfigDatabaseTest
Running org.locationtech.geogig.storage.text.RevTreeTextSerialiationTest
Tests run: 21, Failures: 0, Errors: 0, Skipped: 0, Time elapsed: 6.524 sec - in org.locationtech.geogig.test.integration.DiffOpTest
Running org.locationtech.geogig.storage.text.RevCommitTextSerializationTest
[main] INFO org.locationtech.geogig.plumbing.SendPack - Pushing Ref[refs/heads/Branch1 -> b9ffcf8d172b8905500e906f2218c55b58cf2c44] to refs/remotes/origin/Branch1(Branch1)
Tests run: 3, Failures: 0, Errors: 0, Skipped: 0, Time elapsed: 0.301 sec - in org.locationtech.geogig.storage.datastream.DataStreamFeatureSerializationTest
Running org.locationtech.geogig.storage.text.RevFeatureTextSerializationTest
Tests run: 7, Failures: 0, Errors: 0, Skipped: 0, Time elapsed: 0.114 sec - in org.locationtech.geogig.storage.text.RevTreeTextSerialiationTest
Running org.locationtech.geogig.storage.text.RevFeatureTypeTextSerializationTest
Tests run: 11, Failures: 0, Errors: 0, Skipped: 0, Time elapsed: 0.208 sec - in org.locationtech.geogig.storage.fs.FileRefDatabaseTest
Running org.locationtech.geogig.porcelain.InitOpTest
Removed 32,600 nodes in 2.431 s
Tests run: 9, Failures: 0, Errors: 0, Skipped: 0, Time elapsed: 0.149 sec - in org.locationtech.geogig.storage.text.RevCommitTextSerializationTest
Tests run: 2, Failures: 0, Errors: 0, Skipped: 0, Time elapsed: 0.088 sec - in org.locationtech.geogig.storage.text.RevFeatureTypeTextSerializationTest
Running org.locationtech.geogig.repository.impl.DepthSearchTest
Running org.locationtech.geogig.repository.impl.RepositoryResolverTest
Tests run: 1, Failures: 0, Errors: 0, Skipped: 0, Time elapsed: 0.003 sec - in org.locationtech.geogig.repository.impl.RepositoryResolverTest
Running org.locationtech.geogig.repository.impl.RevFeatureBuilderTest
testCancelScenario1
Tests run: 14, Failures: 0, Errors: 0, Skipped: 0, Time elapsed: 1.098 sec - in org.locationtech.geogig.storage.memory.HeapConflictsDatabaseConformanceTest
Running org.locationtech.geogig.di.caching.CachingModuleTest
Tests run: 17, Failures: 0, Errors: 0, Skipped: 0, Time elapsed: 6.794 sec - in org.locationtech.geogig.test.integration.LogOpTest
Tests run: 5, Failures: 0, Errors: 0, Skipped: 0, Time elapsed: 0.368 sec - in org.locationtech.geogig.storage.text.RevFeatureTextSerializationTest
Tests run: 1, Failures: 0, Errors: 0, Skipped: 0, Time elapsed: 0.3 sec - in org.locationtech.geogig.repository.impl.DepthSearchTest
Tests run: 3, Failures: 0, Errors: 0, Skipped: 0, Time elapsed: 1.853 sec - in org.locationtech.geogig.plumbing.CatObjectTest
Tests run: 23, Failures: 0, Errors: 0, Skipped: 0, Time elapsed: 0.777 sec - in org.locationtech.geogig.storage.fs.IniFileConfigDatabaseTest
Tests run: 7, Failures: 0, Errors: 0, Skipped: 0, Time elapsed: 5.52 sec - in org.locationtech.geogig.plumbing.diff.PostOrderDiffWalkTest
Tests run: 4, Failures: 0, Errors: 0, Skipped: 0, Time elapsed: 1.049 sec - in org.locationtech.geogig.porcelain.InitOpTest
Tests run: 8, Failures: 0, Errors: 0, Skipped: 0, Time elapsed: 0.944 sec - in org.locationtech.geogig.repository.impl.RevFeatureBuilderTest
Tests run: 15, Failures: 0, Errors: 0, Skipped: 0, Time elapsed: 3.228 sec - in org.locationtech.geogig.plumbing.WriteTree2Test
Added 7,000 nodes in 142.3 ms
testCancelScenario2
Tests run: 3, Failures: 0, Errors: 0, Skipped: 0, Time elapsed: 1.208 sec - in org.locationtech.geogig.di.caching.CachingModuleTest
Removed 32,600 nodes in 3.278 s
testCancelScenario3
testCancelScenario4
Tests run: 8, Failures: 0, Errors: 0, Skipped: 0, Time elapsed: 12.822 sec - in org.locationtech.geogig.test.integration.PullOpTest
Added 5,000 nodes in 28.27 ms
[main] INFO org.locationtech.geogig.plumbing.SendPack - Pushing Ref[refs/heads/master -> a3ad4dd3b550a1215e3001faf8071e3448956105] to refs/remotes/origin/master(null)
testNoFastForward
Added 1,024 nodes in Tests run: 11, Failures: 0, Errors: 0, Skipped: 0, Time elapsed: 6.267 sec - in org.locationtech.geogig.plumbing.DiffTreeTest
29.74 ms
Removed 400 nodes in 2.442 ms
testMergeConflictingBranches
testMergeConflictingBranchesOurs
Added 7,000 nodes in 263.7 ms
Tests run: 30, Failures: 0, Errors: 0, Skipped: 0, Time elapsed: 18.878 sec - in org.locationtech.geogig.test.integration.MergeOpTest
Added 10,000 nodes in 194.8 ms
Tests run: 11, Failures: 0, Errors: 0, Skipped: 0, Time elapsed: 7.803 sec - in org.locationtech.geogig.model.internal.CanonicalClusteringStrategyHeapStorageTest
[main] INFO org.locationtech.geogig.plumbing.SendPack - Pushing Ref[refs/heads/master -> a3ad4dd3b550a1215e3001faf8071e3448956105] to refs/remotes/origin/master(null)
Tests run: 11, Failures: 0, Errors: 0, Skipped: 0, Time elapsed: 19.39 sec - in org.locationtech.geogig.test.integration.PushOpTest
Tests run: 14, Failures: 0, Errors: 0, Skipped: 0, Time elapsed: 3.385 sec - in org.locationtech.geogig.storage.fs.FileConflictsDatabaseConformanceTest
[main] INFO org.locationtech.geogig.plumbing.SendPack - Pushing Ref[refs/heads/master -> 32b4e258bf8026e45ba1c2ace4a1f36e15b862a1] to refs/remotes/origin/master(null)
Tests run: 6, Failures: 0, Errors: 0, Skipped: 0, Time elapsed: 6.091 sec - in org.locationtech.geogig.plumbing.DiffBoundsTest
Added 5,000 nodes in 58.41 ms
Tests run: 15, Failures: 0, Errors: 0, Skipped: 0, Time elapsed: 15.277 sec - in org.locationtech.geogig.test.integration.FetchOpTest
Tests run: 12, Failures: 0, Errors: 0, Skipped: 0, Time elapsed: 14.605 sec - in org.locationtech.geogig.test.integration.SparseCloneTest
Added 1,024 nodes in 4.332 ms
Removed 400 nodes in 3.384 ms
Added 10,000 nodes in 86.26 ms
Tests run: 11, Failures: 0, Errors: 0, Skipped: 0, Time elapsed: 9.981 sec - in org.locationtech.geogig.model.internal.CanonicalClusteringStrategyRocksdbStorageTest
Tests run: 7, Failures: 0, Errors: 0, Skipped: 0, Time elapsed: 15.792 sec - in org.locationtech.geogig.plumbing.diff.DepthTreeIteratorTest
PreOrderDiffWalkTest: walked 524,288 vs 262144 trees in 230.9 ms
Tests run: 13, Failures: 0, Errors: 0, Skipped: 0, Time elapsed: 17.996 sec - in org.locationtech.geogig.model.impl.CanonicalTreeBuilderTest
PreOrderDiffWalkTest: walked 1,024 vs 512 trees in 12.97 ms
PreOrderDiffWalkTest: walked 16,384 vs 512 trees in 143.2 ms
Tests run: 24, Failures: 0, Errors: 0, Skipped: 0, Time elapsed: 17.995 sec - in org.locationtech.geogig.plumbing.diff.PreOrderDiffWalkTest
Tests run: 13, Failures: 0, Errors: 0, Skipped: 0, Time elapsed: 20.02 sec - in org.locationtech.geogig.model.impl.LegacyTreeBuilderTest

Results :

Tests run: 943, Failures: 0, Errors: 0, Skipped: 3

[JENKINS] Recording test results
[INFO] 
[INFO] --- maven-jar-plugin:2.4:jar (default-jar) @ geogig-core ---
[INFO] Building jar: /home/hudson/genie.geogig/.hudson/jobs/geogig-1.0.x/workspace/src/core/target/geogig-core-1.0-SNAPSHOT.jar
[INFO] 
[INFO] --- maven-jar-plugin:2.4:test-jar (default) @ geogig-core ---
[INFO] Building jar: /home/hudson/genie.geogig/.hudson/jobs/geogig-1.0.x/workspace/src/core/target/geogig-core-1.0-SNAPSHOT-tests.jar
[INFO] 
[INFO] >>> maven-source-plugin:2.2.1:jar (attach-sources) > generate-sources @ geogig-core >>>
[INFO] 
[INFO] --- git-commit-id-plugin:2.1.8:revision (default) @ geogig-core ---
[WARNING] Failed to getClass for org.apache.maven.plugin.source.SourceJarMojo
[INFO] 
[INFO] <<< maven-source-plugin:2.2.1:jar (attach-sources) < generate-sources @ geogig-core <<<
[INFO] 
[INFO] --- maven-source-plugin:2.2.1:jar (attach-sources) @ geogig-core ---
[INFO] Building jar: /home/hudson/genie.geogig/.hudson/jobs/geogig-1.0.x/workspace/src/core/target/geogig-core-1.0-SNAPSHOT-sources.jar
[INFO] 
[INFO] >>> maven-source-plugin:2.2.1:test-jar (attach-sources) > generate-sources @ geogig-core >>>
[INFO] 
[INFO] --- git-commit-id-plugin:2.1.8:revision (default) @ geogig-core ---
[WARNING] Failed to getClass for org.apache.maven.plugin.source.TestSourceJarMojo
[INFO] 
[INFO] <<< maven-source-plugin:2.2.1:test-jar (attach-sources) < generate-sources @ geogig-core <<<
[INFO] 
[INFO] --- maven-source-plugin:2.2.1:test-jar (attach-sources) @ geogig-core ---
[INFO] Building jar: /home/hudson/genie.geogig/.hudson/jobs/geogig-1.0.x/workspace/src/core/target/geogig-core-1.0-SNAPSHOT-test-sources.jar
[INFO] 
[INFO] --- maven-install-plugin:2.4:install (default-install) @ geogig-core ---
[INFO] Installing /home/hudson/genie.geogig/.hudson/jobs/geogig-1.0.x/workspace/src/core/target/geogig-core-1.0-SNAPSHOT.jar to /home/hudson/genie.geogig/.hudson/jobs/geogig-1.0.x/workspace/.repository/org/locationtech/geogig/geogig-core/1.0-SNAPSHOT/geogig-core-1.0-SNAPSHOT.jar
[INFO] Installing /home/hudson/genie.geogig/.hudson/jobs/geogig-1.0.x/workspace/src/core/pom.xml to /home/hudson/genie.geogig/.hudson/jobs/geogig-1.0.x/workspace/.repository/org/locationtech/geogig/geogig-core/1.0-SNAPSHOT/geogig-core-1.0-SNAPSHOT.pom
[INFO] Installing /home/hudson/genie.geogig/.hudson/jobs/geogig-1.0.x/workspace/src/core/target/geogig-core-1.0-SNAPSHOT-tests.jar to /home/hudson/genie.geogig/.hudson/jobs/geogig-1.0.x/workspace/.repository/org/locationtech/geogig/geogig-core/1.0-SNAPSHOT/geogig-core-1.0-SNAPSHOT-tests.jar
[INFO] Installing /home/hudson/genie.geogig/.hudson/jobs/geogig-1.0.x/workspace/src/core/target/geogig-core-1.0-SNAPSHOT-sources.jar to /home/hudson/genie.geogig/.hudson/jobs/geogig-1.0.x/workspace/.repository/org/locationtech/geogig/geogig-core/1.0-SNAPSHOT/geogig-core-1.0-SNAPSHOT-sources.jar
[INFO] Installing /home/hudson/genie.geogig/.hudson/jobs/geogig-1.0.x/workspace/src/core/target/geogig-core-1.0-SNAPSHOT-test-sources.jar to /home/hudson/genie.geogig/.hudson/jobs/geogig-1.0.x/workspace/.repository/org/locationtech/geogig/geogig-core/1.0-SNAPSHOT/geogig-core-1.0-SNAPSHOT-test-sources.jar
[JENKINS] Archiving disabled