SuccessConsole Output

Started calculate disk usage of build
Finished Calculation of disk usage of build in 0 seconds
Started calculate disk usage of workspace
Finished Calculation of disk usage of workspace in 0 seconds
[INFO]                                                                         
[INFO] ------------------------------------------------------------------------
[INFO] Building GeoGig Core 1.0-SNAPSHOT
[INFO] ------------------------------------------------------------------------
[INFO] 
[INFO] --- maven-clean-plugin:2.5:clean (default-clean) @ geogig-core ---
[INFO] Deleting /home/hudson/genie.geogig/.hudson/jobs/geogig-1.0.x/workspace/src/core/target
[INFO] 
[INFO] --- git-commit-id-plugin:2.1.8:revision (default) @ geogig-core ---
[INFO] 
[INFO] --- maven-resources-plugin:2.6:resources (default-resources) @ geogig-core ---
[INFO] Using 'UTF-8' encoding to copy filtered resources.
[INFO] Copying 4 resources
[INFO] 
[INFO] --- maven-compiler-plugin:3.1:compile (default-compile) @ geogig-core ---
[INFO] Changes detected - recompiling the module!
[INFO] Compiling 305 source files to /home/hudson/genie.geogig/.hudson/jobs/geogig-1.0.x/workspace/src/core/target/classes
[WARNING] /home/hudson/genie.geogig/.hudson/jobs/geogig-1.0.x/workspace/src/core/src/main/java/org/locationtech/geogig/hooks/Scripting.java: Some input files use or override a deprecated API.
[WARNING] /home/hudson/genie.geogig/.hudson/jobs/geogig-1.0.x/workspace/src/core/src/main/java/org/locationtech/geogig/hooks/Scripting.java: Recompile with -Xlint:deprecation for details.
[WARNING] /home/hudson/genie.geogig/.hudson/jobs/geogig-1.0.x/workspace/src/core/src/main/java/org/locationtech/geogig/data/PrimitiveArrayToStringConverterFactory.java: Some input files use unchecked or unsafe operations.
[WARNING] /home/hudson/genie.geogig/.hudson/jobs/geogig-1.0.x/workspace/src/core/src/main/java/org/locationtech/geogig/data/PrimitiveArrayToStringConverterFactory.java: Recompile with -Xlint:unchecked for details.
[INFO] 
[INFO] --- maven-resources-plugin:2.6:testResources (default-testResources) @ geogig-core ---
[INFO] Using 'UTF-8' encoding to copy filtered resources.
[INFO] Copying 3 resources
[INFO] 
[INFO] --- maven-compiler-plugin:3.1:testCompile (default-testCompile) @ geogig-core ---
[INFO] Changes detected - recompiling the module!
[INFO] Compiling 145 source files to /home/hudson/genie.geogig/.hudson/jobs/geogig-1.0.x/workspace/src/core/target/test-classes
[WARNING] /home/hudson/genie.geogig/.hudson/jobs/geogig-1.0.x/workspace/src/core/src/test/java/org/locationtech/geogig/test/integration/HooksTest.java: Some input files use or override a deprecated API.
[WARNING] /home/hudson/genie.geogig/.hudson/jobs/geogig-1.0.x/workspace/src/core/src/test/java/org/locationtech/geogig/test/integration/HooksTest.java: Recompile with -Xlint:deprecation for details.
[WARNING] /home/hudson/genie.geogig/.hudson/jobs/geogig-1.0.x/workspace/src/core/src/test/java/org/locationtech/geogig/di/caching/CachingModuleTest.java: /home/hudson/genie.geogig/.hudson/jobs/geogig-1.0.x/workspace/src/core/src/test/java/org/locationtech/geogig/di/caching/CachingModuleTest.java uses unchecked or unsafe operations.
[WARNING] /home/hudson/genie.geogig/.hudson/jobs/geogig-1.0.x/workspace/src/core/src/test/java/org/locationtech/geogig/di/caching/CachingModuleTest.java: Recompile with -Xlint:unchecked for details.
[INFO] 
[INFO] --- maven-surefire-plugin:2.17:test (default-test) @ geogig-core ---
[INFO] Surefire report directory: /home/hudson/genie.geogig/.hudson/jobs/geogig-1.0.x/workspace/src/core/target/surefire-reports

-------------------------------------------------------
 T E S T S
-------------------------------------------------------

-------------------------------------------------------
 T E S T S
-------------------------------------------------------
Running org.locationtech.geogig.test.integration.ReportMergeConflictsOpTest
Running org.locationtech.geogig.test.integration.ResetOpTest
Running org.locationtech.geogig.test.integration.HooksTest
Running org.locationtech.geogig.test.integration.repository.WorkingTreeTest
Running org.locationtech.geogig.test.integration.BranchDeleteOpTest
Running org.locationtech.geogig.test.integration.repository.IndexTest
Running org.locationtech.geogig.test.integration.ConfigOpTest
Running org.locationtech.geogig.test.integration.BranchListOpTest
Running org.locationtech.geogig.test.integration.AddOpTest
Running org.locationtech.geogig.test.integration.RemoveOpTest
Running org.locationtech.geogig.test.integration.TagTest
Running org.locationtech.geogig.test.integration.FindCommonAncestorTest
Running org.locationtech.geogig.test.integration.LsTreeOpTest
Running org.locationtech.geogig.test.integration.CreatePatchOpTest
Running org.locationtech.geogig.test.integration.RemoteAddOpTest
Running org.locationtech.geogig.test.integration.RebaseOpTest
Running org.locationtech.geogig.test.integration.PushOpTest
Running org.locationtech.geogig.test.integration.RemoteListOpTest
Running org.locationtech.geogig.test.integration.GeogigTransactionTest
Running org.locationtech.geogig.test.integration.CloneOpTest
Running org.locationtech.geogig.test.integration.CleanRefsOpTest
Running org.locationtech.geogig.test.integration.CheckoutOpTest
Running org.locationtech.geogig.test.integration.RebuildGraphOpTest
Running org.locationtech.geogig.test.integration.MergeOpTest
Tests run: 1, Failures: 0, Errors: 0, Skipped: 0, Time elapsed: 5.552 sec - in org.locationtech.geogig.test.integration.CleanRefsOpTest
Running org.locationtech.geogig.test.integration.PullOpTest
testMergeNoCommits
testOctopusMerge
Tests run: 4, Failures: 0, Errors: 0, Skipped: 0, Time elapsed: 6.236 sec - in org.locationtech.geogig.test.integration.RemoteListOpTest
Running org.locationtech.geogig.test.integration.FetchOpTest
Tests run: 10, Failures: 0, Errors: 0, Skipped: 0, Time elapsed: 6.454 sec - in org.locationtech.geogig.test.integration.RemoteAddOpTest
Running org.locationtech.geogig.test.integration.SparseCloneTest
Tests run: 3, Failures: 0, Errors: 0, Skipped: 0, Time elapsed: 6.578 sec - in org.locationtech.geogig.test.integration.TagTest
Running org.locationtech.geogig.test.integration.ConflictsReadWriteOpTest
Tests run: 5, Failures: 0, Errors: 0, Skipped: 0, Time elapsed: 6.735 sec - in org.locationtech.geogig.test.integration.BranchDeleteOpTest
Running org.locationtech.geogig.test.integration.RevParseIntegrationTest
Tests run: 1, Failures: 0, Errors: 0, Skipped: 0, Time elapsed: 0.173 sec - in org.locationtech.geogig.test.integration.ConflictsReadWriteOpTest
Running org.locationtech.geogig.test.integration.ApplyPatchOpTest
[main] INFO org.locationtech.geogig.hooks.Scripting - Running jvm script /opt/public/hipp/ramdisk/geogig/junit9069542439875568962/repo1901059113/.geogig/hooks/pre_commit.js
Tests run: 21, Failures: 0, Errors: 0, Skipped: 0, Time elapsed: 7.649 sec - in org.locationtech.geogig.test.integration.ConfigOpTest
Running org.locationtech.geogig.test.integration.BranchRenameOpTest
Tests run: 3, Failures: 0, Errors: 0, Skipped: 0, Time elapsed: 7.303 sec - in org.locationtech.geogig.test.integration.RebuildGraphOpTest
Running org.locationtech.geogig.test.integration.CheckSparsePathTest
Tests run: 7, Failures: 0, Errors: 0, Skipped: 0, Time elapsed: 1.406 sec - in org.locationtech.geogig.test.integration.RevParseIntegrationTest
Running org.locationtech.geogig.test.integration.BranchCreateOpTest
Tests run: 9, Failures: 0, Errors: 0, Skipped: 0, Time elapsed: 8.309 sec - in org.locationtech.geogig.test.integration.repository.IndexTest
Running org.locationtech.geogig.test.integration.RevertOpTest
[main] INFO org.locationtech.geogig.hooks.Scripting - Running jvm script /opt/public/hipp/ramdisk/geogig/junit9069542439875568962/repo1901059113/.geogig/hooks/pre_commit.js
testMergeTwice
[main] INFO org.locationtech.geogig.hooks.Scripting - Running jvm script /opt/public/hipp/ramdisk/geogig/junit4366938984249655092/repo2142178429/.geogig/hooks/post_commit.js
Tests run: 8, Failures: 0, Errors: 0, Skipped: 0, Time elapsed: 8.841 sec - in org.locationtech.geogig.test.integration.CreatePatchOpTest
Running org.locationtech.geogig.test.integration.CommitOpTest
testNoFastForwardSpecifyAuthor
[main] INFO org.locationtech.geogig.plumbing.SendPack - Pushing Ref[refs/heads/master -> a3ad4dd3b550a1215e3001faf8071e3448956105] to refs/remotes/origin/NewRemoteBranch(NewRemoteBranch)
[main] INFO org.locationtech.geogig.plumbing.SendPack - Pushing Ref[refs/heads/Branch1 -> 43a3e480cf2de155a4a8a7b4a9030df9a23ab671] to refs/remotes/origin/NewRemoteBranch2(NewRemoteBranch2)
[main] WARN org.locationtech.geogig.hooks.CommandHookChain - Post-command hook org.locationtech.geogig.hooks.JVMScriptHook@63f34b70 for command org.locationtech.geogig.porcelain.CommitOp threw an exception that will not be propagated
java.lang.NullPointerException
	at org.locationtech.geogig.hooks.Scripting.runJVMScript(Scripting.java:93)
	at org.locationtech.geogig.hooks.JVMScriptHook.post(JVMScriptHook.java:52)
	at org.locationtech.geogig.hooks.CommandHookChain.runPostHooks(CommandHookChain.java:65)
	at org.locationtech.geogig.hooks.CommandHooksDecorator$HooksListener.postCall(CommandHooksDecorator.java:60)
	at org.locationtech.geogig.repository.AbstractGeoGigOp.notifyPost(AbstractGeoGigOp.java:178)
	at org.locationtech.geogig.repository.AbstractGeoGigOp.call(AbstractGeoGigOp.java:154)
	at org.locationtech.geogig.test.integration.HooksTest.testFailingPostPostProcessHook(HooksTest.java:148)
	at sun.reflect.NativeMethodAccessorImpl.invoke0(Native Method)
	at sun.reflect.NativeMethodAccessorImpl.invoke(NativeMethodAccessorImpl.java:62)
	at sun.reflect.DelegatingMethodAccessorImpl.invoke(DelegatingMethodAccessorImpl.java:43)
	at java.lang.reflect.Method.invoke(Method.java:498)
	at org.junit.runners.model.FrameworkMethod$1.runReflectiveCall(FrameworkMethod.java:50)
	at org.junit.internal.runners.model.ReflectiveCallable.run(ReflectiveCallable.java:12)
	at org.junit.runners.model.FrameworkMethod.invokeExplosively(FrameworkMethod.java:47)
	at org.junit.internal.runners.statements.InvokeMethod.evaluate(InvokeMethod.java:17)
	at org.junit.internal.runners.statements.RunBefores.evaluate(RunBefores.java:26)
	at org.junit.internal.runners.statements.RunAfters.evaluate(RunAfters.java:27)
	at org.junit.rules.ExternalResource$1.evaluate(ExternalResource.java:48)
	at org.junit.rules.RunRules.evaluate(RunRules.java:20)
	at org.junit.runners.ParentRunner.runLeaf(ParentRunner.java:325)
	at org.junit.runners.BlockJUnit4ClassRunner.runChild(BlockJUnit4ClassRunner.java:78)
	at org.junit.runners.BlockJUnit4ClassRunner.runChild(BlockJUnit4ClassRunner.java:57)
	at org.junit.runners.ParentRunner$3.run(ParentRunner.java:290)
	at org.junit.runners.ParentRunner$1.schedule(ParentRunner.java:71)
	at org.junit.runners.ParentRunner.runChildren(ParentRunner.java:288)
	at org.junit.runners.ParentRunner.access$000(ParentRunner.java:58)
	at org.junit.runners.ParentRunner$2.evaluate(ParentRunner.java:268)
	at org.junit.runners.ParentRunner.run(ParentRunner.java:363)
	at org.apache.maven.surefire.junit4.JUnit4Provider.execute(JUnit4Provider.java:264)
	at org.apache.maven.surefire.junit4.JUnit4Provider.executeTestSet(JUnit4Provider.java:153)
	at org.apache.maven.surefire.junit4.JUnit4Provider.invoke(JUnit4Provider.java:124)
	at org.apache.maven.surefire.booter.ForkedBooter.invokeProviderInSameClassLoader(ForkedBooter.java:200)
	at org.apache.maven.surefire.booter.ForkedBooter.runSuitesInProcess(ForkedBooter.java:153)
	at org.apache.maven.surefire.booter.ForkedBooter.main(ForkedBooter.java:103)
Tests run: 2, Failures: 0, Errors: 0, Skipped: 0, Time elapsed: 9.195 sec - in org.locationtech.geogig.test.integration.BranchListOpTest
Running org.locationtech.geogig.test.integration.BlameOpTest
Tests run: 10, Failures: 0, Errors: 0, Skipped: 1, Time elapsed: 9.125 sec - in org.locationtech.geogig.test.integration.RemoveOpTest
Running org.locationtech.geogig.test.integration.CherryPickOpTest
[main] WARN org.locationtech.geogig.hooks.CommandHookChain - Post-command hook org.locationtech.geogig.test.integration.HooksTest$ClasspathHookTest@5c77053b for command org.locationtech.geogig.porcelain.AddOp threw an exception that will not be propagated
java.lang.RuntimeException: expected
	at org.locationtech.geogig.test.integration.HooksTest$ClasspathHookTest.post(HooksTest.java:266)
	at org.locationtech.geogig.hooks.CommandHookChain.runPostHooks(CommandHookChain.java:65)
	at org.locationtech.geogig.hooks.CommandHooksDecorator$HooksListener.postCall(CommandHooksDecorator.java:60)
	at org.locationtech.geogig.repository.AbstractGeoGigOp.notifyPost(AbstractGeoGigOp.java:178)
	at org.locationtech.geogig.repository.AbstractGeoGigOp.call(AbstractGeoGigOp.java:154)
	at org.locationtech.geogig.test.integration.RepositoryTestCase.insertAndAdd(RepositoryTestCase.java:367)
	at org.locationtech.geogig.test.integration.RepositoryTestCase.insertAndAdd(RepositoryTestCase.java:355)
	at org.locationtech.geogig.test.integration.HooksTest.testClasspathHookPostFail(HooksTest.java:191)
	at sun.reflect.NativeMethodAccessorImpl.invoke0(Native Method)
	at sun.reflect.NativeMethodAccessorImpl.invoke(NativeMethodAccessorImpl.java:62)
	at sun.reflect.DelegatingMethodAccessorImpl.invoke(DelegatingMethodAccessorImpl.java:43)
	at java.lang.reflect.Method.invoke(Method.java:498)
	at org.junit.runners.model.FrameworkMethod$1.runReflectiveCall(FrameworkMethod.java:50)
	at org.junit.internal.runners.model.ReflectiveCallable.run(ReflectiveCallable.java:12)
	at org.junit.runners.model.FrameworkMethod.invokeExplosively(FrameworkMethod.java:47)
	at org.junit.internal.runners.statements.InvokeMethod.evaluate(InvokeMethod.java:17)
	at org.junit.internal.runners.statements.RunBefores.evaluate(RunBefores.java:26)
	at org.junit.internal.runners.statements.RunAfters.evaluate(RunAfters.java:27)
	at org.junit.rules.ExternalResource$1.evaluate(ExternalResource.java:48)
	at org.junit.rules.RunRules.evaluate(RunRules.java:20)
	at org.junit.runners.ParentRunner.runLeaf(ParentRunner.java:325)
	at org.junit.runners.BlockJUnit4ClassRunner.runChild(BlockJUnit4ClassRunner.java:78)
	at org.junit.runners.BlockJUnit4ClassRunner.runChild(BlockJUnit4ClassRunner.java:57)
	at org.junit.runners.ParentRunner$3.run(ParentRunner.java:290)
	at org.junit.runners.ParentRunner$1.schedule(ParentRunner.java:71)
	at org.junit.runners.ParentRunner.runChildren(ParentRunner.java:288)
	at org.junit.runners.ParentRunner.access$000(ParentRunner.java:58)
	at org.junit.runners.ParentRunner$2.evaluate(ParentRunner.java:268)
	at org.junit.runners.ParentRunner.run(ParentRunner.java:363)
	at org.apache.maven.surefire.junit4.JUnit4Provider.execute(JUnit4Provider.java:264)
	at org.apache.maven.surefire.junit4.JUnit4Provider.executeTestSet(JUnit4Provider.java:153)
	at org.apache.maven.surefire.junit4.JUnit4Provider.invoke(JUnit4Provider.java:124)
	at org.apache.maven.surefire.booter.ForkedBooter.invokeProviderInSameClassLoader(ForkedBooter.java:200)
	at org.apache.maven.surefire.booter.ForkedBooter.runSuitesInProcess(ForkedBooter.java:153)
	at org.apache.maven.surefire.booter.ForkedBooter.main(ForkedBooter.java:103)
testBothBranchesSameGeometryChange
Tests run: 2, Failures: 0, Errors: 0, Skipped: 0, Time elapsed: 1.947 sec - in org.locationtech.geogig.test.integration.CheckSparsePathTest
Running org.locationtech.geogig.test.integration.RemoteRemoveOpTest
[main] INFO org.locationtech.geogig.hooks.Scripting - Running shell script /opt/public/hipp/ramdisk/geogig/junit5482947807330011570/repo1144832658/.geogig/hooks/pre_commit.bat
[main] INFO org.locationtech.geogig.hooks.Scripting - Running shell script /opt/public/hipp/ramdisk/geogig/junit5482947807330011570/repo1144832658/.geogig/hooks/pre_commit.bat
Tests run: 11, Failures: 0, Errors: 0, Skipped: 0, Time elapsed: 1.846 sec - in org.locationtech.geogig.test.integration.BranchCreateOpTest
Running org.locationtech.geogig.test.integration.SquashOpTest
Tests run: 20, Failures: 0, Errors: 0, Skipped: 0, Time elapsed: 10.13 sec - in org.locationtech.geogig.test.integration.repository.WorkingTreeTest
Running org.locationtech.geogig.test.integration.GeogigAPITest
[main] INFO org.locationtech.geogig.hooks.Scripting - Running jvm script /opt/public/hipp/ramdisk/geogig/junit746901776659656558/repo368658940/.geogig/hooks/pre_commit.js
Tests run: 7, Failures: 0, Errors: 0, Skipped: 0, Time elapsed: 10.251 sec - in org.locationtech.geogig.test.integration.HooksTest
Running org.locationtech.geogig.test.integration.DiffOpTest
Tests run: 12, Failures: 0, Errors: 0, Skipped: 0, Time elapsed: 10.157 sec - in org.locationtech.geogig.test.integration.AddOpTest
Running org.locationtech.geogig.test.integration.ReportCommitConflictsOpTest
Tests run: 8, Failures: 0, Errors: 0, Skipped: 0, Time elapsed: 2.67 sec - in org.locationtech.geogig.test.integration.BranchRenameOpTest
Running org.locationtech.geogig.test.integration.LogOpTest
Tests run: 12, Failures: 0, Errors: 0, Skipped: 0, Time elapsed: 10.194 sec - in org.locationtech.geogig.test.integration.RebaseOpTest
Running org.locationtech.geogig.test.integration.StatusOpTest
[main] INFO org.locationtech.geogig.plumbing.SendPack - Pushing Ref[refs/heads/master -> a3ad4dd3b550a1215e3001faf8071e3448956105] to refs/remotes/origin/NewRemoteBranch(NewRemoteBranch)
Tests run: 5, Failures: 0, Errors: 0, Skipped: 0, Time elapsed: 10.479 sec - in org.locationtech.geogig.test.integration.FindCommonAncestorTest
Tests run: 6, Failures: 0, Errors: 0, Skipped: 0, Time elapsed: 1.421 sec - in org.locationtech.geogig.test.integration.BlameOpTest
Tests run: 7, Failures: 0, Errors: 0, Skipped: 1, Time elapsed: 1.411 sec - in org.locationtech.geogig.test.integration.CherryPickOpTest
Running org.locationtech.geogig.test.performance.HeapGraphDatabaseStressTest
Running org.locationtech.geogig.test.integration.CleanOpTest
Running org.locationtech.geogig.test.performance.LogOpPerformanceTest
testMergeFastForwardSecondCase
[main] INFO org.locationtech.geogig.test.performance.EnablePerformanceTestRule - org.locationtech.geogig.test.performance.LogOpPerformanceTest ignored, run with -Dgeogig.runPerformanceTests=true to enable it.
Tests run: 0, Failures: 0, Errors: 0, Skipped: 0, Time elapsed: 0.012 sec - in org.locationtech.geogig.test.performance.LogOpPerformanceTest
[main] INFO org.locationtech.geogig.test.performance.EnablePerformanceTestRule - org.locationtech.geogig.test.performance.HeapGraphDatabaseStressTest ignored, run with -Dgeogig.runPerformanceTests=true to enable it.
Running org.locationtech.geogig.test.performance.RevTreeBuilderPerformanceTest
Tests run: 0, Failures: 0, Errors: 0, Skipped: 0, Time elapsed: 0.036 sec - in org.locationtech.geogig.test.performance.HeapGraphDatabaseStressTest
Running org.locationtech.geogig.data.MapToStringConverterFactoryTest
[main] INFO org.locationtech.geogig.test.performance.EnablePerformanceTestRule - org.locationtech.geogig.test.performance.RevTreeBuilderPerformanceTest ignored, run with -Dgeogig.runPerformanceTests=true to enable it.
Tests run: 0, Failures: 0, Errors: 0, Skipped: 0, Time elapsed: 0.027 sec - in org.locationtech.geogig.test.performance.RevTreeBuilderPerformanceTest
Running org.locationtech.geogig.data.FeatureBuilderTest
Tests run: 10, Failures: 0, Errors: 0, Skipped: 0, Time elapsed: 10.582 sec - in org.locationtech.geogig.test.integration.LsTreeOpTest
Tests run: 1, Failures: 0, Errors: 0, Skipped: 0, Time elapsed: 0.055 sec - in org.locationtech.geogig.data.MapToStringConverterFactoryTest
Running org.locationtech.geogig.data.PrimitiveArrayToStringConverterFactoryTest
Running org.locationtech.geogig.model.impl.LegacyTreeBuilderTest
Tests run: 1, Failures: 0, Errors: 0, Skipped: 0, Time elapsed: 0.084 sec - in org.locationtech.geogig.data.FeatureBuilderTest
Running org.locationtech.geogig.model.impl.CanonicalTreeBuilderTest
testOctopusMergeWithAutomerge
Tests run: 4, Failures: 0, Errors: 0, Skipped: 0, Time elapsed: 0.655 sec - in org.locationtech.geogig.test.integration.StatusOpTest
Running org.locationtech.geogig.model.impl.RevFeatureTest
Tests run: 3, Failures: 0, Errors: 0, Skipped: 0, Time elapsed: 0.991 sec - in org.locationtech.geogig.test.integration.GeogigAPITest
Running org.locationtech.geogig.model.impl.RevFeatureTypeTest
Tests run: 2, Failures: 0, Errors: 0, Skipped: 0, Time elapsed: 0.023 sec - in org.locationtech.geogig.model.impl.RevFeatureTest
Running org.locationtech.geogig.model.impl.RevPersonTest
Tests run: 3, Failures: 0, Errors: 0, Skipped: 0, Time elapsed: 0 sec - in org.locationtech.geogig.model.impl.RevPersonTest
Running org.locationtech.geogig.model.impl.RevCommitImplTest
Tests run: 2, Failures: 0, Errors: 0, Skipped: 0, Time elapsed: 0.001 sec - in org.locationtech.geogig.model.impl.RevCommitImplTest
Running org.locationtech.geogig.model.impl.CommitBuilderTest
Tests run: 6, Failures: 0, Errors: 0, Skipped: 0, Time elapsed: 0.039 sec - in org.locationtech.geogig.model.impl.CommitBuilderTest
Running org.locationtech.geogig.model.internal.DAGNodeTest
[main] INFO org.locationtech.geogig.plumbing.SendPack - Pushing Ref[refs/heads/master -> d13557ae0d974dbbc25eb1e98414ea3a2455cc3c] to refs/remotes/origin/refs/heads/master(refs/heads/master)
Tests run: 2, Failures: 0, Errors: 0, Skipped: 0, Time elapsed: 0.24 sec - in org.locationtech.geogig.model.impl.RevFeatureTypeTest
Running org.locationtech.geogig.model.internal.CanonicalClusteringStrategyRocksdbStorageTest
Tests run: 7, Failures: 0, Errors: 0, Skipped: 0, Time elapsed: 0.752 sec - in org.locationtech.geogig.data.PrimitiveArrayToStringConverterFactoryTest
Running org.locationtech.geogig.model.internal.QuadTreeBuilderTest
Tests run: 1, Failures: 0, Errors: 0, Skipped: 1, Time elapsed: 0.004 sec - in org.locationtech.geogig.model.internal.QuadTreeBuilderTest
Running org.locationtech.geogig.model.internal.CanonicalClusteringStrategyHeapStorageTest
testConflictingMergeInterceptor
Tests run: 15, Failures: 0, Errors: 0, Skipped: 0, Time elapsed: 11.476 sec - in org.locationtech.geogig.test.integration.GeogigTransactionTest
Running org.locationtech.geogig.plumbing.diff.GeometryDiffTest
Tests run: 8, Failures: 0, Errors: 0, Skipped: 0, Time elapsed: 2.106 sec - in org.locationtech.geogig.test.integration.RemoteRemoveOpTest
Running org.locationtech.geogig.plumbing.diff.DiffCountConsumerTest
Tests run: 18, Failures: 0, Errors: 0, Skipped: 0, Time elapsed: 4.964 sec - in org.locationtech.geogig.test.integration.ApplyPatchOpTest
Running org.locationtech.geogig.plumbing.diff.MutableTreeTest
Tests run: 7, Failures: 0, Errors: 0, Skipped: 0, Time elapsed: 0.08 sec - in org.locationtech.geogig.plumbing.diff.MutableTreeTest
Running org.locationtech.geogig.plumbing.diff.TreeDifferenceTest
Tests run: 7, Failures: 0, Errors: 0, Skipped: 0, Time elapsed: 0.054 sec - in org.locationtech.geogig.plumbing.diff.TreeDifferenceTest
Running org.locationtech.geogig.plumbing.diff.PatchSerializationTest
Tests run: 13, Failures: 0, Errors: 0, Skipped: 0, Time elapsed: 12.055 sec - in org.locationtech.geogig.test.integration.ResetOpTest
Tests run: 3, Failures: 0, Errors: 0, Skipped: 0, Time elapsed: 1.379 sec - in org.locationtech.geogig.test.integration.CleanOpTest
Running org.locationtech.geogig.plumbing.diff.DepthTreeIteratorTest
Running org.locationtech.geogig.plumbing.diff.AttributeDiffTest
Tests run: 4, Failures: 0, Errors: 0, Skipped: 0, Time elapsed: 0.004 sec - in org.locationtech.geogig.plumbing.diff.AttributeDiffTest
Running org.locationtech.geogig.plumbing.diff.PostOrderDiffWalkTest
Tests run: 14, Failures: 0, Errors: 0, Skipped: 0, Time elapsed: 0.327 sec - in org.locationtech.geogig.plumbing.diff.GeometryDiffTest
Running org.locationtech.geogig.plumbing.diff.PreOrderDiffWalkTest
testMerge
Tests run: 4, Failures: 0, Errors: 0, Skipped: 0, Time elapsed: 1.104 sec - in org.locationtech.geogig.model.internal.DAGNodeTest
Tests run: 15, Failures: 0, Errors: 0, Skipped: 0, Time elapsed: 3.992 sec - in org.locationtech.geogig.test.integration.RevertOpTest
Running org.locationtech.geogig.plumbing.DiffFeatureTest
Running org.locationtech.geogig.plumbing.HashObjectTest
Tests run: 13, Failures: 0, Errors: 0, Skipped: 0, Time elapsed: 12.417 sec - in org.locationtech.geogig.test.integration.ReportMergeConflictsOpTest
Running org.locationtech.geogig.plumbing.DiffTreeTest

testConflictingOctopusMerge
sp	StringProp1_1 -> StringProp1_1a
ip	1000 -> 1001
pp	0 point(s) deleted, 0 new point(s) added, 1 point(s) moved

Tests run: 4, Failures: 0, Errors: 0, Skipped: 0, Time elapsed: 1.43 sec - in org.locationtech.geogig.plumbing.DiffFeatureTest
Running org.locationtech.geogig.plumbing.UpdateRefTest
[main] INFO org.locationtech.geogig.plumbing.SendPack - Pushing Ref[refs/heads/master -> a3ad4dd3b550a1215e3001faf8071e3448956105] to refs/remotes/origin/master(null)
Tests run: 8, Failures: 0, Errors: 0, Skipped: 0, Time elapsed: 1.948 sec - in org.locationtech.geogig.plumbing.diff.PatchSerializationTest
Tests run: 7, Failures: 0, Errors: 0, Skipped: 0, Time elapsed: 1.644 sec - in org.locationtech.geogig.plumbing.HashObjectTest
Running org.locationtech.geogig.plumbing.merge.MergeFeaturesOpTest
Running org.locationtech.geogig.plumbing.RevParseTest
Tests run: 10, Failures: 0, Errors: 0, Skipped: 0, Time elapsed: 3.801 sec - in org.locationtech.geogig.test.integration.ReportCommitConflictsOpTest
Running org.locationtech.geogig.plumbing.merge.MergeStatusBuilderDiffEntrySerializerTest
testFastForwardOnly
Tests run: 1, Failures: 0, Errors: 0, Skipped: 0, Time elapsed: 0.357 sec - in org.locationtech.geogig.plumbing.merge.MergeFeaturesOpTest
Removed 32,600 nodes in 1.654 s
Running org.locationtech.geogig.plumbing.WalkGraphOpTest
Tests run: 5, Failures: 0, Errors: 0, Skipped: 0, Time elapsed: 0.659 sec - in org.locationtech.geogig.plumbing.UpdateRefTest
Running org.locationtech.geogig.plumbing.ResolveFeatureTypeTest
testSpecifyAuthor
Tests run: 5, Failures: 0, Errors: 0, Skipped: 0, Time elapsed: 0.361 sec - in org.locationtech.geogig.plumbing.merge.MergeStatusBuilderDiffEntrySerializerTest
Running org.locationtech.geogig.plumbing.RefParseTest
testOursAndTheirs
testNoCommitMerge
[main] INFO org.locationtech.geogig.plumbing.SendPack - Pushing Ref[refs/heads/master -> a3ad4dd3b550a1215e3001faf8071e3448956105] to refs/remotes/origin/master(null)
[main] INFO org.locationtech.geogig.plumbing.SendPack - Pushing Ref[refs/heads/Branch1 -> e4d10fce0f71850b8e201763343ebde1c71aa5f6] to refs/remotes/origin/Branch1(null)
Tests run: 5, Failures: 0, Errors: 0, Skipped: 0, Time elapsed: 0.73 sec - in org.locationtech.geogig.plumbing.ResolveFeatureTypeTest
Running org.locationtech.geogig.plumbing.WriteTree2Test
Added 7,000 nodes in 200.9 ms
Tests run: 17, Failures: 0, Errors: 0, Skipped: 0, Time elapsed: 4.961 sec - in org.locationtech.geogig.test.integration.LogOpTest
Running org.locationtech.geogig.plumbing.UpdateIndexTest
testMergeFastForward
Tests run: 5, Failures: 0, Errors: 0, Skipped: 0, Time elapsed: 0.959 sec - in org.locationtech.geogig.plumbing.RefParseTest
Running org.locationtech.geogig.plumbing.DiffBoundsTest
Tests run: 1, Failures: 0, Errors: 0, Skipped: 0, Time elapsed: 0.209 sec - in org.locationtech.geogig.plumbing.UpdateIndexTest
Running org.locationtech.geogig.plumbing.CheckRefFormatTest
Excaption caught executing task: 
java.lang.IllegalStateException: java.lang.IllegalStateException: Object NodeRef[Points/Points.1 -> a47ca38e5c3e92c94dec9e8ea597c642003ec878] not found.
	at sun.reflect.NativeConstructorAccessorImpl.newInstance0(Native Method)
	at sun.reflect.NativeConstructorAccessorImpl.newInstance(NativeConstructorAccessorImpl.java:62)
	at sun.reflect.DelegatingConstructorAccessorImpl.newInstance(DelegatingConstructorAccessorImpl.java:45)
	at java.lang.reflect.Constructor.newInstance(Constructor.java:423)
	at java.util.concurrent.ForkJoinTask.getThrowableException(ForkJoinTask.java:593)
	at java.util.concurrent.ForkJoinTask.reportException(ForkJoinTask.java:677)
	at java.util.concurrent.ForkJoinTask.join(ForkJoinTask.java:720)
	at java.util.concurrent.ForkJoinPool.invoke(ForkJoinPool.java:2616)
	at org.locationtech.geogig.plumbing.diff.PreOrderDiffWalk.walk(PreOrderDiffWalk.java:304)
	at org.locationtech.geogig.plumbing.WalkGraphOp._call(WalkGraphOp.java:154)
	at org.locationtech.geogig.plumbing.WalkGraphOp._call(WalkGraphOp.java:33)
	at org.locationtech.geogig.repository.AbstractGeoGigOp.call(AbstractGeoGigOp.java:153)
	at org.locationtech.geogig.plumbing.WalkGraphOpTest.testObjectDoesNotExist(WalkGraphOpTest.java:179)
	at sun.reflect.NativeMethodAccessorImpl.invoke0(Native Method)
	at sun.reflect.NativeMethodAccessorImpl.invoke(NativeMethodAccessorImpl.java:62)
	at sun.reflect.DelegatingMethodAccessorImpl.invoke(DelegatingMethodAccessorImpl.java:43)
	at java.lang.reflect.Method.invoke(Method.java:498)
	at org.junit.runners.model.FrameworkMethod$1.runReflectiveCall(FrameworkMethod.java:50)
	at org.junit.internal.runners.model.ReflectiveCallable.run(ReflectiveCallable.java:12)
	at org.junit.runners.model.FrameworkMethod.invokeExplosively(FrameworkMethod.java:47)
	at org.junit.internal.runners.statements.InvokeMethod.evaluate(InvokeMethod.java:17)
	at org.junit.internal.runners.statements.RunBefores.evaluate(RunBefores.java:26)
	at org.junit.internal.runners.statements.RunAfters.evaluate(RunAfters.java:27)
	at org.junit.rules.ExpectedException$ExpectedExceptionStatement.evaluate(ExpectedException.java:239)
	at org.junit.rules.ExternalResource$1.evaluate(ExternalResource.java:48)
	at org.junit.rules.RunRules.evaluate(RunRules.java:20)
	at org.junit.runners.ParentRunner.runLeaf(ParentRunner.java:325)
	at org.junit.runners.BlockJUnit4ClassRunner.runChild(BlockJUnit4ClassRunner.java:78)
	at org.junit.runners.BlockJUnit4ClassRunner.runChild(BlockJUnit4ClassRunner.java:57)
	at org.junit.runners.ParentRunner$3.run(ParentRunner.java:290)
	at org.junit.runners.ParentRunner$1.schedule(ParentRunner.java:71)
	at org.junit.runners.ParentRunner.runChildren(ParentRunner.java:288)
	at org.junit.runners.ParentRunner.access$000(ParentRunner.java:58)
	at org.junit.runners.ParentRunner$2.evaluate(ParentRunner.java:268)
	at org.junit.runners.ParentRunner.run(ParentRunner.java:363)
	at org.apache.maven.surefire.junit4.JUnit4Provider.execute(JUnit4Provider.java:264)
	at org.apache.maven.surefire.junit4.JUnit4Provider.executeTestSet(JUnit4Provider.java:153)
	at org.apache.maven.surefire.junit4.JUnit4Provider.invoke(JUnit4Provider.java:124)
	at org.apache.maven.surefire.booter.ForkedBooter.invokeProviderInSameClassLoader(ForkedBooter.java:200)
	at org.apache.maven.surefire.booter.ForkedBooter.runSuitesInProcess(ForkedBooter.java:153)
	at org.apache.maven.surefire.booter.ForkedBooter.main(ForkedBooter.java:103)
Caused by: java.lang.IllegalStateException: Object NodeRef[Points/Points.1 -> a47ca38e5c3e92c94dec9e8ea597c642003ec878] not found.
	at org.locationtech.geogig.plumbing.WalkGraphOp$1.checkExists(WalkGraphOp.java:149)
	at org.locationtech.geogig.plumbing.WalkGraphOp$1.feature(WalkGraphOp.java:122)
	at org.locationtech.geogig.plumbing.diff.PreOrderDiffWalk$CancellableConsumer.feature(PreOrderDiffWalk.java:1277)
	at org.locationtech.geogig.plumbing.diff.PreOrderDiffWalk$WalkAction.node(PreOrderDiffWalk.java:601)
	at org.locationtech.geogig.plumbing.diff.PreOrderDiffWalk$TraverseLeafLeaf.compute(PreOrderDiffWalk.java:804)
	at org.locationtech.geogig.plumbing.diff.PreOrderDiffWalk$TraverseTreeContents.compute(PreOrderDiffWalk.java:710)
	at org.locationtech.geogig.plumbing.diff.PreOrderDiffWalk$TraverseTree.compute(PreOrderDiffWalk.java:666)
	at java.util.concurrent.RecursiveAction.exec(RecursiveAction.java:189)
	at java.util.concurrent.ForkJoinTask.doExec(ForkJoinTask.java:289)
	at java.util.concurrent.ForkJoinTask.doInvoke(ForkJoinTask.java:401)
	at java.util.concurrent.ForkJoinTask.invokeAll(ForkJoinTask.java:843)
	at org.locationtech.geogig.plumbing.diff.PreOrderDiffWalk$TraverseLeafLeaf.compute(PreOrderDiffWalk.java:811)
	at org.locationtech.geogig.plumbing.diff.PreOrderDiffWalk$TraverseTreeContents.compute(PreOrderDiffWalk.java:710)
	at org.locationtech.geogig.plumbing.diff.PreOrderDiffWalk$TraverseTree.compute(PreOrderDiffWalk.java:666)
	at java.util.concurrent.RecursiveAction.exec(RecursiveAction.java:189)
	at java.util.concurrent.ForkJoinTask.doExec(ForkJoinTask.java:289)
	at java.util.concurrent.ForkJoinPool$WorkQueue.runTask(ForkJoinPool.java:1056)
	at java.util.concurrent.ForkJoinPool.runWorker(ForkJoinPool.java:1692)
	at java.util.concurrent.ForkJoinWorkerThread.run(ForkJoinWorkerThread.java:157)
left : Tree[c932cbd11ec75bcc145e2a362a3199bb85eb3abc; size=7; subtrees=2, buckets=0, features=0]
	[BoundedTreeNode[buildings -> a400000000000000000000000000000000000000], BoundedTreeNode[roads -> ff488999ad51848c7850ffd4d12568a3125172b0]]
	[]
right: Tree[8996d6e4437a8d8ea41ffc1f32cfaab9bf9de384; size=5; subtrees=1, buckets=0, features=0]
	[BoundedTreeNode[roads -> 72e2f547f3adc30edd55733abb885e8e6de1f1a4]]
	[]
testOctopusMergeSameFeatureChanges
Tests run: 2, Failures: 0, Errors: 0, Skipped: 0, Time elapsed: 0.23 sec - in org.locationtech.geogig.plumbing.CheckRefFormatTest
Tests run: 21, Failures: 0, Errors: 0, Skipped: 0, Time elapsed: 15.528 sec - in org.locationtech.geogig.test.integration.CheckoutOpTest
Tests run: 7, Failures: 0, Errors: 0, Skipped: 0, Time elapsed: 1.567 sec - in org.locationtech.geogig.plumbing.WalkGraphOpTest
Tests run: 14, Failures: 0, Errors: 0, Skipped: 0, Time elapsed: 6.257 sec - in org.locationtech.geogig.test.integration.SquashOpTest
Running org.locationtech.geogig.plumbing.CatObjectTest
Running org.locationtech.geogig.plumbing.UpdateSymRefTest
Running org.locationtech.geogig.plumbing.ResolveGeogigURITest
[main] INFO org.locationtech.geogig.plumbing.SendPack - Pushing Ref[refs/heads/master -> b2e392a358773a01efe3ec48a3580362a7fc83d0] to refs/remotes/origin/refs/heads/master(refs/heads/master)
Running org.locationtech.geogig.plumbing.UpdateTreeTest
Tests run: 21, Failures: 0, Errors: 0, Skipped: 0, Time elapsed: 6.198 sec - in org.locationtech.geogig.test.integration.DiffOpTest
Running org.locationtech.geogig.plumbing.ResolveRepositoryNameTest
Tests run: 2, Failures: 0, Errors: 0, Skipped: 0, Time elapsed: 0.237 sec - in org.locationtech.geogig.plumbing.ResolveRepositoryNameTest
testMergeNullCommit
Running org.locationtech.geogig.plumbing.DescribeFeatureTypeTest
Removed 32,600 nodes in 2.226 s
[main] INFO org.locationtech.geogig.plumbing.SendPack - Pushing Ref[refs/heads/Branch1 -> b9ffcf8d172b8905500e906f2218c55b58cf2c44] to refs/remotes/origin/Branch1(Branch1)
Tests run: 5, Failures: 0, Errors: 0, Skipped: 0, Time elapsed: 0.538 sec - in org.locationtech.geogig.plumbing.UpdateSymRefTest
Running org.locationtech.geogig.plumbing.ParseTimestampTest
testMergeMultiple
Tests run: 1, Failures: 0, Errors: 0, Skipped: 0, Time elapsed: 0.657 sec - in org.locationtech.geogig.plumbing.ResolveGeogigURITest
Running org.locationtech.geogig.storage.memory.HeapBlobStoreTest
Tests run: 7, Failures: 0, Errors: 0, Skipped: 0, Time elapsed: 0.007 sec - in org.locationtech.geogig.storage.memory.HeapBlobStoreTest
Running org.locationtech.geogig.storage.memory.HeapConflictsDatabaseConformanceTest
Tests run: 2, Failures: 0, Errors: 0, Skipped: 0, Time elapsed: 0.27 sec - in org.locationtech.geogig.plumbing.DescribeFeatureTypeTest
Running org.locationtech.geogig.storage.memory.HeapRefDatabaseTest
Tests run: 7, Failures: 0, Errors: 0, Skipped: 0, Time elapsed: 0.773 sec - in org.locationtech.geogig.plumbing.UpdateTreeTest
Tests run: 2, Failures: 0, Errors: 0, Skipped: 0, Time elapsed: 0.254 sec - in org.locationtech.geogig.plumbing.ParseTimestampTest
Running org.locationtech.geogig.storage.memory.HeapObjectStoreConformanceTest
Running org.locationtech.geogig.storage.memory.HeapGraphDatabaseTest
Tests run: 11, Failures: 0, Errors: 0, Skipped: 0, Time elapsed: 0.114 sec - in org.locationtech.geogig.storage.memory.HeapRefDatabaseTest
Running org.locationtech.geogig.storage.impl.PersistedIterableTest
Tests run: 10, Failures: 0, Errors: 0, Skipped: 0, Time elapsed: 0.052 sec - in org.locationtech.geogig.storage.memory.HeapGraphDatabaseTest
Running org.locationtech.geogig.storage.impl.INIBlobTest
Tests run: 2, Failures: 0, Errors: 0, Skipped: 0, Time elapsed: 0.1 sec - in org.locationtech.geogig.storage.impl.PersistedIterableTest
Running org.locationtech.geogig.storage.datastream.VarintTest
Tests run: 4, Failures: 0, Errors: 0, Skipped: 0, Time elapsed: 0.017 sec - in org.locationtech.geogig.storage.datastream.VarintTest
Running org.locationtech.geogig.storage.datastream.DataStreamFeatureV2SerializationTest
Tests run: 1, Failures: 0, Errors: 0, Skipped: 0, Time elapsed: 0.074 sec - in org.locationtech.geogig.storage.impl.INIBlobTest
Running org.locationtech.geogig.storage.datastream.DataStreamV2RevTreeSerializationTest
Tests run: 23, Failures: 0, Errors: 0, Skipped: 0, Time elapsed: 0.324 sec - in org.locationtech.geogig.storage.memory.HeapObjectStoreConformanceTest
Tests run: 7, Failures: 0, Errors: 0, Skipped: 0, Time elapsed: 0.093 sec - in org.locationtech.geogig.storage.datastream.DataStreamV2RevTreeSerializationTest
testMergeConflictingPolygon
Running org.locationtech.geogig.storage.datastream.DataStreamFeatureV2_1SerializationTest
Tests run: 7, Failures: 0, Errors: 0, Skipped: 0, Time elapsed: 5.418 sec - in org.locationtech.geogig.plumbing.diff.PostOrderDiffWalkTest
Running org.locationtech.geogig.storage.datastream.DataStreamRevTreeSerializationTest
Running org.locationtech.geogig.storage.datastream.DataStreamV2CommitSerializationTest
Tests run: 8, Failures: 0, Errors: 0, Skipped: 0, Time elapsed: 0.013 sec - in org.locationtech.geogig.storage.datastream.DataStreamV2CommitSerializationTest
Running org.locationtech.geogig.storage.datastream.DataStreamCommitSerializationTest
Tests run: 3, Failures: 0, Errors: 0, Skipped: 0, Time elapsed: 1.254 sec - in org.locationtech.geogig.plumbing.CatObjectTest
Tests run: 7, Failures: 0, Errors: 0, Skipped: 0, Time elapsed: 0.076 sec - in org.locationtech.geogig.storage.datastream.DataStreamRevTreeSerializationTest
Running org.locationtech.geogig.storage.datastream.DataStreamFeatureSerializationTest
Tests run: 3, Failures: 0, Errors: 0, Skipped: 0, Time elapsed: 0.242 sec - in org.locationtech.geogig.storage.datastream.DataStreamFeatureV2SerializationTest
Running org.locationtech.geogig.storage.fs.FileConflictsDatabaseConformanceTest
Running org.locationtech.geogig.storage.fs.FileBlobStoreTest
Tests run: 8, Failures: 0, Errors: 0, Skipped: 0, Time elapsed: 0.137 sec - in org.locationtech.geogig.storage.datastream.DataStreamCommitSerializationTest
Running org.locationtech.geogig.storage.fs.FileRefDatabaseTest
Tests run: 8, Failures: 0, Errors: 0, Skipped: 0, Time elapsed: 17.379 sec - in org.locationtech.geogig.test.integration.CloneOpTest
Running org.locationtech.geogig.storage.fs.IniFileConfigDatabaseTest
Tests run: 3, Failures: 0, Errors: 0, Skipped: 0, Time elapsed: 0.304 sec - in org.locationtech.geogig.storage.datastream.DataStreamFeatureV2_1SerializationTest
Running org.locationtech.geogig.storage.text.RevTreeTextSerialiationTest
Tests run: 11, Failures: 0, Errors: 0, Skipped: 0, Time elapsed: 0.132 sec - in org.locationtech.geogig.storage.fs.FileRefDatabaseTest
Running org.locationtech.geogig.storage.text.RevCommitTextSerializationTest
Tests run: 3, Failures: 0, Errors: 0, Skipped: 0, Time elapsed: 0.231 sec - in org.locationtech.geogig.storage.datastream.DataStreamFeatureSerializationTest
Running org.locationtech.geogig.storage.text.RevFeatureTextSerializationTest
Tests run: 7, Failures: 0, Errors: 0, Skipped: 0, Time elapsed: 0.172 sec - in org.locationtech.geogig.storage.fs.FileBlobStoreTest
Running org.locationtech.geogig.storage.text.RevFeatureTypeTextSerializationTest
Tests run: 14, Failures: 0, Errors: 0, Skipped: 0, Time elapsed: 0.865 sec - in org.locationtech.geogig.storage.memory.HeapConflictsDatabaseConformanceTest
Running org.locationtech.geogig.porcelain.InitOpTest
Tests run: 2, Failures: 0, Errors: 0, Skipped: 0, Time elapsed: 0.087 sec - in org.locationtech.geogig.storage.text.RevFeatureTypeTextSerializationTest
Tests run: 15, Failures: 0, Errors: 0, Skipped: 0, Time elapsed: 2.752 sec - in org.locationtech.geogig.plumbing.WriteTree2Test
Running org.locationtech.geogig.repository.impl.RepositoryResolverTest
Tests run: 1, Failures: 0, Errors: 0, Skipped: 0, Time elapsed: 0.002 sec - in org.locationtech.geogig.repository.impl.RepositoryResolverTest
testMergeConflictingBranchesTheirs
Running org.locationtech.geogig.repository.impl.DepthSearchTest
Tests run: 9, Failures: 0, Errors: 0, Skipped: 0, Time elapsed: 0.175 sec - in org.locationtech.geogig.storage.text.RevCommitTextSerializationTest
Running org.locationtech.geogig.di.caching.CachingModuleTest
Running org.locationtech.geogig.repository.impl.RevFeatureBuilderTest
Tests run: 7, Failures: 0, Errors: 0, Skipped: 0, Time elapsed: 0.307 sec - in org.locationtech.geogig.storage.text.RevTreeTextSerialiationTest
Tests run: 23, Failures: 0, Errors: 0, Skipped: 0, Time elapsed: 0.368 sec - in org.locationtech.geogig.storage.fs.IniFileConfigDatabaseTest
Tests run: 4, Failures: 0, Errors: 0, Skipped: 0, Time elapsed: 0.445 sec - in org.locationtech.geogig.porcelain.InitOpTest
Tests run: 5, Failures: 0, Errors: 0, Skipped: 0, Time elapsed: 0.536 sec - in org.locationtech.geogig.storage.text.RevFeatureTextSerializationTest
Tests run: 3, Failures: 0, Errors: 0, Skipped: 0, Time elapsed: 0.379 sec - in org.locationtech.geogig.di.caching.CachingModuleTest
testMergeWithFeatureMerge
Added 5,000 nodes in 101.4 ms
Tests run: 1, Failures: 0, Errors: 0, Skipped: 0, Time elapsed: 0.63 sec - in org.locationtech.geogig.repository.impl.DepthSearchTest
Added 1,024 nodes in 19.52 ms
Removed 400 nodes in 2.485 ms
Tests run: 8, Failures: 0, Errors: 0, Skipped: 0, Time elapsed: 4.646 sec - in org.locationtech.geogig.plumbing.RevParseTest
Tests run: 26, Failures: 0, Errors: 0, Skipped: 0, Time elapsed: 9.742 sec - in org.locationtech.geogig.test.integration.CommitOpTest
Tests run: 8, Failures: 0, Errors: 0, Skipped: 0, Time elapsed: 0.805 sec - in org.locationtech.geogig.repository.impl.RevFeatureBuilderTest
testMergeNoCommitMessage
[main] INFO org.locationtech.geogig.plumbing.SendPack - Pushing Ref[refs/heads/Branch1 -> b9ffcf8d172b8905500e906f2218c55b58cf2c44] to refs/remotes/origin/Branch1(Branch1)
Tests run: 9, Failures: 0, Errors: 0, Skipped: 0, Time elapsed: 7.318 sec - in org.locationtech.geogig.plumbing.diff.DiffCountConsumerTest
Tests run: 11, Failures: 0, Errors: 0, Skipped: 0, Time elapsed: 6.791 sec - in org.locationtech.geogig.plumbing.DiffTreeTest
testMergeTwoBranchesWithNewFeatureType
Added 7,000 nodes in 1.147 s
Added 10,000 nodes in 98.06 ms
Tests run: 11, Failures: 0, Errors: 0, Skipped: 0, Time elapsed: 7.921 sec - in org.locationtech.geogig.model.internal.CanonicalClusteringStrategyHeapStorageTest
testCancelScenario1
Tests run: 8, Failures: 0, Errors: 0, Skipped: 0, Time elapsed: 13.993 sec - in org.locationtech.geogig.test.integration.PullOpTest
[main] INFO org.locationtech.geogig.plumbing.SendPack - Pushing Ref[refs/heads/master -> a3ad4dd3b550a1215e3001faf8071e3448956105] to refs/remotes/origin/master(null)
Tests run: 14, Failures: 0, Errors: 0, Skipped: 0, Time elapsed: 3.224 sec - in org.locationtech.geogig.storage.fs.FileConflictsDatabaseConformanceTest
[main] INFO org.locationtech.geogig.plumbing.SendPack - Pushing Ref[refs/heads/master -> a3ad4dd3b550a1215e3001faf8071e3448956105] to refs/remotes/origin/master(null)
Tests run: 11, Failures: 0, Errors: 0, Skipped: 0, Time elapsed: 20.857 sec - in org.locationtech.geogig.test.integration.PushOpTest
testCancelScenario2
testCancelScenario3
Added 5,000 nodes in 58.47 ms
testCancelScenario4
Added 1,024 nodes in 17.59 ms
Removed 400 nodes in 4.568 ms
testNoFastForward
testMergeConflictingBranches
testMergeConflictingBranchesOurs
Tests run: 30, Failures: 0, Errors: 0, Skipped: 0, Time elapsed: 21.614 sec - in org.locationtech.geogig.test.integration.MergeOpTest
[main] INFO org.locationtech.geogig.plumbing.SendPack - Pushing Ref[refs/heads/master -> 32b4e258bf8026e45ba1c2ace4a1f36e15b862a1] to refs/remotes/origin/master(null)
Added 10,000 nodes in 122.4 ms
Tests run: 11, Failures: 0, Errors: 0, Skipped: 0, Time elapsed: 10.697 sec - in org.locationtech.geogig.model.internal.CanonicalClusteringStrategyRocksdbStorageTest
Tests run: 15, Failures: 0, Errors: 0, Skipped: 0, Time elapsed: 15.712 sec - in org.locationtech.geogig.test.integration.FetchOpTest
Tests run: 6, Failures: 0, Errors: 0, Skipped: 0, Time elapsed: 6.995 sec - in org.locationtech.geogig.plumbing.DiffBoundsTest
Tests run: 12, Failures: 0, Errors: 0, Skipped: 0, Time elapsed: 15.862 sec - in org.locationtech.geogig.test.integration.SparseCloneTest
Tests run: 7, Failures: 0, Errors: 0, Skipped: 0, Time elapsed: 18.299 sec - in org.locationtech.geogig.plumbing.diff.DepthTreeIteratorTest
PreOrderDiffWalkTest: walked 524,288 vs 262144 trees in 545.8 ms
Tests run: 13, Failures: 0, Errors: 0, Skipped: 0, Time elapsed: 20.396 sec - in org.locationtech.geogig.model.impl.CanonicalTreeBuilderTest
PreOrderDiffWalkTest: walked 1,024 vs 512 trees in 23.30 ms
PreOrderDiffWalkTest: walked 16,384 vs 512 trees in 115.6 ms
Tests run: 24, Failures: 0, Errors: 0, Skipped: 0, Time elapsed: 20.126 sec - in org.locationtech.geogig.plumbing.diff.PreOrderDiffWalkTest
Tests run: 13, Failures: 0, Errors: 0, Skipped: 0, Time elapsed: 21.614 sec - in org.locationtech.geogig.model.impl.LegacyTreeBuilderTest

Results :

Tests run: 943, Failures: 0, Errors: 0, Skipped: 3

[JENKINS] Recording test results
[INFO] 
[INFO] --- maven-jar-plugin:2.4:jar (default-jar) @ geogig-core ---
[INFO] Building jar: /home/hudson/genie.geogig/.hudson/jobs/geogig-1.0.x/workspace/src/core/target/geogig-core-1.0-SNAPSHOT.jar
[INFO] 
[INFO] --- maven-jar-plugin:2.4:test-jar (default) @ geogig-core ---
[INFO] Building jar: /home/hudson/genie.geogig/.hudson/jobs/geogig-1.0.x/workspace/src/core/target/geogig-core-1.0-SNAPSHOT-tests.jar
[INFO] 
[INFO] >>> maven-source-plugin:2.2.1:jar (attach-sources) > generate-sources @ geogig-core >>>
[INFO] 
[INFO] --- git-commit-id-plugin:2.1.8:revision (default) @ geogig-core ---
[WARNING] Failed to getClass for org.apache.maven.plugin.source.SourceJarMojo
[INFO] 
[INFO] <<< maven-source-plugin:2.2.1:jar (attach-sources) < generate-sources @ geogig-core <<<
[INFO] 
[INFO] --- maven-source-plugin:2.2.1:jar (attach-sources) @ geogig-core ---
[INFO] Building jar: /home/hudson/genie.geogig/.hudson/jobs/geogig-1.0.x/workspace/src/core/target/geogig-core-1.0-SNAPSHOT-sources.jar
[INFO] 
[INFO] >>> maven-source-plugin:2.2.1:test-jar (attach-sources) > generate-sources @ geogig-core >>>
[INFO] 
[INFO] --- git-commit-id-plugin:2.1.8:revision (default) @ geogig-core ---
[WARNING] Failed to getClass for org.apache.maven.plugin.source.TestSourceJarMojo
[INFO] 
[INFO] <<< maven-source-plugin:2.2.1:test-jar (attach-sources) < generate-sources @ geogig-core <<<
[INFO] 
[INFO] --- maven-source-plugin:2.2.1:test-jar (attach-sources) @ geogig-core ---
[INFO] Building jar: /home/hudson/genie.geogig/.hudson/jobs/geogig-1.0.x/workspace/src/core/target/geogig-core-1.0-SNAPSHOT-test-sources.jar
[INFO] 
[INFO] --- maven-install-plugin:2.4:install (default-install) @ geogig-core ---
[INFO] Installing /home/hudson/genie.geogig/.hudson/jobs/geogig-1.0.x/workspace/src/core/target/geogig-core-1.0-SNAPSHOT.jar to /home/hudson/genie.geogig/.hudson/jobs/geogig-1.0.x/workspace/.repository/org/locationtech/geogig/geogig-core/1.0-SNAPSHOT/geogig-core-1.0-SNAPSHOT.jar
[INFO] Installing /home/hudson/genie.geogig/.hudson/jobs/geogig-1.0.x/workspace/src/core/pom.xml to /home/hudson/genie.geogig/.hudson/jobs/geogig-1.0.x/workspace/.repository/org/locationtech/geogig/geogig-core/1.0-SNAPSHOT/geogig-core-1.0-SNAPSHOT.pom
[INFO] Installing /home/hudson/genie.geogig/.hudson/jobs/geogig-1.0.x/workspace/src/core/target/geogig-core-1.0-SNAPSHOT-tests.jar to /home/hudson/genie.geogig/.hudson/jobs/geogig-1.0.x/workspace/.repository/org/locationtech/geogig/geogig-core/1.0-SNAPSHOT/geogig-core-1.0-SNAPSHOT-tests.jar
[INFO] Installing /home/hudson/genie.geogig/.hudson/jobs/geogig-1.0.x/workspace/src/core/target/geogig-core-1.0-SNAPSHOT-sources.jar to /home/hudson/genie.geogig/.hudson/jobs/geogig-1.0.x/workspace/.repository/org/locationtech/geogig/geogig-core/1.0-SNAPSHOT/geogig-core-1.0-SNAPSHOT-sources.jar
[INFO] Installing /home/hudson/genie.geogig/.hudson/jobs/geogig-1.0.x/workspace/src/core/target/geogig-core-1.0-SNAPSHOT-test-sources.jar to /home/hudson/genie.geogig/.hudson/jobs/geogig-1.0.x/workspace/.repository/org/locationtech/geogig/geogig-core/1.0-SNAPSHOT/geogig-core-1.0-SNAPSHOT-test-sources.jar
[JENKINS] Archiving disabled