FailedConsole Output

Started by an SCM change
Building remotely on hudson-slave2
Cleaning the workspace because project is configured to clean the workspace before each build.
Checkout:gemini-jpa / /opt/buildhomes/hudsonBuild/workspace/gemini-jpa - hudson.remoting.Channel@3821e98d:hudson-slave2
Using strategy: Default
Last Built Revision: Revision 99c05736dc4ade0c4fcf1394569a2bc39eb58031 (origin/trunk)
Checkout:gemini-jpa / /opt/buildhomes/hudsonBuild/workspace/gemini-jpa - hudson.remoting.LocalChannel@7d5c7a77
Cloning the remote Git repository
Cloning repository origin
Fetching upstream changes from git://git.eclipse.org/gitroot/gemini.jpa/org.eclipse.gemini.jpa.git
Commencing build of Revision c65eb34c11f08d108a3cb49b1068b34253304dc9 (origin/trunk)
Checking out Revision c65eb34c11f08d108a3cb49b1068b34253304dc9 (origin/trunk)
[INFO] Using bundled Maven 3 installation
[INFO] Checking Maven 3 installation environment
[gemini-jpa] $ /opt/buildhomes/hudsonBuild/maven/slavebundle/bundled-maven/bin/mvn --help
[INFO] Checking Maven 3 installation version
[gemini-jpa] $ /opt/buildhomes/hudsonBuild/maven/slavebundle/bundled-maven/bin/mvn --version
[INFO] Detected Maven 3 installation version: 3.0.3
[DEBUG] Waiting for connection on port: 36432
[gemini-jpa] $ /opt/buildhomes/hudsonBuild/maven/slavebundle/bundled-maven/bin/mvn clean install -V -B -Dmaven.ext.class.path=/opt/buildhomes/hudsonBuild/maven/slavebundle/resources:/opt/buildhomes/hudsonBuild/maven/slavebundle/lib/maven3-eventspy-3.0.jar:/opt/buildhomes/hudsonBuild/slave.jar -Dhudson.eventspy.port=36432 -Dmaven.repo.local=/opt/buildhomes/hudsonBuild/workspace/gemini-jpa/.maven/repo -f pom.xml
Apache Maven 3.0.3 (r1075438; 2011-02-28 12:31:09-0500)
Maven home: /opt/buildhomes/hudsonBuild/maven/slavebundle/bundled-maven
Java version: 1.6.0, vendor: IBM Corporation
Java home: /usr/lib64/jvm/java-1_6_0-ibm-1.6.0/jre
Default locale: en_US, platform encoding: UTF-8
OS name: "linux", version: "2.6.32.59-0.7-default", arch: "amd64", family: "unix"
[DEBUG] Connected to remote
[INFO] Scanning for projects...
Downloading: http://repo1.maven.org/maven2/org/eclipse/tycho/tycho-maven-plugin/0.14.0/tycho-maven-plugin-0.14.0.pom
Downloaded: http://repo1.maven.org/maven2/org/eclipse/tycho/tycho-maven-plugin/0.14.0/tycho-maven-plugin-0.14.0.pom (3 KB at 17.2 KB/sec)
Downloading: http://repo1.maven.org/maven2/org/eclipse/tycho/tycho/0.14.0/tycho-0.14.0.pom
Downloaded: http://repo1.maven.org/maven2/org/eclipse/tycho/tycho/0.14.0/tycho-0.14.0.pom (16 KB at 101.2 KB/sec)
Downloading: http://repo1.maven.org/maven2/org/eclipse/tycho/tycho-core/0.14.0/tycho-core-0.14.0.pom
Downloaded: http://repo1.maven.org/maven2/org/eclipse/tycho/tycho-core/0.14.0/tycho-core-0.14.0.pom (5 KB at 90.5 KB/sec)
Downloading: http://repo1.maven.org/maven2/org/apache/maven/maven-core/3.0/maven-core-3.0.pom
Downloaded: http://repo1.maven.org/maven2/org/apache/maven/maven-core/3.0/maven-core-3.0.pom (7 KB at 150.5 KB/sec)
Downloading: http://repo1.maven.org/maven2/org/apache/maven/maven/3.0/maven-3.0.pom
Downloaded: http://repo1.maven.org/maven2/org/apache/maven/maven/3.0/maven-3.0.pom (22 KB at 339.2 KB/sec)
Downloading: http://repo1.maven.org/maven2/org/apache/maven/maven-parent/15/maven-parent-15.pom
Downloaded: http://repo1.maven.org/maven2/org/apache/maven/maven-parent/15/maven-parent-15.pom (24 KB at 349.9 KB/sec)
Downloading: http://repo1.maven.org/maven2/org/apache/apache/6/apache-6.pom
Downloaded: http://repo1.maven.org/maven2/org/apache/apache/6/apache-6.pom (13 KB at 284.0 KB/sec)
Downloading: http://repo1.maven.org/maven2/org/apache/maven/maven-model/3.0/maven-model-3.0.pom
Downloaded: http://repo1.maven.org/maven2/org/apache/maven/maven-model/3.0/maven-model-3.0.pom (4 KB at 88.4 KB/sec)
Downloading: http://repo1.maven.org/maven2/org/codehaus/plexus/plexus-utils/2.0.4/plexus-utils-2.0.4.pom
Downloaded: http://repo1.maven.org/maven2/org/codehaus/plexus/plexus-utils/2.0.4/plexus-utils-2.0.4.pom (4 KB at 74.0 KB/sec)
Downloading: http://repo1.maven.org/maven2/org/codehaus/plexus/plexus/2.0.6/plexus-2.0.6.pom
Downloaded: http://repo1.maven.org/maven2/org/codehaus/plexus/plexus/2.0.6/plexus-2.0.6.pom (17 KB at 380.7 KB/sec)
Downloading: http://repo1.maven.org/maven2/org/apache/maven/maven-settings/3.0/maven-settings-3.0.pom
Downloaded: http://repo1.maven.org/maven2/org/apache/maven/maven-settings/3.0/maven-settings-3.0.pom (2 KB at 7.4 KB/sec)
Downloading: http://repo1.maven.org/maven2/org/apache/maven/maven-settings-builder/3.0/maven-settings-builder-3.0.pom
Downloaded: http://repo1.maven.org/maven2/org/apache/maven/maven-settings-builder/3.0/maven-settings-builder-3.0.pom (3 KB at 50.4 KB/sec)
Downloading: http://repo1.maven.org/maven2/org/codehaus/plexus/plexus-interpolation/1.14/plexus-interpolation-1.14.pom
Downloaded: http://repo1.maven.org/maven2/org/codehaus/plexus/plexus-interpolation/1.14/plexus-interpolation-1.14.pom (910 B at 20.2 KB/sec)
Downloading: http://repo1.maven.org/maven2/org/codehaus/plexus/plexus-components/1.1.18/plexus-components-1.1.18.pom
Downloaded: http://repo1.maven.org/maven2/org/codehaus/plexus/plexus-components/1.1.18/plexus-components-1.1.18.pom (6 KB at 118.9 KB/sec)
Downloading: http://repo1.maven.org/maven2/org/codehaus/plexus/plexus/2.0.7/plexus-2.0.7.pom
Downloaded: http://repo1.maven.org/maven2/org/codehaus/plexus/plexus/2.0.7/plexus-2.0.7.pom (17 KB at 276.9 KB/sec)
Downloading: http://repo1.maven.org/maven2/org/codehaus/plexus/plexus-component-annotations/1.5.5/plexus-component-annotations-1.5.5.pom
Downloaded: http://repo1.maven.org/maven2/org/codehaus/plexus/plexus-component-annotations/1.5.5/plexus-component-annotations-1.5.5.pom (815 B at 18.9 KB/sec)
Downloading: http://repo1.maven.org/maven2/org/codehaus/plexus/plexus-containers/1.5.5/plexus-containers-1.5.5.pom
Downloaded: http://repo1.maven.org/maven2/org/codehaus/plexus/plexus-containers/1.5.5/plexus-containers-1.5.5.pom (5 KB at 96.3 KB/sec)
Downloading: http://repo1.maven.org/maven2/org/sonatype/plexus/plexus-sec-dispatcher/1.3/plexus-sec-dispatcher-1.3.pom
Downloaded: http://repo1.maven.org/maven2/org/sonatype/plexus/plexus-sec-dispatcher/1.3/plexus-sec-dispatcher-1.3.pom (3 KB at 67.2 KB/sec)
Downloading: http://repo1.maven.org/maven2/org/sonatype/spice/spice-parent/12/spice-parent-12.pom
Downloaded: http://repo1.maven.org/maven2/org/sonatype/spice/spice-parent/12/spice-parent-12.pom (7 KB at 154.4 KB/sec)
Downloading: http://repo1.maven.org/maven2/org/sonatype/forge/forge-parent/4/forge-parent-4.pom
Downloaded: http://repo1.maven.org/maven2/org/sonatype/forge/forge-parent/4/forge-parent-4.pom (9 KB at 51.9 KB/sec)
Downloading: http://repo1.maven.org/maven2/org/sonatype/plexus/plexus-cipher/1.4/plexus-cipher-1.4.pom
Downloaded: http://repo1.maven.org/maven2/org/sonatype/plexus/plexus-cipher/1.4/plexus-cipher-1.4.pom (3 KB at 46.9 KB/sec)
Downloading: http://repo1.maven.org/maven2/org/apache/maven/maven-repository-metadata/3.0/maven-repository-metadata-3.0.pom
Downloaded: http://repo1.maven.org/maven2/org/apache/maven/maven-repository-metadata/3.0/maven-repository-metadata-3.0.pom (2 KB at 43.8 KB/sec)
Downloading: http://repo1.maven.org/maven2/org/apache/maven/maven-artifact/3.0/maven-artifact-3.0.pom
Downloaded: http://repo1.maven.org/maven2/org/apache/maven/maven-artifact/3.0/maven-artifact-3.0.pom (2 KB at 43.8 KB/sec)
Downloading: http://repo1.maven.org/maven2/org/apache/maven/maven-plugin-api/3.0/maven-plugin-api-3.0.pom
Downloaded: http://repo1.maven.org/maven2/org/apache/maven/maven-plugin-api/3.0/maven-plugin-api-3.0.pom (3 KB at 52.0 KB/sec)
Downloading: http://repo1.maven.org/maven2/org/sonatype/sisu/sisu-inject-plexus/1.4.2/sisu-inject-plexus-1.4.2.pom
Downloaded: http://repo1.maven.org/maven2/org/sonatype/sisu/sisu-inject-plexus/1.4.2/sisu-inject-plexus-1.4.2.pom (6 KB at 119.2 KB/sec)
Downloading: http://repo1.maven.org/maven2/org/sonatype/sisu/inject/guice-plexus/1.4.2/guice-plexus-1.4.2.pom
Downloaded: http://repo1.maven.org/maven2/org/sonatype/sisu/inject/guice-plexus/1.4.2/guice-plexus-1.4.2.pom (4 KB at 71.0 KB/sec)
Downloading: http://repo1.maven.org/maven2/org/sonatype/sisu/inject/guice-bean/1.4.2/guice-bean-1.4.2.pom
Downloaded: http://repo1.maven.org/maven2/org/sonatype/sisu/inject/guice-bean/1.4.2/guice-bean-1.4.2.pom (3 KB at 60.6 KB/sec)
Downloading: http://repo1.maven.org/maven2/org/sonatype/sisu/sisu-inject/1.4.2/sisu-inject-1.4.2.pom
Downloaded: http://repo1.maven.org/maven2/org/sonatype/sisu/sisu-inject/1.4.2/sisu-inject-1.4.2.pom (2 KB at 29.7 KB/sec)
Downloading: http://repo1.maven.org/maven2/org/sonatype/sisu/sisu-parent/1.4.2/sisu-parent-1.4.2.pom
Downloaded: http://repo1.maven.org/maven2/org/sonatype/sisu/sisu-parent/1.4.2/sisu-parent-1.4.2.pom (8 KB at 180.8 KB/sec)
Downloading: http://repo1.maven.org/maven2/org/sonatype/forge/forge-parent/6/forge-parent-6.pom
Downloaded: http://repo1.maven.org/maven2/org/sonatype/forge/forge-parent/6/forge-parent-6.pom (11 KB at 244.2 KB/sec)
Downloading: http://repo1.maven.org/maven2/org/codehaus/plexus/plexus-classworlds/2.2.3/plexus-classworlds-2.2.3.pom
Downloaded: http://repo1.maven.org/maven2/org/codehaus/plexus/plexus-classworlds/2.2.3/plexus-classworlds-2.2.3.pom (4 KB at 90.8 KB/sec)
Downloading: http://repo1.maven.org/maven2/org/sonatype/sisu/sisu-inject-bean/1.4.2/sisu-inject-bean-1.4.2.pom
Downloaded: http://repo1.maven.org/maven2/org/sonatype/sisu/sisu-inject-bean/1.4.2/sisu-inject-bean-1.4.2.pom (6 KB at 121.1 KB/sec)
Downloading: http://repo1.maven.org/maven2/org/sonatype/sisu/sisu-guice/2.1.7/sisu-guice-2.1.7.pom
Downloaded: http://repo1.maven.org/maven2/org/sonatype/sisu/sisu-guice/2.1.7/sisu-guice-2.1.7.pom (11 KB at 240.0 KB/sec)
Downloading: http://repo1.maven.org/maven2/org/apache/maven/maven-model-builder/3.0/maven-model-builder-3.0.pom
Downloaded: http://repo1.maven.org/maven2/org/apache/maven/maven-model-builder/3.0/maven-model-builder-3.0.pom (3 KB at 52.2 KB/sec)
Downloading: http://repo1.maven.org/maven2/org/apache/maven/maven-aether-provider/3.0/maven-aether-provider-3.0.pom
Downloaded: http://repo1.maven.org/maven2/org/apache/maven/maven-aether-provider/3.0/maven-aether-provider-3.0.pom (3 KB at 57.4 KB/sec)
Downloading: http://repo1.maven.org/maven2/org/sonatype/aether/aether-api/1.7/aether-api-1.7.pom
Downloaded: http://repo1.maven.org/maven2/org/sonatype/aether/aether-api/1.7/aether-api-1.7.pom (2 KB at 38.0 KB/sec)
Downloading: http://repo1.maven.org/maven2/org/sonatype/aether/aether-parent/1.7/aether-parent-1.7.pom
Downloaded: http://repo1.maven.org/maven2/org/sonatype/aether/aether-parent/1.7/aether-parent-1.7.pom (8 KB at 171.5 KB/sec)
Downloading: http://repo1.maven.org/maven2/org/sonatype/aether/aether-util/1.7/aether-util-1.7.pom
Downloaded: http://repo1.maven.org/maven2/org/sonatype/aether/aether-util/1.7/aether-util-1.7.pom (3 KB at 49.1 KB/sec)
Downloading: http://repo1.maven.org/maven2/org/sonatype/aether/aether-impl/1.7/aether-impl-1.7.pom
Downloaded: http://repo1.maven.org/maven2/org/sonatype/aether/aether-impl/1.7/aether-impl-1.7.pom (4 KB at 83.9 KB/sec)
Downloading: http://repo1.maven.org/maven2/org/sonatype/aether/aether-spi/1.7/aether-spi-1.7.pom
Downloaded: http://repo1.maven.org/maven2/org/sonatype/aether/aether-spi/1.7/aether-spi-1.7.pom (2 KB at 41.5 KB/sec)
Downloading: http://repo1.maven.org/maven2/org/codehaus/plexus/plexus-archiver/1.2/plexus-archiver-1.2.pom
Downloaded: http://repo1.maven.org/maven2/org/codehaus/plexus/plexus-archiver/1.2/plexus-archiver-1.2.pom (2 KB at 47.5 KB/sec)
Downloading: http://repo1.maven.org/maven2/org/codehaus/plexus/plexus-io/1.0.1/plexus-io-1.0.1.pom
Downloaded: http://repo1.maven.org/maven2/org/codehaus/plexus/plexus-io/1.0.1/plexus-io-1.0.1.pom (2 KB at 28.7 KB/sec)
Downloading: http://repo1.maven.org/maven2/org/eclipse/tycho/org.eclipse.osgi/3.8.0.v20120123-1419/org.eclipse.osgi-3.8.0.v20120123-1419.pom
Downloaded: http://repo1.maven.org/maven2/org/eclipse/tycho/org.eclipse.osgi/3.8.0.v20120123-1419/org.eclipse.osgi-3.8.0.v20120123-1419.pom (2 KB at 30.5 KB/sec)
Downloading: http://repo1.maven.org/maven2/org/eclipse/tycho/sisu-equinox-embedder/0.14.0/sisu-equinox-embedder-0.14.0.pom
Downloaded: http://repo1.maven.org/maven2/org/eclipse/tycho/sisu-equinox-embedder/0.14.0/sisu-equinox-embedder-0.14.0.pom (2 KB at 40.8 KB/sec)
Downloading: http://repo1.maven.org/maven2/org/eclipse/tycho/sisu-equinox/0.14.0/sisu-equinox-0.14.0.pom
Downloaded: http://repo1.maven.org/maven2/org/eclipse/tycho/sisu-equinox/0.14.0/sisu-equinox-0.14.0.pom (2 KB at 22.1 KB/sec)
Downloading: http://repo1.maven.org/maven2/org/eclipse/tycho/sisu-equinox-api/0.14.0/sisu-equinox-api-0.14.0.pom
Downloaded: http://repo1.maven.org/maven2/org/eclipse/tycho/sisu-equinox-api/0.14.0/sisu-equinox-api-0.14.0.pom (2 KB at 37.6 KB/sec)
Downloading: http://repo1.maven.org/maven2/org/eclipse/tycho/tycho-metadata-model/0.14.0/tycho-metadata-model-0.14.0.pom
Downloaded: http://repo1.maven.org/maven2/org/eclipse/tycho/tycho-metadata-model/0.14.0/tycho-metadata-model-0.14.0.pom (2 KB at 28.3 KB/sec)
Downloading: http://repo1.maven.org/maven2/de/pdark/decentxml/1.3/decentxml-1.3.pom
Downloaded: http://repo1.maven.org/maven2/de/pdark/decentxml/1.3/decentxml-1.3.pom (7 KB at 139.2 KB/sec)
Downloading: http://repo1.maven.org/maven2/org/eclipse/tycho/tycho-embedder-api/0.14.0/tycho-embedder-api-0.14.0.pom
Downloaded: http://repo1.maven.org/maven2/org/eclipse/tycho/tycho-embedder-api/0.14.0/tycho-embedder-api-0.14.0.pom (3 KB at 44.9 KB/sec)
Downloading: http://repo1.maven.org/maven2/org/eclipse/tycho/org.eclipse.tycho.embedder.shared/0.14.0/org.eclipse.tycho.embedder.shared-0.14.0.pom
Downloaded: http://repo1.maven.org/maven2/org/eclipse/tycho/org.eclipse.tycho.embedder.shared/0.14.0/org.eclipse.tycho.embedder.shared-0.14.0.pom (2 KB at 22.7 KB/sec)
Downloading: http://repo1.maven.org/maven2/org/eclipse/tycho/tycho-bundles/0.14.0/tycho-bundles-0.14.0.pom
Downloaded: http://repo1.maven.org/maven2/org/eclipse/tycho/tycho-bundles/0.14.0/tycho-bundles-0.14.0.pom (3 KB at 10.0 KB/sec)
Downloading: http://repo1.maven.org/maven2/org/eclipse/tycho/org.eclipse.tycho.core.shared/0.14.0/org.eclipse.tycho.core.shared-0.14.0.pom
Downloaded: http://repo1.maven.org/maven2/org/eclipse/tycho/org.eclipse.tycho.core.shared/0.14.0/org.eclipse.tycho.core.shared-0.14.0.pom (2 KB at 7.6 KB/sec)
Downloading: http://repo1.maven.org/maven2/org/eclipse/tycho/tycho-p2-facade/0.14.0/tycho-p2-facade-0.14.0.pom
Downloaded: http://repo1.maven.org/maven2/org/eclipse/tycho/tycho-p2-facade/0.14.0/tycho-p2-facade-0.14.0.pom (3 KB at 50.6 KB/sec)
Downloading: http://repo1.maven.org/maven2/org/eclipse/tycho/tycho-p2/0.14.0/tycho-p2-0.14.0.pom
Downloaded: http://repo1.maven.org/maven2/org/eclipse/tycho/tycho-p2/0.14.0/tycho-p2-0.14.0.pom (2 KB at 25.3 KB/sec)
Downloading: http://repo1.maven.org/maven2/org/eclipse/tycho/org.eclipse.tycho.p2.resolver.shared/0.14.0/org.eclipse.tycho.p2.resolver.shared-0.14.0.pom
Downloaded: http://repo1.maven.org/maven2/org/eclipse/tycho/org.eclipse.tycho.p2.resolver.shared/0.14.0/org.eclipse.tycho.p2.resolver.shared-0.14.0.pom (2 KB at 22.5 KB/sec)
Downloading: http://repo1.maven.org/maven2/org/eclipse/tycho/org.eclipse.tycho.p2.tools.shared/0.14.0/org.eclipse.tycho.p2.tools.shared-0.14.0.pom
Downloaded: http://repo1.maven.org/maven2/org/eclipse/tycho/org.eclipse.tycho.p2.tools.shared/0.14.0/org.eclipse.tycho.p2.tools.shared-0.14.0.pom (2 KB at 23.0 KB/sec)
Downloading: http://repo1.maven.org/maven2/org/eclipse/tycho/tycho-maven-plugin/0.14.0/tycho-maven-plugin-0.14.0.jar
Downloaded: http://repo1.maven.org/maven2/org/eclipse/tycho/tycho-maven-plugin/0.14.0/tycho-maven-plugin-0.14.0.jar (5 KB at 100.8 KB/sec)
Downloading: http://repo1.maven.org/maven2/org/eclipse/tycho/tycho-core/0.14.0/tycho-core-0.14.0.jar
Downloaded: http://repo1.maven.org/maven2/org/eclipse/tycho/tycho-core/0.14.0/tycho-core-0.14.0.jar (155 KB at 1072.2 KB/sec)
Downloading: http://repo1.maven.org/maven2/org/sonatype/aether/aether-util/1.7/aether-util-1.7.jar
Downloaded: http://repo1.maven.org/maven2/org/sonatype/aether/aether-util/1.7/aether-util-1.7.jar (106 KB at 1054.2 KB/sec)
Downloading: http://repo1.maven.org/maven2/org/codehaus/plexus/plexus-interpolation/1.14/plexus-interpolation-1.14.jar
Downloading: http://repo1.maven.org/maven2/org/sonatype/plexus/plexus-sec-dispatcher/1.3/plexus-sec-dispatcher-1.3.jar
Downloading: http://repo1.maven.org/maven2/org/sonatype/plexus/plexus-cipher/1.4/plexus-cipher-1.4.jar
Downloading: http://repo1.maven.org/maven2/org/codehaus/plexus/plexus-utils/2.0.4/plexus-utils-2.0.4.jar
Downloading: http://repo1.maven.org/maven2/org/codehaus/plexus/plexus-archiver/1.2/plexus-archiver-1.2.jar
Downloaded: http://repo1.maven.org/maven2/org/codehaus/plexus/plexus-interpolation/1.14/plexus-interpolation-1.14.jar (60 KB at 198.1 KB/sec)
Downloading: http://repo1.maven.org/maven2/org/codehaus/plexus/plexus-io/1.0.1/plexus-io-1.0.1.jar
Downloaded: http://repo1.maven.org/maven2/org/sonatype/plexus/plexus-cipher/1.4/plexus-cipher-1.4.jar (14 KB at 133.1 KB/sec)
Downloading: http://repo1.maven.org/maven2/org/eclipse/tycho/org.eclipse.osgi/3.8.0.v20120123-1419/org.eclipse.osgi-3.8.0.v20120123-1419.jar
Downloaded: http://repo1.maven.org/maven2/org/sonatype/plexus/plexus-sec-dispatcher/1.3/plexus-sec-dispatcher-1.3.jar (28 KB at 236.3 KB/sec)
Downloading: http://repo1.maven.org/maven2/org/eclipse/tycho/sisu-equinox-embedder/0.14.0/sisu-equinox-embedder-0.14.0.jar
Downloaded: http://repo1.maven.org/maven2/org/codehaus/plexus/plexus-io/1.0.1/plexus-io-1.0.1.jar (50 KB at 320.5 KB/sec)
Downloading: http://repo1.maven.org/maven2/org/eclipse/tycho/sisu-equinox-api/0.14.0/sisu-equinox-api-0.14.0.jar
Downloaded: http://repo1.maven.org/maven2/org/eclipse/tycho/sisu-equinox-embedder/0.14.0/sisu-equinox-embedder-0.14.0.jar (11 KB at 69.4 KB/sec)
Downloading: http://repo1.maven.org/maven2/org/eclipse/tycho/tycho-metadata-model/0.14.0/tycho-metadata-model-0.14.0.jar
Downloaded: http://repo1.maven.org/maven2/org/eclipse/tycho/tycho-metadata-model/0.14.0/tycho-metadata-model-0.14.0.jar (28 KB at 424.0 KB/sec)
Downloading: http://repo1.maven.org/maven2/de/pdark/decentxml/1.3/decentxml-1.3.jar
Downloaded: http://repo1.maven.org/maven2/org/codehaus/plexus/plexus-archiver/1.2/plexus-archiver-1.2.jar (178 KB at 466.1 KB/sec)
Downloading: http://repo1.maven.org/maven2/org/eclipse/tycho/tycho-embedder-api/0.14.0/tycho-embedder-api-0.14.0.jar
Downloaded: http://repo1.maven.org/maven2/org/eclipse/tycho/sisu-equinox-api/0.14.0/sisu-equinox-api-0.14.0.jar (4 KB at 22.7 KB/sec)
Downloading: http://repo1.maven.org/maven2/org/eclipse/tycho/org.eclipse.tycho.embedder.shared/0.14.0/org.eclipse.tycho.embedder.shared-0.14.0.jar
Downloaded: http://repo1.maven.org/maven2/de/pdark/decentxml/1.3/decentxml-1.3.jar (109 KB at 1037.7 KB/sec)
Downloading: http://repo1.maven.org/maven2/org/eclipse/tycho/org.eclipse.tycho.core.shared/0.14.0/org.eclipse.tycho.core.shared-0.14.0.jar
Downloaded: http://repo1.maven.org/maven2/org/codehaus/plexus/plexus-utils/2.0.4/plexus-utils-2.0.4.jar (217 KB at 488.6 KB/sec)
Downloading: http://repo1.maven.org/maven2/org/eclipse/tycho/tycho-p2-facade/0.14.0/tycho-p2-facade-0.14.0.jar
Downloaded: http://repo1.maven.org/maven2/org/eclipse/tycho/tycho-embedder-api/0.14.0/tycho-embedder-api-0.14.0.jar (8 KB at 57.2 KB/sec)
Downloading: http://repo1.maven.org/maven2/org/codehaus/plexus/plexus-component-annotations/1.5.5/plexus-component-annotations-1.5.5.jar
Downloaded: http://repo1.maven.org/maven2/org/eclipse/tycho/org.eclipse.tycho.embedder.shared/0.14.0/org.eclipse.tycho.embedder.shared-0.14.0.jar (6 KB at 38.9 KB/sec)
Downloading: http://repo1.maven.org/maven2/org/sonatype/sisu/sisu-inject-bean/1.4.2/sisu-inject-bean-1.4.2.jar
Downloaded: http://repo1.maven.org/maven2/org/eclipse/tycho/tycho-p2-facade/0.14.0/tycho-p2-facade-0.14.0.jar (34 KB at 400.4 KB/sec)
Downloading: http://repo1.maven.org/maven2/org/sonatype/sisu/sisu-guice/2.1.7/sisu-guice-2.1.7-noaop.jar
Downloaded: http://repo1.maven.org/maven2/org/codehaus/plexus/plexus-component-annotations/1.5.5/plexus-component-annotations-1.5.5.jar (5 KB at 100.3 KB/sec)
Downloading: http://repo1.maven.org/maven2/org/eclipse/tycho/org.eclipse.tycho.p2.resolver.shared/0.14.0/org.eclipse.tycho.p2.resolver.shared-0.14.0.jar
Downloaded: http://repo1.maven.org/maven2/org/eclipse/tycho/org.eclipse.tycho.core.shared/0.14.0/org.eclipse.tycho.core.shared-0.14.0.jar (20 KB at 133.7 KB/sec)
Downloading: http://repo1.maven.org/maven2/org/eclipse/tycho/org.eclipse.tycho.p2.tools.shared/0.14.0/org.eclipse.tycho.p2.tools.shared-0.14.0.jar
Downloaded: http://repo1.maven.org/maven2/org/eclipse/tycho/org.eclipse.tycho.p2.resolver.shared/0.14.0/org.eclipse.tycho.p2.resolver.shared-0.14.0.jar (24 KB at 362.8 KB/sec)
Downloaded: http://repo1.maven.org/maven2/org/eclipse/tycho/org.eclipse.tycho.p2.tools.shared/0.14.0/org.eclipse.tycho.p2.tools.shared-0.14.0.jar (14 KB at 313.9 KB/sec)
Downloaded: http://repo1.maven.org/maven2/org/sonatype/sisu/sisu-inject-bean/1.4.2/sisu-inject-bean-1.4.2.jar (150 KB at 398.4 KB/sec)
Downloaded: http://repo1.maven.org/maven2/org/sonatype/sisu/sisu-guice/2.1.7/sisu-guice-2.1.7-noaop.jar (461 KB at 776.9 KB/sec)
Downloaded: http://repo1.maven.org/maven2/org/eclipse/tycho/org.eclipse.osgi/3.8.0.v20120123-1419/org.eclipse.osgi-3.8.0.v20120123-1419.jar (1357 KB at 685.6 KB/sec)
[WARNING] No explicit target runtime environment configuration. Build is platform dependent.
Downloading: http://repo1.maven.org/maven2/org/eclipse/tycho/tycho-bundles-external/0.14.0/tycho-bundles-external-0.14.0.zip
Downloaded: http://repo1.maven.org/maven2/org/eclipse/tycho/tycho-bundles-external/0.14.0/tycho-bundles-external-0.14.0.zip (5452 KB at 3463.3 KB/sec)
Downloading: http://repo1.maven.org/maven2/org/eclipse/tycho/org.eclipse.tycho.p2.resolver.impl/0.14.0/org.eclipse.tycho.p2.resolver.impl-0.14.0.jar
Downloaded: http://repo1.maven.org/maven2/org/eclipse/tycho/org.eclipse.tycho.p2.resolver.impl/0.14.0/org.eclipse.tycho.p2.resolver.impl-0.14.0.jar (150 KB at 595.2 KB/sec)
Downloading: http://repo1.maven.org/maven2/org/eclipse/tycho/org.eclipse.tycho.p2.maven.repository/0.14.0/org.eclipse.tycho.p2.maven.repository-0.14.0.jar
Downloaded: http://repo1.maven.org/maven2/org/eclipse/tycho/org.eclipse.tycho.p2.maven.repository/0.14.0/org.eclipse.tycho.p2.maven.repository-0.14.0.jar (68 KB at 923.5 KB/sec)
Downloading: http://repo1.maven.org/maven2/org/eclipse/tycho/org.eclipse.tycho.p2.tools.impl/0.14.0/org.eclipse.tycho.p2.tools.impl-0.14.0.jar
Downloaded: http://repo1.maven.org/maven2/org/eclipse/tycho/org.eclipse.tycho.p2.tools.impl/0.14.0/org.eclipse.tycho.p2.tools.impl-0.14.0.jar (26 KB at 544.7 KB/sec)
Downloading: http://repo1.maven.org/maven2/org/eclipse/tycho/target-platform-configuration/0.14.0/target-platform-configuration-0.14.0.pom
Downloaded: http://repo1.maven.org/maven2/org/eclipse/tycho/target-platform-configuration/0.14.0/target-platform-configuration-0.14.0.pom (2 KB at 24.1 KB/sec)
Downloading: http://repo1.maven.org/maven2/org/eclipse/tycho/target-platform-configuration/0.14.0/target-platform-configuration-0.14.0.jar
Downloaded: http://repo1.maven.org/maven2/org/eclipse/tycho/target-platform-configuration/0.14.0/target-platform-configuration-0.14.0.jar (4 KB at 72.6 KB/sec)
Downloading: http://repo1.maven.org/maven2/org/eclipse/tycho/tycho-source-plugin/0.14.0/tycho-source-plugin-0.14.0.pom
Downloaded: http://repo1.maven.org/maven2/org/eclipse/tycho/tycho-source-plugin/0.14.0/tycho-source-plugin-0.14.0.pom (3 KB at 51.5 KB/sec)
Downloading: http://repo1.maven.org/maven2/org/eclipse/tycho/tycho-source-plugin/0.14.0/tycho-source-plugin-0.14.0.jar
Downloaded: http://repo1.maven.org/maven2/org/eclipse/tycho/tycho-source-plugin/0.14.0/tycho-source-plugin-0.14.0.jar (16 KB at 103.5 KB/sec)
Downloading: http://repo1.maven.org/maven2/org/apache/maven/plugins/maven-source-plugin/2.1/maven-source-plugin-2.1.pom
Downloaded: http://repo1.maven.org/maven2/org/apache/maven/plugins/maven-source-plugin/2.1/maven-source-plugin-2.1.pom (5 KB at 108.8 KB/sec)
Downloading: http://repo1.maven.org/maven2/org/apache/maven/plugins/maven-plugins/13/maven-plugins-13.pom
Downloaded: http://repo1.maven.org/maven2/org/apache/maven/plugins/maven-plugins/13/maven-plugins-13.pom (12 KB at 280.7 KB/sec)
Downloading: http://repo1.maven.org/maven2/org/apache/maven/maven-parent/11/maven-parent-11.pom
Downloaded: http://repo1.maven.org/maven2/org/apache/maven/maven-parent/11/maven-parent-11.pom (32 KB at 536.4 KB/sec)
Downloading: http://repo1.maven.org/maven2/org/apache/apache/5/apache-5.pom
Downloaded: http://repo1.maven.org/maven2/org/apache/apache/5/apache-5.pom (5 KB at 97.6 KB/sec)
Downloading: http://repo1.maven.org/maven2/org/apache/maven/maven-archiver/2.4/maven-archiver-2.4.pom
Downloaded: http://repo1.maven.org/maven2/org/apache/maven/maven-archiver/2.4/maven-archiver-2.4.pom (4 KB at 71.3 KB/sec)
Downloading: http://repo1.maven.org/maven2/org/apache/maven/shared/maven-shared-components/10/maven-shared-components-10.pom
Downloaded: http://repo1.maven.org/maven2/org/apache/maven/shared/maven-shared-components/10/maven-shared-components-10.pom (9 KB at 196.1 KB/sec)
Downloading: http://repo1.maven.org/maven2/org/apache/maven/maven-parent/9/maven-parent-9.pom
Downloaded: http://repo1.maven.org/maven2/org/apache/maven/maven-parent/9/maven-parent-9.pom (33 KB at 534.5 KB/sec)
Downloading: http://repo1.maven.org/maven2/org/apache/apache/4/apache-4.pom
Downloaded: http://repo1.maven.org/maven2/org/apache/apache/4/apache-4.pom (5 KB at 104.5 KB/sec)
Downloading: http://repo1.maven.org/maven2/org/codehaus/plexus/plexus-interpolation/1.6/plexus-interpolation-1.6.pom
Downloaded: http://repo1.maven.org/maven2/org/codehaus/plexus/plexus-interpolation/1.6/plexus-interpolation-1.6.pom (3 KB at 69.2 KB/sec)
Downloading: http://repo1.maven.org/maven2/org/codehaus/plexus/plexus/1.0.11/plexus-1.0.11.pom
Downloaded: http://repo1.maven.org/maven2/org/codehaus/plexus/plexus/1.0.11/plexus-1.0.11.pom (9 KB at 213.6 KB/sec)
Downloading: http://repo1.maven.org/maven2/org/eclipse/tycho/tycho-packaging-plugin/0.14.0/tycho-packaging-plugin-0.14.0.pom
Downloaded: http://repo1.maven.org/maven2/org/eclipse/tycho/tycho-packaging-plugin/0.14.0/tycho-packaging-plugin-0.14.0.pom (3 KB at 54.1 KB/sec)
Downloading: http://repo1.maven.org/maven2/org/apache/maven/plugins/maven-source-plugin/2.1/maven-source-plugin-2.1.jar
Downloading: http://repo1.maven.org/maven2/org/apache/maven/maven-archiver/2.4/maven-archiver-2.4.jar
Downloading: http://repo1.maven.org/maven2/org/eclipse/tycho/tycho-packaging-plugin/0.14.0/tycho-packaging-plugin-0.14.0.jar
Downloaded: http://repo1.maven.org/maven2/org/apache/maven/maven-archiver/2.4/maven-archiver-2.4.jar (20 KB at 118.3 KB/sec)
Downloaded: http://repo1.maven.org/maven2/org/apache/maven/plugins/maven-source-plugin/2.1/maven-source-plugin-2.1.jar (24 KB at 142.8 KB/sec)
Downloaded: http://repo1.maven.org/maven2/org/eclipse/tycho/tycho-packaging-plugin/0.14.0/tycho-packaging-plugin-0.14.0.jar (95 KB at 308.3 KB/sec)
Downloading: http://repo1.maven.org/maven2/org/apache/maven/plugins/maven-clean-plugin/2.4.1/maven-clean-plugin-2.4.1.pom
Downloaded: http://repo1.maven.org/maven2/org/apache/maven/plugins/maven-clean-plugin/2.4.1/maven-clean-plugin-2.4.1.pom (5 KB at 94.4 KB/sec)
Downloading: http://repo1.maven.org/maven2/org/apache/maven/plugins/maven-plugins/18/maven-plugins-18.pom
Downloaded: http://repo1.maven.org/maven2/org/apache/maven/plugins/maven-plugins/18/maven-plugins-18.pom (13 KB at 295.3 KB/sec)
Downloading: http://repo1.maven.org/maven2/org/apache/maven/maven-parent/16/maven-parent-16.pom
Downloaded: http://repo1.maven.org/maven2/org/apache/maven/maven-parent/16/maven-parent-16.pom (23 KB at 372.6 KB/sec)
Downloading: http://repo1.maven.org/maven2/org/apache/apache/7/apache-7.pom
Downloaded: http://repo1.maven.org/maven2/org/apache/apache/7/apache-7.pom (15 KB at 335.5 KB/sec)
Downloading: http://repo1.maven.org/maven2/org/apache/maven/plugins/maven-clean-plugin/2.4.1/maven-clean-plugin-2.4.1.jar
Downloaded: http://repo1.maven.org/maven2/org/apache/maven/plugins/maven-clean-plugin/2.4.1/maven-clean-plugin-2.4.1.jar (23 KB at 377.0 KB/sec)
Downloading: http://repo1.maven.org/maven2/org/eclipse/tycho/tycho-compiler-plugin/0.14.0/tycho-compiler-plugin-0.14.0.pom
Downloaded: http://repo1.maven.org/maven2/org/eclipse/tycho/tycho-compiler-plugin/0.14.0/tycho-compiler-plugin-0.14.0.pom (3 KB at 12.9 KB/sec)
Downloading: http://repo1.maven.org/maven2/org/eclipse/tycho/tycho-compiler-plugin/0.14.0/tycho-compiler-plugin-0.14.0.jar
Downloaded: http://repo1.maven.org/maven2/org/eclipse/tycho/tycho-compiler-plugin/0.14.0/tycho-compiler-plugin-0.14.0.jar (25 KB at 371.4 KB/sec)
Downloading: http://repo1.maven.org/maven2/org/eclipse/tycho/tycho-p2-plugin/0.14.0/tycho-p2-plugin-0.14.0.pom
Downloaded: http://repo1.maven.org/maven2/org/eclipse/tycho/tycho-p2-plugin/0.14.0/tycho-p2-plugin-0.14.0.pom (2 KB at 7.2 KB/sec)
Downloading: http://repo1.maven.org/maven2/org/eclipse/tycho/tycho-p2-plugin/0.14.0/tycho-p2-plugin-0.14.0.jar
Downloaded: http://repo1.maven.org/maven2/org/eclipse/tycho/tycho-p2-plugin/0.14.0/tycho-p2-plugin-0.14.0.jar (13 KB at 260.9 KB/sec)
Downloading: http://repo1.maven.org/maven2/org/eclipse/tycho/sisu-equinox-launching/0.14.0/sisu-equinox-launching-0.14.0.pom
Downloaded: http://repo1.maven.org/maven2/org/eclipse/tycho/sisu-equinox-launching/0.14.0/sisu-equinox-launching-0.14.0.pom (3 KB at 29.4 KB/sec)
Downloading: http://repo1.maven.org/maven2/org/eclipse/tycho/sisu-equinox-launching/0.14.0/sisu-equinox-launching-0.14.0.jar
Downloaded: http://repo1.maven.org/maven2/org/eclipse/tycho/sisu-equinox-launching/0.14.0/sisu-equinox-launching-0.14.0.jar (24 KB at 369.3 KB/sec)
Downloading: http://repo1.maven.org/maven2/org/apache/maven/plugins/maven-deploy-plugin/2.5/maven-deploy-plugin-2.5.pom
Downloaded: http://repo1.maven.org/maven2/org/apache/maven/plugins/maven-deploy-plugin/2.5/maven-deploy-plugin-2.5.pom (6 KB at 132.7 KB/sec)
Downloading: http://repo1.maven.org/maven2/org/apache/maven/plugins/maven-plugins/16/maven-plugins-16.pom
Downloaded: http://repo1.maven.org/maven2/org/apache/maven/plugins/maven-plugins/16/maven-plugins-16.pom (13 KB at 301.1 KB/sec)
Downloading: http://repo1.maven.org/maven2/org/apache/maven/plugins/maven-deploy-plugin/2.5/maven-deploy-plugin-2.5.jar
Downloaded: http://repo1.maven.org/maven2/org/apache/maven/plugins/maven-deploy-plugin/2.5/maven-deploy-plugin-2.5.jar (23 KB at 369.7 KB/sec)
Downloading: http://repo1.maven.org/maven2/org/apache/maven/plugins/maven-resources-plugin/2.5/maven-resources-plugin-2.5.pom
Downloaded: http://repo1.maven.org/maven2/org/apache/maven/plugins/maven-resources-plugin/2.5/maven-resources-plugin-2.5.pom (7 KB at 165.4 KB/sec)
Downloading: http://repo1.maven.org/maven2/org/apache/maven/plugins/maven-plugins/19/maven-plugins-19.pom
Downloaded: http://repo1.maven.org/maven2/org/apache/maven/plugins/maven-plugins/19/maven-plugins-19.pom (11 KB at 255.9 KB/sec)
Downloading: http://repo1.maven.org/maven2/org/apache/maven/maven-parent/19/maven-parent-19.pom
Downloaded: http://repo1.maven.org/maven2/org/apache/maven/maven-parent/19/maven-parent-19.pom (25 KB at 400.3 KB/sec)
Downloading: http://repo1.maven.org/maven2/org/apache/apache/9/apache-9.pom
Downloaded: http://repo1.maven.org/maven2/org/apache/apache/9/apache-9.pom (15 KB at 264.4 KB/sec)
Downloading: http://repo1.maven.org/maven2/org/apache/maven/plugins/maven-resources-plugin/2.5/maven-resources-plugin-2.5.jar
Downloaded: http://repo1.maven.org/maven2/org/apache/maven/plugins/maven-resources-plugin/2.5/maven-resources-plugin-2.5.jar (26 KB at 418.9 KB/sec)
Downloading: http://repo1.maven.org/maven2/org/apache/maven/plugins/maven-install-plugin/2.3.1/maven-install-plugin-2.3.1.pom
Downloaded: http://repo1.maven.org/maven2/org/apache/maven/plugins/maven-install-plugin/2.3.1/maven-install-plugin-2.3.1.pom (5 KB at 99.4 KB/sec)
Downloading: http://repo1.maven.org/maven2/org/apache/maven/plugins/maven-install-plugin/2.3.1/maven-install-plugin-2.3.1.jar
Downloaded: http://repo1.maven.org/maven2/org/apache/maven/plugins/maven-install-plugin/2.3.1/maven-install-plugin-2.3.1.jar (23 KB at 364.4 KB/sec)
Downloading: http://repo1.maven.org/maven2/org/apache/maven/plugins/maven-site-plugin/2.0.1/maven-site-plugin-2.0.1.pom
Downloaded: http://repo1.maven.org/maven2/org/apache/maven/plugins/maven-site-plugin/2.0.1/maven-site-plugin-2.0.1.pom (14 KB at 318.2 KB/sec)
Downloading: http://repo1.maven.org/maven2/org/apache/maven/plugins/maven-site-plugin/2.0.1/maven-site-plugin-2.0.1.jar
Downloaded: http://repo1.maven.org/maven2/org/apache/maven/plugins/maven-site-plugin/2.0.1/maven-site-plugin-2.0.1.jar (79 KB at 666.4 KB/sec)
[WARNING] No explicit target runtime environment configuration. Build is platform dependent.
[WARNING] No explicit target runtime environment configuration. Build is platform dependent.
[WARNING] No explicit target runtime environment configuration. Build is platform dependent.
[WARNING] No explicit target runtime environment configuration. Build is platform dependent.
[WARNING] No explicit target runtime environment configuration. Build is platform dependent.
[WARNING] No explicit target runtime environment configuration. Build is platform dependent.
[WARNING] No explicit target runtime environment configuration. Build is platform dependent.
Downloading: http://repo1.maven.org/maven2/org/eclipse/tycho/tycho-p2-publisher-plugin/0.14.0/tycho-p2-publisher-plugin-0.14.0.pom
Downloaded: http://repo1.maven.org/maven2/org/eclipse/tycho/tycho-p2-publisher-plugin/0.14.0/tycho-p2-publisher-plugin-0.14.0.pom (2 KB at 35.2 KB/sec)
Downloading: http://repo1.maven.org/maven2/org/eclipse/tycho/tycho-p2-publisher-plugin/0.14.0/tycho-p2-publisher-plugin-0.14.0.jar
Downloaded: http://repo1.maven.org/maven2/org/eclipse/tycho/tycho-p2-publisher-plugin/0.14.0/tycho-p2-publisher-plugin-0.14.0.jar (18 KB at 267.8 KB/sec)
Downloading: http://repo1.maven.org/maven2/org/eclipse/tycho/tycho-p2-repository-plugin/0.14.0/tycho-p2-repository-plugin-0.14.0.pom
Downloaded: http://repo1.maven.org/maven2/org/eclipse/tycho/tycho-p2-repository-plugin/0.14.0/tycho-p2-repository-plugin-0.14.0.pom (2 KB at 29.6 KB/sec)
Downloading: http://repo1.maven.org/maven2/org/eclipse/tycho/tycho-p2-repository-plugin/0.14.0/tycho-p2-repository-plugin-0.14.0.jar
Downloaded: http://repo1.maven.org/maven2/org/eclipse/tycho/tycho-p2-repository-plugin/0.14.0/tycho-p2-repository-plugin-0.14.0.jar (11 KB at 223.7 KB/sec)
[INFO] Computing target platform for MavenProject: org.eclipse.gemini:org.eclipse.gemini.jpa:1.2.0.M2 @ /opt/buildhomes/hudsonBuild/workspace/gemini-jpa/org.eclipse.gemini.jpa/pom.xml
[INFO] Resolving dependencies of MavenProject: org.eclipse.gemini:org.eclipse.gemini.jpa:1.2.0.M2 @ /opt/buildhomes/hudsonBuild/workspace/gemini-jpa/org.eclipse.gemini.jpa/pom.xml
[INFO] Downloading org.eclipse.equinox.servletbridge.extensionbundle
[INFO] Fetching download.php (0B of 76B at 0B/s) from http://www.eclipse.org/downloads/download.php?format=xml&file=/releases/juno/201303010900/&countryCode=us&timeZone=-5&format=xml
[INFO] Fetching download.php (63B of 76B at 0B/s) from http://www.eclipse.org/downloads/download.php?format=xml&file=/releases/juno/201303010900/&countryCode=us&timeZone=-5&format=xml
[INFO] Fetching org.eclipse.equinox.servletbridge.extensionbundle_1.2.100.v20120522-2049.jar.pack.gz (0B of 6.06kB at 0B/s) from http://download.eclipse.org/releases/juno/201303010900/plugins/
[INFO] Fetching org.eclipse.equinox.servletbridge.extensionbundle_1.2.100.v20120522-2049.jar.pack.gz (4kB of 6.06kB at 0B/s) from http://download.eclipse.org/releases/juno/201303010900/plugins/
[INFO] 1 operation remaining.
[INFO] Downloading org.eclipse.osgi
[INFO] Fetching download.php (0B of 76B at 0B/s) from http://www.eclipse.org/downloads/download.php?format=xml&file=/releases/juno/201209280900/&countryCode=us&timeZone=-5&format=xml
[INFO] Fetching download.php (63B of 76B at 0B/s) from http://www.eclipse.org/downloads/download.php?format=xml&file=/releases/juno/201209280900/&countryCode=us&timeZone=-5&format=xml
[INFO] Fetching org.eclipse.osgi_3.8.1.v20120830-144521.jar.pack.gz (0B of 462kB at 0B/s) from http://download.eclipse.org/releases/juno/201209280900/plugins/
[INFO] 1 operation remaining.
[INFO] Fetching org.eclipse.osgi_3.8.1.v20120830-144521.jar.pack.gz (4kB of 462kB at 0B/s) from http://download.eclipse.org/releases/juno/201209280900/plugins/
[INFO] Downloading osgi.enterprise
[INFO] Fetching osgi.enterprise_4.2.0.201003190513.jar (0B of 294.55kB at 0B/s) from http://download.eclipse.org/gemini/dbaccess/updates/1.0/plugins/
[INFO] 1 operation remaining.
[INFO] Fetching osgi.enterprise_4.2.0.201003190513.jar (4kB of 294.55kB at 0B/s) from http://download.eclipse.org/gemini/dbaccess/updates/1.0/plugins/
[INFO] Downloading javax.persistence
[INFO] Downloading org.eclipse.persistence.asm
[INFO] Downloading org.eclipse.persistence.antlr
[INFO] Downloading org.eclipse.persistence.core
[INFO] Fetching javax.persistence_2.1.0.v201304241213.jar (0B of 158.33kB at 0B/s) from http://download.eclipse.org/rt/eclipselink/updates/2.5.0.v20130507-3faac2b/plugins/
[INFO] 1 operation remaining.
[INFO] Fetching org.eclipse.persistence.antlr_3.2.0.v201302191141.jar (0B of 185.2kB at 0B/s) from http://download.eclipse.org/rt/eclipselink/updates/2.5.0.v20130507-3faac2b/plugins/
[INFO] 1 operation remaining.
[INFO] Fetching org.eclipse.persistence.core_2.5.0.v20130507-3faac2b.jar (0B of 4.75MB at 0B/s) from http://download.eclipse.org/rt/eclipselink/updates/2.5.0.v20130507-3faac2b/plugins/
[INFO] 1 operation remaining.
[INFO] Fetching javax.persistence_2.1.0.v201304241213.jar (4kB of 158.33kB at 0B/s) from http://download.eclipse.org/rt/eclipselink/updates/2.5.0.v20130507-3faac2b/plugins/
[INFO] Fetching org.eclipse.persistence.core_2.5.0.v20130507-3faac2b.jar (4kB of 4.75MB at 0B/s) from http://download.eclipse.org/rt/eclipselink/updates/2.5.0.v20130507-3faac2b/plugins/
[INFO] Fetching org.eclipse.persistence.antlr_3.2.0.v201302191141.jar (4kB of 185.2kB at 0B/s) from http://download.eclipse.org/rt/eclipselink/updates/2.5.0.v20130507-3faac2b/plugins/
[INFO] Fetching org.eclipse.persistence.asm_3.3.1.v201302191223.jar (0B of 264.85kB at 0B/s) from http://download.eclipse.org/rt/eclipselink/updates/2.5.0.v20130507-3faac2b/plugins/
[INFO] 1 operation remaining.
[INFO] Fetching org.eclipse.persistence.asm_3.3.1.v201302191223.jar (4kB of 264.85kB at 0B/s) from http://download.eclipse.org/rt/eclipselink/updates/2.5.0.v20130507-3faac2b/plugins/
[INFO] Downloading org.eclipse.persistence.jpa
[INFO] Fetching org.eclipse.persistence.jpa_2.5.0.v20130507-3faac2b.jar (0B of 1.09MB at 0B/s) from http://download.eclipse.org/rt/eclipselink/updates/2.5.0.v20130507-3faac2b/plugins/
[INFO] 1 operation remaining.
[INFO] Fetching org.eclipse.persistence.jpa_2.5.0.v20130507-3faac2b.jar (4kB of 1.09MB at 0B/s) from http://download.eclipse.org/rt/eclipselink/updates/2.5.0.v20130507-3faac2b/plugins/
[INFO] Downloading org.eclipse.persistence.jpa.jpql
[INFO] Fetching org.eclipse.persistence.jpa.jpql_2.5.0.v20130507-3faac2b.jar (0B of 1.33MB at 0B/s) from http://download.eclipse.org/rt/eclipselink/updates/2.5.0.v20130507-3faac2b/plugins/
[INFO] 1 operation remaining.
[INFO] Fetching org.eclipse.persistence.jpa.jpql_2.5.0.v20130507-3faac2b.jar (4kB of 1.33MB at 0B/s) from http://download.eclipse.org/rt/eclipselink/updates/2.5.0.v20130507-3faac2b/plugins/
[INFO] Resolving class path of MavenProject: org.eclipse.gemini:org.eclipse.gemini.jpa:1.2.0.M2 @ /opt/buildhomes/hudsonBuild/workspace/gemini-jpa/org.eclipse.gemini.jpa/pom.xml
[INFO] Computing target platform for MavenProject: org.eclipse.gemini:org.eclipse.gemini.jpa.sample.basic:1.2.0.M2 @ /opt/buildhomes/hudsonBuild/workspace/gemini-jpa/org.eclipse.gemini.jpa.sample.basic/pom.xml
[INFO] Resolving dependencies of MavenProject: org.eclipse.gemini:org.eclipse.gemini.jpa.sample.basic:1.2.0.M2 @ /opt/buildhomes/hudsonBuild/workspace/gemini-jpa/org.eclipse.gemini.jpa.sample.basic/pom.xml
[INFO] Resolving class path of MavenProject: org.eclipse.gemini:org.eclipse.gemini.jpa.sample.basic:1.2.0.M2 @ /opt/buildhomes/hudsonBuild/workspace/gemini-jpa/org.eclipse.gemini.jpa.sample.basic/pom.xml
[INFO] Computing target platform for MavenProject: org.eclipse.gemini:org.eclipse.gemini.jpa.sample.configadmin.gen:1.2.0.M2 @ /opt/buildhomes/hudsonBuild/workspace/gemini-jpa/org.eclipse.gemini.jpa.sample.configadmin.gen/pom.xml
[INFO] Resolving dependencies of MavenProject: org.eclipse.gemini:org.eclipse.gemini.jpa.sample.configadmin.gen:1.2.0.M2 @ /opt/buildhomes/hudsonBuild/workspace/gemini-jpa/org.eclipse.gemini.jpa.sample.configadmin.gen/pom.xml
[INFO] Downloading org.eclipse.osgi.services
[INFO] Fetching org.eclipse.osgi.services_3.3.100.v20120522-1822.jar.pack.gz (0B of 31.33kB at 0B/s) from http://download.eclipse.org/releases/juno/201303010900/plugins/
[INFO] 1 operation remaining.
[INFO] Fetching org.eclipse.osgi.services_3.3.100.v20120522-1822.jar.pack.gz (4kB of 31.33kB at 0B/s) from http://download.eclipse.org/releases/juno/201303010900/plugins/
[INFO] Resolving class path of MavenProject: org.eclipse.gemini:org.eclipse.gemini.jpa.sample.configadmin.gen:1.2.0.M2 @ /opt/buildhomes/hudsonBuild/workspace/gemini-jpa/org.eclipse.gemini.jpa.sample.configadmin.gen/pom.xml
[INFO] Computing target platform for MavenProject: org.eclipse.gemini:org.eclipse.gemini.jpa.sample.configadmin.pu:1.2.0.M2 @ /opt/buildhomes/hudsonBuild/workspace/gemini-jpa/org.eclipse.gemini.jpa.sample.configadmin.pu/pom.xml
[INFO] Resolving dependencies of MavenProject: org.eclipse.gemini:org.eclipse.gemini.jpa.sample.configadmin.pu:1.2.0.M2 @ /opt/buildhomes/hudsonBuild/workspace/gemini-jpa/org.eclipse.gemini.jpa.sample.configadmin.pu/pom.xml
[INFO] Resolving class path of MavenProject: org.eclipse.gemini:org.eclipse.gemini.jpa.sample.configadmin.pu:1.2.0.M2 @ /opt/buildhomes/hudsonBuild/workspace/gemini-jpa/org.eclipse.gemini.jpa.sample.configadmin.pu/pom.xml
[INFO] Computing target platform for MavenProject: org.eclipse.gemini:org.eclipse.gemini.jpa.sample.configadmin:1.2.0.M2 @ /opt/buildhomes/hudsonBuild/workspace/gemini-jpa/org.eclipse.gemini.jpa.sample.configadmin/pom.xml
[INFO] Resolving dependencies of MavenProject: org.eclipse.gemini:org.eclipse.gemini.jpa.sample.configadmin:1.2.0.M2 @ /opt/buildhomes/hudsonBuild/workspace/gemini-jpa/org.eclipse.gemini.jpa.sample.configadmin/pom.xml
[INFO] Resolving class path of MavenProject: org.eclipse.gemini:org.eclipse.gemini.jpa.sample.configadmin:1.2.0.M2 @ /opt/buildhomes/hudsonBuild/workspace/gemini-jpa/org.eclipse.gemini.jpa.sample.configadmin/pom.xml
[INFO] Computing target platform for MavenProject: org.eclipse.gemini:org.eclipse.gemini.jpa.feature:1.2.0.M2 @ /opt/buildhomes/hudsonBuild/workspace/gemini-jpa/org.eclipse.gemini.jpa.feature/pom.xml
[INFO] Resolving dependencies of MavenProject: org.eclipse.gemini:org.eclipse.gemini.jpa.feature:1.2.0.M2 @ /opt/buildhomes/hudsonBuild/workspace/gemini-jpa/org.eclipse.gemini.jpa.feature/pom.xml
[INFO] Resolving class path of MavenProject: org.eclipse.gemini:org.eclipse.gemini.jpa.feature:1.2.0.M2 @ /opt/buildhomes/hudsonBuild/workspace/gemini-jpa/org.eclipse.gemini.jpa.feature/pom.xml
[INFO] Computing target platform for MavenProject: org.eclipse.gemini:org.eclipse.gemini.jpa.samples.feature:1.2.0.M2 @ /opt/buildhomes/hudsonBuild/workspace/gemini-jpa/org.eclipse.gemini.jpa.samples.feature/pom.xml
[INFO] Resolving dependencies of MavenProject: org.eclipse.gemini:org.eclipse.gemini.jpa.samples.feature:1.2.0.M2 @ /opt/buildhomes/hudsonBuild/workspace/gemini-jpa/org.eclipse.gemini.jpa.samples.feature/pom.xml
[INFO] Downloading javax.servlet
[INFO] Fetching javax.servlet_3.0.0.v201112011016.jar.pack.gz (0B of 120kB at 0B/s) from http://download.eclipse.org/releases/juno/201303010900/plugins/
[INFO] 1 operation remaining.
[INFO] Fetching javax.servlet_3.0.0.v201112011016.jar.pack.gz (4kB of 120kB at 0B/s) from http://download.eclipse.org/releases/juno/201303010900/plugins/
[INFO] Resolving class path of MavenProject: org.eclipse.gemini:org.eclipse.gemini.jpa.samples.feature:1.2.0.M2 @ /opt/buildhomes/hudsonBuild/workspace/gemini-jpa/org.eclipse.gemini.jpa.samples.feature/pom.xml
[INFO] Computing target platform for MavenProject: org.eclipse.gemini:org.eclipse.gemini.jpa.updatesite:1.2.0.M2 @ /opt/buildhomes/hudsonBuild/workspace/gemini-jpa/org.eclipse.gemini.jpa.updatesite/pom.xml
[INFO] Resolving dependencies of MavenProject: org.eclipse.gemini:org.eclipse.gemini.jpa.updatesite:1.2.0.M2 @ /opt/buildhomes/hudsonBuild/workspace/gemini-jpa/org.eclipse.gemini.jpa.updatesite/pom.xml
[INFO] Resolving class path of MavenProject: org.eclipse.gemini:org.eclipse.gemini.jpa.updatesite:1.2.0.M2 @ /opt/buildhomes/hudsonBuild/workspace/gemini-jpa/org.eclipse.gemini.jpa.updatesite/pom.xml
[INFO] ------------------------------------------------------------------------
[INFO] Reactor Build Order:
[INFO] 
[INFO] Gemini JPA Parent
[INFO] org.eclipse.gemini.jpa.targetdef
[INFO] org.eclipse.gemini.jpa
[INFO] org.eclipse.gemini.jpa.sample.basic
[INFO] org.eclipse.gemini.jpa.sample.configadmin.gen
[INFO] org.eclipse.gemini.jpa.sample.configadmin.pu
[INFO] org.eclipse.gemini.jpa.sample.configadmin
[INFO] org.eclipse.gemini.jpa.feature
[INFO] org.eclipse.gemini.jpa.samples.feature
[INFO] org.eclipse.gemini.jpa.updatesite
[INFO]                                                                         
[INFO] ------------------------------------------------------------------------
[INFO] Building Gemini JPA Parent 1.2.0.M2
[INFO] ------------------------------------------------------------------------
[INFO] 
[INFO] --- maven-clean-plugin:2.4.1:clean (default-clean) @ org.eclipse.gemini.jpa.parent ---
Downloading: http://repo1.maven.org/maven2/org/apache/maven/maven-plugin-api/2.0.6/maven-plugin-api-2.0.6.pom
Downloaded: http://repo1.maven.org/maven2/org/apache/maven/maven-plugin-api/2.0.6/maven-plugin-api-2.0.6.pom (2 KB at 23.3 KB/sec)
Downloading: http://repo1.maven.org/maven2/org/apache/maven/maven/2.0.6/maven-2.0.6.pom
Downloaded: http://repo1.maven.org/maven2/org/apache/maven/maven/2.0.6/maven-2.0.6.pom (9 KB at 215.5 KB/sec)
Downloading: http://repo1.maven.org/maven2/org/apache/maven/maven-parent/5/maven-parent-5.pom
Downloaded: http://repo1.maven.org/maven2/org/apache/maven/maven-parent/5/maven-parent-5.pom (15 KB at 252.2 KB/sec)
Downloading: http://repo1.maven.org/maven2/org/apache/apache/3/apache-3.pom
Downloaded: http://repo1.maven.org/maven2/org/apache/apache/3/apache-3.pom (4 KB at 81.7 KB/sec)
Downloading: http://repo1.maven.org/maven2/org/codehaus/plexus/plexus-utils/2.0.5/plexus-utils-2.0.5.pom
Downloaded: http://repo1.maven.org/maven2/org/codehaus/plexus/plexus-utils/2.0.5/plexus-utils-2.0.5.pom (4 KB at 79.4 KB/sec)
Downloading: http://repo1.maven.org/maven2/org/codehaus/plexus/plexus-utils/2.0.5/plexus-utils-2.0.5.jar
Downloaded: http://repo1.maven.org/maven2/org/codehaus/plexus/plexus-utils/2.0.5/plexus-utils-2.0.5.jar (218 KB at 762.0 KB/sec)
[INFO] 
[INFO] --- tycho-source-plugin:0.14.0:plugin-source (attach-source) @ org.eclipse.gemini.jpa.parent ---
[INFO] 
[INFO] --- maven-install-plugin:2.3.1:install (default-install) @ org.eclipse.gemini.jpa.parent ---
Downloading: http://repo1.maven.org/maven2/org/apache/maven/maven-project/2.0.6/maven-project-2.0.6.pom
Downloaded: http://repo1.maven.org/maven2/org/apache/maven/maven-project/2.0.6/maven-project-2.0.6.pom (3 KB at 62.8 KB/sec)
Downloading: http://repo1.maven.org/maven2/org/apache/maven/maven-settings/2.0.6/maven-settings-2.0.6.pom
Downloaded: http://repo1.maven.org/maven2/org/apache/maven/maven-settings/2.0.6/maven-settings-2.0.6.pom (2 KB at 47.7 KB/sec)
Downloading: http://repo1.maven.org/maven2/org/apache/maven/maven-model/2.0.6/maven-model-2.0.6.pom
Downloaded: http://repo1.maven.org/maven2/org/apache/maven/maven-model/2.0.6/maven-model-2.0.6.pom (3 KB at 70.8 KB/sec)
Downloading: http://repo1.maven.org/maven2/org/codehaus/plexus/plexus-utils/1.4.1/plexus-utils-1.4.1.pom
Downloaded: http://repo1.maven.org/maven2/org/codehaus/plexus/plexus-utils/1.4.1/plexus-utils-1.4.1.pom (2 KB at 44.4 KB/sec)
Downloading: http://repo1.maven.org/maven2/org/codehaus/plexus/plexus-container-default/1.0-alpha-9-stable-1/plexus-container-default-1.0-alpha-9-stable-1.pom
Downloaded: http://repo1.maven.org/maven2/org/codehaus/plexus/plexus-container-default/1.0-alpha-9-stable-1/plexus-container-default-1.0-alpha-9-stable-1.pom (4 KB at 94.1 KB/sec)
Downloading: http://repo1.maven.org/maven2/org/codehaus/plexus/plexus-containers/1.0.3/plexus-containers-1.0.3.pom
Downloaded: http://repo1.maven.org/maven2/org/codehaus/plexus/plexus-containers/1.0.3/plexus-containers-1.0.3.pom (492 B at 11.7 KB/sec)
Downloading: http://repo1.maven.org/maven2/org/codehaus/plexus/plexus/1.0.4/plexus-1.0.4.pom
Downloaded: http://repo1.maven.org/maven2/org/codehaus/plexus/plexus/1.0.4/plexus-1.0.4.pom (6 KB at 136.6 KB/sec)
Downloading: http://repo1.maven.org/maven2/junit/junit/3.8.1/junit-3.8.1.pom
Downloaded: http://repo1.maven.org/maven2/junit/junit/3.8.1/junit-3.8.1.pom (998 B at 23.8 KB/sec)
Downloading: http://repo1.maven.org/maven2/org/codehaus/plexus/plexus-utils/1.0.4/plexus-utils-1.0.4.pom
Downloaded: http://repo1.maven.org/maven2/org/codehaus/plexus/plexus-utils/1.0.4/plexus-utils-1.0.4.pom (7 KB at 159.4 KB/sec)
Downloading: http://repo1.maven.org/maven2/classworlds/classworlds/1.1-alpha-2/classworlds-1.1-alpha-2.pom
Downloaded: http://repo1.maven.org/maven2/classworlds/classworlds/1.1-alpha-2/classworlds-1.1-alpha-2.pom (4 KB at 74.5 KB/sec)
Downloading: http://repo1.maven.org/maven2/org/apache/maven/maven-profile/2.0.6/maven-profile-2.0.6.pom
Downloaded: http://repo1.maven.org/maven2/org/apache/maven/maven-profile/2.0.6/maven-profile-2.0.6.pom (2 KB at 47.2 KB/sec)
Downloading: http://repo1.maven.org/maven2/org/apache/maven/maven-artifact-manager/2.0.6/maven-artifact-manager-2.0.6.pom
Downloaded: http://repo1.maven.org/maven2/org/apache/maven/maven-artifact-manager/2.0.6/maven-artifact-manager-2.0.6.pom (3 KB at 64.0 KB/sec)
Downloading: http://repo1.maven.org/maven2/org/apache/maven/maven-repository-metadata/2.0.6/maven-repository-metadata-2.0.6.pom
Downloaded: http://repo1.maven.org/maven2/org/apache/maven/maven-repository-metadata/2.0.6/maven-repository-metadata-2.0.6.pom (2 KB at 44.1 KB/sec)
Downloading: http://repo1.maven.org/maven2/org/apache/maven/maven-artifact/2.0.6/maven-artifact-2.0.6.pom
Downloaded: http://repo1.maven.org/maven2/org/apache/maven/maven-artifact/2.0.6/maven-artifact-2.0.6.pom (2 KB at 37.6 KB/sec)
Downloading: http://repo1.maven.org/maven2/org/apache/maven/maven-plugin-registry/2.0.6/maven-plugin-registry-2.0.6.pom
Downloaded: http://repo1.maven.org/maven2/org/apache/maven/maven-plugin-registry/2.0.6/maven-plugin-registry-2.0.6.pom (2 KB at 46.4 KB/sec)
Downloading: http://repo1.maven.org/maven2/org/codehaus/plexus/plexus-digest/1.0/plexus-digest-1.0.pom
Downloaded: http://repo1.maven.org/maven2/org/codehaus/plexus/plexus-digest/1.0/plexus-digest-1.0.pom (2 KB at 25.2 KB/sec)
Downloading: http://repo1.maven.org/maven2/org/codehaus/plexus/plexus-components/1.1.7/plexus-components-1.1.7.pom
Downloaded: http://repo1.maven.org/maven2/org/codehaus/plexus/plexus-components/1.1.7/plexus-components-1.1.7.pom (5 KB at 118.5 KB/sec)
Downloading: http://repo1.maven.org/maven2/org/codehaus/plexus/plexus/1.0.8/plexus-1.0.8.pom
Downloaded: http://repo1.maven.org/maven2/org/codehaus/plexus/plexus/1.0.8/plexus-1.0.8.pom (8 KB at 172.2 KB/sec)
Downloading: http://repo1.maven.org/maven2/org/codehaus/plexus/plexus-container-default/1.0-alpha-8/plexus-container-default-1.0-alpha-8.pom
Downloaded: http://repo1.maven.org/maven2/org/codehaus/plexus/plexus-container-default/1.0-alpha-8/plexus-container-default-1.0-alpha-8.pom (8 KB at 173.0 KB/sec)
Downloading: http://repo1.maven.org/maven2/junit/junit/3.8.1/junit-3.8.1.jar
Downloading: http://repo1.maven.org/maven2/org/codehaus/plexus/plexus-digest/1.0/plexus-digest-1.0.jar
Downloaded: http://repo1.maven.org/maven2/org/codehaus/plexus/plexus-digest/1.0/plexus-digest-1.0.jar (12 KB at 117.0 KB/sec)
Downloaded: http://repo1.maven.org/maven2/junit/junit/3.8.1/junit-3.8.1.jar (119 KB at 863.0 KB/sec)
[INFO] Installing /opt/buildhomes/hudsonBuild/workspace/gemini-jpa/pom.xml to /opt/buildhomes/hudsonBuild/workspace/gemini-jpa/.maven/repo/org/eclipse/gemini/org.eclipse.gemini.jpa.parent/1.2.0.M2/org.eclipse.gemini.jpa.parent-1.2.0.M2.pom
[INFO]                                                                         
[INFO] ------------------------------------------------------------------------
[INFO] Building org.eclipse.gemini.jpa.targetdef 1.2.0.M2
[INFO] ------------------------------------------------------------------------
Downloading: http://repo1.maven.org/maven2/org/codehaus/mojo/build-helper-maven-plugin/1.3/build-helper-maven-plugin-1.3.pom
Downloaded: http://repo1.maven.org/maven2/org/codehaus/mojo/build-helper-maven-plugin/1.3/build-helper-maven-plugin-1.3.pom (4 KB at 84.0 KB/sec)
Downloading: http://repo1.maven.org/maven2/org/codehaus/mojo/mojo-parent/21/mojo-parent-21.pom
Downloaded: http://repo1.maven.org/maven2/org/codehaus/mojo/mojo-parent/21/mojo-parent-21.pom (19 KB at 298.0 KB/sec)
Downloading: http://repo1.maven.org/maven2/org/codehaus/mojo/build-helper-maven-plugin/1.3/build-helper-maven-plugin-1.3.jar
Downloaded: http://repo1.maven.org/maven2/org/codehaus/mojo/build-helper-maven-plugin/1.3/build-helper-maven-plugin-1.3.jar (21 KB at 315.9 KB/sec)
[INFO] 
[INFO] --- maven-clean-plugin:2.4.1:clean (default-clean) @ org.eclipse.gemini.jpa.targetdef ---
[INFO] 
[INFO] --- tycho-source-plugin:0.14.0:plugin-source (attach-source) @ org.eclipse.gemini.jpa.targetdef ---
[INFO] 
[INFO] --- build-helper-maven-plugin:1.3:attach-artifact (attach-artifacts) @ org.eclipse.gemini.jpa.targetdef ---
Downloading: http://repo1.maven.org/maven2/org/apache/maven/maven-model/2.0.2/maven-model-2.0.2.pom
Downloaded: http://repo1.maven.org/maven2/org/apache/maven/maven-model/2.0.2/maven-model-2.0.2.pom (3 KB at 11.3 KB/sec)
Downloading: http://repo1.maven.org/maven2/org/apache/maven/maven/2.0.2/maven-2.0.2.pom
Downloaded: http://repo1.maven.org/maven2/org/apache/maven/maven/2.0.2/maven-2.0.2.pom (13 KB at 306.3 KB/sec)
Downloading: http://repo1.maven.org/maven2/org/codehaus/plexus/plexus-utils/1.1/plexus-utils-1.1.pom
Downloaded: http://repo1.maven.org/maven2/org/codehaus/plexus/plexus-utils/1.1/plexus-utils-1.1.pom (767 B at 18.3 KB/sec)
Downloading: http://repo1.maven.org/maven2/org/apache/maven/maven-project/2.0.2/maven-project-2.0.2.pom
Downloaded: http://repo1.maven.org/maven2/org/apache/maven/maven-project/2.0.2/maven-project-2.0.2.pom (2 KB at 40.2 KB/sec)
Downloading: http://repo1.maven.org/maven2/org/apache/maven/maven-profile/2.0.2/maven-profile-2.0.2.pom
Downloaded: http://repo1.maven.org/maven2/org/apache/maven/maven-profile/2.0.2/maven-profile-2.0.2.pom (2 KB at 30.9 KB/sec)
Downloading: http://repo1.maven.org/maven2/org/codehaus/plexus/plexus-container-default/1.0-alpha-9/plexus-container-default-1.0-alpha-9.pom
Downloaded: http://repo1.maven.org/maven2/org/codehaus/plexus/plexus-container-default/1.0-alpha-9/plexus-container-default-1.0-alpha-9.pom (2 KB at 29.4 KB/sec)
Downloading: http://repo1.maven.org/maven2/junit/junit/3.8.2/junit-3.8.2.pom
Downloaded: http://repo1.maven.org/maven2/junit/junit/3.8.2/junit-3.8.2.pom (747 B at 17.8 KB/sec)
Downloading: http://repo1.maven.org/maven2/org/apache/maven/maven-artifact-manager/2.0.2/maven-artifact-manager-2.0.2.pom
Downloaded: http://repo1.maven.org/maven2/org/apache/maven/maven-artifact-manager/2.0.2/maven-artifact-manager-2.0.2.pom (2 KB at 33.2 KB/sec)
Downloading: http://repo1.maven.org/maven2/org/apache/maven/maven-repository-metadata/2.0.2/maven-repository-metadata-2.0.2.pom
Downloaded: http://repo1.maven.org/maven2/org/apache/maven/maven-repository-metadata/2.0.2/maven-repository-metadata-2.0.2.pom (2 KB at 31.2 KB/sec)
Downloading: http://repo1.maven.org/maven2/org/apache/maven/maven-artifact/2.0.2/maven-artifact-2.0.2.pom
Downloaded: http://repo1.maven.org/maven2/org/apache/maven/maven-artifact/2.0.2/maven-artifact-2.0.2.pom (765 B at 18.7 KB/sec)
Downloading: http://repo1.maven.org/maven2/org/apache/maven/maven-core/2.0.2/maven-core-2.0.2.pom
Downloaded: http://repo1.maven.org/maven2/org/apache/maven/maven-core/2.0.2/maven-core-2.0.2.pom (6 KB at 121.2 KB/sec)
Downloading: http://repo1.maven.org/maven2/org/apache/maven/maven-settings/2.0.2/maven-settings-2.0.2.pom
Downloaded: http://repo1.maven.org/maven2/org/apache/maven/maven-settings/2.0.2/maven-settings-2.0.2.pom (2 KB at 33.6 KB/sec)
Downloading: http://repo1.maven.org/maven2/org/apache/maven/maven-plugin-parameter-documenter/2.0.2/maven-plugin-parameter-documenter-2.0.2.pom
Downloaded: http://repo1.maven.org/maven2/org/apache/maven/maven-plugin-parameter-documenter/2.0.2/maven-plugin-parameter-documenter-2.0.2.pom (2 KB at 34.9 KB/sec)
Downloading: http://repo1.maven.org/maven2/org/apache/maven/reporting/maven-reporting-api/2.0.2/maven-reporting-api-2.0.2.pom
Downloaded: http://repo1.maven.org/maven2/org/apache/maven/reporting/maven-reporting-api/2.0.2/maven-reporting-api-2.0.2.pom (902 B at 21.0 KB/sec)
Downloading: http://repo1.maven.org/maven2/org/apache/maven/reporting/maven-reporting/2.0.2/maven-reporting-2.0.2.pom
Downloaded: http://repo1.maven.org/maven2/org/apache/maven/reporting/maven-reporting/2.0.2/maven-reporting-2.0.2.pom (738 B at 17.2 KB/sec)
Downloading: http://repo1.maven.org/maven2/org/apache/maven/doxia/doxia-sink-api/1.0-alpha-7/doxia-sink-api-1.0-alpha-7.pom
Downloaded: http://repo1.maven.org/maven2/org/apache/maven/doxia/doxia-sink-api/1.0-alpha-7/doxia-sink-api-1.0-alpha-7.pom (424 B at 10.1 KB/sec)
Downloading: http://repo1.maven.org/maven2/org/apache/maven/doxia/doxia/1.0-alpha-7/doxia-1.0-alpha-7.pom
Downloaded: http://repo1.maven.org/maven2/org/apache/maven/doxia/doxia/1.0-alpha-7/doxia-1.0-alpha-7.pom (4 KB at 93.2 KB/sec)
Downloading: http://repo1.maven.org/maven2/org/apache/maven/maven-error-diagnostics/2.0.2/maven-error-diagnostics-2.0.2.pom
Downloaded: http://repo1.maven.org/maven2/org/apache/maven/maven-error-diagnostics/2.0.2/maven-error-diagnostics-2.0.2.pom (854 B at 19.9 KB/sec)
Downloading: http://repo1.maven.org/maven2/org/apache/maven/maven-plugin-registry/2.0.2/maven-plugin-registry-2.0.2.pom
Downloaded: http://repo1.maven.org/maven2/org/apache/maven/maven-plugin-registry/2.0.2/maven-plugin-registry-2.0.2.pom (2 KB at 11.4 KB/sec)
Downloading: http://repo1.maven.org/maven2/commons-cli/commons-cli/1.0/commons-cli-1.0.pom
Downloaded: http://repo1.maven.org/maven2/commons-cli/commons-cli/1.0/commons-cli-1.0.pom (3 KB at 50.1 KB/sec)
Downloading: http://repo1.maven.org/maven2/org/apache/maven/maven-plugin-api/2.0/maven-plugin-api-2.0.pom
Downloaded: http://repo1.maven.org/maven2/org/apache/maven/maven-plugin-api/2.0/maven-plugin-api-2.0.pom (601 B at 2.6 KB/sec)
Downloading: http://repo1.maven.org/maven2/org/apache/maven/maven/2.0/maven-2.0.pom
Downloaded: http://repo1.maven.org/maven2/org/apache/maven/maven/2.0/maven-2.0.pom (9 KB at 208.8 KB/sec)
Downloading: http://repo1.maven.org/maven2/org/apache/maven/maven-plugin-descriptor/2.0.2/maven-plugin-descriptor-2.0.2.pom
Downloaded: http://repo1.maven.org/maven2/org/apache/maven/maven-plugin-descriptor/2.0.2/maven-plugin-descriptor-2.0.2.pom (2 KB at 35.9 KB/sec)
Downloading: http://repo1.maven.org/maven2/org/codehaus/plexus/plexus-interactivity-api/1.0-alpha-4/plexus-interactivity-api-1.0-alpha-4.pom
Downloaded: http://repo1.maven.org/maven2/org/codehaus/plexus/plexus-interactivity-api/1.0-alpha-4/plexus-interactivity-api-1.0-alpha-4.pom (7 KB at 168.9 KB/sec)
Downloading: http://repo1.maven.org/maven2/org/apache/maven/maven-monitor/2.0.2/maven-monitor-2.0.2.pom
Downloaded: http://repo1.maven.org/maven2/org/apache/maven/maven-monitor/2.0.2/maven-monitor-2.0.2.pom (442 B at 10.3 KB/sec)
Downloading: http://repo1.maven.org/maven2/classworlds/classworlds/1.1/classworlds-1.1.pom
Downloaded: http://repo1.maven.org/maven2/classworlds/classworlds/1.1/classworlds-1.1.pom (4 KB at 81.2 KB/sec)
Downloading: http://repo1.maven.org/maven2/org/apache/maven/maven-artifact/2.0/maven-artifact-2.0.pom
Downloaded: http://repo1.maven.org/maven2/org/apache/maven/maven-artifact/2.0/maven-artifact-2.0.pom (723 B at 17.2 KB/sec)
Downloading: http://repo1.maven.org/maven2/org/codehaus/plexus/plexus-utils/1.5.8/plexus-utils-1.5.8.pom
Downloaded: http://repo1.maven.org/maven2/org/codehaus/plexus/plexus-utils/1.5.8/plexus-utils-1.5.8.pom (8 KB at 192.0 KB/sec)
Downloading: http://repo1.maven.org/maven2/org/codehaus/plexus/plexus/2.0.2/plexus-2.0.2.pom
Downloaded: http://repo1.maven.org/maven2/org/codehaus/plexus/plexus/2.0.2/plexus-2.0.2.pom (12 KB at 283.4 KB/sec)
Downloading: http://repo1.maven.org/maven2/org/apache/maven/reporting/maven-reporting-api/2.0.2/maven-reporting-api-2.0.2.jar
Downloaded: http://repo1.maven.org/maven2/org/apache/maven/reporting/maven-reporting-api/2.0.2/maven-reporting-api-2.0.2.jar (5 KB at 116.1 KB/sec)
Downloading: http://repo1.maven.org/maven2/org/apache/maven/doxia/doxia-sink-api/1.0-alpha-7/doxia-sink-api-1.0-alpha-7.jar
Downloaded: http://repo1.maven.org/maven2/org/apache/maven/doxia/doxia-sink-api/1.0-alpha-7/doxia-sink-api-1.0-alpha-7.jar (6 KB at 141.4 KB/sec)
Downloading: http://repo1.maven.org/maven2/commons-cli/commons-cli/1.0/commons-cli-1.0.jar
Downloaded: http://repo1.maven.org/maven2/commons-cli/commons-cli/1.0/commons-cli-1.0.jar (30 KB at 490.2 KB/sec)
Downloading: http://repo1.maven.org/maven2/org/codehaus/plexus/plexus-interactivity-api/1.0-alpha-4/plexus-interactivity-api-1.0-alpha-4.jar
Downloaded: http://repo1.maven.org/maven2/org/codehaus/plexus/plexus-interactivity-api/1.0-alpha-4/plexus-interactivity-api-1.0-alpha-4.jar (14 KB at 319.3 KB/sec)
Downloading: http://repo1.maven.org/maven2/org/codehaus/plexus/plexus-utils/1.5.8/plexus-utils-1.5.8.jar
Downloaded: http://repo1.maven.org/maven2/org/codehaus/plexus/plexus-utils/1.5.8/plexus-utils-1.5.8.jar (262 KB at 1348.3 KB/sec)
[INFO] 
[INFO] --- maven-install-plugin:2.3.1:install (default-install) @ org.eclipse.gemini.jpa.targetdef ---
[INFO] Installing /opt/buildhomes/hudsonBuild/workspace/gemini-jpa/org.eclipse.gemini.jpa.targetdef/pom.xml to /opt/buildhomes/hudsonBuild/workspace/gemini-jpa/.maven/repo/org/eclipse/gemini/org.eclipse.gemini.jpa.targetdef/1.2.0.M2/org.eclipse.gemini.jpa.targetdef-1.2.0.M2.pom
[INFO] Installing /opt/buildhomes/hudsonBuild/workspace/gemini-jpa/org.eclipse.gemini.jpa.targetdef/org.eclipse.gemini.jpa.target to /opt/buildhomes/hudsonBuild/workspace/gemini-jpa/.maven/repo/org/eclipse/gemini/org.eclipse.gemini.jpa.targetdef/1.2.0.M2/org.eclipse.gemini.jpa.targetdef-1.2.0.M2-org.eclipse.gemini.jpa.target.target
[INFO]                                                                         
[INFO] ------------------------------------------------------------------------
[INFO] Building org.eclipse.gemini.jpa 1.2.0.M2
[INFO] ------------------------------------------------------------------------
[INFO] 
[INFO] --- maven-clean-plugin:2.4.1:clean (default-clean) @ org.eclipse.gemini.jpa ---
[INFO] 
[INFO] --- tycho-packaging-plugin:0.14.0:build-qualifier (default-build-qualifier) @ org.eclipse.gemini.jpa ---
[INFO] 
[INFO] --- tycho-packaging-plugin:0.14.0:validate-id (default-validate-id) @ org.eclipse.gemini.jpa ---
[INFO] 
[INFO] --- tycho-packaging-plugin:0.14.0:validate-version (default-validate-version) @ org.eclipse.gemini.jpa ---
[INFO] ------------------------------------------------------------------------
[INFO] Reactor Summary:
[INFO] 
[INFO] Gemini JPA Parent ................................. SUCCESS [4.493s]
[INFO] org.eclipse.gemini.jpa.targetdef .................. SUCCESS [5.533s]
[INFO] org.eclipse.gemini.jpa ............................ FAILURE [0.164s]
[INFO] org.eclipse.gemini.jpa.sample.basic ............... SKIPPED
[INFO] org.eclipse.gemini.jpa.sample.configadmin.gen ..... SKIPPED
[INFO] org.eclipse.gemini.jpa.sample.configadmin.pu ...... SKIPPED
[INFO] org.eclipse.gemini.jpa.sample.configadmin ......... SKIPPED
[INFO] org.eclipse.gemini.jpa.feature .................... SKIPPED
[INFO] org.eclipse.gemini.jpa.samples.feature ............ SKIPPED
[INFO] org.eclipse.gemini.jpa.updatesite ................. SKIPPED
[INFO] ------------------------------------------------------------------------
[INFO] BUILD FAILURE
[INFO] ------------------------------------------------------------------------
[INFO] Total time: 1:06.386s
[INFO] Finished at: Fri Jun 21 03:02:59 EDT 2013
[INFO] Final Memory: 124M/286M
[INFO] ------------------------------------------------------------------------
[INFO] o.h.m.e.h.MavenExecutionResultHandler - Build failed with exception(s)
[INFO] o.h.m.e.h.MavenExecutionResultHandler - [1] org.apache.maven.lifecycle.LifecycleExecutionException: Failed to execute goal org.eclipse.tycho:tycho-packaging-plugin:0.14.0:validate-version (default-validate-version) on project org.eclipse.gemini.jpa: OSGi version 1.2.0.M1 in META-INF/MANIFEST.MF does not match Maven version 1.2.0.M2 in pom.xml
[DEBUG] Closing connection to remote
[ERROR] Failed to execute goal org.eclipse.tycho:tycho-packaging-plugin:0.14.0:validate-version (default-validate-version) on project org.eclipse.gemini.jpa: OSGi version 1.2.0.M1 in META-INF/MANIFEST.MF does not match Maven version 1.2.0.M2 in pom.xml -> [Help 1]
[ERROR] 
[ERROR] To see the full stack trace of the errors, re-run Maven with the -e switch.
[ERROR] Re-run Maven using the -X switch to enable full debug logging.
[ERROR] 
[ERROR] For more information about the errors and possible solutions, please read the following articles:
[ERROR] [Help 1] http://cwiki.apache.org/confluence/display/MAVEN/MojoExecutionException
[ERROR] 
[ERROR] After correcting the problems, you can resume the build with the command
[ERROR]   mvn <goals> -rf :org.eclipse.gemini.jpa
[DEBUG] Waiting for process to finish
[DEBUG] Result: 1
Archiving artifacts
Sending e-mails to: michael.keith@oracle.com
[DEBUG] Skipping watched dependency update for build: gemini-jpa #80 due to result: FAILURE
Finished: FAILURE