FailedConsole Output

Skipping 45 KB.. Full Log
AAP9b85aBtbiIQSWjNKU4P0+vJLE4u1gvPjexLDVPzxdEhicW5WXmpfvll6S2fNly5fzGzauYGBgqihikoFqS8/OK83NS9ZwhNEghAwQwghQWAACwxA+XYgAAAA==[WARNING] Some problems were encountered while building the effective model for org.eclipse.gemini.blueprint.iandt.blueprint:simple.bundle:jar:2.1.0.JAVA7-SNAPSHOT
[WARNING] Reporting configuration should be done in <reporting> section, not in maven-site-plugin <configuration> as reportPlugins parameter.
[WARNING] 
[WARNING] Some problems were encountered while building the effective model for org.eclipse.gemini.blueprint.iandt.blueprint:error.bundle:jar:2.1.0.JAVA7-SNAPSHOT
[WARNING] Reporting configuration should be done in <reporting> section, not in maven-site-plugin <configuration> as reportPlugins parameter.
[WARNING] 
[WARNING] Some problems were encountered while building the effective model for org.eclipse.gemini.blueprint.iandt.blueprint:waiting.bundle:jar:2.1.0.JAVA7-SNAPSHOT
[WARNING] Reporting configuration should be done in <reporting> section, not in maven-site-plugin <configuration> as reportPlugins parameter.
[WARNING] 
[WARNING] Some problems were encountered while building the effective model for org.eclipse.gemini.blueprint.iandt.blueprint:config.bundle:jar:2.1.0.JAVA7-SNAPSHOT
[WARNING] Reporting configuration should be done in <reporting> section, not in maven-site-plugin <configuration> as reportPlugins parameter.
[WARNING] 
[WARNING] Some problems were encountered while building the effective model for org.eclipse.gemini.blueprint.iandt.blueprint:bundles:pom:2.1.0.JAVA7-SNAPSHOT
[WARNING] Reporting configuration should be done in <reporting> section, not in maven-site-plugin <configuration> as reportPlugins parameter.
[WARNING] 
[WARNING] Some problems were encountered while building the effective model for org.eclipse.gemini.blueprint.iandt:gemini-blueprint-integration-test-bundles:pom:2.1.0.JAVA7-SNAPSHOT
[WARNING] Reporting configuration should be done in <reporting> section, not in maven-site-plugin <configuration> as reportPlugins parameter.
[WARNING] 
[WARNING] Some problems were encountered while building the effective model for org.eclipse.gemini.blueprint.iandt:gemini-blueprint-integration-tests:jar:2.1.0.JAVA7-SNAPSHOT
[WARNING] Reporting configuration should be done in <reporting> section, not in maven-site-plugin <configuration> as reportPlugins parameter.
[WARNING] 
[WARNING] Some problems were encountered while building the effective model for org.eclipse.gemini.blueprint.iandt:gemini-blueprint-integration-tests-parent:pom:2.1.0.JAVA7-SNAPSHOT
[WARNING] Reporting configuration should be done in <reporting> section, not in maven-site-plugin <configuration> as reportPlugins parameter.
[WARNING] 
[WARNING] Some problems were encountered while building the effective model for org.eclipse.gemini.blueprint:gemini-blueprint:pom:2.1.0.JAVA7-SNAPSHOT
[WARNING] Reporting configuration should be done in <reporting> section, not in maven-site-plugin <configuration> as reportPlugins parameter. @ line 619, column 32
[WARNING] 
[WARNING] It is highly recommended to fix these problems because they threaten the stability of your build.
[WARNING] 
[WARNING] For this reason, future Maven versions might no longer support building such malformed projects.
[WARNING] 
[INFO] ------------------------------------------------------------------------
[INFO] Reactor Build Order:
[INFO] 
[INFO] Gemini Blueprint                                                   [pom]
[INFO] Gemini Blueprint Mocks                                             [jar]
[INFO] Gemini Blueprint IO                                                [jar]
[INFO] Gemini Blueprint Core                                              [jar]
[INFO] Gemini Blueprint Extender                                          [jar]
[INFO] Gemini Blueprint Extensions                                        [jar]
[INFO] Gemini Blueprint Testing Framework                                 [jar]
[INFO] Eclipse Gemini Blueprint Integration Tests Parent                  [pom]
[INFO] Eclipse Gemini Blueprint Integration Testing Bundles               [pom]
[INFO] Gemini Blueprint Test Bundle: Simple service test bundle           [jar]
[INFO] Gemini Blueprint Test Bundle: Simple service test bundle (impl differs) [jar]
[INFO] Gemini Blueprint Test Bundle: Simple service test bundle (impl differs) [jar]
[INFO] Gemini Blueprint Test Bundle: Simple service test bundle 2         [jar]
[INFO] Gemini Blueprint Test Bundle: Simple service test bundle 3         [jar]
[INFO] Gemini Blueprint Test Bundle: Simple service created by a factory which has a non trivial delay in createObject() [jar]
[INFO] Gemini Blueprint Test Bundle: Trivial OSGi bundle                  [jar]
[INFO] Gemini Blueprint Test Bundle: Simple test that uses trivial bundle [jar]
[INFO] Gemini Blueprint Test Bundle: Spring context lifecycle test bundle [jar]
[INFO] Gemini Blueprint Test Bundle: Spring context service listener test bundle [jar]
[INFO] Gemini Blueprint Test Bundle: Spring context service reference lifecycle test bundle [jar]
[INFO] Gemini Blueprint Test Bundle: Spring context service reference destruction test bundle [jar]
[INFO] Gemini Blueprint Test Bundle: Spring context dependencies test bundle [jar]
[INFO] Gemini Blueprint Test Bundle: Spring context service reference cardinality 0..1 bundle [jar]
[INFO] Gemini Blueprint Test Bundle: Bundle scoping test bundle - A       [jar]
[INFO] Gemini Blueprint Test Bundle: Bundle scoping test bundle - B       [jar]
[INFO] Gemini Blueprint Test Bundle: Bundle scoping test bundle - Common  [jar]
[INFO] Gemini Blueprint Test Bundle: IO fragment 1 bundle                 [jar]
[INFO] Gemini Blueprint Test Bundle: IO fragment 2 bundle                 [jar]
[INFO] Gemini Blueprint Test Bundle: Error bundle                         [jar]
[INFO] Gemini Blueprint Test Bundle: Deadlock bundle                      [jar]
[INFO] Gemini Blueprint Test Bundle: Configuration test bundle            [jar]
[INFO] Gemini Blueprint Test Bundle: ExtenderVersion-Test-Bundle          [jar]
[INFO] Gemini Blueprint Test Bundle: Integration testing bundles for configuration options [pom]
[INFO] Gemini Blueprint Test Bundle: NoPublish-Bundle                     [jar]
[INFO] Gemini Blueprint Test Bundle: Async-NoWait-Bundle                  [jar]
[INFO] Gemini Blueprint Test Bundle: Async-Wait-Bundle                    [jar]
[INFO] Gemini Blueprint Test Bundle: Sync-NoWait-Bundle                   [jar]
[INFO] Gemini Blueprint Test Bundle: Sync-Tail-Bundle                     [jar]
[INFO] Gemini Blueprint Test Bundle: Sync-Wait-Bundle                     [jar]
[INFO] Gemini Blueprint Test Bundle: Spring service TCCL management inteface test bundle [jar]
[INFO] Gemini Blueprint Test Bundle: Spring service TCCL management test bundle [jar]
[INFO] Gemini Blueprint Test Bundle: Config File With Dots bundle         [jar]
[INFO] Gemini Blueprint Test Bundle: Spring Proxy Creator bundle          [jar]
[INFO] Gemini Blueprint Test Bundle: Extender Configuration Fragment Bundle [jar]
[INFO] Gemini Blueprint Test Bundle: JDK proxy test                       [jar]
[INFO] Gemini Blueprint Test Bundle: Extender Event listener bundle Bundle [jar]
[INFO] Gemini Blueprint Test Bundle: namespace provider and consumer bundle [jar]
[INFO] Gemini Blueprint Test Bundle: Just a listener exported as a service [jar]
[INFO] Gemini Blueprint Test Bundle: Export Import Dependency Bundle      [jar]
[INFO] Eclipse Gemini Blueprint JDK5 Integration Testing Bundles          [pom]
[INFO] Gemini Blueprint Test Bundle: @Component beans bundle              [jar]
[INFO] Eclipse Gemini Blueprint Test Bundle: Recursive Type test bundle   [jar]
[INFO] Gemini Blueprint Integration Testing Bundles                       [pom]
[INFO] Eclipse Gemini Blueprint Test Bundle: Simple service test bundle   [jar]
[INFO] Eclipse Gemini Blueprint Test Bundle: Error bundle                 [jar]
[INFO] Eclipse Gemini Blueprint Test Bundle: Waiting bundle               [jar]
[INFO] Eclipse Gemini Blueprint Test Bundle: Configuration test bundle    [jar]
[INFO] Eclipse Gemini Blueprint Integration Tests                         [jar]
[INFO] 
[INFO] -----------< org.eclipse.gemini.blueprint:gemini-blueprint >------------
[INFO] Building Gemini Blueprint 2.1.0.JAVA7-SNAPSHOT                    [1/58]
[INFO] --------------------------------[ pom ]---------------------------------
[INFO] 
[INFO] --- maven-clean-plugin:3.0.0:clean (default-clean) @ gemini-blueprint ---
[INFO] 
[INFO] --- git-commit-id-plugin:2.2.2:revision (default) @ gemini-blueprint ---
[INFO] 
[INFO] --- maven-source-plugin:2.2.1:jar-no-fork (attach-sources) @ gemini-blueprint ---
[INFO] 
[INFO] --- maven-install-plugin:2.5.2:install (default-install) @ gemini-blueprint ---
[INFO] Installing /jobs/genie.gemini/java7-gemini-blueprint-felix/workspace/pom.xml to /opt/public/hipp/homes/genie.gemini/.m2/repository/org/eclipse/gemini/blueprint/gemini-blueprint/2.1.0.JAVA7-SNAPSHOT/gemini-blueprint-2.1.0.JAVA7-SNAPSHOT.pom
[INFO] 
[INFO] ---------< org.eclipse.gemini.blueprint:gemini-blueprint-mock >---------
[INFO] Building Gemini Blueprint Mocks 2.1.0.JAVA7-SNAPSHOT              [2/58]
[INFO] --------------------------------[ jar ]---------------------------------
[INFO] 
[INFO] --- maven-clean-plugin:3.0.0:clean (default-clean) @ gemini-blueprint-mock ---
[INFO] Deleting /jobs/genie.gemini/java7-gemini-blueprint-felix/workspace/mock/target
[INFO] 
[INFO] --- git-commit-id-plugin:2.2.2:revision (default) @ gemini-blueprint-mock ---
[INFO] 
[INFO] --- maven-resources-plugin:3.0.2:resources (default-resources) @ gemini-blueprint-mock ---
[INFO] Using 'UTF-8' encoding to copy filtered resources.
[INFO] Copying 0 resource
[INFO] 
[INFO] --- maven-compiler-plugin:3.6.1:compile (default-compile) @ gemini-blueprint-mock ---
[INFO] Changes detected - recompiling the module!
[INFO] Compiling 10 source files to /jobs/genie.gemini/java7-gemini-blueprint-felix/workspace/mock/target/classes
[INFO] /jobs/genie.gemini/java7-gemini-blueprint-felix/workspace/mock/src/main/java/org/eclipse/gemini/blueprint/mock/MockBundle.java: Some input files use unchecked or unsafe operations.
[INFO] /jobs/genie.gemini/java7-gemini-blueprint-felix/workspace/mock/src/main/java/org/eclipse/gemini/blueprint/mock/MockBundle.java: Recompile with -Xlint:unchecked for details.
[INFO] 
[INFO] --- bnd-maven-plugin:3.3.0:bnd-process (default) @ gemini-blueprint-mock ---
[WARNING] /jobs/genie.gemini/java7-gemini-blueprint-felix/workspace/mock/bnd.bnd [0:0]: No translation found for macro: git.commit.id.describe
[INFO] 
[INFO] --- maven-resources-plugin:3.0.2:testResources (default-testResources) @ gemini-blueprint-mock ---
[INFO] Using 'UTF-8' encoding to copy filtered resources.
[INFO] skip non existing resourceDirectory /jobs/genie.gemini/java7-gemini-blueprint-felix/workspace/mock/src/test/resources
[INFO] 
[INFO] --- maven-compiler-plugin:3.6.1:testCompile (default-testCompile) @ gemini-blueprint-mock ---
[INFO] Changes detected - recompiling the module!
[INFO] Compiling 8 source files to /jobs/genie.gemini/java7-gemini-blueprint-felix/workspace/mock/target/test-classes
[INFO] /jobs/genie.gemini/java7-gemini-blueprint-felix/workspace/mock/src/test/java/org/eclipse/gemini/blueprint/mock/MockServiceReferenceTest.java: Some input files use unchecked or unsafe operations.
[INFO] /jobs/genie.gemini/java7-gemini-blueprint-felix/workspace/mock/src/test/java/org/eclipse/gemini/blueprint/mock/MockServiceReferenceTest.java: Recompile with -Xlint:unchecked for details.
[INFO] 
[INFO] --- maven-surefire-plugin:2.19.1:test (default-test) @ gemini-blueprint-mock ---

-------------------------------------------------------
 T E S T S
-------------------------------------------------------
Picked up JAVA_TOOL_OPTIONS: -Xmx2G -Djava.io.tmpdir=/tmp/genie.gemini -DforkCount=1
Running org.eclipse.gemini.blueprint.mock.MockServiceReferenceTest
Tests run: 15, Failures: 0, Errors: 0, Skipped: 0, Time elapsed: 0.002 sec - in org.eclipse.gemini.blueprint.mock.MockServiceReferenceTest
Running org.eclipse.gemini.blueprint.mock.MockBundleActivatorTest
Tests run: 2, Failures: 0, Errors: 0, Skipped: 0, Time elapsed: 0 sec - in org.eclipse.gemini.blueprint.mock.MockBundleActivatorTest
Running org.eclipse.gemini.blueprint.mock.EntryLookupControllingMockBundleTest
Tests run: 2, Failures: 0, Errors: 0, Skipped: 0, Time elapsed: 0 sec - in org.eclipse.gemini.blueprint.mock.EntryLookupControllingMockBundleTest
Running org.eclipse.gemini.blueprint.mock.ArrayEnumeratorTest
Tests run: 4, Failures: 0, Errors: 0, Skipped: 0, Time elapsed: 0.001 sec - in org.eclipse.gemini.blueprint.mock.ArrayEnumeratorTest
Running org.eclipse.gemini.blueprint.mock.MockServiceRegistrationTest
Tests run: 11, Failures: 0, Errors: 0, Skipped: 0, Time elapsed: 0 sec - in org.eclipse.gemini.blueprint.mock.MockServiceRegistrationTest
Running org.eclipse.gemini.blueprint.mock.MockBundleContextTest
Tests run: 21, Failures: 0, Errors: 0, Skipped: 0, Time elapsed: 0 sec - in org.eclipse.gemini.blueprint.mock.MockBundleContextTest
Running org.eclipse.gemini.blueprint.mock.MockBundleTest
Tests run: 28, Failures: 0, Errors: 0, Skipped: 0, Time elapsed: 0.005 sec - in org.eclipse.gemini.blueprint.mock.MockBundleTest
Running org.eclipse.gemini.blueprint.mock.MockFilterTest
Tests run: 3, Failures: 0, Errors: 0, Skipped: 0, Time elapsed: 0 sec - in org.eclipse.gemini.blueprint.mock.MockFilterTest

Results :

Tests run: 86, Failures: 0, Errors: 0, Skipped: 0

[INFO] 
[INFO] --- maven-jar-plugin:3.0.2:jar (default-jar) @ gemini-blueprint-mock ---
[INFO] Building jar: /jobs/genie.gemini/java7-gemini-blueprint-felix/workspace/mock/target/gemini-blueprint-mock-2.1.0.JAVA7-SNAPSHOT.jar
[INFO] 
[INFO] --- maven-source-plugin:2.2.1:jar-no-fork (attach-sources) @ gemini-blueprint-mock ---
[INFO] Building jar: /jobs/genie.gemini/java7-gemini-blueprint-felix/workspace/mock/target/gemini-blueprint-mock-2.1.0.JAVA7-SNAPSHOT-sources.jar
[INFO] 
[INFO] --- maven-install-plugin:2.5.2:install (default-install) @ gemini-blueprint-mock ---
[INFO] Installing /jobs/genie.gemini/java7-gemini-blueprint-felix/workspace/mock/target/gemini-blueprint-mock-2.1.0.JAVA7-SNAPSHOT.jar to /opt/public/hipp/homes/genie.gemini/.m2/repository/org/eclipse/gemini/blueprint/gemini-blueprint-mock/2.1.0.JAVA7-SNAPSHOT/gemini-blueprint-mock-2.1.0.JAVA7-SNAPSHOT.jar
[INFO] Installing /jobs/genie.gemini/java7-gemini-blueprint-felix/workspace/mock/pom.xml to /opt/public/hipp/homes/genie.gemini/.m2/repository/org/eclipse/gemini/blueprint/gemini-blueprint-mock/2.1.0.JAVA7-SNAPSHOT/gemini-blueprint-mock-2.1.0.JAVA7-SNAPSHOT.pom
[INFO] Installing /jobs/genie.gemini/java7-gemini-blueprint-felix/workspace/mock/target/gemini-blueprint-mock-2.1.0.JAVA7-SNAPSHOT-sources.jar to /opt/public/hipp/homes/genie.gemini/.m2/repository/org/eclipse/gemini/blueprint/gemini-blueprint-mock/2.1.0.JAVA7-SNAPSHOT/gemini-blueprint-mock-2.1.0.JAVA7-SNAPSHOT-sources.jar
[INFO] 
[INFO] ----------< org.eclipse.gemini.blueprint:gemini-blueprint-io >----------
[INFO] Building Gemini Blueprint IO 2.1.0.JAVA7-SNAPSHOT                 [3/58]
[INFO] --------------------------------[ jar ]---------------------------------
[INFO] 
[INFO] --- maven-clean-plugin:3.0.0:clean (default-clean) @ gemini-blueprint-io ---
[INFO] Deleting /jobs/genie.gemini/java7-gemini-blueprint-felix/workspace/io/target
[INFO] 
[INFO] --- git-commit-id-plugin:2.2.2:revision (default) @ gemini-blueprint-io ---
[INFO] 
[INFO] --- maven-resources-plugin:3.0.2:resources (default-resources) @ gemini-blueprint-io ---
[INFO] Using 'UTF-8' encoding to copy filtered resources.
[INFO] Copying 0 resource
[INFO] 
[INFO] --- maven-compiler-plugin:3.6.1:compile (default-compile) @ gemini-blueprint-io ---
[INFO] Changes detected - recompiling the module!
[INFO] Compiling 10 source files to /jobs/genie.gemini/java7-gemini-blueprint-felix/workspace/io/target/classes
[INFO] /jobs/genie.gemini/java7-gemini-blueprint-felix/workspace/io/src/main/java/org/eclipse/gemini/blueprint/io/internal/resolver/DependencyResolver.java: Some input files use or override a deprecated API.
[INFO] /jobs/genie.gemini/java7-gemini-blueprint-felix/workspace/io/src/main/java/org/eclipse/gemini/blueprint/io/internal/resolver/DependencyResolver.java: Recompile with -Xlint:deprecation for details.
[INFO] /jobs/genie.gemini/java7-gemini-blueprint-felix/workspace/io/src/main/java/org/eclipse/gemini/blueprint/io/internal/resolver/PackageAdminResolver.java: /jobs/genie.gemini/java7-gemini-blueprint-felix/workspace/io/src/main/java/org/eclipse/gemini/blueprint/io/internal/resolver/PackageAdminResolver.java uses unchecked or unsafe operations.
[INFO] /jobs/genie.gemini/java7-gemini-blueprint-felix/workspace/io/src/main/java/org/eclipse/gemini/blueprint/io/internal/resolver/PackageAdminResolver.java: Recompile with -Xlint:unchecked for details.
[INFO] 
[INFO] --- bnd-maven-plugin:3.3.0:bnd-process (default) @ gemini-blueprint-io ---
[WARNING] /jobs/genie.gemini/java7-gemini-blueprint-felix/workspace/io/bnd.bnd [0:0]: No translation found for macro: git.commit.id.describe
[INFO] 
[INFO] --- maven-resources-plugin:3.0.2:testResources (default-testResources) @ gemini-blueprint-io ---
[INFO] Using 'UTF-8' encoding to copy filtered resources.
[INFO] Copying 4 resources
[INFO] 
[INFO] --- maven-compiler-plugin:3.6.1:testCompile (default-testCompile) @ gemini-blueprint-io ---
[INFO] Changes detected - recompiling the module!
[INFO] Compiling 5 source files to /jobs/genie.gemini/java7-gemini-blueprint-felix/workspace/io/target/test-classes
[INFO] /jobs/genie.gemini/java7-gemini-blueprint-felix/workspace/io/src/test/java/org/eclipse/gemini/blueprint/io/internal/OsgiResourceUtilsTest.java: Some input files use unchecked or unsafe operations.
[INFO] /jobs/genie.gemini/java7-gemini-blueprint-felix/workspace/io/src/test/java/org/eclipse/gemini/blueprint/io/internal/OsgiResourceUtilsTest.java: Recompile with -Xlint:unchecked for details.
[INFO] 
[INFO] --- maven-surefire-plugin:2.19.1:test (default-test) @ gemini-blueprint-io ---

-------------------------------------------------------
 T E S T S
-------------------------------------------------------
Picked up JAVA_TOOL_OPTIONS: -Xmx2G -Djava.io.tmpdir=/tmp/genie.gemini -DforkCount=1
Running org.eclipse.gemini.blueprint.io.internal.OsgiResourceUtilsTest
Tests run: 22, Failures: 0, Errors: 0, Skipped: 0, Time elapsed: 0.019 sec - in org.eclipse.gemini.blueprint.io.internal.OsgiResourceUtilsTest
Running org.eclipse.gemini.blueprint.io.internal.OsgiHeaderUtilsTest
Tests run: 25, Failures: 0, Errors: 0, Skipped: 0, Time elapsed: 0.012 sec - in org.eclipse.gemini.blueprint.io.internal.OsgiHeaderUtilsTest
Running org.eclipse.gemini.blueprint.io.OsgiBundleResourceTest
Tests run: 25, Failures: 0, Errors: 0, Skipped: 0, Time elapsed: 0.09 sec - in org.eclipse.gemini.blueprint.io.OsgiBundleResourceTest
Running org.eclipse.gemini.blueprint.io.OsgiBundleResourceLoaderTest
Tests run: 5, Failures: 0, Errors: 0, Skipped: 0, Time elapsed: 0 sec - in org.eclipse.gemini.blueprint.io.OsgiBundleResourceLoaderTest
Running org.eclipse.gemini.blueprint.io.OsgiBundleResourcePatternResolverTest
Tests run: 3, Failures: 0, Errors: 0, Skipped: 0, Time elapsed: 0.217 sec - in org.eclipse.gemini.blueprint.io.OsgiBundleResourcePatternResolverTest

Results :

Tests run: 80, Failures: 0, Errors: 0, Skipped: 0

[INFO] 
[INFO] --- maven-jar-plugin:3.0.2:jar (default-jar) @ gemini-blueprint-io ---
[INFO] Building jar: /jobs/genie.gemini/java7-gemini-blueprint-felix/workspace/io/target/gemini-blueprint-io-2.1.0.JAVA7-SNAPSHOT.jar
[INFO] 
[INFO] --- maven-source-plugin:2.2.1:jar-no-fork (attach-sources) @ gemini-blueprint-io ---
[INFO] Building jar: /jobs/genie.gemini/java7-gemini-blueprint-felix/workspace/io/target/gemini-blueprint-io-2.1.0.JAVA7-SNAPSHOT-sources.jar
[INFO] 
[INFO] --- maven-install-plugin:2.5.2:install (default-install) @ gemini-blueprint-io ---
[INFO] Installing /jobs/genie.gemini/java7-gemini-blueprint-felix/workspace/io/target/gemini-blueprint-io-2.1.0.JAVA7-SNAPSHOT.jar to /opt/public/hipp/homes/genie.gemini/.m2/repository/org/eclipse/gemini/blueprint/gemini-blueprint-io/2.1.0.JAVA7-SNAPSHOT/gemini-blueprint-io-2.1.0.JAVA7-SNAPSHOT.jar
[INFO] Installing /jobs/genie.gemini/java7-gemini-blueprint-felix/workspace/io/pom.xml to /opt/public/hipp/homes/genie.gemini/.m2/repository/org/eclipse/gemini/blueprint/gemini-blueprint-io/2.1.0.JAVA7-SNAPSHOT/gemini-blueprint-io-2.1.0.JAVA7-SNAPSHOT.pom
[INFO] Installing /jobs/genie.gemini/java7-gemini-blueprint-felix/workspace/io/target/gemini-blueprint-io-2.1.0.JAVA7-SNAPSHOT-sources.jar to /opt/public/hipp/homes/genie.gemini/.m2/repository/org/eclipse/gemini/blueprint/gemini-blueprint-io/2.1.0.JAVA7-SNAPSHOT/gemini-blueprint-io-2.1.0.JAVA7-SNAPSHOT-sources.jar
[INFO] 
[INFO] ---------< org.eclipse.gemini.blueprint:gemini-blueprint-core >---------
[INFO] Building Gemini Blueprint Core 2.1.0.JAVA7-SNAPSHOT               [4/58]
[INFO] --------------------------------[ jar ]---------------------------------
[INFO] 
[INFO] --- maven-clean-plugin:3.0.0:clean (default-clean) @ gemini-blueprint-core ---
[INFO] Deleting /jobs/genie.gemini/java7-gemini-blueprint-felix/workspace/core/target
[INFO] 
[INFO] --- git-commit-id-plugin:2.2.2:revision (default) @ gemini-blueprint-core ---
[INFO] 
[INFO] --- maven-resources-plugin:3.0.2:resources (default-resources) @ gemini-blueprint-core ---
[INFO] Using 'UTF-8' encoding to copy filtered resources.
[INFO] Copying 18 resources
[INFO] 
[INFO] --- maven-compiler-plugin:3.6.1:compile (default-compile) @ gemini-blueprint-core ---
[INFO] Changes detected - recompiling the module!
[INFO] Compiling 259 source files to /jobs/genie.gemini/java7-gemini-blueprint-felix/workspace/core/target/classes
[INFO] /jobs/genie.gemini/java7-gemini-blueprint-felix/workspace/core/src/main/java/org/eclipse/gemini/blueprint/bundle/BundleFactoryBean.java: Some input files use or override a deprecated API.
[INFO] /jobs/genie.gemini/java7-gemini-blueprint-felix/workspace/core/src/main/java/org/eclipse/gemini/blueprint/bundle/BundleFactoryBean.java: Recompile with -Xlint:deprecation for details.
[INFO] /jobs/genie.gemini/java7-gemini-blueprint-felix/workspace/core/src/main/java/org/eclipse/gemini/blueprint/blueprint/container/support/internal/config/CycleOrderingProcessor.java: Some input files use unchecked or unsafe operations.
[INFO] /jobs/genie.gemini/java7-gemini-blueprint-felix/workspace/core/src/main/java/org/eclipse/gemini/blueprint/blueprint/container/support/internal/config/CycleOrderingProcessor.java: Recompile with -Xlint:unchecked for details.
[INFO] 
[INFO] --- bnd-maven-plugin:3.3.0:bnd-process (default) @ gemini-blueprint-core ---
[WARNING] /jobs/genie.gemini/java7-gemini-blueprint-felix/workspace/core/bnd.bnd [0:0]: Version for package org.osgi.service.blueprint.container is set to different values in the source (1.0.0) and in the manifest (1.0.2). The version in the manifest is not picked up by an other sibling bundles in this project or projects that directly depend on this project
[WARNING] /jobs/genie.gemini/java7-gemini-blueprint-felix/workspace/core/bnd.bnd [0:0]: Version for package org.osgi.service.blueprint.reflect is set to different values in the source (1.0.0) and in the manifest (1.0.1). The version in the manifest is not picked up by an other sibling bundles in this project or projects that directly depend on this project
[WARNING] /jobs/genie.gemini/java7-gemini-blueprint-felix/workspace/core/bnd.bnd [0:0]: No translation found for macro: git.commit.id.describe
[INFO] 
[INFO] --- maven-resources-plugin:3.0.2:testResources (default-testResources) @ gemini-blueprint-core ---
[INFO] Using 'UTF-8' encoding to copy filtered resources.
[INFO] Copying 44 resources
[INFO] 
[INFO] --- maven-compiler-plugin:3.6.1:testCompile (default-testCompile) @ gemini-blueprint-core ---
[INFO] Changes detected - recompiling the module!
[INFO] Compiling 157 source files to /jobs/genie.gemini/java7-gemini-blueprint-felix/workspace/core/target/test-classes
[INFO] /jobs/genie.gemini/java7-gemini-blueprint-felix/workspace/core/src/test/java/org/eclipse/gemini/blueprint/DictionaryEditorTest.java: Some input files use or override a deprecated API.
[INFO] /jobs/genie.gemini/java7-gemini-blueprint-felix/workspace/core/src/test/java/org/eclipse/gemini/blueprint/DictionaryEditorTest.java: Recompile with -Xlint:deprecation for details.
[INFO] /jobs/genie.gemini/java7-gemini-blueprint-felix/workspace/core/src/test/java/org/eclipse/gemini/blueprint/internal/service/collection/threading/DynamicCollectionThreadingTest.java: Some input files use unchecked or unsafe operations.
[INFO] /jobs/genie.gemini/java7-gemini-blueprint-felix/workspace/core/src/test/java/org/eclipse/gemini/blueprint/internal/service/collection/threading/DynamicCollectionThreadingTest.java: Recompile with -Xlint:unchecked for details.
[INFO] 
[INFO] --- maven-surefire-plugin:2.19.1:test (default-test) @ gemini-blueprint-core ---

-------------------------------------------------------
 T E S T S
-------------------------------------------------------
Picked up JAVA_TOOL_OPTIONS: -Xmx2G -Djava.io.tmpdir=/tmp/genie.gemini -DforkCount=1
Running org.eclipse.gemini.blueprint.blueprint.container.TestBlueprintBuiltinConvertersTest
class java.util.LinkedHashSet
class org.eclipse.gemini.blueprint.blueprint.MyCustomList
class java.util.ArrayList
[IntegerOne, customCollection, customMap, customDictionary, setToCollection, setToList, setToSet, setToSortedSet, setToStack, setToHashSet, setToLinkedHashSet, setToTreeSet, setToArrayList, setToLinkedList, setToVector, listToCollection, listToList, listToSet, listToSortedSet, listToStack, listToHashSet, listTolinkedHashSet, listToTreeSet, listToArrayList, listToLinkedList, listToVector, arrayToCollection, arrayToList, arrayToSet, arrayToSortedSet, arrayToStack, arrayToHashSet, arrayTolinkedHashSet, arrayToTreeSet, arrayToArrayList, arrayToLinkedList, arrayToVector, mapToHashMap, mapToTreeMap, mapToHashtable, mapToDictionary, mapToSortedMap, mapToConcurrentMap, mapToConcurrentHashMap, arrayToQueue, propertiesInjection]
Tests run: 4, Failures: 0, Errors: 0, Skipped: 0, Time elapsed: 0.846 sec - in org.eclipse.gemini.blueprint.blueprint.container.TestBlueprintBuiltinConvertersTest
Running org.eclipse.gemini.blueprint.blueprint.container.LazyExporterTest
[ServiceOne, ServiceOneService]
Tests run: 1, Failures: 0, Errors: 0, Skipped: 0, Time elapsed: 0.077 sec - in org.eclipse.gemini.blueprint.blueprint.container.LazyExporterTest
Running org.eclipse.gemini.blueprint.blueprint.container.CycleTest
Tests run: 1, Failures: 0, Errors: 0, Skipped: 0, Time elapsed: 0.042 sec - in org.eclipse.gemini.blueprint.blueprint.container.CycleTest
Running org.eclipse.gemini.blueprint.blueprint.container.BlueprintFieldsTest
applicationEventPublisher
availability
beanClassLoader
beanName
blueprintCompliant
bundleContext
class
eagerInit
filter
importContextClassLoader
interfaces
listeners
object
objectType
prototype
serviceBeanName
singleton
sticky
timeout
unifiedFilter
useBlueprintExceptions
type is boolean
Tests run: 1, Failures: 0, Errors: 0, Skipped: 0, Time elapsed: 0.022 sec - in org.eclipse.gemini.blueprint.blueprint.container.BlueprintFieldsTest
Running org.eclipse.gemini.blueprint.blueprint.container.TestLazyBeansTest
5
dependsleaf1
dependsleaf2
lazyCollection
null
listener
[dependsleaf1, dependsleaf2, lazyCollection, listener]
Initialized
Initialized
Tests run: 2, Failures: 0, Errors: 0, Skipped: 0, Time elapsed: 0.14 sec - in org.eclipse.gemini.blueprint.blueprint.container.TestLazyBeansTest
Running org.eclipse.gemini.blueprint.blueprint.container.TypeFactoryTest
Tests run: 22, Failures: 0, Errors: 0, Skipped: 0, Time elapsed: 0.022 sec - in org.eclipse.gemini.blueprint.blueprint.container.TypeFactoryTest
Running org.eclipse.gemini.blueprint.blueprint.container.GenericsTest
created {Finish=java.awt.Point[x=0,y=0], Start=java.awt.Point[x=123,y=456]}
created class java.util.concurrent.ConcurrentHashMap
created class java.util.concurrent.ConcurrentHashMap
[rawInjection, genericConversion, concurrentMap]
created {Finish=java.awt.Point[x=0,y=0], Start=java.awt.Point[x=123,y=456]}
created class java.util.concurrent.ConcurrentHashMap
created class java.util.concurrent.ConcurrentHashMap
Tests run: 2, Failures: 0, Errors: 0, Skipped: 0, Time elapsed: 0.108 sec - in org.eclipse.gemini.blueprint.blueprint.container.GenericsTest
Running org.eclipse.gemini.blueprint.blueprint.config.ConstructorInjectionTest
Tests run: 13, Failures: 0, Errors: 0, Skipped: 0, Time elapsed: 0.494 sec - in org.eclipse.gemini.blueprint.blueprint.config.ConstructorInjectionTest
Running org.eclipse.gemini.blueprint.blueprint.config.ComponentSubElementTest
2356 [main] WARN : o.s.b.GenericTypeAwarePropertyDescriptor - Invalid JavaBean property 'ambigousProp' being accessed! Ambiguous write methods found next to actually used [public void org.eclipse.gemini.blueprint.blueprint.AmbigousTestComponent.setAmbigousProp(java.lang.Object)]: [public void org.eclipse.gemini.blueprint.blueprint.AmbigousTestComponent.setAmbigousProp(int)]
Object setter called
2452 [main] WARN : o.s.b.GenericTypeAwarePropertyDescriptor - Invalid JavaBean property 'ambigousProp' being accessed! Ambiguous write methods found next to actually used [public void org.eclipse.gemini.blueprint.blueprint.AmbigousTestComponent.setAmbigousProp(java.lang.Object)]: [public void org.eclipse.gemini.blueprint.blueprint.AmbigousTestComponent.setAmbigousProp(int)]
Object setter called
2542 [main] WARN : o.s.b.GenericTypeAwarePropertyDescriptor - Invalid JavaBean property 'ambigousProp' being accessed! Ambiguous write methods found next to actually used [public void org.eclipse.gemini.blueprint.blueprint.AmbigousTestComponent.setAmbigousProp(java.lang.Object)]: [public void org.eclipse.gemini.blueprint.blueprint.AmbigousTestComponent.setAmbigousProp(int)]
Object setter called
2630 [main] WARN : o.s.b.GenericTypeAwarePropertyDescriptor - Invalid JavaBean property 'ambigousProp' being accessed! Ambiguous write methods found next to actually used [public void org.eclipse.gemini.blueprint.blueprint.AmbigousTestComponent.setAmbigousProp(java.lang.Object)]: [public void org.eclipse.gemini.blueprint.blueprint.AmbigousTestComponent.setAmbigousProp(int)]
Object setter called
2710 [main] WARN : o.s.b.GenericTypeAwarePropertyDescriptor - Invalid JavaBean property 'ambigousProp' being accessed! Ambiguous write methods found next to actually used [public void org.eclipse.gemini.blueprint.blueprint.AmbigousTestComponent.setAmbigousProp(java.lang.Object)]: [public void org.eclipse.gemini.blueprint.blueprint.AmbigousTestComponent.setAmbigousProp(int)]
Object setter called
2794 [main] WARN : o.s.b.GenericTypeAwarePropertyDescriptor - Invalid JavaBean property 'ambigousProp' being accessed! Ambiguous write methods found next to actually used [public void org.eclipse.gemini.blueprint.blueprint.AmbigousTestComponent.setAmbigousProp(java.lang.Object)]: [public void org.eclipse.gemini.blueprint.blueprint.AmbigousTestComponent.setAmbigousProp(int)]
Object setter called
2865 [main] WARN : o.s.b.GenericTypeAwarePropertyDescriptor - Invalid JavaBean property 'ambigousProp' being accessed! Ambiguous write methods found next to actually used [public void org.eclipse.gemini.blueprint.blueprint.AmbigousTestComponent.setAmbigousProp(java.lang.Object)]: [public void org.eclipse.gemini.blueprint.blueprint.AmbigousTestComponent.setAmbigousProp(int)]
Object setter called
2938 [main] WARN : o.s.b.GenericTypeAwarePropertyDescriptor - Invalid JavaBean property 'ambigousProp' being accessed! Ambiguous write methods found next to actually used [public void org.eclipse.gemini.blueprint.blueprint.AmbigousTestComponent.setAmbigousProp(java.lang.Object)]: [public void org.eclipse.gemini.blueprint.blueprint.AmbigousTestComponent.setAmbigousProp(int)]
Object setter called
3004 [main] WARN : o.s.b.GenericTypeAwarePropertyDescriptor - Invalid JavaBean property 'ambigousProp' being accessed! Ambiguous write methods found next to actually used [public void org.eclipse.gemini.blueprint.blueprint.AmbigousTestComponent.setAmbigousProp(java.lang.Object)]: [public void org.eclipse.gemini.blueprint.blueprint.AmbigousTestComponent.setAmbigousProp(int)]
Object setter called
3068 [main] WARN : o.s.b.GenericTypeAwarePropertyDescriptor - Invalid JavaBean property 'ambigousProp' being accessed! Ambiguous write methods found next to actually used [public void org.eclipse.gemini.blueprint.blueprint.AmbigousTestComponent.setAmbigousProp(java.lang.Object)]: [public void org.eclipse.gemini.blueprint.blueprint.AmbigousTestComponent.setAmbigousProp(int)]
Object setter called
3131 [main] WARN : o.s.b.GenericTypeAwarePropertyDescriptor - Invalid JavaBean property 'ambigousProp' being accessed! Ambiguous write methods found next to actually used [public void org.eclipse.gemini.blueprint.blueprint.AmbigousTestComponent.setAmbigousProp(java.lang.Object)]: [public void org.eclipse.gemini.blueprint.blueprint.AmbigousTestComponent.setAmbigousProp(int)]
Object setter called
3192 [main] WARN : o.s.b.GenericTypeAwarePropertyDescriptor - Invalid JavaBean property 'ambigousProp' being accessed! Ambiguous write methods found next to actually used [public void org.eclipse.gemini.blueprint.blueprint.AmbigousTestComponent.setAmbigousProp(java.lang.Object)]: [public void org.eclipse.gemini.blueprint.blueprint.AmbigousTestComponent.setAmbigousProp(int)]
Object setter called
3252 [main] WARN : o.s.b.GenericTypeAwarePropertyDescriptor - Invalid JavaBean property 'ambigousProp' being accessed! Ambiguous write methods found next to actually used [public void org.eclipse.gemini.blueprint.blueprint.AmbigousTestComponent.setAmbigousProp(java.lang.Object)]: [public void org.eclipse.gemini.blueprint.blueprint.AmbigousTestComponent.setAmbigousProp(int)]
Object setter called
3314 [main] WARN : o.s.b.GenericTypeAwarePropertyDescriptor - Invalid JavaBean property 'ambigousProp' being accessed! Ambiguous write methods found next to actually used [public void org.eclipse.gemini.blueprint.blueprint.AmbigousTestComponent.setAmbigousProp(java.lang.Object)]: [public void org.eclipse.gemini.blueprint.blueprint.AmbigousTestComponent.setAmbigousProp(int)]
Object setter called
org.eclipse.gemini.blueprint.blueprint.AmbigousTestComponent@2f93e4a8
Tests run: 14, Failures: 0, Errors: 0, Skipped: 0, Time elapsed: 1.069 sec - in org.eclipse.gemini.blueprint.blueprint.config.ComponentSubElementTest
Running org.eclipse.gemini.blueprint.blueprint.config.SchemaWithLocationTest
Tests run: 1, Failures: 0, Errors: 0, Skipped: 0, Time elapsed: 0.012 sec - in org.eclipse.gemini.blueprint.blueprint.config.SchemaWithLocationTest
Running org.eclipse.gemini.blueprint.blueprint.config.SpringDmRfc124Test
[foo, list, reference, service, dm.exporter]
Tests run: 1, Failures: 0, Errors: 0, Skipped: 0, Time elapsed: 0.076 sec - in org.eclipse.gemini.blueprint.blueprint.config.SpringDmRfc124Test
Running org.eclipse.gemini.blueprint.blueprint.config.TypeConverterTest
The beans declared are: {.org.eclipse.gemini.blueprint.blueprint.container.BlueprintConverterConfigurer#0, arrayConversion, asianCodeExample, converterB, conversion, booleanConversion, serviceReference, referenceFactory, objectToCollectionConversion1, objectToCollectionConversion2}
Tests run: 9, Failures: 0, Errors: 0, Skipped: 0, Time elapsed: 0.304 sec - in org.eclipse.gemini.blueprint.blueprint.config.TypeConverterTest
Running org.eclipse.gemini.blueprint.blueprint.config.NestedElementsTest
The beans declared are: {classname, class, foo, bar}
Tests run: 1, Failures: 0, Errors: 0, Skipped: 0, Time elapsed: 0.026 sec - in org.eclipse.gemini.blueprint.blueprint.config.NestedElementsTest
Running org.eclipse.gemini.blueprint.blueprint.config.MixedRfc124BeansTest
The beans declared are: {simple-component, nested-bean, .org.eclipse.gemini.blueprint.blueprint.TestComponent#0, .org.eclipse.gemini.blueprint.blueprint.TestComponent#0#0, .org.eclipse.gemini.blueprint.blueprint.TestComponent#0#1, nan, char}
Tests run: 3, Failures: 0, Errors: 0, Skipped: 0, Time elapsed: 0.077 sec - in org.eclipse.gemini.blueprint.blueprint.config.MixedRfc124BeansTest
Running org.eclipse.gemini.blueprint.blueprint.config.ComponentElementTest
The beans declared are: {simple, depends-on, destroy-method, lazy-init, factory-method, thread, factory-component}
Tests run: 7, Failures: 0, Errors: 0, Skipped: 0, Time elapsed: 0.124 sec - in org.eclipse.gemini.blueprint.blueprint.config.ComponentElementTest
Running org.eclipse.gemini.blueprint.blueprint.config.SpringRootConfigTest
The beans declared are: {nested-bean}
Tests run: 1, Failures: 0, Errors: 0, Skipped: 0, Time elapsed: 0.014 sec - in org.eclipse.gemini.blueprint.blueprint.config.SpringRootConfigTest
Running org.eclipse.gemini.blueprint.blueprint.reflect.NestedDefinitionMetadataTest
Initialized
Initialized
Initialized
Initialized
Initialized
Initialized
null
null
null
.org.eclipse.gemini.blueprint.service.importer.support.OsgiServiceProxyFactoryBean#0#0
[dependsleaf1, dependsleaf2, first-level, deeply-nested, .org.eclipse.gemini.blueprint.service.importer.support.OsgiServiceCollectionProxyFactoryBean#0, nested-collection, nested-beans, .org.eclipse.gemini.blueprint.service.importer.support.OsgiServiceProxyFactoryBean#0, nested-references, .org.eclipse.gemini.blueprint.service.importer.support.OsgiServiceProxyFactoryBean#0#0]
Tests run: 6, Failures: 0, Errors: 0, Skipped: 0, Time elapsed: 0.267 sec - in org.eclipse.gemini.blueprint.blueprint.reflect.NestedDefinitionMetadataTest
Running org.eclipse.gemini.blueprint.blueprint.metadata.BundleContextApiTest
Tests run: 3, Failures: 0, Errors: 0, Skipped: 0, Time elapsed: 0.068 sec - in org.eclipse.gemini.blueprint.blueprint.metadata.BundleContextApiTest
Running org.eclipse.gemini.blueprint.blueprint.metadata.ExporterMetadataTest
[org.eclipse.gemini.blueprint.blueprint.reflect.SimpleMapEntry@108f8051, org.eclipse.gemini.blueprint.blueprint.reflect.SimpleMapEntry@3d314e55]
Tests run: 2, Failures: 0, Errors: 0, Skipped: 0, Time elapsed: 0.052 sec - in org.eclipse.gemini.blueprint.blueprint.metadata.ExporterMetadataTest
Running org.eclipse.gemini.blueprint.blueprint.metadata.ImporterMetadataTest
Initialized
Initialized
org.eclipse.gemini.blueprint.blueprint.reflect.SimpleReferenceMetadata
Initialized
Initialized
Initialized
Initialized
Initialized
Initialized
Initialized
Initialized
Initialized
Initialized
Initialized
Initialized
Tests run: 7, Failures: 0, Errors: 0, Skipped: 0, Time elapsed: 0.289 sec - in org.eclipse.gemini.blueprint.blueprint.metadata.ImporterMetadataTest
Running org.eclipse.gemini.blueprint.blueprint.metadata.BeanComponentMetadataTest
4702 [main] WARN : o.s.b.GenericTypeAwarePropertyDescriptor - Invalid JavaBean property 'ambigousProp' being accessed! Ambiguous write methods found next to actually used [public void org.eclipse.gemini.blueprint.blueprint.AmbigousTestComponent.setAmbigousProp(java.lang.Object)]: [public void org.eclipse.gemini.blueprint.blueprint.AmbigousTestComponent.setAmbigousProp(int)]
Object setter called
4763 [main] WARN : o.s.b.GenericTypeAwarePropertyDescriptor - Invalid JavaBean property 'ambigousProp' being accessed! Ambiguous write methods found next to actually used [public void org.eclipse.gemini.blueprint.blueprint.AmbigousTestComponent.setAmbigousProp(java.lang.Object)]: [public void org.eclipse.gemini.blueprint.blueprint.AmbigousTestComponent.setAmbigousProp(int)]
Object setter called
Param value is org.eclipse.gemini.blueprint.blueprint.reflect.SimpleValueMetadata@77c9912f
4819 [main] WARN : o.s.b.GenericTypeAwarePropertyDescriptor - Invalid JavaBean property 'ambigousProp' being accessed! Ambiguous write methods found next to actually used [public void org.eclipse.gemini.blueprint.blueprint.AmbigousTestComponent.setAmbigousProp(java.lang.Object)]: [public void org.eclipse.gemini.blueprint.blueprint.AmbigousTestComponent.setAmbigousProp(int)]
Object setter called
[Ljava.util.Date;@267f6728
null
java.net.URL
class [Ljava.lang.Object;
[org.eclipse.gemini.blueprint.blueprint.reflect.SimpleValueMetadata@764d86d6, org.eclipse.gemini.blueprint.blueprint.reflect.SimpleValueMetadata@5bcf8847]
null
http://www.osgi.org
null
http://www.gmail.com
4873 [main] WARN : o.s.b.GenericTypeAwarePropertyDescriptor - Invalid JavaBean property 'ambigousProp' being accessed! Ambiguous write methods found next to actually used [public void org.eclipse.gemini.blueprint.blueprint.AmbigousTestComponent.setAmbigousProp(java.lang.Object)]: [public void org.eclipse.gemini.blueprint.blueprint.AmbigousTestComponent.setAmbigousProp(int)]
Object setter called
4927 [main] WARN : o.s.b.GenericTypeAwarePropertyDescriptor - Invalid JavaBean property 'ambigousProp' being accessed! Ambiguous write methods found next to actually used [public void org.eclipse.gemini.blueprint.blueprint.AmbigousTestComponent.setAmbigousProp(java.lang.Object)]: [public void org.eclipse.gemini.blueprint.blueprint.AmbigousTestComponent.setAmbigousProp(int)]
Object setter called
4980 [main] WARN : o.s.b.GenericTypeAwarePropertyDescriptor - Invalid JavaBean property 'ambigousProp' being accessed! Ambiguous write methods found next to actually used [public void org.eclipse.gemini.blueprint.blueprint.AmbigousTestComponent.setAmbigousProp(java.lang.Object)]: [public void org.eclipse.gemini.blueprint.blueprint.AmbigousTestComponent.setAmbigousProp(int)]
Object setter called
5030 [main] WARN : o.s.b.GenericTypeAwarePropertyDescriptor - Invalid JavaBean property 'ambigousProp' being accessed! Ambiguous write methods found next to actually used [public void org.eclipse.gemini.blueprint.blueprint.AmbigousTestComponent.setAmbigousProp(java.lang.Object)]: [public void org.eclipse.gemini.blueprint.blueprint.AmbigousTestComponent.setAmbigousProp(int)]
Object setter called
StaticFactory param 1
StaticFactory param 2
StaticFactory param 0
5079 [main] WARN : o.s.b.GenericTypeAwarePropertyDescriptor - Invalid JavaBean property 'ambigousProp' being accessed! Ambiguous write methods found next to actually used [public void org.eclipse.gemini.blueprint.blueprint.AmbigousTestComponent.setAmbigousProp(java.lang.Object)]: [public void org.eclipse.gemini.blueprint.blueprint.AmbigousTestComponent.setAmbigousProp(int)]
Object setter called
5129 [main] WARN : o.s.b.GenericTypeAwarePropertyDescriptor - Invalid JavaBean property 'ambigousProp' being accessed! Ambiguous write methods found next to actually used [public void org.eclipse.gemini.blueprint.blueprint.AmbigousTestComponent.setAmbigousProp(java.lang.Object)]: [public void org.eclipse.gemini.blueprint.blueprint.AmbigousTestComponent.setAmbigousProp(int)]
Object setter called
5180 [main] WARN : o.s.b.GenericTypeAwarePropertyDescriptor - Invalid JavaBean property 'ambigousProp' being accessed! Ambiguous write methods found next to actually used [public void org.eclipse.gemini.blueprint.blueprint.AmbigousTestComponent.setAmbigousProp(java.lang.Object)]: [public void org.eclipse.gemini.blueprint.blueprint.AmbigousTestComponent.setAmbigousProp(int)]
Object setter called
5229 [main] WARN : o.s.b.GenericTypeAwarePropertyDescriptor - Invalid JavaBean property 'ambigousProp' being accessed! Ambiguous write methods found next to actually used [public void org.eclipse.gemini.blueprint.blueprint.AmbigousTestComponent.setAmbigousProp(java.lang.Object)]: [public void org.eclipse.gemini.blueprint.blueprint.AmbigousTestComponent.setAmbigousProp(int)]
Object setter called
5279 [main] WARN : o.s.b.GenericTypeAwarePropertyDescriptor - Invalid JavaBean property 'ambigousProp' being accessed! Ambiguous write methods found next to actually used [public void org.eclipse.gemini.blueprint.blueprint.AmbigousTestComponent.setAmbigousProp(java.lang.Object)]: [public void org.eclipse.gemini.blueprint.blueprint.AmbigousTestComponent.setAmbigousProp(int)]
Object setter called
5326 [main] WARN : o.s.b.GenericTypeAwarePropertyDescriptor - Invalid JavaBean property 'ambigousProp' being accessed! Ambiguous write methods found next to actually used [public void org.eclipse.gemini.blueprint.blueprint.AmbigousTestComponent.setAmbigousProp(java.lang.Object)]: [public void org.eclipse.gemini.blueprint.blueprint.AmbigousTestComponent.setAmbigousProp(int)]
Object setter called
5372 [main] WARN : o.s.b.GenericTypeAwarePropertyDescriptor - Invalid JavaBean property 'ambigousProp' being accessed! Ambiguous write methods found next to actually used [public void org.eclipse.gemini.blueprint.blueprint.AmbigousTestComponent.setAmbigousProp(java.lang.Object)]: [public void org.eclipse.gemini.blueprint.blueprint.AmbigousTestComponent.setAmbigousProp(int)]
Object setter called
5416 [main] WARN : o.s.b.GenericTypeAwarePropertyDescriptor - Invalid JavaBean property 'ambigousProp' being accessed! Ambiguous write methods found next to actually used [public void org.eclipse.gemini.blueprint.blueprint.AmbigousTestComponent.setAmbigousProp(java.lang.Object)]: [public void org.eclipse.gemini.blueprint.blueprint.AmbigousTestComponent.setAmbigousProp(int)]
Object setter called
0.0
5459 [main] WARN : o.s.b.GenericTypeAwarePropertyDescriptor - Invalid JavaBean property 'ambigousProp' being accessed! Ambiguous write methods found next to actually used [public void org.eclipse.gemini.blueprint.blueprint.AmbigousTestComponent.setAmbigousProp(java.lang.Object)]: [public void org.eclipse.gemini.blueprint.blueprint.AmbigousTestComponent.setAmbigousProp(int)]
Object setter called
5503 [main] WARN : o.s.b.GenericTypeAwarePropertyDescriptor - Invalid JavaBean property 'ambigousProp' being accessed! Ambiguous write methods found next to actually used [public void org.eclipse.gemini.blueprint.blueprint.AmbigousTestComponent.setAmbigousProp(java.lang.Object)]: [public void org.eclipse.gemini.blueprint.blueprint.AmbigousTestComponent.setAmbigousProp(int)]
Object setter called
org.eclipse.gemini.blueprint.blueprint.reflect.SimplePropsMetadata@6106258e
5546 [main] WARN : o.s.b.GenericTypeAwarePropertyDescriptor - Invalid JavaBean property 'ambigousProp' being accessed! Ambiguous write methods found next to actually used [public void org.eclipse.gemini.blueprint.blueprint.AmbigousTestComponent.setAmbigousProp(java.lang.Object)]: [public void org.eclipse.gemini.blueprint.blueprint.AmbigousTestComponent.setAmbigousProp(int)]
Object setter called
5589 [main] WARN : o.s.b.GenericTypeAwarePropertyDescriptor - Invalid JavaBean property 'ambigousProp' being accessed! Ambiguous write methods found next to actually used [public void org.eclipse.gemini.blueprint.blueprint.AmbigousTestComponent.setAmbigousProp(java.lang.Object)]: [public void org.eclipse.gemini.blueprint.blueprint.AmbigousTestComponent.setAmbigousProp(int)]
Object setter called
NaN
[org.eclipse.gemini.blueprint.blueprint.reflect.SimpleBeanProperty@480955df]
5633 [main] WARN : o.s.b.GenericTypeAwarePropertyDescriptor - Invalid JavaBean property 'ambigousProp' being accessed! Ambiguous write methods found next to actually used [public void org.eclipse.gemini.blueprint.blueprint.AmbigousTestComponent.setAmbigousProp(java.lang.Object)]: [public void org.eclipse.gemini.blueprint.blueprint.AmbigousTestComponent.setAmbigousProp(int)]
Object setter called
Param value is org.eclipse.gemini.blueprint.blueprint.reflect.SimpleValueMetadata@6be9ef9b
Tests run: 20, Failures: 0, Errors: 0, Skipped: 0, Time elapsed: 0.984 sec - in org.eclipse.gemini.blueprint.blueprint.metadata.BeanComponentMetadataTest
Running org.eclipse.gemini.blueprint.blueprint.metadata.DefaultsTest
Initialized dependsleaf1
Initialized dependsleaf2
Initialized overridden-activation
Initialized
1
Initialized dependsleaf1
Initialized dependsleaf2
Initialized overridden-activation
Initialized dependsleaf1
Initialized dependsleaf2
Initialized overridden-activation
Initialized dependsleaf1
Initialized dependsleaf2
Initialized overridden-activation
Tests run: 4, Failures: 0, Errors: 0, Skipped: 0, Time elapsed: 0.097 sec - in org.eclipse.gemini.blueprint.blueprint.metadata.DefaultsTest
Running org.eclipse.gemini.blueprint.blueprint.metadata.ImporterCollectionsMetadataTest
Tests run: 2, Failures: 0, Errors: 0, Skipped: 0, Time elapsed: 0.038 sec - in org.eclipse.gemini.blueprint.blueprint.metadata.ImporterCollectionsMetadataTest
Running org.eclipse.gemini.blueprint.blueprint.ReflectionTest
boolean
java.lang.Boolean
Boolean true
boolean true
Boolean true
Tests run: 1, Failures: 0, Errors: 0, Skipped: 0, Time elapsed: 0.001 sec - in org.eclipse.gemini.blueprint.blueprint.ReflectionTest
Running org.eclipse.gemini.blueprint.compendium.config.CmConfigAndCtxPropertiesConfigurationTest
Tests run: 1, Failures: 0, Errors: 0, Skipped: 0, Time elapsed: 0.084 sec - in org.eclipse.gemini.blueprint.compendium.config.CmConfigAndCtxPropertiesConfigurationTest
Running org.eclipse.gemini.blueprint.compendium.config.ManagedPropertiesTest
Tests run: 7, Failures: 0, Errors: 0, Skipped: 0, Time elapsed: 0.179 sec - in org.eclipse.gemini.blueprint.compendium.config.ManagedPropertiesTest
Running org.eclipse.gemini.blueprint.compendium.config.ConfigPropertiesHandlerTest
Tests run: 7, Failures: 0, Errors: 0, Skipped: 0, Time elapsed: 0.114 sec - in org.eclipse.gemini.blueprint.compendium.config.ConfigPropertiesHandlerTest
Running org.eclipse.gemini.blueprint.compendium.config.ManagedServiceFactoryTest
Tests run: 6, Failures: 0, Errors: 0, Skipped: 0, Time elapsed: 0.16 sec - in org.eclipse.gemini.blueprint.compendium.config.ManagedServiceFactoryTest
Running org.eclipse.gemini.blueprint.compendium.internal.cm.ManagedFactoryDisposableInvokerTest
Tests run: 5, Failures: 0, Errors: 0, Skipped: 0, Time elapsed: 0.003 sec - in org.eclipse.gemini.blueprint.compendium.internal.cm.ManagedFactoryDisposableInvokerTest
Running org.eclipse.gemini.blueprint.compendium.internal.cm.UpdateMethodAdapterTest
Tests run: 8, Failures: 0, Errors: 0, Skipped: 0, Time elapsed: 0.003 sec - in org.eclipse.gemini.blueprint.compendium.internal.cm.UpdateMethodAdapterTest
Running org.eclipse.gemini.blueprint.compendium.internal.cm.ConfigurationAdminManagerTest
Tests run: 4, Failures: 0, Errors: 0, Skipped: 0, Time elapsed: 0 sec - in org.eclipse.gemini.blueprint.compendium.internal.cm.ConfigurationAdminManagerTest
Running org.eclipse.gemini.blueprint.compendium.internal.cm.DefaultManagedServiceBeanManagerTest
Tests run: 9, Failures: 0, Errors: 0, Skipped: 0, Time elapsed: 0.002 sec - in org.eclipse.gemini.blueprint.compendium.internal.cm.DefaultManagedServiceBeanManagerTest
Running org.eclipse.gemini.blueprint.config.OsgiReferenceCollectionNamespaceHandlerTest
Tests run: 10, Failures: 0, Errors: 0, Skipped: 0, Time elapsed: 0.256 sec - in org.eclipse.gemini.blueprint.config.OsgiReferenceCollectionNamespaceHandlerTest
Running org.eclipse.gemini.blueprint.config.internal.OsgiServiceRegistrationListenerAdapterTest
6609 [main] WARN : o.e.g.b.c.i.a.OsgiServiceRegistrationListenerAdapter - Standard registered method on [org.eclipse.gemini.blueprint.config.internal.OsgiServiceRegistrationListenerAdapterTest$ExceptionListener] threw exception
org.eclipse.gemini.blueprint.config.internal.OsgiServiceRegistrationListenerAdapterTest$ExceptionListener$1: expected!
6610 [main] WARN : o.e.g.b.c.i.a.OsgiServiceRegistrationListenerAdapter - Standard unregistered method on [org.eclipse.gemini.blueprint.config.internal.OsgiServiceRegistrationListenerAdapterTest$ExceptionListener] threw exception
org.eclipse.gemini.blueprint.config.internal.OsgiServiceRegistrationListenerAdapterTest$ExceptionListener$2: expected!
Tests run: 15, Failures: 0, Errors: 0, Skipped: 0, Time elapsed: 0.015 sec - in org.eclipse.gemini.blueprint.config.internal.OsgiServiceRegistrationListenerAdapterTest
Running org.eclipse.gemini.blueprint.config.internal.OsgiServiceLifecycleListenerAdapterTest
6626 [main] WARN : o.e.g.b.c.i.a.CustomListenerAdapterUtils - Custom method [public void org.eclipse.gemini.blueprint.config.internal.OsgiServiceLifecycleListenerAdapterTest$ExceptionCustomListener.myBind(java.util.Date,java.util.Map)] threw exception when passing service [java.util.Date@5a0a4ec7]
org.eclipse.gemini.blueprint.config.internal.OsgiServiceLifecycleListenerAdapterTest$ExceptionCustomListener$1: expected!
6629 [main] WARN : o.e.g.b.c.i.a.OsgiServiceLifecycleListenerAdapter - standard bind method on [org.eclipse.gemini.blueprint.config.internal.OsgiServiceLifecycleListenerAdapterTest$ExceptionListener] threw exception
org.eclipse.gemini.blueprint.config.internal.OsgiServiceLifecycleListenerAdapterTest$ExceptionListener$1: expected!
6629 [main] WARN : o.e.g.b.c.i.a.OsgiServiceLifecycleListenerAdapter - Standard unbind method on [org.eclipse.gemini.blueprint.config.internal.OsgiServiceLifecycleListenerAdapterTest$ExceptionListener] threw exception
org.eclipse.gemini.blueprint.config.internal.OsgiServiceLifecycleListenerAdapterTest$ExceptionListener$2: expected!
Tests run: 18, Failures: 0, Errors: 0, Skipped: 0, Time elapsed: 0.019 sec - in org.eclipse.gemini.blueprint.config.internal.OsgiServiceLifecycleListenerAdapterTest
Running org.eclipse.gemini.blueprint.config.BundleFactoryBeanParserTest
Tests run: 8, Failures: 0, Errors: 0, Skipped: 0, Time elapsed: 0.124 sec - in org.eclipse.gemini.blueprint.config.BundleFactoryBeanParserTest
Running org.eclipse.gemini.blueprint.config.OsgiServiceNamespaceHandlerTest
string bean
Tests run: 9, Failures: 0, Errors: 0, Skipped: 0, Time elapsed: 0.248 sec - in org.eclipse.gemini.blueprint.config.OsgiServiceNamespaceHandlerTest
Running org.eclipse.gemini.blueprint.config.InvalidOsgiDefaultsTest
Tests run: 1, Failures: 0, Errors: 0, Skipped: 0, Time elapsed: 0.008 sec - in org.eclipse.gemini.blueprint.config.InvalidOsgiDefaultsTest
Running org.eclipse.gemini.blueprint.config.OsgiReferenceNamespaceHandlerTest
Tests run: 4, Failures: 0, Errors: 0, Skipped: 0, Time elapsed: 0.092 sec - in org.eclipse.gemini.blueprint.config.OsgiReferenceNamespaceHandlerTest
Running org.eclipse.gemini.blueprint.config.NestedReferencesTest
Tests run: 5, Failures: 0, Errors: 0, Skipped: 0, Time elapsed: 0.14 sec - in org.eclipse.gemini.blueprint.config.NestedReferencesTest
Running org.eclipse.gemini.blueprint.config.OsgiSingleReferenceParserWithInvalidFilesTest
Tests run: 3, Failures: 0, Errors: 0, Skipped: 0, Time elapsed: 0.033 sec - in org.eclipse.gemini.blueprint.config.OsgiSingleReferenceParserWithInvalidFilesTest
Running org.eclipse.gemini.blueprint.context.support.ConfigLocationsTest
Tests run: 1, Failures: 0, Errors: 0, Skipped: 0, Time elapsed: 0.003 sec - in org.eclipse.gemini.blueprint.context.support.ConfigLocationsTest
Running org.eclipse.gemini.blueprint.context.support.AbstractRefreshableOsgiBundleApplicationContextTest
Tests run: 2, Failures: 0, Errors: 0, Skipped: 0, Time elapsed: 0.016 sec - in org.eclipse.gemini.blueprint.context.support.AbstractRefreshableOsgiBundleApplicationContextTest
Running org.eclipse.gemini.blueprint.context.support.AbstractBundleXmlApplicationContextTest
Tests run: 3, Failures: 0, Errors: 0, Skipped: 0, Time elapsed: 0 sec - in org.eclipse.gemini.blueprint.context.support.AbstractBundleXmlApplicationContextTest
Running org.eclipse.gemini.blueprint.context.internal.classloader.ChainedClassLoaderTest
Tests run: 7, Failures: 0, Errors: 0, Skipped: 0, Time elapsed: 0.001 sec - in org.eclipse.gemini.blueprint.context.internal.classloader.ChainedClassLoaderTest
Running org.eclipse.gemini.blueprint.context.OsgiBundleScopeTest
Tests run: 4, Failures: 0, Errors: 0, Skipped: 0, Time elapsed: 0 sec - in org.eclipse.gemini.blueprint.context.OsgiBundleScopeTest
Running org.eclipse.gemini.blueprint.util.internal.ServiceReferenceBasedMapTest
Tests run: 8, Failures: 0, Errors: 0, Skipped: 0, Time elapsed: 0.002 sec - in org.eclipse.gemini.blueprint.util.internal.ServiceReferenceBasedMapTest
Running org.eclipse.gemini.blueprint.util.OsgiListenerUtilsTest
Tests run: 3, Failures: 0, Errors: 0, Skipped: 0, Time elapsed: 0 sec - in org.eclipse.gemini.blueprint.util.OsgiListenerUtilsTest
Running org.eclipse.gemini.blueprint.util.OsgiStringUtilsTest
Tests run: 13, Failures: 0, Errors: 0, Skipped: 0, Time elapsed: 0.002 sec - in org.eclipse.gemini.blueprint.util.OsgiStringUtilsTest
Running org.eclipse.gemini.blueprint.util.ClassUtilsTest
Tests run: 6, Failures: 0, Errors: 0, Skipped: 0, Time elapsed: 0 sec - in org.eclipse.gemini.blueprint.util.ClassUtilsTest
Running org.eclipse.gemini.blueprint.util.BundleDelegatingClassLoaderTest
Tests run: 7, Failures: 0, Errors: 0, Skipped: 0, Time elapsed: 0.147 sec - in org.eclipse.gemini.blueprint.util.BundleDelegatingClassLoaderTest
Running org.eclipse.gemini.blueprint.util.SimpleLoggerTest
Tests run: 18, Failures: 0, Errors: 0, Skipped: 0, Time elapsed: 0.055 sec - in org.eclipse.gemini.blueprint.util.SimpleLoggerTest
Running org.eclipse.gemini.blueprint.util.MapBasedDictionaryTest
Tests run: 18, Failures: 0, Errors: 0, Skipped: 0, Time elapsed: 0.002 sec - in org.eclipse.gemini.blueprint.util.MapBasedDictionaryTest
Running org.eclipse.gemini.blueprint.util.OsgiPlatformDetectorTest
Tests run: 3, Failures: 0, Errors: 0, Skipped: 0, Time elapsed: 0 sec - in org.eclipse.gemini.blueprint.util.OsgiPlatformDetectorTest
Running org.eclipse.gemini.blueprint.util.DebugUtilsTest
Tests run: 7, Failures: 0, Errors: 0, Skipped: 0, Time elapsed: 0 sec - in org.eclipse.gemini.blueprint.util.DebugUtilsTest
Running org.eclipse.gemini.blueprint.util.OsgiBundleUtilsTest
Tests run: 2, Failures: 0, Errors: 0, Skipped: 0, Time elapsed: 0 sec - in org.eclipse.gemini.blueprint.util.OsgiBundleUtilsTest
Running org.eclipse.gemini.blueprint.internal.context.support.OsgiReferenceToServiceReferenceConversionTest
org.eclipse.gemini.blueprint.service.importer.support.internal.aop.SwappingServiceReferenceProxy@86baed2
Tests run: 2, Failures: 0, Errors: 0, Skipped: 0, Time elapsed: 0.052 sec - in org.eclipse.gemini.blueprint.internal.context.support.OsgiReferenceToServiceReferenceConversionTest
Running org.eclipse.gemini.blueprint.internal.service.collection.threading.DynamicCollectionThreadingTest
thread Iter2 is waiting for time 10
thread Iter1 is waiting for time 40
thread Writer is waiting for time 20
thread Iter1 is in state WAITING
thread Iter2 is in state WAITING
thread Writer is in state WAITING
thread Iter1 is in state WAITING
thread Iter2 is in state WAITING
thread Writer is in state WAITING
Time is now 10
thread Writer is waiting for time 20
thread Iter1 is waiting for time 40
Releasing thread Iter2 at time 10
thread Iter2 is waiting for time 30
thread Iter1 is in state WAITING
thread Iter2 is in state WAITING
thread Writer is in state WAITING
thread Iter1 is in state WAITING
thread Iter2 is in state WAITING
thread Writer is in state WAITING
Time is now 20
thread Iter2 is waiting for time 30
thread Iter1 is waiting for time 40
Releasing thread Writer at time 20
thread Writer is waiting for time 50
thread Iter1 is in state WAITING
thread Iter2 is in state WAITING
thread Writer is in state WAITING
thread Iter1 is in state WAITING
thread Iter2 is in state WAITING
thread Writer is in state WAITING
Time is now 30
thread Writer is waiting for time 50
thread Iter1 is waiting for time 40
Releasing thread Iter2 at time 30
thread Iter2 is waiting for time 70
thread Iter1 is in state WAITING
thread Iter2 is in state WAITING
thread Writer is in state WAITING
thread Iter1 is in state WAITING
thread Iter2 is in state WAITING
thread Writer is in state WAITING
Time is now 40
thread Iter2 is waiting for time 70
Releasing thread Iter1 at time 40
thread Iter1 is waiting for time 60
thread Writer is waiting for time 50
thread Iter1 is in state WAITING
thread Iter2 is in state WAITING
thread Writer is in state WAITING
thread Iter1 is in state WAITING
thread Iter2 is in state WAITING
thread Writer is in state WAITING
Time is now 50
Releasing thread Writer at time 50
thread Iter1 is waiting for time 60
thread Iter2 is waiting for time 70
thread Iter1 is in state WAITING
thread Iter2 is in state WAITING
thread Iter1 is in state WAITING
thread Iter2 is in state WAITING
Time is now 60
thread Iter2 is waiting for time 70
Releasing thread Iter1 at time 60
thread Iter2 is in state WAITING
thread Iter2 is in state WAITING
Time is now 70
Releasing thread Iter2 at time 70
thread Writer is waiting for time 20
thread Iter2 is waiting for time 10
thread Iter1 is waiting for time 40
thread Iter1 is in state WAITING
thread Iter2 is in state WAITING
thread Writer is in state WAITING
thread Iter1 is in state WAITING
thread Iter2 is in state WAITING
thread Writer is in state WAITING
Time is now 10
thread Iter1 is waiting for time 40
Releasing thread Iter2 at time 10
thread Writer is waiting for time 20
thread Iter2 is waiting for time 30
thread Iter1 is in state WAITING
thread Iter2 is in state WAITING
thread Writer is in state WAITING
thread Iter1 is in state WAITING
thread Iter2 is in state WAITING
thread Writer is in state WAITING
Time is now 20
thread Iter2 is waiting for time 30
Releasing thread Writer at time 20
thread Writer is waiting for time 50
thread Iter1 is waiting for time 40
thread Iter1 is in state WAITING
thread Iter2 is in state WAITING
thread Writer is in state WAITING
thread Iter1 is in state WAITING
thread Iter2 is in state WAITING
thread Writer is in state WAITING
Time is now 30
thread Iter1 is waiting for time 40
thread Writer is waiting for time 50
Releasing thread Iter2 at time 30
thread Iter2 is waiting for time 70
thread Iter1 is in state WAITING
thread Iter2 is in state WAITING
thread Writer is in state WAITING
thread Iter1 is in state WAITING
thread Iter2 is in state WAITING
thread Writer is in state WAITING
Time is now 40
thread Iter2 is waiting for time 70
thread Writer is waiting for time 50
Releasing thread Iter1 at time 40
thread Iter1 is waiting for time 60
thread Iter1 is in state WAITING
thread Iter2 is in state WAITING
thread Writer is in state WAITING
thread Iter1 is in state WAITING
thread Iter2 is in state WAITING
thread Writer is in state WAITING
Time is now 50
thread Iter1 is waiting for time 60
Releasing thread Writer at time 50
thread Iter2 is waiting for time 70
thread Iter1 is in state WAITING
thread Iter2 is in state WAITING
thread Iter1 is in state WAITING
thread Iter2 is in state WAITING
Time is now 60
thread Iter2 is waiting for time 70
Releasing thread Iter1 at time 60
thread Iter2 is in state WAITING
thread Iter2 is in state WAITING
Time is now 70
Releasing thread Iter2 at time 70
thread Iter1 is waiting for time 40
thread Writer is waiting for time 20
thread Iter2 is waiting for time 10
thread Iter1 is in state WAITING
thread Iter2 is in state WAITING
thread Writer is in state WAITING
thread Iter1 is in state WAITING
thread Iter2 is in state WAITING
thread Writer is in state WAITING
Time is now 10
Releasing thread Iter2 at time 10
thread Iter2 is waiting for time 30
thread Writer is waiting for time 20
thread Iter1 is waiting for time 40
thread Iter1 is in state WAITING
thread Iter2 is in state WAITING
thread Writer is in state WAITING
thread Iter1 is in state WAITING
thread Iter2 is in state WAITING
thread Writer is in state WAITING
Time is now 20
thread Iter1 is waiting for time 40
Releasing thread Writer at time 20
thread Writer is waiting for time 50
thread Iter2 is waiting for time 30
thread Iter1 is in state WAITING
thread Iter2 is in state WAITING
thread Writer is in state WAITING
thread Iter1 is in state WAITING
thread Iter2 is in state WAITING
thread Writer is in state WAITING
Time is now 30
Releasing thread Iter2 at time 30
thread Iter2 is waiting for time 70
thread Writer is waiting for time 50
thread Iter1 is waiting for time 40
thread Iter1 is in state WAITING
thread Iter2 is in state WAITING
thread Writer is in state WAITING
thread Iter1 is in state WAITING
thread Iter2 is in state WAITING
thread Writer is in state WAITING
Time is now 40
Releasing thread Iter1 at time 40
thread Iter1 is waiting for time 60
thread Writer is waiting for time 50
thread Iter2 is waiting for time 70
thread Iter1 is in state WAITING
thread Iter2 is in state WAITING
thread Writer is in state WAITING
thread Iter1 is in state WAITING
thread Iter2 is in state WAITING
thread Writer is in state WAITING
Time is now 50
thread Iter2 is waiting for time 70
Releasing thread Writer at time 50
thread Iter1 is waiting for time 60
thread Iter1 is in state WAITING
thread Iter2 is in state WAITING
thread Iter1 is in state WAITING
thread Iter2 is in state WAITING
Time is now 60
Releasing thread Iter1 at time 60
thread Iter2 is waiting for time 70
thread Iter2 is in state WAITING
thread Iter2 is in state WAITING
Time is now 70
Releasing thread Iter2 at time 70
Tests run: 1, Failures: 0, Errors: 0, Skipped: 0, Time elapsed: 0.464 sec - in org.eclipse.gemini.blueprint.internal.service.collection.threading.DynamicCollectionThreadingTest
Running org.eclipse.gemini.blueprint.internal.service.collection.OsgiServiceListTest
given classes {interface org.eclipse.gemini.blueprint.internal.service.collection.AbstractOsgiCollectionTest$Wrapper, interface java.lang.Comparable} | resulting classes {interface org.eclipse.gemini.blueprint.internal.service.collection.AbstractOsgiCollectionTest$Wrapper, interface java.lang.Comparable, interface org.eclipse.gemini.blueprint.service.importer.ImportedOsgiServiceProxy, interface org.springframework.aop.SpringProxy}
given classes {interface org.eclipse.gemini.blueprint.internal.service.collection.AbstractOsgiCollectionTest$Wrapper, interface java.lang.Comparable} | resulting classes {interface org.eclipse.gemini.blueprint.internal.service.collection.AbstractOsgiCollectionTest$Wrapper, interface java.lang.Comparable, interface org.eclipse.gemini.blueprint.service.importer.ImportedOsgiServiceProxy, interface org.springframework.aop.SpringProxy}
given classes {interface org.eclipse.gemini.blueprint.internal.service.collection.AbstractOsgiCollectionTest$Wrapper, interface java.lang.Comparable} | resulting classes {interface org.eclipse.gemini.blueprint.internal.service.collection.AbstractOsgiCollectionTest$Wrapper, interface java.lang.Comparable, interface org.eclipse.gemini.blueprint.service.importer.ImportedOsgiServiceProxy, interface org.springframework.aop.SpringProxy}
given classes {interface org.eclipse.gemini.blueprint.internal.service.collection.AbstractOsgiCollectionTest$Wrapper, interface java.lang.Comparable} | resulting classes {interface org.eclipse.gemini.blueprint.internal.service.collection.AbstractOsgiCollectionTest$Wrapper, interface java.lang.Comparable, interface org.eclipse.gemini.blueprint.service.importer.ImportedOsgiServiceProxy, interface org.springframework.aop.SpringProxy}
Tests run: 4, Failures: 0, Errors: 0, Skipped: 0, Time elapsed: 0.006 sec - in org.eclipse.gemini.blueprint.internal.service.collection.OsgiServiceListTest
Running org.eclipse.gemini.blueprint.internal.service.collection.ServiceReferenceComparatorTest
Tests run: 6, Failures: 0, Errors: 0, Skipped: 0, Time elapsed: 0 sec - in org.eclipse.gemini.blueprint.internal.service.collection.ServiceReferenceComparatorTest
Running org.eclipse.gemini.blueprint.internal.service.collection.DynamicSetTest
Tests run: 7, Failures: 0, Errors: 0, Skipped: 0, Time elapsed: 0 sec - in org.eclipse.gemini.blueprint.internal.service.collection.DynamicSetTest
Running org.eclipse.gemini.blueprint.internal.service.collection.DynamicSortedSetTest
Tests run: 11, Failures: 0, Errors: 0, Skipped: 0, Time elapsed: 0.002 sec - in org.eclipse.gemini.blueprint.internal.service.collection.DynamicSortedSetTest
Running org.eclipse.gemini.blueprint.internal.service.collection.DynamicSortedSetIteratorTest
Tests run: 5, Failures: 0, Errors: 0, Skipped: 0, Time elapsed: 0.001 sec - in org.eclipse.gemini.blueprint.internal.service.collection.DynamicSortedSetIteratorTest
Running org.eclipse.gemini.blueprint.internal.service.collection.DynamicCollectionTest
Tests run: 4, Failures: 0, Errors: 0, Skipped: 0, Time elapsed: 0 sec - in org.eclipse.gemini.blueprint.internal.service.collection.DynamicCollectionTest
Running org.eclipse.gemini.blueprint.internal.service.collection.DynamicSetIteratorTest
Tests run: 4, Failures: 0, Errors: 0, Skipped: 0, Time elapsed: 0.001 sec - in org.eclipse.gemini.blueprint.internal.service.collection.DynamicSetIteratorTest
Running org.eclipse.gemini.blueprint.internal.service.collection.OsgiServiceCollectionTest
given classes {interface org.eclipse.gemini.blueprint.internal.service.collection.AbstractOsgiCollectionTest$Wrapper, interface java.lang.Comparable} | resulting classes {interface org.eclipse.gemini.blueprint.internal.service.collection.AbstractOsgiCollectionTest$Wrapper, interface java.lang.Comparable, interface org.eclipse.gemini.blueprint.service.importer.ImportedOsgiServiceProxy, interface org.springframework.aop.SpringProxy}
given classes {interface org.eclipse.gemini.blueprint.internal.service.collection.AbstractOsgiCollectionTest$Wrapper, interface java.lang.Comparable} | resulting classes {interface org.eclipse.gemini.blueprint.internal.service.collection.AbstractOsgiCollectionTest$Wrapper, interface java.lang.Comparable, interface org.eclipse.gemini.blueprint.service.importer.ImportedOsgiServiceProxy, interface org.springframework.aop.SpringProxy}
given classes {interface org.eclipse.gemini.blueprint.internal.service.collection.AbstractOsgiCollectionTest$Wrapper, interface java.lang.Comparable} | resulting classes {interface org.eclipse.gemini.blueprint.internal.service.collection.AbstractOsgiCollectionTest$Wrapper, interface java.lang.Comparable, interface org.eclipse.gemini.blueprint.service.importer.ImportedOsgiServiceProxy, interface org.springframework.aop.SpringProxy}
given classes {interface org.eclipse.gemini.blueprint.internal.service.collection.AbstractOsgiCollectionTest$Wrapper, interface java.lang.Comparable} | resulting classes {interface org.eclipse.gemini.blueprint.internal.service.collection.AbstractOsgiCollectionTest$Wrapper, interface java.lang.Comparable, interface org.eclipse.gemini.blueprint.service.importer.ImportedOsgiServiceProxy, interface org.springframework.aop.SpringProxy}
Tests run: 4, Failures: 0, Errors: 0, Skipped: 0, Time elapsed: 0.002 sec - in org.eclipse.gemini.blueprint.internal.service.collection.OsgiServiceCollectionTest
Running org.eclipse.gemini.blueprint.internal.service.collection.OsgiServiceSetTest
given classes {interface org.eclipse.gemini.blueprint.internal.service.collection.AbstractOsgiCollectionTest$Wrapper, interface java.lang.Comparable} | resulting classes {interface org.eclipse.gemini.blueprint.internal.service.collection.AbstractOsgiCollectionTest$Wrapper, interface java.lang.Comparable, interface org.eclipse.gemini.blueprint.service.importer.ImportedOsgiServiceProxy, interface org.springframework.aop.SpringProxy}
given classes {interface org.eclipse.gemini.blueprint.internal.service.collection.AbstractOsgiCollectionTest$Wrapper, interface java.lang.Comparable} | resulting classes {interface org.eclipse.gemini.blueprint.internal.service.collection.AbstractOsgiCollectionTest$Wrapper, interface java.lang.Comparable, interface org.eclipse.gemini.blueprint.service.importer.ImportedOsgiServiceProxy, interface org.springframework.aop.SpringProxy}
given classes {interface org.eclipse.gemini.blueprint.internal.service.collection.AbstractOsgiCollectionTest$Wrapper, interface java.lang.Comparable} | resulting classes {interface org.eclipse.gemini.blueprint.internal.service.collection.AbstractOsgiCollectionTest$Wrapper, interface java.lang.Comparable, interface org.eclipse.gemini.blueprint.service.importer.ImportedOsgiServiceProxy, interface org.springframework.aop.SpringProxy}
given classes {interface org.eclipse.gemini.blueprint.internal.service.collection.AbstractOsgiCollectionTest$Wrapper, interface java.lang.Comparable} | resulting classes {interface org.eclipse.gemini.blueprint.internal.service.collection.AbstractOsgiCollectionTest$Wrapper, interface java.lang.Comparable, interface org.eclipse.gemini.blueprint.service.importer.ImportedOsgiServiceProxy, interface org.springframework.aop.SpringProxy}
Tests run: 4, Failures: 0, Errors: 0, Skipped: 0, Time elapsed: 0.002 sec - in org.eclipse.gemini.blueprint.internal.service.collection.OsgiServiceSetTest
Running org.eclipse.gemini.blueprint.internal.service.collection.DynamicCollectionIteratorTest
Tests run: 17, Failures: 0, Errors: 0, Skipped: 0, Time elapsed: 0 sec - in org.eclipse.gemini.blueprint.internal.service.collection.DynamicCollectionIteratorTest
Running org.eclipse.gemini.blueprint.internal.service.collection.OsgiServiceSortedSetTest
given classes {interface org.eclipse.gemini.blueprint.internal.service.collection.AbstractOsgiCollectionTest$Wrapper, interface java.lang.Comparable} | resulting classes {interface org.eclipse.gemini.blueprint.internal.service.collection.AbstractOsgiCollectionTest$Wrapper, interface java.lang.Comparable, interface org.eclipse.gemini.blueprint.service.importer.ImportedOsgiServiceProxy, interface org.springframework.aop.SpringProxy}
given classes {interface org.eclipse.gemini.blueprint.internal.service.collection.AbstractOsgiCollectionTest$Wrapper, interface java.lang.Comparable} | resulting classes {interface org.eclipse.gemini.blueprint.internal.service.collection.AbstractOsgiCollectionTest$Wrapper, interface java.lang.Comparable, interface org.eclipse.gemini.blueprint.service.importer.ImportedOsgiServiceProxy, interface org.springframework.aop.SpringProxy}
given classes {interface org.eclipse.gemini.blueprint.internal.service.collection.AbstractOsgiCollectionTest$Wrapper, interface java.lang.Comparable} | resulting classes {interface org.eclipse.gemini.blueprint.internal.service.collection.AbstractOsgiCollectionTest$Wrapper, interface java.lang.Comparable, interface org.eclipse.gemini.blueprint.service.importer.ImportedOsgiServiceProxy, interface org.springframework.aop.SpringProxy}
given classes {interface org.eclipse.gemini.blueprint.internal.service.collection.AbstractOsgiCollectionTest$Wrapper, interface java.lang.Comparable} | resulting classes {interface org.eclipse.gemini.blueprint.internal.service.collection.AbstractOsgiCollectionTest$Wrapper, interface java.lang.Comparable, interface org.eclipse.gemini.blueprint.service.importer.ImportedOsgiServiceProxy, interface org.springframework.aop.SpringProxy}
Tests run: 4, Failures: 0, Errors: 0, Skipped: 0, Time elapsed: 0.003 sec - in org.eclipse.gemini.blueprint.internal.service.collection.OsgiServiceSortedSetTest
Running org.eclipse.gemini.blueprint.internal.service.collection.DynamicListTest
Tests run: 11, Failures: 0, Errors: 0, Skipped: 0, Time elapsed: 0 sec - in org.eclipse.gemini.blueprint.internal.service.collection.DynamicListTest
Running org.eclipse.gemini.blueprint.internal.service.collection.WeakCollectionTest
Tests run: 2, Failures: 0, Errors: 0, Skipped: 0, Time elapsed: 0.227 sec - in org.eclipse.gemini.blueprint.internal.service.collection.WeakCollectionTest
Running org.eclipse.gemini.blueprint.internal.service.collection.OsgiServiceSortedListTest
given classes {interface org.eclipse.gemini.blueprint.internal.service.collection.AbstractOsgiCollectionTest$Wrapper, interface java.lang.Comparable} | resulting classes {interface org.eclipse.gemini.blueprint.internal.service.collection.AbstractOsgiCollectionTest$Wrapper, interface java.lang.Comparable, interface org.eclipse.gemini.blueprint.service.importer.ImportedOsgiServiceProxy, interface org.springframework.aop.SpringProxy}
given classes {interface org.eclipse.gemini.blueprint.internal.service.collection.AbstractOsgiCollectionTest$Wrapper, interface java.lang.Comparable} | resulting classes {interface org.eclipse.gemini.blueprint.internal.service.collection.AbstractOsgiCollectionTest$Wrapper, interface java.lang.Comparable, interface org.eclipse.gemini.blueprint.service.importer.ImportedOsgiServiceProxy, interface org.springframework.aop.SpringProxy}
given classes {interface org.eclipse.gemini.blueprint.internal.service.collection.AbstractOsgiCollectionTest$Wrapper, interface java.lang.Comparable} | resulting classes {interface org.eclipse.gemini.blueprint.internal.service.collection.AbstractOsgiCollectionTest$Wrapper, interface java.lang.Comparable, interface org.eclipse.gemini.blueprint.service.importer.ImportedOsgiServiceProxy, interface org.springframework.aop.SpringProxy}
given classes {interface org.eclipse.gemini.blueprint.internal.service.collection.AbstractOsgiCollectionTest$Wrapper, interface java.lang.Comparable} | resulting classes {interface org.eclipse.gemini.blueprint.internal.service.collection.AbstractOsgiCollectionTest$Wrapper, interface java.lang.Comparable, interface org.eclipse.gemini.blueprint.service.importer.ImportedOsgiServiceProxy, interface org.springframework.aop.SpringProxy}
given classes {interface org.eclipse.gemini.blueprint.internal.service.collection.AbstractOsgiCollectionTest$Wrapper, interface java.lang.Comparable} | resulting classes {interface org.eclipse.gemini.blueprint.internal.service.collection.AbstractOsgiCollectionTest$Wrapper, interface java.lang.Comparable, interface org.eclipse.gemini.blueprint.service.importer.ImportedOsgiServiceProxy, interface org.springframework.aop.SpringProxy}
given classes {interface org.eclipse.gemini.blueprint.internal.service.collection.AbstractOsgiCollectionTest$Wrapper, interface java.lang.Comparable} | resulting classes {interface org.eclipse.gemini.blueprint.internal.service.collection.AbstractOsgiCollectionTest$Wrapper, interface java.lang.Comparable, interface org.eclipse.gemini.blueprint.service.importer.ImportedOsgiServiceProxy, interface org.springframework.aop.SpringProxy}
Tests run: 6, Failures: 0, Errors: 0, Skipped: 0, Time elapsed: 0.004 sec - in org.eclipse.gemini.blueprint.internal.service.collection.OsgiServiceSortedListTest
Running org.eclipse.gemini.blueprint.internal.service.interceptor.OsgiServiceDynamicInterceptorListenerTest
Tests run: 6, Failures: 0, Errors: 0, Skipped: 0, Time elapsed: 0 sec - in org.eclipse.gemini.blueprint.internal.service.interceptor.OsgiServiceDynamicInterceptorListenerTest
Running org.eclipse.gemini.blueprint.internal.service.interceptor.RetryTemplateTest
About to reset template...
Resetted template...
About to reset template...
Resetted template...
Tests run: 4, Failures: 0, Errors: 0, Skipped: 0, Time elapsed: 13.375 sec - in org.eclipse.gemini.blueprint.internal.service.interceptor.RetryTemplateTest
Running org.eclipse.gemini.blueprint.internal.service.interceptor.OsgiServiceDynamicInterceptorTest
Tests run: 8, Failures: 0, Errors: 0, Skipped: 0, Time elapsed: 3.003 sec - in org.eclipse.gemini.blueprint.internal.service.interceptor.OsgiServiceDynamicInterceptorTest
Running org.eclipse.gemini.blueprint.internal.service.interceptor.OsgiServiceStaticInterceptorTest
Tests run: 3, Failures: 0, Errors: 0, Skipped: 0, Time elapsed: 0 sec - in org.eclipse.gemini.blueprint.internal.service.interceptor.OsgiServiceStaticInterceptorTest
Running org.eclipse.gemini.blueprint.internal.service.interceptor.OsgiServiceInvokerTest
Tests run: 2, Failures: 0, Errors: 0, Skipped: 0, Time elapsed: 0 sec - in org.eclipse.gemini.blueprint.internal.service.interceptor.OsgiServiceInvokerTest
Running org.eclipse.gemini.blueprint.internal.service.interceptor.OsgiServiceDynamicInterceptorSyntheticEventsTest
Tests run: 3, Failures: 0, Errors: 0, Skipped: 0, Time elapsed: 0.206 sec - in org.eclipse.gemini.blueprint.internal.service.interceptor.OsgiServiceDynamicInterceptorSyntheticEventsTest
Running org.eclipse.gemini.blueprint.internal.util.BeanFactoryUtilsTest
Tests run: 11, Failures: 0, Errors: 0, Skipped: 0, Time elapsed: 0.009 sec - in org.eclipse.gemini.blueprint.internal.util.BeanFactoryUtilsTest
Running org.eclipse.gemini.blueprint.service.importer.ServiceProxyDestroyedExceptionTest
Tests run: 4, Failures: 0, Errors: 0, Skipped: 0, Time elapsed: 0.001 sec - in org.eclipse.gemini.blueprint.service.importer.ServiceProxyDestroyedExceptionTest
Running org.eclipse.gemini.blueprint.service.importer.OsgiServiceCollectionProxyFactoryBeanTest
Tests run: 4, Failures: 0, Errors: 0, Skipped: 0, Time elapsed: 0.002 sec - in org.eclipse.gemini.blueprint.service.importer.OsgiServiceCollectionProxyFactoryBeanTest
Running org.eclipse.gemini.blueprint.service.importer.support.InfrastructureProxyTest
Tests run: 2, Failures: 0, Errors: 0, Skipped: 0, Time elapsed: 0.002 sec - in org.eclipse.gemini.blueprint.service.importer.support.InfrastructureProxyTest
Running org.eclipse.gemini.blueprint.service.importer.support.OsgiServiceProxyEqualityTest
Tests run: 10, Failures: 0, Errors: 0, Skipped: 0, Time elapsed: 0.01 sec - in org.eclipse.gemini.blueprint.service.importer.support.OsgiServiceProxyEqualityTest
Running org.eclipse.gemini.blueprint.service.importer.support.GreedyProxyTest
Tests run: 7, Failures: 0, Errors: 0, Skipped: 0, Time elapsed: 0.001 sec - in org.eclipse.gemini.blueprint.service.importer.support.GreedyProxyTest
Running org.eclipse.gemini.blueprint.service.importer.support.internal.aop.SwappingServiceReferenceProxyTest
Tests run: 19, Failures: 0, Errors: 0, Skipped: 0, Time elapsed: 0.002 sec - in org.eclipse.gemini.blueprint.service.importer.support.internal.aop.SwappingServiceReferenceProxyTest
Running org.eclipse.gemini.blueprint.service.importer.support.LocalBundleContextAdviceTest
Tests run: 1, Failures: 0, Errors: 0, Skipped: 0, Time elapsed: 0 sec - in org.eclipse.gemini.blueprint.service.importer.support.LocalBundleContextAdviceTest
Running org.eclipse.gemini.blueprint.service.importer.support.OsgiServiceCollectionProxiesTest
Tests run: 8, Failures: 0, Errors: 0, Skipped: 0, Time elapsed: 0.002 sec - in org.eclipse.gemini.blueprint.service.importer.support.OsgiServiceCollectionProxiesTest
Running org.eclipse.gemini.blueprint.service.importer.OsgiSingleServiceProxyFactoryBeanTest
25673 [main] WARN : o.e.g.b.s.i.s.AbstractOsgiServiceImportFactoryBean - OSGi importer [] definition contains no interfaces: all invocations will be executed on the proxy and not on the backing service
Tests run: 8, Failures: 0, Errors: 0, Skipped: 0, Time elapsed: 0.007 sec - in org.eclipse.gemini.blueprint.service.importer.OsgiSingleServiceProxyFactoryBeanTest
Running org.eclipse.gemini.blueprint.service.exporter.support.internal.support.ServiceRegistrationWrapperTest
Tests run: 5, Failures: 0, Errors: 0, Skipped: 0, Time elapsed: 0.001 sec - in org.eclipse.gemini.blueprint.service.exporter.support.internal.support.ServiceRegistrationWrapperTest
Running org.eclipse.gemini.blueprint.service.exporter.support.AbstractListenerAwareExporterTest
Tests run: 2, Failures: 0, Errors: 0, Skipped: 0, Time elapsed: 0 sec - in org.eclipse.gemini.blueprint.service.exporter.support.AbstractListenerAwareExporterTest
Running org.eclipse.gemini.blueprint.service.exporter.support.OsgiServiceFactoryBeanTest
Tests run: 24, Failures: 0, Errors: 0, Skipped: 0, Time elapsed: 0.011 sec - in org.eclipse.gemini.blueprint.service.exporter.support.OsgiServiceFactoryBeanTest
Running org.eclipse.gemini.blueprint.service.exporter.BeanNameServicePropertiesResolverTest
Tests run: 2, Failures: 0, Errors: 0, Skipped: 0, Time elapsed: 0 sec - in org.eclipse.gemini.blueprint.service.exporter.BeanNameServicePropertiesResolverTest
Running org.eclipse.gemini.blueprint.service.OsgiFilterUtilsTest
Tests run: 16, Failures: 0, Errors: 0, Skipped: 0, Time elapsed: 0.002 sec - in org.eclipse.gemini.blueprint.service.OsgiFilterUtilsTest
Running org.eclipse.gemini.blueprint.service.OsgiServiceUtilsTest
Tests run: 3, Failures: 0, Errors: 0, Skipped: 0, Time elapsed: 0.001 sec - in org.eclipse.gemini.blueprint.service.OsgiServiceUtilsTest
Running org.eclipse.gemini.blueprint.service.ServiceExceptionTest
Tests run: 4, Failures: 0, Errors: 0, Skipped: 0, Time elapsed: 0 sec - in org.eclipse.gemini.blueprint.service.ServiceExceptionTest
Running org.eclipse.gemini.blueprint.service.OsgiServiceReferenceUtilsTest
Tests run: 8, Failures: 0, Errors: 0, Skipped: 0, Time elapsed: 0 sec - in org.eclipse.gemini.blueprint.service.OsgiServiceReferenceUtilsTest
Running org.eclipse.gemini.blueprint.service.ServiceUnavailableExceptionTest
Tests run: 6, Failures: 0, Errors: 0, Skipped: 0, Time elapsed: 0.058 sec - in org.eclipse.gemini.blueprint.service.ServiceUnavailableExceptionTest
Running org.eclipse.gemini.blueprint.DictionaryEditorTest
Tests run: 2, Failures: 0, Errors: 0, Skipped: 0, Time elapsed: 0 sec - in org.eclipse.gemini.blueprint.DictionaryEditorTest
Running org.eclipse.gemini.blueprint.OsgiExceptionTest
Tests run: 4, Failures: 0, Errors: 0, Skipped: 0, Time elapsed: 0 sec - in org.eclipse.gemini.blueprint.OsgiExceptionTest
Running org.eclipse.gemini.blueprint.ThreadTest
Tests run: 1, Failures: 0, Errors: 0, Skipped: 0, Time elapsed: 0.999 sec - in org.eclipse.gemini.blueprint.ThreadTest

Results :

Tests run: 619, Failures: 0, Errors: 0, Skipped: 0

[INFO] 
[INFO] --- maven-jar-plugin:3.0.2:jar (default-jar) @ gemini-blueprint-core ---
[INFO] Building jar: /jobs/genie.gemini/java7-gemini-blueprint-felix/workspace/core/target/gemini-blueprint-core-2.1.0.JAVA7-SNAPSHOT.jar
[INFO] 
[INFO] --- maven-source-plugin:2.2.1:jar-no-fork (attach-sources) @ gemini-blueprint-core ---
[INFO] Building jar: /jobs/genie.gemini/java7-gemini-blueprint-felix/workspace/core/target/gemini-blueprint-core-2.1.0.JAVA7-SNAPSHOT-sources.jar
[INFO] 
[INFO] --- maven-install-plugin:2.5.2:install (default-install) @ gemini-blueprint-core ---
[INFO] Installing /jobs/genie.gemini/java7-gemini-blueprint-felix/workspace/core/target/gemini-blueprint-core-2.1.0.JAVA7-SNAPSHOT.jar to /opt/public/hipp/homes/genie.gemini/.m2/repository/org/eclipse/gemini/blueprint/gemini-blueprint-core/2.1.0.JAVA7-SNAPSHOT/gemini-blueprint-core-2.1.0.JAVA7-SNAPSHOT.jar
[INFO] Installing /jobs/genie.gemini/java7-gemini-blueprint-felix/workspace/core/pom.xml to /opt/public/hipp/homes/genie.gemini/.m2/repository/org/eclipse/gemini/blueprint/gemini-blueprint-core/2.1.0.JAVA7-SNAPSHOT/gemini-blueprint-core-2.1.0.JAVA7-SNAPSHOT.pom
[INFO] Installing /jobs/genie.gemini/java7-gemini-blueprint-felix/workspace/core/target/gemini-blueprint-core-2.1.0.JAVA7-SNAPSHOT-sources.jar to /opt/public/hipp/homes/genie.gemini/.m2/repository/org/eclipse/gemini/blueprint/gemini-blueprint-core/2.1.0.JAVA7-SNAPSHOT/gemini-blueprint-core-2.1.0.JAVA7-SNAPSHOT-sources.jar
[INFO] 
[INFO] -------< org.eclipse.gemini.blueprint:gemini-blueprint-extender >-------
[INFO] Building Gemini Blueprint Extender 2.1.0.JAVA7-SNAPSHOT           [5/58]
[INFO] --------------------------------[ jar ]---------------------------------
[INFO] 
[INFO] --- maven-clean-plugin:3.0.0:clean (default-clean) @ gemini-blueprint-extender ---
[INFO] Deleting /jobs/genie.gemini/java7-gemini-blueprint-felix/workspace/extender/target
[INFO] 
[INFO] --- git-commit-id-plugin:2.2.2:revision (default) @ gemini-blueprint-extender ---
[INFO] 
[INFO] --- maven-resources-plugin:3.0.2:resources (default-resources) @ gemini-blueprint-extender ---
[INFO] Using 'UTF-8' encoding to copy filtered resources.
[INFO] Copying 1 resource
[INFO] 
[INFO] --- maven-compiler-plugin:3.6.1:compile (default-compile) @ gemini-blueprint-extender ---
[INFO] Changes detected - recompiling the module!
[INFO] Compiling 63 source files to /jobs/genie.gemini/java7-gemini-blueprint-felix/workspace/extender/target/classes
[INFO] /jobs/genie.gemini/java7-gemini-blueprint-felix/workspace/extender/src/main/java/org/eclipse/gemini/blueprint/extender/internal/util/concurrent/RunnableTimedExecution.java: Some input files use or override a deprecated API.
[INFO] /jobs/genie.gemini/java7-gemini-blueprint-felix/workspace/extender/src/main/java/org/eclipse/gemini/blueprint/extender/internal/util/concurrent/RunnableTimedExecution.java: Recompile with -Xlint:deprecation for details.
[INFO] /jobs/genie.gemini/java7-gemini-blueprint-felix/workspace/extender/src/main/java/org/eclipse/gemini/blueprint/extender/internal/blueprint/activator/BlueprintListenerManager.java: Some input files use unchecked or unsafe operations.
[INFO] /jobs/genie.gemini/java7-gemini-blueprint-felix/workspace/extender/src/main/java/org/eclipse/gemini/blueprint/extender/internal/blueprint/activator/BlueprintListenerManager.java: Recompile with -Xlint:unchecked for details.
[INFO] 
[INFO] --- bnd-maven-plugin:3.3.0:bnd-process (default) @ gemini-blueprint-extender ---
[WARNING] /jobs/genie.gemini/java7-gemini-blueprint-felix/workspace/extender/bnd.bnd [0:0]: Unused Import-Package instructions: [org.aopalliance.*] 
[WARNING] /jobs/genie.gemini/java7-gemini-blueprint-felix/workspace/extender/bnd.bnd [0:0]: No translation found for macro: git.commit.id.describe
[INFO] 
[INFO] --- maven-resources-plugin:3.0.2:testResources (default-testResources) @ gemini-blueprint-extender ---
[INFO] Using 'UTF-8' encoding to copy filtered resources.
[INFO] Copying 9 resources
[INFO] 
[INFO] --- maven-compiler-plugin:3.6.1:testCompile (default-testCompile) @ gemini-blueprint-extender ---
[INFO] Changes detected - recompiling the module!
[INFO] Compiling 23 source files to /jobs/genie.gemini/java7-gemini-blueprint-felix/workspace/extender/target/test-classes
[INFO] /jobs/genie.gemini/java7-gemini-blueprint-felix/workspace/extender/src/test/java/org/eclipse/gemini/blueprint/extender/internal/activator/ListListenerAdapterTest.java: /jobs/genie.gemini/java7-gemini-blueprint-felix/workspace/extender/src/test/java/org/eclipse/gemini/blueprint/extender/internal/activator/ListListenerAdapterTest.java uses or overrides a deprecated API.
[INFO] /jobs/genie.gemini/java7-gemini-blueprint-felix/workspace/extender/src/test/java/org/eclipse/gemini/blueprint/extender/internal/activator/ListListenerAdapterTest.java: Recompile with -Xlint:deprecation for details.
[INFO] /jobs/genie.gemini/java7-gemini-blueprint-felix/workspace/extender/src/test/java/org/eclipse/gemini/blueprint/extender/internal/util/HeaderConstantsTest.java: Some input files use unchecked or unsafe operations.
[INFO] /jobs/genie.gemini/java7-gemini-blueprint-felix/workspace/extender/src/test/java/org/eclipse/gemini/blueprint/extender/internal/util/HeaderConstantsTest.java: Recompile with -Xlint:unchecked for details.
[INFO] 
[INFO] --- maven-surefire-plugin:2.19.1:test (default-test) @ gemini-blueprint-extender ---

-------------------------------------------------------
 T E S T S
-------------------------------------------------------
Picked up JAVA_TOOL_OPTIONS: -Xmx2G -Djava.io.tmpdir=/tmp/genie.gemini -DforkCount=1
Running org.eclipse.gemini.blueprint.extender.internal.blueprint.support.BlueprintConfigUtilsTest
™
Tests run: 7, Failures: 0, Errors: 0, Skipped: 0, Time elapsed: 0.007 sec - in org.eclipse.gemini.blueprint.extender.internal.blueprint.support.BlueprintConfigUtilsTest
Running org.eclipse.gemini.blueprint.extender.internal.support.ApplicationContextConfigurationTest
Tests run: 11, Failures: 0, Errors: 0, Skipped: 0, Time elapsed: 0.26 sec - in org.eclipse.gemini.blueprint.extender.internal.support.ApplicationContextConfigurationTest
Running org.eclipse.gemini.blueprint.extender.internal.support.NamespacePluginsTest
Tests run: 5, Failures: 0, Errors: 0, Skipped: 0, Time elapsed: 0.02 sec - in org.eclipse.gemini.blueprint.extender.internal.support.NamespacePluginsTest
Running org.eclipse.gemini.blueprint.extender.internal.support.ExtenderConfigurationCustomSettingsTest
WARN [org.eclipse.gemini.blueprint.extender.internal.support.ExtenderConfiguration] - Gemini Blueprint extensions bundle not present, annotation processing disabled.
WARN [org.eclipse.gemini.blueprint.extender.internal.support.ExtenderConfiguration] - Gemini Blueprint extensions bundle not present, annotation processing disabled.
WARN [org.eclipse.gemini.blueprint.extender.internal.support.ExtenderConfiguration] - Gemini Blueprint extensions bundle not present, annotation processing disabled.
WARN [org.eclipse.gemini.blueprint.extender.internal.support.ExtenderConfiguration] - Gemini Blueprint extensions bundle not present, annotation processing disabled.
WARN [org.eclipse.gemini.blueprint.extender.internal.support.ExtenderConfiguration] - Gemini Blueprint extensions bundle not present, annotation processing disabled.
WARN [org.eclipse.gemini.blueprint.extender.internal.support.ExtenderConfiguration] - Gemini Blueprint extensions bundle not present, annotation processing disabled.
WARN [org.eclipse.gemini.blueprint.extender.internal.support.ExtenderConfiguration] - Gemini Blueprint extensions bundle not present, annotation processing disabled.
WARN [org.eclipse.gemini.blueprint.extender.internal.support.ExtenderConfiguration] - Gemini Blueprint extensions bundle not present, annotation processing disabled.
WARN [org.eclipse.gemini.blueprint.extender.internal.support.ExtenderConfiguration] - Gemini Blueprint extensions bundle not present, annotation processing disabled.
WARN [org.eclipse.gemini.blueprint.extender.internal.support.ExtenderConfiguration] - Gemini Blueprint extensions bundle not present, annotation processing disabled.
Tests run: 10, Failures: 0, Errors: 0, Skipped: 0, Time elapsed: 0.928 sec - in org.eclipse.gemini.blueprint.extender.internal.support.ExtenderConfigurationCustomSettingsTest
Running org.eclipse.gemini.blueprint.extender.internal.support.ExtenderConfigurationDefaultSettingsTest
WARN [org.eclipse.gemini.blueprint.extender.internal.support.ExtenderConfiguration] - Gemini Blueprint extensions bundle not present, annotation processing disabled.
WARN [org.eclipse.gemini.blueprint.extender.internal.support.ExtenderConfiguration] - Gemini Blueprint extensions bundle not present, annotation processing disabled.
WARN [org.eclipse.gemini.blueprint.extender.internal.support.ExtenderConfiguration] - Gemini Blueprint extensions bundle not present, annotation processing disabled.
WARN [org.eclipse.gemini.blueprint.extender.internal.support.ExtenderConfiguration] - Gemini Blueprint extensions bundle not present, annotation processing disabled.
WARN [org.eclipse.gemini.blueprint.extender.internal.support.ExtenderConfiguration] - Gemini Blueprint extensions bundle not present, annotation processing disabled.
WARN [org.eclipse.gemini.blueprint.extender.internal.support.ExtenderConfiguration] - Gemini Blueprint extensions bundle not present, annotation processing disabled.
WARN [org.eclipse.gemini.blueprint.extender.internal.support.ExtenderConfiguration] - Gemini Blueprint extensions bundle not present, annotation processing disabled.
WARN [org.eclipse.gemini.blueprint.extender.internal.support.ExtenderConfiguration] - Gemini Blueprint extensions bundle not present, annotation processing disabled.
WARN [org.eclipse.gemini.blueprint.extender.internal.support.ExtenderConfiguration] - Gemini Blueprint extensions bundle not present, annotation processing disabled.
WARN [org.eclipse.gemini.blueprint.extender.internal.support.ExtenderConfiguration] - Gemini Blueprint extensions bundle not present, annotation processing disabled.
WARN [org.eclipse.gemini.blueprint.extender.internal.support.ExtenderConfiguration] - Gemini Blueprint extensions bundle not present, annotation processing disabled.
WARN [org.eclipse.gemini.blueprint.extender.internal.support.ExtenderConfiguration] - Gemini Blueprint extensions bundle not present, annotation processing disabled.
WARN [org.eclipse.gemini.blueprint.extender.internal.support.ExtenderConfiguration] - Gemini Blueprint extensions bundle not present, annotation processing disabled.
WARN [org.eclipse.gemini.blueprint.extender.internal.support.ExtenderConfiguration] - Gemini Blueprint extensions bundle not present, annotation processing disabled.
WARN [org.eclipse.gemini.blueprint.extender.internal.support.ExtenderConfiguration] - Gemini Blueprint extensions bundle not present, annotation processing disabled.
WARN [org.eclipse.gemini.blueprint.extender.internal.support.ExtenderConfiguration] - Gemini Blueprint extensions bundle not present, annotation processing disabled.
WARN [org.eclipse.gemini.blueprint.extender.internal.support.ExtenderConfiguration] - Gemini Blueprint extensions bundle not present, annotation processing disabled.
WARN [org.eclipse.gemini.blueprint.extender.internal.support.ExtenderConfiguration] - Gemini Blueprint extensions bundle not present, annotation processing disabled.
WARN [org.eclipse.gemini.blueprint.extender.internal.support.ExtenderConfiguration] - Gemini Blueprint extensions bundle not present, annotation processing disabled.
WARN [org.eclipse.gemini.blueprint.extender.internal.support.ExtenderConfiguration] - Gemini Blueprint extensions bundle not present, annotation processing disabled.
Tests run: 10, Failures: 0, Errors: 0, Skipped: 0, Time elapsed: 0.064 sec - in org.eclipse.gemini.blueprint.extender.internal.support.ExtenderConfigurationDefaultSettingsTest
Running org.eclipse.gemini.blueprint.extender.internal.util.HeaderConstantsTest
Tests run: 5, Failures: 0, Errors: 0, Skipped: 0, Time elapsed: 0 sec - in org.eclipse.gemini.blueprint.extender.internal.util.HeaderConstantsTest
Running org.eclipse.gemini.blueprint.extender.internal.util.ConfigUtilsVersioningTest
Tests run: 10, Failures: 0, Errors: 0, Skipped: 0, Time elapsed: 0.003 sec - in org.eclipse.gemini.blueprint.extender.internal.util.ConfigUtilsVersioningTest
Running org.eclipse.gemini.blueprint.extender.internal.util.concurrent.RunnableTimedExecutionTest
ERROR [org.eclipse.gemini.blueprint.extender.internal.util.concurrent.RunnableTimedExecution] - org.eclipse.gemini.blueprint.extender.internal.util.concurrent.RunnableTimedExecutionTest$2@592eca34 did not finish in 10ms; consider taking a snapshot and then shutdown the VM in case the thread still hangs
Tests run: 2, Failures: 0, Errors: 0, Skipped: 0, Time elapsed: 0.013 sec - in org.eclipse.gemini.blueprint.extender.internal.util.concurrent.RunnableTimedExecutionTest
Running org.eclipse.gemini.blueprint.extender.internal.util.ConfigUtilsTest
Tests run: 6, Failures: 0, Errors: 0, Skipped: 0, Time elapsed: 0.001 sec - in org.eclipse.gemini.blueprint.extender.internal.util.ConfigUtilsTest
Running org.eclipse.gemini.blueprint.extender.internal.activator.GenericsTest
Tests run: 4, Failures: 0, Errors: 0, Skipped: 0, Time elapsed: 0.003 sec - in org.eclipse.gemini.blueprint.extender.internal.activator.GenericsTest
Running org.eclipse.gemini.blueprint.extender.internal.activator.ListListenerAdapterTest
Tests run: 2, Failures: 0, Errors: 0, Skipped: 0, Time elapsed: 0.19 sec - in org.eclipse.gemini.blueprint.extender.internal.activator.ListListenerAdapterTest
Running org.eclipse.gemini.blueprint.extender.internal.activator.LifecycleManagerTest
ERROR [org.eclipse.gemini.blueprint.extender.internal.activator.LifecycleManager] - JUnit test context context shutdown failed.
java.lang.RuntimeException: THIS IS AN EXPECTED TEST EXCEPTION
	at org.eclipse.gemini.blueprint.extender.internal.activator.LifecycleManager.closeApplicationContext(LifecycleManager.java:332) ~[classes/:na]
	at org.eclipse.gemini.blueprint.extender.internal.activator.LifecycleManager.access$200(LifecycleManager.java:51) ~[classes/:na]
	at org.eclipse.gemini.blueprint.extender.internal.activator.LifecycleManager$2.run(LifecycleManager.java:297) ~[classes/:na]
	at org.eclipse.gemini.blueprint.extender.internal.activator.LifecycleManager.maybeClose(LifecycleManager.java:310) ~[classes/:na]
	at org.eclipse.gemini.blueprint.extender.internal.activator.LifecycleManagerTest.shutdownContext(LifecycleManagerTest.java:179) [test-classes/:na]
	at org.eclipse.gemini.blueprint.extender.internal.activator.LifecycleManagerTest.testFailingSynchronousShutdown(LifecycleManagerTest.java:110) [test-classes/:na]
	at sun.reflect.NativeMethodAccessorImpl.invoke0(Native Method) ~[na:1.7.0_80]
	at sun.reflect.NativeMethodAccessorImpl.invoke(NativeMethodAccessorImpl.java:57) ~[na:1.7.0_80]
	at sun.reflect.DelegatingMethodAccessorImpl.invoke(DelegatingMethodAccessorImpl.java:43) ~[na:1.7.0_80]
	at java.lang.reflect.Method.invoke(Method.java:606) ~[na:1.7.0_80]
	at org.junit.runners.model.FrameworkMethod$1.runReflectiveCall(FrameworkMethod.java:50) [org.apache.servicemix.bundles.junit-4.12_1.jar:na]
	at org.junit.internal.runners.model.ReflectiveCallable.run(ReflectiveCallable.java:12) [org.apache.servicemix.bundles.junit-4.12_1.jar:na]
	at org.junit.runners.model.FrameworkMethod.invokeExplosively(FrameworkMethod.java:47) [org.apache.servicemix.bundles.junit-4.12_1.jar:na]
	at org.junit.internal.runners.statements.InvokeMethod.evaluate(InvokeMethod.java:17) [org.apache.servicemix.bundles.junit-4.12_1.jar:na]
	at org.junit.internal.runners.statements.RunBefores.evaluate(RunBefores.java:26) [org.apache.servicemix.bundles.junit-4.12_1.jar:na]
	at org.junit.runners.ParentRunner.runLeaf(ParentRunner.java:325) [org.apache.servicemix.bundles.junit-4.12_1.jar:na]
	at org.junit.runners.BlockJUnit4ClassRunner.runChild(BlockJUnit4ClassRunner.java:78) [org.apache.servicemix.bundles.junit-4.12_1.jar:na]
	at org.junit.runners.BlockJUnit4ClassRunner.runChild(BlockJUnit4ClassRunner.java:57) [org.apache.servicemix.bundles.junit-4.12_1.jar:na]
	at org.junit.runners.ParentRunner$3.run(ParentRunner.java:290) [org.apache.servicemix.bundles.junit-4.12_1.jar:na]
	at org.junit.runners.ParentRunner$1.schedule(ParentRunner.java:71) [org.apache.servicemix.bundles.junit-4.12_1.jar:na]
	at org.junit.runners.ParentRunner.runChildren(ParentRunner.java:288) [org.apache.servicemix.bundles.junit-4.12_1.jar:na]
	at org.junit.runners.ParentRunner.access$000(ParentRunner.java:58) [org.apache.servicemix.bundles.junit-4.12_1.jar:na]
	at org.junit.runners.ParentRunner$2.evaluate(ParentRunner.java:268) [org.apache.servicemix.bundles.junit-4.12_1.jar:na]
	at org.junit.runners.ParentRunner.run(ParentRunner.java:363) [org.apache.servicemix.bundles.junit-4.12_1.jar:na]
	at org.mockito.internal.runners.JUnit45AndHigherRunnerImpl.run(JUnit45AndHigherRunnerImpl.java:37) [mockito-all-1.9.5.jar:na]
	at org.mockito.runners.MockitoJUnitRunner.run(MockitoJUnitRunner.java:62) [mockito-all-1.9.5.jar:na]
	at org.junit.runners.Suite.runChild(Suite.java:128) [org.apache.servicemix.bundles.junit-4.12_1.jar:na]
	at org.junit.runners.Suite.runChild(Suite.java:27) [org.apache.servicemix.bundles.junit-4.12_1.jar:na]
	at org.junit.runners.ParentRunner$3.run(ParentRunner.java:290) [org.apache.servicemix.bundles.junit-4.12_1.jar:na]
	at org.junit.runners.ParentRunner$1.schedule(ParentRunner.java:71) [org.apache.servicemix.bundles.junit-4.12_1.jar:na]
	at org.junit.runners.ParentRunner.runChildren(ParentRunner.java:288) [org.apache.servicemix.bundles.junit-4.12_1.jar:na]
	at org.junit.runners.ParentRunner.access$000(ParentRunner.java:58) [org.apache.servicemix.bundles.junit-4.12_1.jar:na]
	at org.junit.runners.ParentRunner$2.evaluate(ParentRunner.java:268) [org.apache.servicemix.bundles.junit-4.12_1.jar:na]
	at org.junit.runners.ParentRunner.run(ParentRunner.java:363) [org.apache.servicemix.bundles.junit-4.12_1.jar:na]
	at org.apache.maven.surefire.junitcore.JUnitCore.run(JUnitCore.java:55) [surefire-junit47-2.19.1.jar:2.19.1]
	at org.apache.maven.surefire.junitcore.JUnitCoreWrapper.createRequestAndRun(JUnitCoreWrapper.java:137) [surefire-junit47-2.19.1.jar:2.19.1]
	at org.apache.maven.surefire.junitcore.JUnitCoreWrapper.executeEager(JUnitCoreWrapper.java:107) [surefire-junit47-2.19.1.jar:2.19.1]
	at org.apache.maven.surefire.junitcore.JUnitCoreWrapper.execute(JUnitCoreWrapper.java:83) [surefire-junit47-2.19.1.jar:2.19.1]
	at org.apache.maven.surefire.junitcore.JUnitCoreWrapper.execute(JUnitCoreWrapper.java:75) [surefire-junit47-2.19.1.jar:2.19.1]
	at org.apache.maven.surefire.junitcore.JUnitCoreProvider.invoke(JUnitCoreProvider.java:161) [surefire-junit47-2.19.1.jar:2.19.1]
	at org.apache.maven.surefire.booter.ForkedBooter.invokeProviderInSameClassLoader(ForkedBooter.java:290) [surefire-booter-2.19.1.jar:2.19.1]
	at org.apache.maven.surefire.booter.ForkedBooter.runSuitesInProcess(ForkedBooter.java:242) [surefire-booter-2.19.1.jar:2.19.1]
	at org.apache.maven.surefire.booter.ForkedBooter.main(ForkedBooter.java:121) [surefire-booter-2.19.1.jar:2.19.1]
Exception in thread "Thread for runnable [org.eclipse.gemini.blueprint.extender.internal.util.concurrent.RunnableTimedExecution$MonitoredRunnable@1b87966c]" java.lang.RuntimeException: THIS IS AN EXPECTED TEST EXCEPTIONTests run: 7, Failures: 0, Errors: 0, Skipped: 0, Time elapsed: 0.083 sec - in org.eclipse.gemini.blueprint.extender.internal.activator.LifecycleManagerTest
Running org.eclipse.gemini.blueprint.extender.internal.dependencies.BlueprintShutdownSorterTest

	at org.eclipse.gemini.blueprint.extender.internal.activator.LifecycleManager.closeApplicationContext(LifecycleManager.java:332)
	at org.eclipse.gemini.blueprint.extender.internal.activator.LifecycleManager.access$200(LifecycleManager.java:51)
	at org.eclipse.gemini.blueprint.extender.internal.activator.LifecycleManager$2.run(LifecycleManager.java:297)
	at org.eclipse.gemini.blueprint.extender.internal.util.concurrent.RunnableTimedExecution$MonitoredRunnable.run(RunnableTimedExecution.java:55)
	at java.lang.Thread.run(Thread.java:745)
Shutdown order is [C, A, B, E, D]
Shutdown order is [C, A, B, D, E]
Shutdown order is [C, A, B, D, E]
Tests run: 3, Failures: 0, Errors: 0, Skipped: 0, Time elapsed: 0.003 sec - in org.eclipse.gemini.blueprint.extender.internal.dependencies.BlueprintShutdownSorterTest

Results :

Tests run: 82, Failures: 0, Errors: 0, Skipped: 0

[INFO] 
[INFO] --- maven-jar-plugin:3.0.2:jar (default-jar) @ gemini-blueprint-extender ---
[INFO] Building jar: /jobs/genie.gemini/java7-gemini-blueprint-felix/workspace/extender/target/gemini-blueprint-extender-2.1.0.JAVA7-SNAPSHOT.jar
[INFO] 
[INFO] --- maven-source-plugin:2.2.1:jar-no-fork (attach-sources) @ gemini-blueprint-extender ---
[INFO] Building jar: /jobs/genie.gemini/java7-gemini-blueprint-felix/workspace/extender/target/gemini-blueprint-extender-2.1.0.JAVA7-SNAPSHOT-sources.jar
[INFO] 
[INFO] --- maven-install-plugin:2.5.2:install (default-install) @ gemini-blueprint-extender ---
[INFO] Installing /jobs/genie.gemini/java7-gemini-blueprint-felix/workspace/extender/target/gemini-blueprint-extender-2.1.0.JAVA7-SNAPSHOT.jar to /opt/public/hipp/homes/genie.gemini/.m2/repository/org/eclipse/gemini/blueprint/gemini-blueprint-extender/2.1.0.JAVA7-SNAPSHOT/gemini-blueprint-extender-2.1.0.JAVA7-SNAPSHOT.jar
[INFO] Installing /jobs/genie.gemini/java7-gemini-blueprint-felix/workspace/extender/pom.xml to /opt/public/hipp/homes/genie.gemini/.m2/repository/org/eclipse/gemini/blueprint/gemini-blueprint-extender/2.1.0.JAVA7-SNAPSHOT/gemini-blueprint-extender-2.1.0.JAVA7-SNAPSHOT.pom
[INFO] Installing /jobs/genie.gemini/java7-gemini-blueprint-felix/workspace/extender/target/gemini-blueprint-extender-2.1.0.JAVA7-SNAPSHOT-sources.jar to /opt/public/hipp/homes/genie.gemini/.m2/repository/org/eclipse/gemini/blueprint/gemini-blueprint-extender/2.1.0.JAVA7-SNAPSHOT/gemini-blueprint-extender-2.1.0.JAVA7-SNAPSHOT-sources.jar
[INFO] 
[INFO] ------< org.eclipse.gemini.blueprint:gemini-blueprint-extensions >------
[INFO] Building Gemini Blueprint Extensions 2.1.0.JAVA7-SNAPSHOT         [6/58]
[INFO] --------------------------------[ jar ]---------------------------------
[INFO] 
[INFO] --- maven-clean-plugin:3.0.0:clean (default-clean) @ gemini-blueprint-extensions ---
[INFO] Deleting /jobs/genie.gemini/java7-gemini-blueprint-felix/workspace/extensions/target
[INFO] 
[INFO] --- git-commit-id-plugin:2.2.2:revision (default) @ gemini-blueprint-extensions ---
[INFO] 
[INFO] --- maven-resources-plugin:3.0.2:resources (default-resources) @ gemini-blueprint-extensions ---
[INFO] Using 'UTF-8' encoding to copy filtered resources.
[INFO] Copying 0 resource
[INFO] 
[INFO] --- maven-compiler-plugin:3.6.1:compile (default-compile) @ gemini-blueprint-extensions ---
[INFO] Changes detected - recompiling the module!
[INFO] Compiling 4 source files to /jobs/genie.gemini/java7-gemini-blueprint-felix/workspace/extensions/target/classes
[INFO] 
[INFO] --- bnd-maven-plugin:3.3.0:bnd-process (default) @ gemini-blueprint-extensions ---
[WARNING] /jobs/genie.gemini/java7-gemini-blueprint-felix/workspace/extensions/bnd.bnd [0:0]: No translation found for macro: git.commit.id.describe
[INFO] 
[INFO] --- maven-resources-plugin:3.0.2:testResources (default-testResources) @ gemini-blueprint-extensions ---
[INFO] Using 'UTF-8' encoding to copy filtered resources.
[INFO] Copying 1 resource
[INFO] 
[INFO] --- maven-compiler-plugin:3.6.1:testCompile (default-testCompile) @ gemini-blueprint-extensions ---
[INFO] Changes detected - recompiling the module!
[INFO] Compiling 6 source files to /jobs/genie.gemini/java7-gemini-blueprint-felix/workspace/extensions/target/test-classes
[INFO] /jobs/genie.gemini/java7-gemini-blueprint-felix/workspace/extensions/src/test/java/org/eclipse/gemini/blueprint/extensions/annotation/OsgiServiceAnnotationTest.java: /jobs/genie.gemini/java7-gemini-blueprint-felix/workspace/extensions/src/test/java/org/eclipse/gemini/blueprint/extensions/annotation/OsgiServiceAnnotationTest.java uses unchecked or unsafe operations.
[INFO] /jobs/genie.gemini/java7-gemini-blueprint-felix/workspace/extensions/src/test/java/org/eclipse/gemini/blueprint/extensions/annotation/OsgiServiceAnnotationTest.java: Recompile with -Xlint:unchecked for details.
[INFO] 
[INFO] --- maven-surefire-plugin:2.19.1:test (default-test) @ gemini-blueprint-extensions ---

-------------------------------------------------------
 T E S T S
-------------------------------------------------------
Picked up JAVA_TOOL_OPTIONS: -Xmx2G -Djava.io.tmpdir=/tmp/genie.gemini -DforkCount=1
Running org.eclipse.gemini.blueprint.extensions.annotation.OsgiServiceAnnotationTest
Tests run: 13, Failures: 0, Errors: 0, Skipped: 0, Time elapsed: 0.457 sec - in org.eclipse.gemini.blueprint.extensions.annotation.OsgiServiceAnnotationTest

Results :

Tests run: 13, Failures: 0, Errors: 0, Skipped: 0

[INFO] 
[INFO] --- maven-jar-plugin:3.0.2:jar (default-jar) @ gemini-blueprint-extensions ---
[INFO] Building jar: /jobs/genie.gemini/java7-gemini-blueprint-felix/workspace/extensions/target/gemini-blueprint-extensions-2.1.0.JAVA7-SNAPSHOT.jar
[INFO] 
[INFO] --- maven-source-plugin:2.2.1:jar-no-fork (attach-sources) @ gemini-blueprint-extensions ---
[INFO] Building jar: /jobs/genie.gemini/java7-gemini-blueprint-felix/workspace/extensions/target/gemini-blueprint-extensions-2.1.0.JAVA7-SNAPSHOT-sources.jar
[INFO] 
[INFO] --- maven-install-plugin:2.5.2:install (default-install) @ gemini-blueprint-extensions ---
[INFO] Installing /jobs/genie.gemini/java7-gemini-blueprint-felix/workspace/extensions/target/gemini-blueprint-extensions-2.1.0.JAVA7-SNAPSHOT.jar to /opt/public/hipp/homes/genie.gemini/.m2/repository/org/eclipse/gemini/blueprint/gemini-blueprint-extensions/2.1.0.JAVA7-SNAPSHOT/gemini-blueprint-extensions-2.1.0.JAVA7-SNAPSHOT.jar
[INFO] Installing /jobs/genie.gemini/java7-gemini-blueprint-felix/workspace/extensions/pom.xml to /opt/public/hipp/homes/genie.gemini/.m2/repository/org/eclipse/gemini/blueprint/gemini-blueprint-extensions/2.1.0.JAVA7-SNAPSHOT/gemini-blueprint-extensions-2.1.0.JAVA7-SNAPSHOT.pom
[INFO] Installing /jobs/genie.gemini/java7-gemini-blueprint-felix/workspace/extensions/target/gemini-blueprint-extensions-2.1.0.JAVA7-SNAPSHOT-sources.jar to /opt/public/hipp/homes/genie.gemini/.m2/repository/org/eclipse/gemini/blueprint/gemini-blueprint-extensions/2.1.0.JAVA7-SNAPSHOT/gemini-blueprint-extensions-2.1.0.JAVA7-SNAPSHOT-sources.jar
[INFO] 
[INFO] ---------< org.eclipse.gemini.blueprint:gemini-blueprint-test >---------
[INFO] Building Gemini Blueprint Testing Framework 2.1.0.JAVA7-SNAPSHOT  [7/58]
[INFO] --------------------------------[ jar ]---------------------------------
[INFO] 
[INFO] --- maven-clean-plugin:3.0.0:clean (default-clean) @ gemini-blueprint-test ---
[INFO] Deleting /jobs/genie.gemini/java7-gemini-blueprint-felix/workspace/test-support/target
[INFO] 
[INFO] --- git-commit-id-plugin:2.2.2:revision (default) @ gemini-blueprint-test ---
[INFO] 
[INFO] --- maven-resources-plugin:3.0.2:resources (default-resources) @ gemini-blueprint-test ---
[INFO] Using 'UTF-8' encoding to copy filtered resources.
[INFO] Copying 3 resources
[INFO] 
[INFO] --- maven-compiler-plugin:3.6.1:compile (default-compile) @ gemini-blueprint-test ---
[INFO] Changes detected - recompiling the module!
[INFO] Compiling 43 source files to /jobs/genie.gemini/java7-gemini-blueprint-felix/workspace/test-support/target/classes
[INFO] /jobs/genie.gemini/java7-gemini-blueprint-felix/workspace/test-support/src/main/java/org/eclipse/gemini/blueprint/test/AbstractOptionalDependencyInjectionTests.java: Some input files use or override a deprecated API.
[INFO] /jobs/genie.gemini/java7-gemini-blueprint-felix/workspace/test-support/src/main/java/org/eclipse/gemini/blueprint/test/AbstractOptionalDependencyInjectionTests.java: Recompile with -Xlint:deprecation for details.
[INFO] /jobs/genie.gemini/java7-gemini-blueprint-felix/workspace/test-support/src/main/java/org/eclipse/gemini/blueprint/test/internal/util/jar/ManifestUtils.java: Some input files use unchecked or unsafe operations.
[INFO] /jobs/genie.gemini/java7-gemini-blueprint-felix/workspace/test-support/src/main/java/org/eclipse/gemini/blueprint/test/internal/util/jar/ManifestUtils.java: Recompile with -Xlint:unchecked for details.
[INFO] 
[INFO] --- bnd-maven-plugin:3.3.0:bnd-process (default) @ gemini-blueprint-test ---
[WARNING] /jobs/genie.gemini/java7-gemini-blueprint-felix/workspace/test-support/bnd.bnd [0:0]: Unused Private-Package instructions, no such package(s) on the class path: [org.eclipse.gemini.blueprint.test.*]
[WARNING] /jobs/genie.gemini/java7-gemini-blueprint-felix/workspace/test-support/bnd.bnd [0:0]: No translation found for macro: git.commit.id.describe
[INFO] 
[INFO] --- maven-resources-plugin:3.0.2:testResources (default-testResources) @ gemini-blueprint-test ---
[INFO] Using 'UTF-8' encoding to copy filtered resources.
[INFO] Copying 14 resources
[INFO] 
[INFO] --- maven-compiler-plugin:3.6.1:testCompile (default-testCompile) @ gemini-blueprint-test ---
[INFO] Changes detected - recompiling the module!
[INFO] Compiling 24 source files to /jobs/genie.gemini/java7-gemini-blueprint-felix/workspace/test-support/target/test-classes
[INFO] /jobs/genie.gemini/java7-gemini-blueprint-felix/workspace/test-support/src/test/java/org/eclipse/gemini/blueprint/test/JUnitTestActivatorTest.java: Some input files use unchecked or unsafe operations.
[INFO] /jobs/genie.gemini/java7-gemini-blueprint-felix/workspace/test-support/src/test/java/org/eclipse/gemini/blueprint/test/JUnitTestActivatorTest.java: Recompile with -Xlint:unchecked for details.
[INFO] 
[INFO] --- maven-surefire-plugin:2.19.1:test (default-test) @ gemini-blueprint-test ---
[WARNING] The parameter forkMode is deprecated since version 2.14. Use forkCount and reuseForks instead.

-------------------------------------------------------
 T E S T S
-------------------------------------------------------
Picked up JAVA_TOOL_OPTIONS: -Xmx2G -Djava.io.tmpdir=/tmp/genie.gemini -DforkCount=1
Running org.eclipse.gemini.blueprint.test.internal.util.MemoryStorageTest
wrote 661 bytes
Tests run: 6, Failures: 0, Errors: 0, Skipped: 0, Time elapsed: 0.016 sec - in org.eclipse.gemini.blueprint.test.internal.util.MemoryStorageTest
Picked up JAVA_TOOL_OPTIONS: -Xmx2G -Djava.io.tmpdir=/tmp/genie.gemini -DforkCount=1
Running org.eclipse.gemini.blueprint.test.internal.util.FileSystemStorageTest
wrote 1644 bytes
Tests run: 8, Failures: 0, Errors: 0, Skipped: 0, Time elapsed: 0.037 sec - in org.eclipse.gemini.blueprint.test.internal.util.FileSystemStorageTest
Picked up JAVA_TOOL_OPTIONS: -Xmx2G -Djava.io.tmpdir=/tmp/genie.gemini -DforkCount=1
Running org.eclipse.gemini.blueprint.test.internal.util.PropertiesUtilTest
Tests run: 6, Failures: 0, Errors: 0, Skipped: 0, Time elapsed: 0.014 sec - in org.eclipse.gemini.blueprint.test.internal.util.PropertiesUtilTest
Picked up JAVA_TOOL_OPTIONS: -Xmx2G -Djava.io.tmpdir=/tmp/genie.gemini -DforkCount=1
Running org.eclipse.gemini.blueprint.test.internal.util.ManifestUtilsTest
Tests run: 3, Failures: 0, Errors: 0, Skipped: 0, Time elapsed: 0.022 sec - in org.eclipse.gemini.blueprint.test.internal.util.ManifestUtilsTest
Picked up JAVA_TOOL_OPTIONS: -Xmx2G -Djava.io.tmpdir=/tmp/genie.gemini -DforkCount=1
Running org.eclipse.gemini.blueprint.test.provisioning.internal.MavenArtifactFinderTest
Tests run: 6, Failures: 0, Errors: 0, Skipped: 0, Time elapsed: 0.301 sec - in org.eclipse.gemini.blueprint.test.provisioning.internal.MavenArtifactFinderTest
Picked up JAVA_TOOL_OPTIONS: -Xmx2G -Djava.io.tmpdir=/tmp/genie.gemini -DforkCount=1
Running org.eclipse.gemini.blueprint.test.provisioning.internal.LocalFileSystemMavenRepositoryTest
Tests run: 2, Failures: 0, Errors: 0, Skipped: 0, Time elapsed: 0.313 sec - in org.eclipse.gemini.blueprint.test.provisioning.internal.LocalFileSystemMavenRepositoryTest
Picked up JAVA_TOOL_OPTIONS: -Xmx2G -Djava.io.tmpdir=/tmp/genie.gemini -DforkCount=1
Running org.eclipse.gemini.blueprint.test.ConfigurableBundleCreatorTestsTest
Tests run: 3, Failures: 0, Errors: 0, Skipped: 0, Time elapsed: 0.348 sec - in org.eclipse.gemini.blueprint.test.ConfigurableBundleCreatorTestsTest
Picked up JAVA_TOOL_OPTIONS: -Xmx2G -Djava.io.tmpdir=/tmp/genie.gemini -DforkCount=1
Running org.eclipse.gemini.blueprint.test.platform.FelixPlatformTest
Tests run: 5, Failures: 0, Errors: 0, Skipped: 0, Time elapsed: 0.595 sec - in org.eclipse.gemini.blueprint.test.platform.FelixPlatformTest
Picked up JAVA_TOOL_OPTIONS: -Xmx2G -Djava.io.tmpdir=/tmp/genie.gemini -DforkCount=1
Running org.eclipse.gemini.blueprint.test.platform.KnopflerfishPlatformTest
Tests run: 5, Failures: 0, Errors: 0, Skipped: 0, Time elapsed: 0.488 sec - in org.eclipse.gemini.blueprint.test.platform.KnopflerfishPlatformTest
Picked up JAVA_TOOL_OPTIONS: -Xmx2G -Djava.io.tmpdir=/tmp/genie.gemini -DforkCount=1
Running org.eclipse.gemini.blueprint.test.platform.PlatformConfigurationTest
Tests run: 1, Failures: 0, Errors: 0, Skipped: 0, Time elapsed: 0.284 sec - in org.eclipse.gemini.blueprint.test.platform.PlatformConfigurationTest
Picked up JAVA_TOOL_OPTIONS: -Xmx2G -Djava.io.tmpdir=/tmp/genie.gemini -DforkCount=1
Running org.eclipse.gemini.blueprint.test.platform.EquinoxPlatformTest
Tests run: 5, Failures: 0, Errors: 0, Skipped: 0, Time elapsed: 6.23 sec - in org.eclipse.gemini.blueprint.test.platform.EquinoxPlatformTest
Picked up JAVA_TOOL_OPTIONS: -Xmx2G -Djava.io.tmpdir=/tmp/genie.gemini -DforkCount=1
Running org.eclipse.gemini.blueprint.test.platform.AbstractOsgiPlatformTest
Tests run: 3, Failures: 0, Errors: 0, Skipped: 0, Time elapsed: 0.28 sec - in org.eclipse.gemini.blueprint.test.platform.AbstractOsgiPlatformTest
Picked up JAVA_TOOL_OPTIONS: -Xmx2G -Djava.io.tmpdir=/tmp/genie.gemini -DforkCount=1
Running org.eclipse.gemini.blueprint.test.parsing.DifferentParentsInDifferentBundlesTest
Tests run: 3, Failures: 0, Errors: 0, Skipped: 0, Time elapsed: 0.437 sec - in org.eclipse.gemini.blueprint.test.parsing.DifferentParentsInDifferentBundlesTest
Picked up JAVA_TOOL_OPTIONS: -Xmx2G -Djava.io.tmpdir=/tmp/genie.gemini -DforkCount=1
Running org.eclipse.gemini.blueprint.test.JUnitTestActivatorTest
Tests run: 3, Failures: 0, Errors: 0, Skipped: 0, Time elapsed: 0.329 sec - in org.eclipse.gemini.blueprint.test.JUnitTestActivatorTest

Results :

Tests run: 59, Failures: 0, Errors: 0, Skipped: 0

[INFO] 
[INFO] --- maven-jar-plugin:3.0.2:jar (default-jar) @ gemini-blueprint-test ---
[INFO] Building jar: /jobs/genie.gemini/java7-gemini-blueprint-felix/workspace/test-support/target/gemini-blueprint-test-2.1.0.JAVA7-SNAPSHOT.jar
[INFO] 
[INFO] --- maven-shade-plugin:2.1:shade (default) @ gemini-blueprint-test ---
[INFO] Excluding org.apache.servicemix.bundles:org.apache.servicemix.bundles.junit:jar:4.12_1 from the shaded jar.
[INFO] Excluding org.hamcrest:hamcrest-core:jar:1.3 from the shaded jar.
[INFO] Excluding org.apache.servicemix.bundles:org.apache.servicemix.bundles.spring-test:jar:4.3.7.RELEASE_1 from the shaded jar.
[INFO] Excluding org.ow2.asm:asm-all:jar:5.2 from the shaded jar.
[INFO] Excluding org.eclipse.gemini.blueprint:gemini-blueprint-core:jar:2.1.0.JAVA7-SNAPSHOT from the shaded jar.
[INFO] Excluding org.eclipse.gemini.blueprint:gemini-blueprint-io:jar:2.1.0.JAVA7-SNAPSHOT from the shaded jar.
[INFO] Excluding org.apache.servicemix.bundles:org.apache.servicemix.bundles.spring-aop:jar:4.3.7.RELEASE_1 from the shaded jar.
[INFO] Excluding org.apache.servicemix.bundles:org.apache.servicemix.bundles.spring-beans:jar:4.3.7.RELEASE_1 from the shaded jar.
[INFO] Excluding org.apache.servicemix.bundles:org.apache.servicemix.bundles.spring-context:jar:4.3.7.RELEASE_1 from the shaded jar.
[INFO] Excluding org.apache.servicemix.bundles:org.apache.servicemix.bundles.spring-core:jar:4.3.7.RELEASE_1 from the shaded jar.
[INFO] Excluding org.apache.servicemix.bundles:org.apache.servicemix.bundles.spring-expression:jar:4.3.7.RELEASE_1 from the shaded jar.
[INFO] Including org.eclipse.gemini.blueprint:gemini-blueprint-extender:jar:2.1.0.JAVA7-SNAPSHOT in the shaded jar.
[INFO] Excluding javax.inject:javax.inject:jar:1 from the shaded jar.
[INFO] Replacing original artifact with shaded artifact.
[INFO] Replacing /jobs/genie.gemini/java7-gemini-blueprint-felix/workspace/test-support/target/gemini-blueprint-test-2.1.0.JAVA7-SNAPSHOT.jar with /jobs/genie.gemini/java7-gemini-blueprint-felix/workspace/test-support/target/gemini-blueprint-test-2.1.0.JAVA7-SNAPSHOT-shaded.jar
[INFO] Dependency-reduced POM written at: /jobs/genie.gemini/java7-gemini-blueprint-felix/workspace/test-support/dependency-reduced-pom.xml
[INFO] Dependency-reduced POM written at: /jobs/genie.gemini/java7-gemini-blueprint-felix/workspace/test-support/dependency-reduced-pom.xml
[INFO] 
[INFO] --- maven-source-plugin:2.2.1:jar-no-fork (attach-sources) @ gemini-blueprint-test ---
[INFO] Building jar: /jobs/genie.gemini/java7-gemini-blueprint-felix/workspace/test-support/target/gemini-blueprint-test-2.1.0.JAVA7-SNAPSHOT-sources.jar
[INFO] 
[INFO] --- maven-install-plugin:2.5.2:install (default-install) @ gemini-blueprint-test ---
[INFO] Installing /jobs/genie.gemini/java7-gemini-blueprint-felix/workspace/test-support/target/gemini-blueprint-test-2.1.0.JAVA7-SNAPSHOT.jar to /opt/public/hipp/homes/genie.gemini/.m2/repository/org/eclipse/gemini/blueprint/gemini-blueprint-test/2.1.0.JAVA7-SNAPSHOT/gemini-blueprint-test-2.1.0.JAVA7-SNAPSHOT.jar
[INFO] Installing /jobs/genie.gemini/java7-gemini-blueprint-felix/workspace/test-support/dependency-reduced-pom.xml to /opt/public/hipp/homes/genie.gemini/.m2/repository/org/eclipse/gemini/blueprint/gemini-blueprint-test/2.1.0.JAVA7-SNAPSHOT/gemini-blueprint-test-2.1.0.JAVA7-SNAPSHOT.pom
[INFO] ------------------------------------------------------------------------
[INFO] Reactor Summary for Gemini Blueprint 2.1.0.JAVA7-SNAPSHOT:
[INFO] 
[INFO] Gemini Blueprint ................................... SUCCESS [  1.709 s]
[INFO] Gemini Blueprint Mocks ............................. SUCCESS [  6.221 s]
[INFO] Gemini Blueprint IO ................................ SUCCESS [  2.987 s]
[INFO] Gemini Blueprint Core .............................. SUCCESS [ 37.452 s]
[INFO] Gemini Blueprint Extender .......................... SUCCESS [  4.369 s]
[INFO] Gemini Blueprint Extensions ........................ SUCCESS [  2.019 s]
[INFO] Gemini Blueprint Testing Framework ................. FAILURE [ 23.567 s]
[INFO] Eclipse Gemini Blueprint Integration Tests Parent .. SKIPPED
[INFO] Eclipse Gemini Blueprint Integration Testing Bundles SKIPPED
[INFO] Gemini Blueprint Test Bundle: Simple service test bundle SKIPPED
[INFO] Gemini Blueprint Test Bundle: Simple service test bundle (impl differs) SKIPPED
[INFO] Gemini Blueprint Test Bundle: Simple service test bundle (impl differs) SKIPPED
[INFO] Gemini Blueprint Test Bundle: Simple service test bundle 2 SKIPPED
[INFO] Gemini Blueprint Test Bundle: Simple service test bundle 3 SKIPPED
[INFO] Gemini Blueprint Test Bundle: Simple service created by a factory which has a non trivial delay in createObject() SKIPPED
[INFO] Gemini Blueprint Test Bundle: Trivial OSGi bundle .. SKIPPED
[INFO] Gemini Blueprint Test Bundle: Simple test that uses trivial bundle SKIPPED
[INFO] Gemini Blueprint Test Bundle: Spring context lifecycle test bundle SKIPPED
[INFO] Gemini Blueprint Test Bundle: Spring context service listener test bundle SKIPPED
[INFO] Gemini Blueprint Test Bundle: Spring context service reference lifecycle test bundle SKIPPED
[INFO] Gemini Blueprint Test Bundle: Spring context service reference destruction test bundle SKIPPED
[INFO] Gemini Blueprint Test Bundle: Spring context dependencies test bundle SKIPPED
[INFO] Gemini Blueprint Test Bundle: Spring context service reference cardinality 0..1 bundle SKIPPED
[INFO] Gemini Blueprint Test Bundle: Bundle scoping test bundle - A SKIPPED
[INFO] Gemini Blueprint Test Bundle: Bundle scoping test bundle - B SKIPPED
[INFO] Gemini Blueprint Test Bundle: Bundle scoping test bundle - Common SKIPPED
[INFO] Gemini Blueprint Test Bundle: IO fragment 1 bundle . SKIPPED
[INFO] Gemini Blueprint Test Bundle: IO fragment 2 bundle . SKIPPED
[INFO] Gemini Blueprint Test Bundle: Error bundle ......... SKIPPED
[INFO] Gemini Blueprint Test Bundle: Deadlock bundle ...... SKIPPED
[INFO] Gemini Blueprint Test Bundle: Configuration test bundle SKIPPED
[INFO] Gemini Blueprint Test Bundle: ExtenderVersion-Test-Bundle SKIPPED
[INFO] Gemini Blueprint Test Bundle: Integration testing bundles for configuration options SKIPPED
[INFO] Gemini Blueprint Test Bundle: NoPublish-Bundle ..... SKIPPED
[INFO] Gemini Blueprint Test Bundle: Async-NoWait-Bundle .. SKIPPED
[INFO] Gemini Blueprint Test Bundle: Async-Wait-Bundle .... SKIPPED
[INFO] Gemini Blueprint Test Bundle: Sync-NoWait-Bundle ... SKIPPED
[INFO] Gemini Blueprint Test Bundle: Sync-Tail-Bundle ..... SKIPPED
[INFO] Gemini Blueprint Test Bundle: Sync-Wait-Bundle ..... SKIPPED
[INFO] Gemini Blueprint Test Bundle: Spring service TCCL management inteface test bundle SKIPPED
[INFO] Gemini Blueprint Test Bundle: Spring service TCCL management test bundle SKIPPED
[INFO] Gemini Blueprint Test Bundle: Config File With Dots bundle SKIPPED
[INFO] Gemini Blueprint Test Bundle: Spring Proxy Creator bundle SKIPPED
[INFO] Gemini Blueprint Test Bundle: Extender Configuration Fragment Bundle SKIPPED
[INFO] Gemini Blueprint Test Bundle: JDK proxy test ....... SKIPPED
[INFO] Gemini Blueprint Test Bundle: Extender Event listener bundle Bundle SKIPPED
[INFO] Gemini Blueprint Test Bundle: namespace provider and consumer bundle SKIPPED
[INFO] Gemini Blueprint Test Bundle: Just a listener exported as a service SKIPPED
[INFO] Gemini Blueprint Test Bundle: Export Import Dependency Bundle SKIPPED
[INFO] Eclipse Gemini Blueprint JDK5 Integration Testing Bundles SKIPPED
[INFO] Gemini Blueprint Test Bundle: @Component beans bundle SKIPPED
[INFO] Eclipse Gemini Blueprint Test Bundle: Recursive Type test bundle SKIPPED
[INFO] Gemini Blueprint Integration Testing Bundles ....... SKIPPED
[INFO] Eclipse Gemini Blueprint Test Bundle: Simple service test bundle SKIPPED
[INFO] Eclipse Gemini Blueprint Test Bundle: Error bundle . SKIPPED
[INFO] Eclipse Gemini Blueprint Test Bundle: Waiting bundle SKIPPED
[INFO] Eclipse Gemini Blueprint Test Bundle: Configuration test bundle SKIPPED
[INFO] Eclipse Gemini Blueprint Integration Tests ......... SKIPPED
[INFO] ------------------------------------------------------------------------
[INFO] BUILD FAILURE
[INFO] ------------------------------------------------------------------------
[INFO] Total time:  01:19 min
[INFO] Finished at: 2020-03-29T20:55:23-04:00
[INFO] ------------------------------------------------------------------------
[ERROR] Failed to execute goal org.apache.maven.plugins:maven-install-plugin:2.5.2:install (default-install) on project gemini-blueprint-test: Failed to install metadata org.eclipse.gemini.blueprint:gemini-blueprint-test/maven-metadata.xml: Could not parse metadata /opt/public/hipp/homes/genie.gemini/.m2/repository/org/eclipse/gemini/blueprint/gemini-blueprint-test/maven-metadata-local.xml: in epilog non whitespace content is not allowed but got 8 (position: END_TAG seen ...</metadata>\n8... @12:2)  -> [Help 1]
[ERROR] 
[ERROR] To see the full stack trace of the errors, re-run Maven with the -e switch.
[ERROR] Re-run Maven using the -X switch to enable full debug logging.
[ERROR] 
[ERROR] For more information about the errors and possible solutions, please read the following articles:
[ERROR] [Help 1] http://cwiki.apache.org/confluence/display/MAVEN/MojoExecutionException
[ERROR] 
[ERROR] After correcting the problems, you can resume the build with the command
[ERROR]   mvn <args> -rf :gemini-blueprint-test
Build step 'Invoke top-level Maven targets' marked build as failure
Sending e-mails to: olaf@x100.de
Recording test results
Started calculate disk usage of build
Finished Calculation of disk usage of build in 0 seconds
Started calculate disk usage of workspace
Finished Calculation of disk usage of workspace in 0 seconds
Finished: FAILURE