FailedConsole Output

Started by timer
Building in workspace /home/hudson/genie.gemini/.jenkins/jobs/gemini-management/workspace
No credentials specified
 > /usr/local/bin/git rev-parse --is-inside-work-tree # timeout=10
Fetching changes from the remote Git repository
 > /usr/local/bin/git config remote.origin.url git://git.eclipse.org/gitroot/gemini.management/org.eclipse.gemini.managment.git # timeout=10
Fetching upstream changes from git://git.eclipse.org/gitroot/gemini.management/org.eclipse.gemini.managment.git
 > /usr/local/bin/git --version # timeout=10
 > /usr/local/bin/git fetch --tags --progress git://git.eclipse.org/gitroot/gemini.management/org.eclipse.gemini.managment.git +refs/heads/*:refs/remotes/origin/*
 > /usr/local/bin/git rev-parse origin/master^{commit} # timeout=10
Checking out Revision e4b2bde49257b51696cbf5e75cc932005ee1301d (origin/master)
 > /usr/local/bin/git config core.sparsecheckout # timeout=10
 > /usr/local/bin/git checkout -f e4b2bde49257b51696cbf5e75cc932005ee1301d
Commit message: "Bug 462159 - Bumps Tycho version from 0.18.0 to 0.22.0"
 > /usr/local/bin/git rev-list --no-walk e4b2bde49257b51696cbf5e75cc932005ee1301d # timeout=10
[workspace] $ /shared/common/apache-maven-latest/bin/mvn -f gemini.management.releng/pom.xml clean install -e
Picked up JAVA_TOOL_OPTIONS: -Xmx2G -Djava.io.tmpdir=/tmp/genie.gemini -DforkCount=1
[INFO] Error stacktraces are turned on.
[INFO] Scanning for projects...
[WARNING] No explicit target runtime environment configuration. Build is platform dependent.
[WARNING] No explicit target runtime environment configuration. Build is platform dependent.
[WARNING] No explicit target runtime environment configuration. Build is platform dependent.
[WARNING] No explicit target runtime environment configuration. Build is platform dependent.
[INFO] Computing target platform for MavenProject: org.eclipse.gemini.management:org.eclipse.gemini.management:2.0.1-SNAPSHOT @ /jobs/genie.gemini/gemini-management/workspace/org.eclipse.gemini.management/pom.xml
[INFO] Fetching p2.index from http://download.eclipse.org/eclipse/updates/3.8/ (0B at 0B/s)
[INFO] Adding repository http://download.eclipse.org/eclipse/updates/3.8
[INFO] Resolving dependencies of MavenProject: org.eclipse.gemini.management:org.eclipse.gemini.management:2.0.1-SNAPSHOT @ /jobs/genie.gemini/gemini-management/workspace/org.eclipse.gemini.management/pom.xml
[INFO] Resolving class path of MavenProject: org.eclipse.gemini.management:org.eclipse.gemini.management:2.0.1-SNAPSHOT @ /jobs/genie.gemini/gemini-management/workspace/org.eclipse.gemini.management/pom.xml
[INFO] Computing target platform for MavenProject: org.eclipse.gemini.management:org.eclipse.gemini.management.tests:2.0.1-SNAPSHOT @ /jobs/genie.gemini/gemini-management/workspace/org.eclipse.gemini.management.tests/pom.xml
[INFO] Resolving dependencies of MavenProject: org.eclipse.gemini.management:org.eclipse.gemini.management.tests:2.0.1-SNAPSHOT @ /jobs/genie.gemini/gemini-management/workspace/org.eclipse.gemini.management.tests/pom.xml
[INFO] Resolving class path of MavenProject: org.eclipse.gemini.management:org.eclipse.gemini.management.tests:2.0.1-SNAPSHOT @ /jobs/genie.gemini/gemini-management/workspace/org.eclipse.gemini.management.tests/pom.xml
[INFO] Computing target platform for MavenProject: org.eclipse.gemini.management:org.eclipse.gemini.management.feature:2.0.1-SNAPSHOT @ /jobs/genie.gemini/gemini-management/workspace/org.eclipse.gemini.management.feature/pom.xml
[INFO] Resolving dependencies of MavenProject: org.eclipse.gemini.management:org.eclipse.gemini.management.feature:2.0.1-SNAPSHOT @ /jobs/genie.gemini/gemini-management/workspace/org.eclipse.gemini.management.feature/pom.xml
[INFO] Resolving class path of MavenProject: org.eclipse.gemini.management:org.eclipse.gemini.management.feature:2.0.1-SNAPSHOT @ /jobs/genie.gemini/gemini-management/workspace/org.eclipse.gemini.management.feature/pom.xml
[INFO] Computing target platform for MavenProject: org.eclipse.gemini.management:gemini.management.repository:2.0.1-SNAPSHOT @ /jobs/genie.gemini/gemini-management/workspace/gemini.management.repository/pom.xml
[INFO] Resolving dependencies of MavenProject: org.eclipse.gemini.management:gemini.management.repository:2.0.1-SNAPSHOT @ /jobs/genie.gemini/gemini-management/workspace/gemini.management.repository/pom.xml
[INFO] Resolving class path of MavenProject: org.eclipse.gemini.management:gemini.management.repository:2.0.1-SNAPSHOT @ /jobs/genie.gemini/gemini-management/workspace/gemini.management.repository/pom.xml
[INFO] ------------------------------------------------------------------------
[INFO] Reactor Build Order:
[INFO] 
[INFO] Gemini Management Parent POM                                       [pom]
[INFO] Gemini Management Bundle                                [eclipse-plugin]
[INFO] Gemini Management Bundle Tests                     [eclipse-test-plugin]
[INFO] Gemini Management Feature                              [eclipse-feature]
[INFO] Gemini Management Update Site                      [eclipse-update-site]
[INFO] Gemini Management Target Platform                                  [pom]
[INFO] 
[INFO] --< org.eclipse.gemini.management:org.eclipse.gemini.management_parent >--
[INFO] Building Gemini Management Parent POM 2.0.1-SNAPSHOT               [1/6]
[INFO] --------------------------------[ pom ]---------------------------------
[INFO] 
[INFO] --- maven-clean-plugin:2.5:clean (default-clean) @ org.eclipse.gemini.management_parent ---
[INFO] 
[INFO] --- maven-install-plugin:2.4:install (default-install) @ org.eclipse.gemini.management_parent ---
[INFO] Installing /jobs/genie.gemini/gemini-management/workspace/gemini.management.releng/pom.xml to /opt/public/hipp/homes/genie.gemini/.m2/repository/org/eclipse/gemini/management/org.eclipse.gemini.management_parent/2.0.1-SNAPSHOT/org.eclipse.gemini.management_parent-2.0.1-SNAPSHOT.pom
[INFO] 
[INFO] ----< org.eclipse.gemini.management:org.eclipse.gemini.management >-----
[INFO] Building Gemini Management Bundle 2.0.1-SNAPSHOT                   [2/6]
[INFO] ---------------------------[ eclipse-plugin ]---------------------------
[INFO] 
[INFO] --- maven-clean-plugin:2.5:clean (default-clean) @ org.eclipse.gemini.management ---
[INFO] Deleting /jobs/genie.gemini/gemini-management/workspace/org.eclipse.gemini.management/target
[INFO] 
[INFO] --- tycho-packaging-plugin:0.22.0:build-qualifier (default-build-qualifier) @ org.eclipse.gemini.management ---
[INFO] The project's OSGi version is 2.0.1.201910170131
[INFO] 
[INFO] --- tycho-packaging-plugin:0.22.0:validate-id (default-validate-id) @ org.eclipse.gemini.management ---
[INFO] 
[INFO] --- tycho-packaging-plugin:0.22.0:validate-version (default-validate-version) @ org.eclipse.gemini.management ---
[INFO] 
[INFO] --- maven-resources-plugin:2.4.1:resources (default-resources) @ org.eclipse.gemini.management ---
[INFO] Using 'ISO-8859-1' encoding to copy filtered resources.
[INFO] skip non existing resourceDirectory /jobs/genie.gemini/gemini-management/workspace/org.eclipse.gemini.management/src/main/resources
[INFO] 
[INFO] --- tycho-compiler-plugin:0.22.0:compile (default-compile) @ org.eclipse.gemini.management ---
[INFO] Compiling 50 source files to /jobs/genie.gemini/gemini-management/workspace/org.eclipse.gemini.management/target/classes
[INFO] 
[INFO] --- maven-resources-plugin:2.4.1:testResources (default-testResources) @ org.eclipse.gemini.management ---
[INFO] Using 'ISO-8859-1' encoding to copy filtered resources.
[INFO] skip non existing resourceDirectory /jobs/genie.gemini/gemini-management/workspace/org.eclipse.gemini.management/src/test/resources
[INFO] 
[INFO] --- tycho-source-plugin:0.22.0:plugin-source (plugin-source) @ org.eclipse.gemini.management ---
[WARNING] bundle localization file /jobs/genie.gemini/gemini-management/workspace/org.eclipse.gemini.management/plugin.properties not found
[WARNING] Bundle-Vendor header not found in /jobs/genie.gemini/gemini-management/workspace/org.eclipse.gemini.management/META-INF/MANIFEST.MF, fallback to 'unknown' for source bundle
[INFO] Building jar: /jobs/genie.gemini/gemini-management/workspace/org.eclipse.gemini.management/target/org.eclipse.gemini.management-2.0.1-SNAPSHOT-sources.jar
[INFO] 
[INFO] --- target-platform-configuration:0.22.0:target-platform (default-target-platform) @ org.eclipse.gemini.management ---
[INFO] 
[INFO] --- tycho-packaging-plugin:0.22.0:package-plugin (default-package-plugin) @ org.eclipse.gemini.management ---
[INFO] Building jar: /jobs/genie.gemini/gemini-management/workspace/org.eclipse.gemini.management/target/org.eclipse.gemini.management-2.0.1-SNAPSHOT.jar
[INFO] 
[INFO] --- tycho-p2-plugin:0.22.0:p2-metadata-default (default-p2-metadata-default) @ org.eclipse.gemini.management ---
[INFO] 
[INFO] >>> findbugs-maven-plugin:2.3.2:check (default) > :findbugs @ org.eclipse.gemini.management >>>
[INFO] 
[INFO] --- findbugs-maven-plugin:2.3.2:findbugs (findbugs) @ org.eclipse.gemini.management ---
[INFO] ------------------------------------------------------------------------
[INFO] Reactor Summary for Gemini Management Parent POM 2.0.1-SNAPSHOT:
[INFO] 
[INFO] Gemini Management Parent POM ....................... SUCCESS [  0.409 s]
[INFO] Gemini Management Bundle ........................... FAILURE [  6.305 s]
[INFO] Gemini Management Bundle Tests ..................... SKIPPED
[INFO] Gemini Management Feature .......................... SKIPPED
[INFO] Gemini Management Update Site ...................... SKIPPED
[INFO] Gemini Management Target Platform .................. SKIPPED
[INFO] ------------------------------------------------------------------------
[INFO] BUILD FAILURE
[INFO] ------------------------------------------------------------------------
[INFO] Total time:  20.498 s
[INFO] Finished at: 2019-10-16T21:31:26-04:00
[INFO] ------------------------------------------------------------------------
[ERROR] Failed to execute goal org.codehaus.mojo:findbugs-maven-plugin:2.3.2:findbugs (findbugs) on project org.eclipse.gemini.management: Unable to parse configuration of mojo org.codehaus.mojo:findbugs-maven-plugin:2.3.2:findbugs for parameter pluginArtifacts: Cannot assign configuration entry 'pluginArtifacts' with value '${plugin.artifacts}' of type java.util.Collections.UnmodifiableRandomAccessList to property of type java.util.ArrayList -> [Help 1]
org.apache.maven.lifecycle.LifecycleExecutionException: Failed to execute goal org.codehaus.mojo:findbugs-maven-plugin:2.3.2:findbugs (findbugs) on project org.eclipse.gemini.management: Unable to parse configuration of mojo org.codehaus.mojo:findbugs-maven-plugin:2.3.2:findbugs for parameter pluginArtifacts: Cannot assign configuration entry 'pluginArtifacts' with value '${plugin.artifacts}' of type java.util.Collections.UnmodifiableRandomAccessList to property of type java.util.ArrayList
    at org.apache.maven.lifecycle.internal.MojoExecutor.execute (MojoExecutor.java:215)
    at org.apache.maven.lifecycle.internal.MojoExecutor.execute (MojoExecutor.java:156)
    at org.apache.maven.lifecycle.internal.MojoExecutor.execute (MojoExecutor.java:148)
    at org.apache.maven.lifecycle.internal.MojoExecutor.executeForkedExecutions (MojoExecutor.java:355)
    at org.apache.maven.lifecycle.internal.MojoExecutor.execute (MojoExecutor.java:200)
    at org.apache.maven.lifecycle.internal.MojoExecutor.execute (MojoExecutor.java:156)
    at org.apache.maven.lifecycle.internal.MojoExecutor.execute (MojoExecutor.java:148)
    at org.apache.maven.lifecycle.internal.LifecycleModuleBuilder.buildProject (LifecycleModuleBuilder.java:117)
    at org.apache.maven.lifecycle.internal.LifecycleModuleBuilder.buildProject (LifecycleModuleBuilder.java:81)
    at org.apache.maven.lifecycle.internal.builder.singlethreaded.SingleThreadedBuilder.build (SingleThreadedBuilder.java:56)
    at org.apache.maven.lifecycle.internal.LifecycleStarter.execute (LifecycleStarter.java:128)
    at org.apache.maven.DefaultMaven.doExecute (DefaultMaven.java:305)
    at org.apache.maven.DefaultMaven.doExecute (DefaultMaven.java:192)
    at org.apache.maven.DefaultMaven.execute (DefaultMaven.java:105)
    at org.apache.maven.cli.MavenCli.execute (MavenCli.java:956)
    at org.apache.maven.cli.MavenCli.doMain (MavenCli.java:288)
    at org.apache.maven.cli.MavenCli.main (MavenCli.java:192)
    at sun.reflect.NativeMethodAccessorImpl.invoke0 (Native Method)
    at sun.reflect.NativeMethodAccessorImpl.invoke (NativeMethodAccessorImpl.java:57)
    at sun.reflect.DelegatingMethodAccessorImpl.invoke (DelegatingMethodAccessorImpl.java:43)
    at java.lang.reflect.Method.invoke (Method.java:606)
    at org.codehaus.plexus.classworlds.launcher.Launcher.launchEnhanced (Launcher.java:289)
    at org.codehaus.plexus.classworlds.launcher.Launcher.launch (Launcher.java:229)
    at org.codehaus.plexus.classworlds.launcher.Launcher.mainWithExitCode (Launcher.java:415)
    at org.codehaus.plexus.classworlds.launcher.Launcher.main (Launcher.java:356)
Caused by: org.apache.maven.plugin.PluginConfigurationException: Unable to parse configuration of mojo org.codehaus.mojo:findbugs-maven-plugin:2.3.2:findbugs for parameter pluginArtifacts: Cannot assign configuration entry 'pluginArtifacts' with value '${plugin.artifacts}' of type java.util.Collections.UnmodifiableRandomAccessList to property of type java.util.ArrayList
    at org.apache.maven.plugin.internal.DefaultMavenPluginManager.populatePluginFields (DefaultMavenPluginManager.java:665)
    at org.apache.maven.plugin.internal.DefaultMavenPluginManager.getConfiguredMojo (DefaultMavenPluginManager.java:597)
    at org.apache.maven.plugin.DefaultBuildPluginManager.executeMojo (DefaultBuildPluginManager.java:124)
    at org.apache.maven.lifecycle.internal.MojoExecutor.execute (MojoExecutor.java:210)
    at org.apache.maven.lifecycle.internal.MojoExecutor.execute (MojoExecutor.java:156)
    at org.apache.maven.lifecycle.internal.MojoExecutor.execute (MojoExecutor.java:148)
    at org.apache.maven.lifecycle.internal.MojoExecutor.executeForkedExecutions (MojoExecutor.java:355)
    at org.apache.maven.lifecycle.internal.MojoExecutor.execute (MojoExecutor.java:200)
    at org.apache.maven.lifecycle.internal.MojoExecutor.execute (MojoExecutor.java:156)
    at org.apache.maven.lifecycle.internal.MojoExecutor.execute (MojoExecutor.java:148)
    at org.apache.maven.lifecycle.internal.LifecycleModuleBuilder.buildProject (LifecycleModuleBuilder.java:117)
    at org.apache.maven.lifecycle.internal.LifecycleModuleBuilder.buildProject (LifecycleModuleBuilder.java:81)
    at org.apache.maven.lifecycle.internal.builder.singlethreaded.SingleThreadedBuilder.build (SingleThreadedBuilder.java:56)
    at org.apache.maven.lifecycle.internal.LifecycleStarter.execute (LifecycleStarter.java:128)
    at org.apache.maven.DefaultMaven.doExecute (DefaultMaven.java:305)
    at org.apache.maven.DefaultMaven.doExecute (DefaultMaven.java:192)
    at org.apache.maven.DefaultMaven.execute (DefaultMaven.java:105)
    at org.apache.maven.cli.MavenCli.execute (MavenCli.java:956)
    at org.apache.maven.cli.MavenCli.doMain (MavenCli.java:288)
    at org.apache.maven.cli.MavenCli.main (MavenCli.java:192)
    at sun.reflect.NativeMethodAccessorImpl.invoke0 (Native Method)
    at sun.reflect.NativeMethodAccessorImpl.invoke (NativeMethodAccessorImpl.java:57)
    at sun.reflect.DelegatingMethodAccessorImpl.invoke (DelegatingMethodAccessorImpl.java:43)
    at java.lang.reflect.Method.invoke (Method.java:606)
    at org.codehaus.plexus.classworlds.launcher.Launcher.launchEnhanced (Launcher.java:289)
    at org.codehaus.plexus.classworlds.launcher.Launcher.launch (Launcher.java:229)
    at org.codehaus.plexus.classworlds.launcher.Launcher.mainWithExitCode (Launcher.java:415)
    at org.codehaus.plexus.classworlds.launcher.Launcher.main (Launcher.java:356)
Caused by: org.codehaus.plexus.component.configurator.ComponentConfigurationException: Cannot assign configuration entry 'pluginArtifacts' with value '${plugin.artifacts}' of type java.util.Collections.UnmodifiableRandomAccessList to property of type java.util.ArrayList
    at org.codehaus.plexus.component.configurator.converters.AbstractConfigurationConverter.failIfNotTypeCompatible (AbstractConfigurationConverter.java:100)
    at org.codehaus.plexus.component.configurator.converters.composite.CollectionConverter.fromConfiguration (CollectionConverter.java:82)
    at org.codehaus.plexus.component.configurator.converters.composite.CollectionConverter.fromConfiguration (CollectionConverter.java:47)
    at org.eclipse.sisu.plexus.CompositeBeanHelper.convertProperty (CompositeBeanHelper.java:273)
    at org.eclipse.sisu.plexus.CompositeBeanHelper.setProperty (CompositeBeanHelper.java:174)
    at org.codehaus.plexus.component.configurator.converters.composite.ObjectWithFieldsConverter.processConfiguration (ObjectWithFieldsConverter.java:101)
    at org.codehaus.plexus.component.configurator.BasicComponentConfigurator.configureComponent (BasicComponentConfigurator.java:34)
    at org.apache.maven.plugin.internal.DefaultMavenPluginManager.populatePluginFields (DefaultMavenPluginManager.java:635)
    at org.apache.maven.plugin.internal.DefaultMavenPluginManager.getConfiguredMojo (DefaultMavenPluginManager.java:597)
    at org.apache.maven.plugin.DefaultBuildPluginManager.executeMojo (DefaultBuildPluginManager.java:124)
    at org.apache.maven.lifecycle.internal.MojoExecutor.execute (MojoExecutor.java:210)
    at org.apache.maven.lifecycle.internal.MojoExecutor.execute (MojoExecutor.java:156)
    at org.apache.maven.lifecycle.internal.MojoExecutor.execute (MojoExecutor.java:148)
    at org.apache.maven.lifecycle.internal.MojoExecutor.executeForkedExecutions (MojoExecutor.java:355)
    at org.apache.maven.lifecycle.internal.MojoExecutor.execute (MojoExecutor.java:200)
    at org.apache.maven.lifecycle.internal.MojoExecutor.execute (MojoExecutor.java:156)
    at org.apache.maven.lifecycle.internal.MojoExecutor.execute (MojoExecutor.java:148)
    at org.apache.maven.lifecycle.internal.LifecycleModuleBuilder.buildProject (LifecycleModuleBuilder.java:117)
    at org.apache.maven.lifecycle.internal.LifecycleModuleBuilder.buildProject (LifecycleModuleBuilder.java:81)
    at org.apache.maven.lifecycle.internal.builder.singlethreaded.SingleThreadedBuilder.build (SingleThreadedBuilder.java:56)
    at org.apache.maven.lifecycle.internal.LifecycleStarter.execute (LifecycleStarter.java:128)
    at org.apache.maven.DefaultMaven.doExecute (DefaultMaven.java:305)
    at org.apache.maven.DefaultMaven.doExecute (DefaultMaven.java:192)
    at org.apache.maven.DefaultMaven.execute (DefaultMaven.java:105)
    at org.apache.maven.cli.MavenCli.execute (MavenCli.java:956)
    at org.apache.maven.cli.MavenCli.doMain (MavenCli.java:288)
    at org.apache.maven.cli.MavenCli.main (MavenCli.java:192)
    at sun.reflect.NativeMethodAccessorImpl.invoke0 (Native Method)
    at sun.reflect.NativeMethodAccessorImpl.invoke (NativeMethodAccessorImpl.java:57)
    at sun.reflect.DelegatingMethodAccessorImpl.invoke (DelegatingMethodAccessorImpl.java:43)
    at java.lang.reflect.Method.invoke (Method.java:606)
    at org.codehaus.plexus.classworlds.launcher.Launcher.launchEnhanced (Launcher.java:289)
    at org.codehaus.plexus.classworlds.launcher.Launcher.launch (Launcher.java:229)
    at org.codehaus.plexus.classworlds.launcher.Launcher.mainWithExitCode (Launcher.java:415)
    at org.codehaus.plexus.classworlds.launcher.Launcher.main (Launcher.java:356)
[ERROR] 
[ERROR] Re-run Maven using the -X switch to enable full debug logging.
[ERROR] 
[ERROR] For more information about the errors and possible solutions, please read the following articles:
[ERROR] [Help 1] http://cwiki.apache.org/confluence/display/MAVEN/PluginConfigurationException
[ERROR] 
[ERROR] After correcting the problems, you can resume the build with the command
[ERROR]   mvn <goals> -rf :org.eclipse.gemini.management
Build step 'Invoke top-level Maven targets' marked build as failure
Sending e-mails to: fwaibel@eclipsesource.com
Recording test results
ERROR: Step ‘Publish JUnit test result report’ failed: Test reports were found but none of them are new. Did leafNodes run? 
For example, /home/hudson/genie.gemini/.jenkins/jobs/gemini-management/workspace/org.eclipse.gemini.management.tests/target/surefire-reports/TEST-org.eclipse.gemini.management.integration.tests.BundleStateTest.xml is 6 mo 29 days old

Started calculate disk usage of build
Finished Calculation of disk usage of build in 0 seconds
Started calculate disk usage of workspace
Finished Calculation of disk usage of workspace in 0 seconds
Finished: FAILURE