FailedConsole Output

Skipping 26,984 KB.. Full Log
ttach-sources) @ gemini-blueprint-test ---
[INFO] [INFO] Building jar: /jobs/genie.gemini/gemini-blueprint-stage-release/workspace/test-support/target/gemini-blueprint-test-2.1.0.M1-SNAPSHOT-sources.jar
[INFO] [INFO] 
[INFO] [INFO] --- maven-gpg-plugin:1.6:sign (sign-artifacts) @ gemini-blueprint-test ---
[INFO] [INFO]                                                                         
[INFO] [INFO] ------------------------------------------------------------------------
[INFO] [INFO] Building Eclipse Gemini Blueprint Integration Tests Parent 2.1.0.M1-SNAPSHOT
[INFO] [INFO] ------------------------------------------------------------------------
[INFO] [INFO] 
[INFO] [INFO] --- maven-clean-plugin:3.0.0:clean (default-clean) @ gemini-blueprint-integration-tests-parent ---
[INFO] [INFO] 
[INFO] [INFO] --- git-commit-id-plugin:2.1.5:revision (default) @ gemini-blueprint-integration-tests-parent ---
[INFO] [info] 
[INFO] [info] 
[INFO] [INFO] 
[INFO] [INFO] --- maven-site-plugin:3.6:site (site) @ gemini-blueprint-integration-tests-parent ---
[INFO] [INFO] maven.site.skip = true: Skipping site generation
[INFO] [INFO] 
[INFO] [INFO] --- maven-source-plugin:2.2.1:jar-no-fork (attach-sources) @ gemini-blueprint-integration-tests-parent ---
[INFO] [INFO] Skipping source per configuration.
[INFO] [INFO] 
[INFO] [INFO] --- maven-gpg-plugin:1.6:sign (sign-artifacts) @ gemini-blueprint-integration-tests-parent ---
[INFO] [INFO]                                                                         
[INFO] [INFO] ------------------------------------------------------------------------
[INFO] [INFO] Building Eclipse Gemini Blueprint Integration Testing Bundles 2.1.0.M1-SNAPSHOT
[INFO] [INFO] ------------------------------------------------------------------------
[INFO] [INFO] 
[INFO] [INFO] --- maven-clean-plugin:3.0.0:clean (default-clean) @ gemini-blueprint-integration-test-bundles ---
[INFO] [INFO] 
[INFO] [INFO] --- git-commit-id-plugin:2.1.5:revision (default) @ gemini-blueprint-integration-test-bundles ---
[INFO] [info] 
[INFO] [info] 
[INFO] [INFO] 
[INFO] [INFO] --- maven-site-plugin:3.6:site (site) @ gemini-blueprint-integration-test-bundles ---
[INFO] [INFO] maven.site.skip = true: Skipping site generation
[INFO] [INFO] 
[INFO] [INFO] --- maven-source-plugin:2.2.1:jar-no-fork (attach-sources) @ gemini-blueprint-integration-test-bundles ---
[INFO] [INFO] Skipping source per configuration.
[INFO] [INFO] 
[INFO] [INFO] --- maven-gpg-plugin:1.6:sign (sign-artifacts) @ gemini-blueprint-integration-test-bundles ---
[INFO] [INFO]                                                                         
[INFO] [INFO] ------------------------------------------------------------------------
[INFO] [INFO] Building Gemini Blueprint Test Bundle: Simple service test bundle 2.1.0.M1-SNAPSHOT
[INFO] [INFO] ------------------------------------------------------------------------
[INFO] [INFO] 
[INFO] [INFO] --- maven-clean-plugin:3.0.0:clean (default-clean) @ simple.service ---
[INFO] [INFO] 
[INFO] [INFO] --- git-commit-id-plugin:2.1.5:revision (default) @ simple.service ---
[INFO] [info] 
[INFO] [info] /jobs/genie.gemini/gemini-blueprint-stage-release/workspace/.git
[INFO] [info] 
[INFO] [info] 
[INFO] [info] 
[INFO] [info] 
[INFO] [info] 
[INFO] [info] 
[INFO] [info] 
[INFO] [info] 
[INFO] [info] 
[INFO] [info] 
[INFO] [info] 
[INFO] [info] 
[INFO] [info] 
[INFO] [info] 
[INFO] [info] 
[INFO] [INFO] 
[INFO] [INFO] --- maven-resources-plugin:3.0.2:resources (default-resources) @ simple.service ---
[INFO] [INFO] Using 'UTF-8' encoding to copy filtered resources.
[INFO] [INFO] Copying 3 resources
[INFO] [INFO] 
[INFO] [INFO] --- maven-compiler-plugin:3.6.1:compile (default-compile) @ simple.service ---
[INFO] [INFO] Changes detected - recompiling the module!
[INFO] [INFO] Compiling 4 source files to /jobs/genie.gemini/gemini-blueprint-stage-release/workspace/integration-tests/bundles/simple.service.bundle/target/classes
[INFO] [INFO] 
[INFO] [INFO] --- maven-resources-plugin:3.0.2:testResources (default-testResources) @ simple.service ---
[INFO] [INFO] Using 'UTF-8' encoding to copy filtered resources.
[INFO] [INFO] Copying 0 resource
[INFO] [INFO] 
[INFO] [INFO] --- maven-compiler-plugin:3.6.1:testCompile (default-testCompile) @ simple.service ---
[INFO] [INFO] Nothing to compile - all classes are up to date
[INFO] [INFO] 
[INFO] [INFO] --- maven-surefire-plugin:2.19.1:test (default-test) @ simple.service ---
[INFO] [INFO] Tests are skipped.
[INFO] [INFO] 
[INFO] [INFO] --- maven-site-plugin:3.6:site (site) @ simple.service ---
[INFO] [INFO] maven.site.skip = true: Skipping site generation
[INFO] [INFO] 
[INFO] [INFO] --- maven-jar-plugin:3.0.2:jar (default-jar) @ simple.service ---
[INFO] [INFO] Building jar: /jobs/genie.gemini/gemini-blueprint-stage-release/workspace/integration-tests/bundles/simple.service.bundle/target/simple.service-2.1.0.M1-SNAPSHOT.jar
[INFO] [INFO] 
[INFO] [INFO] --- maven-source-plugin:2.2.1:jar-no-fork (attach-sources) @ simple.service ---
[INFO] [INFO] Skipping source per configuration.
[INFO] [INFO] 
[INFO] [INFO] --- maven-gpg-plugin:1.6:sign (sign-artifacts) @ simple.service ---
[INFO] [INFO]                                                                         
[INFO] [INFO] ------------------------------------------------------------------------
[INFO] [INFO] Building Gemini Blueprint Test Bundle: Simple service test bundle (impl differs) 2.1.0.M1-SNAPSHOT
[INFO] [INFO] ------------------------------------------------------------------------
[INFO] [INFO] 
[INFO] [INFO] --- maven-clean-plugin:3.0.0:clean (default-clean) @ simple.service.identical ---
[INFO] [INFO] 
[INFO] [INFO] --- git-commit-id-plugin:2.1.5:revision (default) @ simple.service.identical ---
[INFO] [info] 
[INFO] [info] /jobs/genie.gemini/gemini-blueprint-stage-release/workspace/.git
[INFO] [info] 
[INFO] [info] 
[INFO] [info] 
[INFO] [info] 
[INFO] [info] 
[INFO] [info] 
[INFO] [info] 
[INFO] [info] 
[INFO] [info] 
[INFO] [info] 
[INFO] [info] 
[INFO] [info] 
[INFO] [info] 
[INFO] [info] 
[INFO] [info] 
[INFO] [INFO] 
[INFO] [INFO] --- maven-resources-plugin:3.0.2:resources (default-resources) @ simple.service.identical ---
[INFO] [INFO] Using 'UTF-8' encoding to copy filtered resources.
[INFO] [INFO] Copying 3 resources
[INFO] [INFO] 
[INFO] [INFO] --- maven-compiler-plugin:3.6.1:compile (default-compile) @ simple.service.identical ---
[INFO] [INFO] Changes detected - recompiling the module!
[INFO] [INFO] Compiling 1 source file to /jobs/genie.gemini/gemini-blueprint-stage-release/workspace/integration-tests/bundles/simple.service.bundle.identical/target/classes
[INFO] [INFO] 
[INFO] [INFO] --- maven-resources-plugin:3.0.2:testResources (default-testResources) @ simple.service.identical ---
[INFO] [INFO] Using 'UTF-8' encoding to copy filtered resources.
[INFO] [INFO] Copying 0 resource
[INFO] [INFO] 
[INFO] [INFO] --- maven-compiler-plugin:3.6.1:testCompile (default-testCompile) @ simple.service.identical ---
[INFO] [INFO] Nothing to compile - all classes are up to date
[INFO] [INFO] 
[INFO] [INFO] --- maven-surefire-plugin:2.19.1:test (default-test) @ simple.service.identical ---
[INFO] [INFO] Tests are skipped.
[INFO] [INFO] 
[INFO] [INFO] --- maven-site-plugin:3.6:site (site) @ simple.service.identical ---
[INFO] [INFO] maven.site.skip = true: Skipping site generation
[INFO] [INFO] 
[INFO] [INFO] --- maven-jar-plugin:3.0.2:jar (default-jar) @ simple.service.identical ---
[INFO] [INFO] Building jar: /jobs/genie.gemini/gemini-blueprint-stage-release/workspace/integration-tests/bundles/simple.service.bundle.identical/target/simple.service.identical-2.1.0.M1-SNAPSHOT.jar
[INFO] [INFO] 
[INFO] [INFO] --- maven-source-plugin:2.2.1:jar-no-fork (attach-sources) @ simple.service.identical ---
[INFO] [INFO] Skipping source per configuration.
[INFO] [INFO] 
[INFO] [INFO] --- maven-gpg-plugin:1.6:sign (sign-artifacts) @ simple.service.identical ---
[INFO] [INFO]                                                                         
[INFO] [INFO] ------------------------------------------------------------------------
[INFO] [INFO] Building Gemini Blueprint Test Bundle: Simple service test bundle (impl differs) 2.1.0.M1-SNAPSHOT
[INFO] [INFO] ------------------------------------------------------------------------
[INFO] [INFO] 
[INFO] [INFO] --- maven-clean-plugin:3.0.0:clean (default-clean) @ simple.service.2.identical ---
[INFO] [INFO] 
[INFO] [INFO] --- git-commit-id-plugin:2.1.5:revision (default) @ simple.service.2.identical ---
[INFO] [info] 
[INFO] [info] /jobs/genie.gemini/gemini-blueprint-stage-release/workspace/.git
[INFO] [info] 
[INFO] [info] 
[INFO] [info] 
[INFO] [info] 
[INFO] [info] 
[INFO] [info] 
[INFO] [info] 
[INFO] [info] 
[INFO] [info] 
[INFO] [info] 
[INFO] [info] 
[INFO] [info] 
[INFO] [info] 
[INFO] [info] 
[INFO] [info] 
[INFO] [INFO] 
[INFO] [INFO] --- maven-resources-plugin:3.0.2:resources (default-resources) @ simple.service.2.identical ---
[INFO] [INFO] Using 'UTF-8' encoding to copy filtered resources.
[INFO] [INFO] Copying 3 resources
[INFO] [INFO] 
[INFO] [INFO] --- maven-compiler-plugin:3.6.1:compile (default-compile) @ simple.service.2.identical ---
[INFO] [INFO] Changes detected - recompiling the module!
[INFO] [INFO] Compiling 1 source file to /jobs/genie.gemini/gemini-blueprint-stage-release/workspace/integration-tests/bundles/simple.service.bundle.2.identical/target/classes
[INFO] [INFO] 
[INFO] [INFO] --- maven-resources-plugin:3.0.2:testResources (default-testResources) @ simple.service.2.identical ---
[INFO] [INFO] Using 'UTF-8' encoding to copy filtered resources.
[INFO] [INFO] Copying 0 resource
[INFO] [INFO] 
[INFO] [INFO] --- maven-compiler-plugin:3.6.1:testCompile (default-testCompile) @ simple.service.2.identical ---
[INFO] [INFO] Nothing to compile - all classes are up to date
[INFO] [INFO] 
[INFO] [INFO] --- maven-surefire-plugin:2.19.1:test (default-test) @ simple.service.2.identical ---
[INFO] [INFO] Tests are skipped.
[INFO] [INFO] 
[INFO] [INFO] --- maven-site-plugin:3.6:site (site) @ simple.service.2.identical ---
[INFO] [INFO] maven.site.skip = true: Skipping site generation
[INFO] [INFO] 
[INFO] [INFO] --- maven-jar-plugin:3.0.2:jar (default-jar) @ simple.service.2.identical ---
[INFO] [INFO] Building jar: /jobs/genie.gemini/gemini-blueprint-stage-release/workspace/integration-tests/bundles/simple.service.bundle.2.identical/target/simple.service.2.identical-2.1.0.M1-SNAPSHOT.jar
[INFO] [INFO] 
[INFO] [INFO] --- maven-source-plugin:2.2.1:jar-no-fork (attach-sources) @ simple.service.2.identical ---
[INFO] [INFO] Skipping source per configuration.
[INFO] [INFO] 
[INFO] [INFO] --- maven-gpg-plugin:1.6:sign (sign-artifacts) @ simple.service.2.identical ---
[INFO] [INFO]                                                                         
[INFO] [INFO] ------------------------------------------------------------------------
[INFO] [INFO] Building Gemini Blueprint Test Bundle: Simple service test bundle 2 2.1.0.M1-SNAPSHOT
[INFO] [INFO] ------------------------------------------------------------------------
[INFO] [INFO] 
[INFO] [INFO] --- maven-clean-plugin:3.0.0:clean (default-clean) @ simple.service2 ---
[INFO] [INFO] 
[INFO] [INFO] --- git-commit-id-plugin:2.1.5:revision (default) @ simple.service2 ---
[INFO] [info] 
[INFO] [info] /jobs/genie.gemini/gemini-blueprint-stage-release/workspace/.git
[INFO] [info] 
[INFO] [info] 
[INFO] [info] 
[INFO] [info] 
[INFO] [info] 
[INFO] [info] 
[INFO] [info] 
[INFO] [info] 
[INFO] [info] 
[INFO] [info] 
[INFO] [info] 
[INFO] [info] 
[INFO] [info] 
[INFO] [info] 
[INFO] [info] 
[INFO] [INFO] 
[INFO] [INFO] --- maven-resources-plugin:3.0.2:resources (default-resources) @ simple.service2 ---
[INFO] [INFO] Using 'UTF-8' encoding to copy filtered resources.
[INFO] [INFO] Copying 3 resources
[INFO] [INFO] 
[INFO] [INFO] --- maven-compiler-plugin:3.6.1:compile (default-compile) @ simple.service2 ---
[INFO] [INFO] No sources to compile
[INFO] [INFO] 
[INFO] [INFO] --- maven-resources-plugin:3.0.2:testResources (default-testResources) @ simple.service2 ---
[INFO] [INFO] Using 'UTF-8' encoding to copy filtered resources.
[INFO] [INFO] skip non existing resourceDirectory /jobs/genie.gemini/gemini-blueprint-stage-release/workspace/integration-tests/bundles/simple.service.2.bundle/src/test/resources
[INFO] [INFO] 
[INFO] [INFO] --- maven-compiler-plugin:3.6.1:testCompile (default-testCompile) @ simple.service2 ---
[INFO] [INFO] No sources to compile
[INFO] [INFO] 
[INFO] [INFO] --- maven-surefire-plugin:2.19.1:test (default-test) @ simple.service2 ---
[INFO] [INFO] Tests are skipped.
[INFO] [INFO] 
[INFO] [INFO] --- maven-site-plugin:3.6:site (site) @ simple.service2 ---
[INFO] [INFO] maven.site.skip = true: Skipping site generation
[INFO] [INFO] 
[INFO] [INFO] --- maven-jar-plugin:3.0.2:jar (default-jar) @ simple.service2 ---
[INFO] [INFO] Building jar: /jobs/genie.gemini/gemini-blueprint-stage-release/workspace/integration-tests/bundles/simple.service.2.bundle/target/simple.service2-2.1.0.M1-SNAPSHOT.jar
[INFO] [INFO] 
[INFO] [INFO] --- maven-source-plugin:2.2.1:jar-no-fork (attach-sources) @ simple.service2 ---
[INFO] [INFO] Skipping source per configuration.
[INFO] [INFO] 
[INFO] [INFO] --- maven-gpg-plugin:1.6:sign (sign-artifacts) @ simple.service2 ---
[INFO] [INFO]                                                                         
[INFO] [INFO] ------------------------------------------------------------------------
[INFO] [INFO] Building Gemini Blueprint Test Bundle: Simple service test bundle 3 2.1.0.M1-SNAPSHOT
[INFO] [INFO] ------------------------------------------------------------------------
[INFO] [INFO] 
[INFO] [INFO] --- maven-clean-plugin:3.0.0:clean (default-clean) @ simple.service3 ---
[INFO] [INFO] 
[INFO] [INFO] --- git-commit-id-plugin:2.1.5:revision (default) @ simple.service3 ---
[INFO] [info] 
[INFO] [info] /jobs/genie.gemini/gemini-blueprint-stage-release/workspace/.git
[INFO] [info] 
[INFO] [info] 
[INFO] [info] 
[INFO] [info] 
[INFO] [info] 
[INFO] [info] 
[INFO] [info] 
[INFO] [info] 
[INFO] [info] 
[INFO] [info] 
[INFO] [info] 
[INFO] [info] 
[INFO] [info] 
[INFO] [info] 
[INFO] [info] 
[INFO] [INFO] 
[INFO] [INFO] --- maven-resources-plugin:3.0.2:resources (default-resources) @ simple.service3 ---
[INFO] [INFO] Using 'UTF-8' encoding to copy filtered resources.
[INFO] [INFO] Copying 3 resources
[INFO] [INFO] 
[INFO] [INFO] --- maven-compiler-plugin:3.6.1:compile (default-compile) @ simple.service3 ---
[INFO] [INFO] No sources to compile
[INFO] [INFO] 
[INFO] [INFO] --- maven-resources-plugin:3.0.2:testResources (default-testResources) @ simple.service3 ---
[INFO] [INFO] Using 'UTF-8' encoding to copy filtered resources.
[INFO] [INFO] skip non existing resourceDirectory /jobs/genie.gemini/gemini-blueprint-stage-release/workspace/integration-tests/bundles/simple.service.3.bundle/src/test/resources
[INFO] [INFO] 
[INFO] [INFO] --- maven-compiler-plugin:3.6.1:testCompile (default-testCompile) @ simple.service3 ---
[INFO] [INFO] No sources to compile
[INFO] [INFO] 
[INFO] [INFO] --- maven-surefire-plugin:2.19.1:test (default-test) @ simple.service3 ---
[INFO] [INFO] Tests are skipped.
[INFO] [INFO] 
[INFO] [INFO] --- maven-site-plugin:3.6:site (site) @ simple.service3 ---
[INFO] [INFO] maven.site.skip = true: Skipping site generation
[INFO] [INFO] 
[INFO] [INFO] --- maven-jar-plugin:3.0.2:jar (default-jar) @ simple.service3 ---
[INFO] [INFO] Building jar: /jobs/genie.gemini/gemini-blueprint-stage-release/workspace/integration-tests/bundles/simple.service.3.bundle/target/simple.service3-2.1.0.M1-SNAPSHOT.jar
[INFO] [INFO] 
[INFO] [INFO] --- maven-source-plugin:2.2.1:jar-no-fork (attach-sources) @ simple.service3 ---
[INFO] [INFO] Skipping source per configuration.
[INFO] [INFO] 
[INFO] [INFO] --- maven-gpg-plugin:1.6:sign (sign-artifacts) @ simple.service3 ---
[INFO] [INFO]                                                                         
[INFO] [INFO] ------------------------------------------------------------------------
[INFO] [INFO] Building Gemini Blueprint Test Bundle: Simple service created by a factory which has a non trivial delay in createObject() 2.1.0.M1-SNAPSHOT
[INFO] [INFO] ------------------------------------------------------------------------
[INFO] [INFO] 
[INFO] [INFO] --- maven-clean-plugin:3.0.0:clean (default-clean) @ dependendencies.factory ---
[INFO] [INFO] 
[INFO] [INFO] --- git-commit-id-plugin:2.1.5:revision (default) @ dependendencies.factory ---
[INFO] [info] 
[INFO] [info] /jobs/genie.gemini/gemini-blueprint-stage-release/workspace/.git
[INFO] [info] 
[INFO] [info] 
[INFO] [info] 
[INFO] [info] 
[INFO] [info] 
[INFO] [info] 
[INFO] [info] 
[INFO] [info] 
[INFO] [info] 
[INFO] [info] 
[INFO] [info] 
[INFO] [info] 
[INFO] [info] 
[INFO] [info] 
[INFO] [info] 
[INFO] [INFO] 
[INFO] [INFO] --- maven-resources-plugin:3.0.2:resources (default-resources) @ dependendencies.factory ---
[INFO] [INFO] Using 'UTF-8' encoding to copy filtered resources.
[INFO] [INFO] Copying 2 resources
[INFO] [INFO] 
[INFO] [INFO] --- maven-compiler-plugin:3.6.1:compile (default-compile) @ dependendencies.factory ---
[INFO] [INFO] Changes detected - recompiling the module!
[INFO] [INFO] Compiling 4 source files to /jobs/genie.gemini/gemini-blueprint-stage-release/workspace/integration-tests/bundles/dependency.factory.bundle/target/classes
[INFO] [INFO] 
[INFO] [INFO] --- maven-resources-plugin:3.0.2:testResources (default-testResources) @ dependendencies.factory ---
[INFO] [INFO] Using 'UTF-8' encoding to copy filtered resources.
[INFO] [INFO] skip non existing resourceDirectory /jobs/genie.gemini/gemini-blueprint-stage-release/workspace/integration-tests/bundles/dependency.factory.bundle/src/test/resources
[INFO] [INFO] 
[INFO] [INFO] --- maven-compiler-plugin:3.6.1:testCompile (default-testCompile) @ dependendencies.factory ---
[INFO] [INFO] No sources to compile
[INFO] [INFO] 
[INFO] [INFO] --- maven-surefire-plugin:2.19.1:test (default-test) @ dependendencies.factory ---
[INFO] [INFO] Tests are skipped.
[INFO] [INFO] 
[INFO] [INFO] --- maven-site-plugin:3.6:site (site) @ dependendencies.factory ---
[INFO] [INFO] maven.site.skip = true: Skipping site generation
[INFO] [INFO] 
[INFO] [INFO] --- maven-jar-plugin:3.0.2:jar (default-jar) @ dependendencies.factory ---
[INFO] [INFO] Building jar: /jobs/genie.gemini/gemini-blueprint-stage-release/workspace/integration-tests/bundles/dependency.factory.bundle/target/dependendencies.factory-2.1.0.M1-SNAPSHOT.jar
[INFO] [INFO] 
[INFO] [INFO] --- maven-source-plugin:2.2.1:jar-no-fork (attach-sources) @ dependendencies.factory ---
[INFO] [INFO] Skipping source per configuration.
[INFO] [INFO] 
[INFO] [INFO] --- maven-gpg-plugin:1.6:sign (sign-artifacts) @ dependendencies.factory ---
[INFO] [INFO]                                                                         
[INFO] [INFO] ------------------------------------------------------------------------
[INFO] [INFO] Building Gemini Blueprint Test Bundle: Trivial OSGi bundle 2.1.0.M1-SNAPSHOT
[INFO] [INFO] ------------------------------------------------------------------------
[INFO] [INFO] 
[INFO] [INFO] --- maven-clean-plugin:3.0.0:clean (default-clean) @ trivial ---
[INFO] [INFO] 
[INFO] [INFO] --- git-commit-id-plugin:2.1.5:revision (default) @ trivial ---
[INFO] [info] 
[INFO] [info] /jobs/genie.gemini/gemini-blueprint-stage-release/workspace/.git
[INFO] [info] 
[INFO] [info] 
[INFO] [info] 
[INFO] [info] 
[INFO] [info] 
[INFO] [info] 
[INFO] [info] 
[INFO] [info] 
[INFO] [info] 
[INFO] [info] 
[INFO] [info] 
[INFO] [info] 
[INFO] [info] 
[INFO] [info] 
[INFO] [info] 
[INFO] [INFO] 
[INFO] [INFO] --- maven-resources-plugin:3.0.2:resources (default-resources) @ trivial ---
[INFO] [INFO] Using 'UTF-8' encoding to copy filtered resources.
[INFO] [INFO] Copying 1 resource
[INFO] [INFO] 
[INFO] [INFO] --- maven-compiler-plugin:3.6.1:compile (default-compile) @ trivial ---
[INFO] [INFO] Changes detected - recompiling the module!
[INFO] [INFO] Compiling 1 source file to /jobs/genie.gemini/gemini-blueprint-stage-release/workspace/integration-tests/bundles/trivial.bundle/target/classes
[INFO] [INFO] 
[INFO] [INFO] --- maven-resources-plugin:3.0.2:testResources (default-testResources) @ trivial ---
[INFO] [INFO] Using 'UTF-8' encoding to copy filtered resources.
[INFO] [INFO] Copying 0 resource
[INFO] [INFO] 
[INFO] [INFO] --- maven-compiler-plugin:3.6.1:testCompile (default-testCompile) @ trivial ---
[INFO] [INFO] Nothing to compile - all classes are up to date
[INFO] [INFO] 
[INFO] [INFO] --- maven-surefire-plugin:2.19.1:test (default-test) @ trivial ---
[INFO] [INFO] Tests are skipped.
[INFO] [INFO] 
[INFO] [INFO] --- maven-site-plugin:3.6:site (site) @ trivial ---
[INFO] [INFO] maven.site.skip = true: Skipping site generation
[INFO] [INFO] 
[INFO] [INFO] --- maven-jar-plugin:3.0.2:jar (default-jar) @ trivial ---
[INFO] [INFO] Building jar: /jobs/genie.gemini/gemini-blueprint-stage-release/workspace/integration-tests/bundles/trivial.bundle/target/trivial-2.1.0.M1-SNAPSHOT.jar
[INFO] [INFO] 
[INFO] [INFO] --- maven-source-plugin:2.2.1:jar-no-fork (attach-sources) @ trivial ---
[INFO] [INFO] Skipping source per configuration.
[INFO] [INFO] 
[INFO] [INFO] --- maven-gpg-plugin:1.6:sign (sign-artifacts) @ trivial ---
[INFO] [INFO]                                                                         
[INFO] [INFO] ------------------------------------------------------------------------
[INFO] [INFO] Building Gemini Blueprint Test Bundle: Simple test that uses trivial bundle 2.1.0.M1-SNAPSHOT
[INFO] [INFO] ------------------------------------------------------------------------
[INFO] [INFO] 
[INFO] [INFO] --- maven-clean-plugin:3.0.0:clean (default-clean) @ trivial.tests ---
[INFO] [INFO] 
[INFO] [INFO] --- git-commit-id-plugin:2.1.5:revision (default) @ trivial.tests ---
[INFO] [info] 
[INFO] [info] /jobs/genie.gemini/gemini-blueprint-stage-release/workspace/.git
[INFO] [info] 
[INFO] [info] 
[INFO] [info] 
[INFO] [info] 
[INFO] [info] 
[INFO] [info] 
[INFO] [info] 
[INFO] [info] 
[INFO] [info] 
[INFO] [info] 
[INFO] [info] 
[INFO] [info] 
[INFO] [info] 
[INFO] [info] 
[INFO] [info] 
[INFO] [INFO] 
[INFO] [INFO] --- maven-resources-plugin:3.0.2:resources (default-resources) @ trivial.tests ---
[INFO] [INFO] Using 'UTF-8' encoding to copy filtered resources.
[INFO] [INFO] Copying 1 resource
[INFO] [INFO] 
[INFO] [INFO] --- maven-compiler-plugin:3.6.1:compile (default-compile) @ trivial.tests ---
[INFO] [INFO] Changes detected - recompiling the module!
[INFO] [INFO] Compiling 1 source file to /jobs/genie.gemini/gemini-blueprint-stage-release/workspace/integration-tests/bundles/trivial.test.bundle/target/classes
[INFO] [INFO] 
[INFO] [INFO] --- maven-resources-plugin:3.0.2:testResources (default-testResources) @ trivial.tests ---
[INFO] [INFO] Using 'UTF-8' encoding to copy filtered resources.
[INFO] [INFO] Copying 0 resource
[INFO] [INFO] 
[INFO] [INFO] --- maven-compiler-plugin:3.6.1:testCompile (default-testCompile) @ trivial.tests ---
[INFO] [INFO] Nothing to compile - all classes are up to date
[INFO] [INFO] 
[INFO] [INFO] --- maven-surefire-plugin:2.19.1:test (default-test) @ trivial.tests ---
[INFO] [INFO] Tests are skipped.
[INFO] [INFO] 
[INFO] [INFO] --- maven-site-plugin:3.6:site (site) @ trivial.tests ---
[INFO] [INFO] maven.site.skip = true: Skipping site generation
[INFO] [INFO] 
[INFO] [INFO] --- maven-jar-plugin:3.0.2:jar (default-jar) @ trivial.tests ---
[INFO] [INFO] Building jar: /jobs/genie.gemini/gemini-blueprint-stage-release/workspace/integration-tests/bundles/trivial.test.bundle/target/trivial.tests-2.1.0.M1-SNAPSHOT.jar
[INFO] [INFO] 
[INFO] [INFO] --- maven-source-plugin:2.2.1:jar-no-fork (attach-sources) @ trivial.tests ---
[INFO] [INFO] Skipping source per configuration.
[INFO] [INFO] 
[INFO] [INFO] --- maven-gpg-plugin:1.6:sign (sign-artifacts) @ trivial.tests ---
[INFO] [INFO]                                                                         
[INFO] [INFO] ------------------------------------------------------------------------
[INFO] [INFO] Building Gemini Blueprint Test Bundle: Spring context lifecycle test bundle 2.1.0.M1-SNAPSHOT
[INFO] [INFO] ------------------------------------------------------------------------
[INFO] [INFO] 
[INFO] [INFO] --- maven-clean-plugin:3.0.0:clean (default-clean) @ lifecycle ---
[INFO] [INFO] 
[INFO] [INFO] --- git-commit-id-plugin:2.1.5:revision (default) @ lifecycle ---
[INFO] [info] 
[INFO] [info] /jobs/genie.gemini/gemini-blueprint-stage-release/workspace/.git
[INFO] [info] 
[INFO] [info] 
[INFO] [info] 
[INFO] [info] 
[INFO] [info] 
[INFO] [info] 
[INFO] [info] 
[INFO] [info] 
[INFO] [info] 
[INFO] [info] 
[INFO] [info] 
[INFO] [info] 
[INFO] [info] 
[INFO] [info] 
[INFO] [info] 
[INFO] [INFO] 
[INFO] [INFO] --- maven-resources-plugin:3.0.2:resources (default-resources) @ lifecycle ---
[INFO] [INFO] Using 'UTF-8' encoding to copy filtered resources.
[INFO] [INFO] Copying 2 resources
[INFO] [INFO] 
[INFO] [INFO] --- maven-compiler-plugin:3.6.1:compile (default-compile) @ lifecycle ---
[INFO] [INFO] Changes detected - recompiling the module!
[INFO] [INFO] Compiling 1 source file to /jobs/genie.gemini/gemini-blueprint-stage-release/workspace/integration-tests/bundles/lifecycle.test.bundle/target/classes
[INFO] [INFO] 
[INFO] [INFO] --- maven-resources-plugin:3.0.2:testResources (default-testResources) @ lifecycle ---
[INFO] [INFO] Using 'UTF-8' encoding to copy filtered resources.
[INFO] [INFO] skip non existing resourceDirectory /jobs/genie.gemini/gemini-blueprint-stage-release/workspace/integration-tests/bundles/lifecycle.test.bundle/src/test/resources
[INFO] [INFO] 
[INFO] [INFO] --- maven-compiler-plugin:3.6.1:testCompile (default-testCompile) @ lifecycle ---
[INFO] [INFO] No sources to compile
[INFO] [INFO] 
[INFO] [INFO] --- maven-surefire-plugin:2.19.1:test (default-test) @ lifecycle ---
[INFO] [INFO] Tests are skipped.
[INFO] [INFO] 
[INFO] [INFO] --- maven-site-plugin:3.6:site (site) @ lifecycle ---
[INFO] [INFO] maven.site.skip = true: Skipping site generation
[INFO] [INFO] 
[INFO] [INFO] --- maven-jar-plugin:3.0.2:jar (default-jar) @ lifecycle ---
[INFO] [INFO] Building jar: /jobs/genie.gemini/gemini-blueprint-stage-release/workspace/integration-tests/bundles/lifecycle.test.bundle/target/lifecycle-2.1.0.M1-SNAPSHOT.jar
[INFO] [INFO] 
[INFO] [INFO] --- maven-source-plugin:2.2.1:jar-no-fork (attach-sources) @ lifecycle ---
[INFO] [INFO] Skipping source per configuration.
[INFO] [INFO] 
[INFO] [INFO] --- maven-gpg-plugin:1.6:sign (sign-artifacts) @ lifecycle ---
[INFO] [INFO]                                                                         
[INFO] [INFO] ------------------------------------------------------------------------
[INFO] [INFO] Building Gemini Blueprint Test Bundle: Spring context service listener test bundle 2.1.0.M1-SNAPSHOT
[INFO] [INFO] ------------------------------------------------------------------------
[INFO] [INFO] 
[INFO] [INFO] --- maven-clean-plugin:3.0.0:clean (default-clean) @ service.listener ---
[INFO] [INFO] 
[INFO] [INFO] --- git-commit-id-plugin:2.1.5:revision (default) @ service.listener ---
[INFO] [info] 
[INFO] [info] /jobs/genie.gemini/gemini-blueprint-stage-release/workspace/.git
[INFO] [info] 
[INFO] [info] 
[INFO] [info] 
[INFO] [info] 
[INFO] [info] 
[INFO] [info] 
[INFO] [info] 
[INFO] [info] 
[INFO] [info] 
[INFO] [info] 
[INFO] [info] 
[INFO] [info] 
[INFO] [info] 
[INFO] [info] 
[INFO] [info] 
[INFO] [INFO] 
[INFO] [INFO] --- maven-resources-plugin:3.0.2:resources (default-resources) @ service.listener ---
[INFO] [INFO] Using 'UTF-8' encoding to copy filtered resources.
[INFO] [INFO] Copying 2 resources
[INFO] [INFO] 
[INFO] [INFO] --- maven-compiler-plugin:3.6.1:compile (default-compile) @ service.listener ---
[INFO] [INFO] Changes detected - recompiling the module!
[INFO] [INFO] Compiling 1 source file to /jobs/genie.gemini/gemini-blueprint-stage-release/workspace/integration-tests/bundles/service.listener.bundle/target/classes
[INFO] [INFO] 
[INFO] [INFO] --- maven-resources-plugin:3.0.2:testResources (default-testResources) @ service.listener ---
[INFO] [INFO] Using 'UTF-8' encoding to copy filtered resources.
[INFO] [INFO] skip non existing resourceDirectory /jobs/genie.gemini/gemini-blueprint-stage-release/workspace/integration-tests/bundles/service.listener.bundle/src/test/resources
[INFO] [INFO] 
[INFO] [INFO] --- maven-compiler-plugin:3.6.1:testCompile (default-testCompile) @ service.listener ---
[INFO] [INFO] No sources to compile
[INFO] [INFO] 
[INFO] [INFO] --- maven-surefire-plugin:2.19.1:test (default-test) @ service.listener ---
[INFO] [INFO] Tests are skipped.
[INFO] [INFO] 
[INFO] [INFO] --- maven-site-plugin:3.6:site (site) @ service.listener ---
[INFO] [INFO] maven.site.skip = true: Skipping site generation
[INFO] [INFO] 
[INFO] [INFO] --- maven-jar-plugin:3.0.2:jar (default-jar) @ service.listener ---
[INFO] [INFO] Building jar: /jobs/genie.gemini/gemini-blueprint-stage-release/workspace/integration-tests/bundles/service.listener.bundle/target/service.listener-2.1.0.M1-SNAPSHOT.jar
[INFO] [INFO] 
[INFO] [INFO] --- maven-source-plugin:2.2.1:jar-no-fork (attach-sources) @ service.listener ---
[INFO] [INFO] Skipping source per configuration.
[INFO] [INFO] 
[INFO] [INFO] --- maven-gpg-plugin:1.6:sign (sign-artifacts) @ service.listener ---
[INFO] [INFO]                                                                         
[INFO] [INFO] ------------------------------------------------------------------------
[INFO] [INFO] Building Gemini Blueprint Test Bundle: Spring context service reference lifecycle test bundle 2.1.0.M1-SNAPSHOT
[INFO] [INFO] ------------------------------------------------------------------------
[INFO] [INFO] 
[INFO] [INFO] --- maven-clean-plugin:3.0.0:clean (default-clean) @ reference.proxy ---
[INFO] [INFO] 
[INFO] [INFO] --- git-commit-id-plugin:2.1.5:revision (default) @ reference.proxy ---
[INFO] [info] 
[INFO] [info] /jobs/genie.gemini/gemini-blueprint-stage-release/workspace/.git
[INFO] [info] 
[INFO] [info] 
[INFO] [info] 
[INFO] [info] 
[INFO] [info] 
[INFO] [info] 
[INFO] [info] 
[INFO] [info] 
[INFO] [info] 
[INFO] [info] 
[INFO] [info] 
[INFO] [info] 
[INFO] [info] 
[INFO] [info] 
[INFO] [info] 
[INFO] [INFO] 
[INFO] [INFO] --- maven-resources-plugin:3.0.2:resources (default-resources) @ reference.proxy ---
[INFO] [INFO] Using 'UTF-8' encoding to copy filtered resources.
[INFO] [INFO] Copying 2 resources
[INFO] [INFO] 
[INFO] [INFO] --- maven-compiler-plugin:3.6.1:compile (default-compile) @ reference.proxy ---
[INFO] [INFO] Changes detected - recompiling the module!
[INFO] [INFO] Compiling 1 source file to /jobs/genie.gemini/gemini-blueprint-stage-release/workspace/integration-tests/bundles/reference.test.bundle/target/classes
[INFO] [INFO] 
[INFO] [INFO] --- maven-resources-plugin:3.0.2:testResources (default-testResources) @ reference.proxy ---
[INFO] [INFO] Using 'UTF-8' encoding to copy filtered resources.
[INFO] [INFO] skip non existing resourceDirectory /jobs/genie.gemini/gemini-blueprint-stage-release/workspace/integration-tests/bundles/reference.test.bundle/src/test/resources
[INFO] [INFO] 
[INFO] [INFO] --- maven-compiler-plugin:3.6.1:testCompile (default-testCompile) @ reference.proxy ---
[INFO] [INFO] No sources to compile
[INFO] [INFO] 
[INFO] [INFO] --- maven-surefire-plugin:2.19.1:test (default-test) @ reference.proxy ---
[INFO] [INFO] Tests are skipped.
[INFO] [INFO] 
[INFO] [INFO] --- maven-site-plugin:3.6:site (site) @ reference.proxy ---
[INFO] [INFO] maven.site.skip = true: Skipping site generation
[INFO] [INFO] 
[INFO] [INFO] --- maven-jar-plugin:3.0.2:jar (default-jar) @ reference.proxy ---
[INFO] [INFO] Building jar: /jobs/genie.gemini/gemini-blueprint-stage-release/workspace/integration-tests/bundles/reference.test.bundle/target/reference.proxy-2.1.0.M1-SNAPSHOT.jar
[INFO] [INFO] 
[INFO] [INFO] --- maven-source-plugin:2.2.1:jar-no-fork (attach-sources) @ reference.proxy ---
[INFO] [INFO] Skipping source per configuration.
[INFO] [INFO] 
[INFO] [INFO] --- maven-gpg-plugin:1.6:sign (sign-artifacts) @ reference.proxy ---
[INFO] [INFO]                                                                         
[INFO] [INFO] ------------------------------------------------------------------------
[INFO] [INFO] Building Gemini Blueprint Test Bundle: Spring context service reference destruction test bundle 2.1.0.M1-SNAPSHOT
[INFO] [INFO] ------------------------------------------------------------------------
[INFO] [INFO] 
[INFO] [INFO] --- maven-clean-plugin:3.0.0:clean (default-clean) @ proxy.destruction ---
[INFO] [INFO] 
[INFO] [INFO] --- git-commit-id-plugin:2.1.5:revision (default) @ proxy.destruction ---
[INFO] [info] 
[INFO] [info] /jobs/genie.gemini/gemini-blueprint-stage-release/workspace/.git
[INFO] [info] 
[INFO] [info] 
[INFO] [info] 
[INFO] [info] 
[INFO] [info] 
[INFO] [info] 
[INFO] [info] 
[INFO] [info] 
[INFO] [info] 
[INFO] [info] 
[INFO] [info] 
[INFO] [info] 
[INFO] [info] 
[INFO] [info] 
[INFO] [info] 
[INFO] [INFO] 
[INFO] [INFO] --- maven-resources-plugin:3.0.2:resources (default-resources) @ proxy.destruction ---
[INFO] [INFO] Using 'UTF-8' encoding to copy filtered resources.
[INFO] [INFO] Copying 2 resources
[INFO] [INFO] 
[INFO] [INFO] --- maven-compiler-plugin:3.6.1:compile (default-compile) @ proxy.destruction ---
[INFO] [INFO] Changes detected - recompiling the module!
[INFO] [INFO] Compiling 1 source file to /jobs/genie.gemini/gemini-blueprint-stage-release/workspace/integration-tests/bundles/proxy.destruction.test.bundle/target/classes
[INFO] [INFO] 
[INFO] [INFO] --- maven-resources-plugin:3.0.2:testResources (default-testResources) @ proxy.destruction ---
[INFO] [INFO] Using 'UTF-8' encoding to copy filtered resources.
[INFO] [INFO] skip non existing resourceDirectory /jobs/genie.gemini/gemini-blueprint-stage-release/workspace/integration-tests/bundles/proxy.destruction.test.bundle/src/test/resources
[INFO] [INFO] 
[INFO] [INFO] --- maven-compiler-plugin:3.6.1:testCompile (default-testCompile) @ proxy.destruction ---
[INFO] [INFO] No sources to compile
[INFO] [INFO] 
[INFO] [INFO] --- maven-surefire-plugin:2.19.1:test (default-test) @ proxy.destruction ---
[INFO] [INFO] Tests are skipped.
[INFO] [INFO] 
[INFO] [INFO] --- maven-site-plugin:3.6:site (site) @ proxy.destruction ---
[INFO] [INFO] maven.site.skip = true: Skipping site generation
[INFO] [INFO] 
[INFO] [INFO] --- maven-jar-plugin:3.0.2:jar (default-jar) @ proxy.destruction ---
[INFO] [INFO] Building jar: /jobs/genie.gemini/gemini-blueprint-stage-release/workspace/integration-tests/bundles/proxy.destruction.test.bundle/target/proxy.destruction-2.1.0.M1-SNAPSHOT.jar
[INFO] [INFO] 
[INFO] [INFO] --- maven-source-plugin:2.2.1:jar-no-fork (attach-sources) @ proxy.destruction ---
[INFO] [INFO] Skipping source per configuration.
[INFO] [INFO] 
[INFO] [INFO] --- maven-gpg-plugin:1.6:sign (sign-artifacts) @ proxy.destruction ---
[INFO] [INFO]                                                                         
[INFO] [INFO] ------------------------------------------------------------------------
[INFO] [INFO] Building Gemini Blueprint Test Bundle: Spring context dependencies test bundle 2.1.0.M1-SNAPSHOT
[INFO] [INFO] ------------------------------------------------------------------------
[INFO] [INFO] 
[INFO] [INFO] --- maven-clean-plugin:3.0.0:clean (default-clean) @ dependencies ---
[INFO] [INFO] 
[INFO] [INFO] --- git-commit-id-plugin:2.1.5:revision (default) @ dependencies ---
[INFO] [info] 
[INFO] [info] /jobs/genie.gemini/gemini-blueprint-stage-release/workspace/.git
[INFO] [info] 
[INFO] [info] 
[INFO] [info] 
[INFO] [info] 
[INFO] [info] 
[INFO] [info] 
[INFO] [info] 
[INFO] [info] 
[INFO] [info] 
[INFO] [info] 
[INFO] [info] 
[INFO] [info] 
[INFO] [info] 
[INFO] [info] 
[INFO] [info] 
[INFO] [INFO] 
[INFO] [INFO] --- maven-resources-plugin:3.0.2:resources (default-resources) @ dependencies ---
[INFO] [INFO] Using 'UTF-8' encoding to copy filtered resources.
[INFO] [INFO] Copying 2 resources
[INFO] [INFO] 
[INFO] [INFO] --- maven-compiler-plugin:3.6.1:compile (default-compile) @ dependencies ---
[INFO] [INFO] Changes detected - recompiling the module!
[INFO] [INFO] Compiling 2 source files to /jobs/genie.gemini/gemini-blueprint-stage-release/workspace/integration-tests/bundles/dependency.test.bundle/target/classes
[INFO] [INFO] 
[INFO] [INFO] --- maven-resources-plugin:3.0.2:testResources (default-testResources) @ dependencies ---
[INFO] [INFO] Using 'UTF-8' encoding to copy filtered resources.
[INFO] [INFO] skip non existing resourceDirectory /jobs/genie.gemini/gemini-blueprint-stage-release/workspace/integration-tests/bundles/dependency.test.bundle/src/test/resources
[INFO] [INFO] 
[INFO] [INFO] --- maven-compiler-plugin:3.6.1:testCompile (default-testCompile) @ dependencies ---
[INFO] [INFO] No sources to compile
[INFO] [INFO] 
[INFO] [INFO] --- maven-surefire-plugin:2.19.1:test (default-test) @ dependencies ---
[INFO] [INFO] Tests are skipped.
[INFO] [INFO] 
[INFO] [INFO] --- maven-site-plugin:3.6:site (site) @ dependencies ---
[INFO] [INFO] maven.site.skip = true: Skipping site generation
[INFO] [INFO] 
[INFO] [INFO] --- maven-jar-plugin:3.0.2:jar (default-jar) @ dependencies ---
[INFO] [INFO] Building jar: /jobs/genie.gemini/gemini-blueprint-stage-release/workspace/integration-tests/bundles/dependency.test.bundle/target/dependencies-2.1.0.M1-SNAPSHOT.jar
[INFO] [INFO] 
[INFO] [INFO] --- maven-source-plugin:2.2.1:jar-no-fork (attach-sources) @ dependencies ---
[INFO] [INFO] Skipping source per configuration.
[INFO] [INFO] 
[INFO] [INFO] --- maven-gpg-plugin:1.6:sign (sign-artifacts) @ dependencies ---
[INFO] [INFO]                                                                         
[INFO] [INFO] ------------------------------------------------------------------------
[INFO] [INFO] Building Gemini Blueprint Test Bundle: Spring context service reference cardinality 0..1 bundle 2.1.0.M1-SNAPSHOT
[INFO] [INFO] ------------------------------------------------------------------------
[INFO] [INFO] 
[INFO] [INFO] --- maven-clean-plugin:3.0.0:clean (default-clean) @ cardinality0to1 ---
[INFO] [INFO] 
[INFO] [INFO] --- git-commit-id-plugin:2.1.5:revision (default) @ cardinality0to1 ---
[INFO] [info] 
[INFO] [info] /jobs/genie.gemini/gemini-blueprint-stage-release/workspace/.git
[INFO] [info] 
[INFO] [info] 
[INFO] [info] 
[INFO] [info] 
[INFO] [info] 
[INFO] [info] 
[INFO] [info] 
[INFO] [info] 
[INFO] [info] 
[INFO] [info] 
[INFO] [info] 
[INFO] [info] 
[INFO] [info] 
[INFO] [info] 
[INFO] [info] 
[INFO] [INFO] 
[INFO] [INFO] --- maven-resources-plugin:3.0.2:resources (default-resources) @ cardinality0to1 ---
[INFO] [INFO] Using 'UTF-8' encoding to copy filtered resources.
[INFO] [INFO] Copying 2 resources
[INFO] [INFO] 
[INFO] [INFO] --- maven-compiler-plugin:3.6.1:compile (default-compile) @ cardinality0to1 ---
[INFO] [INFO] Changes detected - recompiling the module!
[INFO] [INFO] Compiling 2 source files to /jobs/genie.gemini/gemini-blueprint-stage-release/workspace/integration-tests/bundles/cardinality.0to1.bundle/target/classes
[INFO] [INFO] 
[INFO] [INFO] --- maven-resources-plugin:3.0.2:testResources (default-testResources) @ cardinality0to1 ---
[INFO] [INFO] Using 'UTF-8' encoding to copy filtered resources.
[INFO] [INFO] skip non existing resourceDirectory /jobs/genie.gemini/gemini-blueprint-stage-release/workspace/integration-tests/bundles/cardinality.0to1.bundle/src/test/resources
[INFO] [INFO] 
[INFO] [INFO] --- maven-compiler-plugin:3.6.1:testCompile (default-testCompile) @ cardinality0to1 ---
[INFO] [INFO] No sources to compile
[INFO] [INFO] 
[INFO] [INFO] --- maven-surefire-plugin:2.19.1:test (default-test) @ cardinality0to1 ---
[INFO] [INFO] Tests are skipped.
[INFO] [INFO] 
[INFO] [INFO] --- maven-site-plugin:3.6:site (site) @ cardinality0to1 ---
[INFO] [INFO] maven.site.skip = true: Skipping site generation
[INFO] [INFO] 
[INFO] [INFO] --- maven-jar-plugin:3.0.2:jar (default-jar) @ cardinality0to1 ---
[INFO] [INFO] Building jar: /jobs/genie.gemini/gemini-blueprint-stage-release/workspace/integration-tests/bundles/cardinality.0to1.bundle/target/cardinality0to1-2.1.0.M1-SNAPSHOT.jar
[INFO] [INFO] 
[INFO] [INFO] --- maven-source-plugin:2.2.1:jar-no-fork (attach-sources) @ cardinality0to1 ---
[INFO] [INFO] Skipping source per configuration.
[INFO] [INFO] 
[INFO] [INFO] --- maven-gpg-plugin:1.6:sign (sign-artifacts) @ cardinality0to1 ---
[INFO] [INFO]                                                                         
[INFO] [INFO] ------------------------------------------------------------------------
[INFO] [INFO] Building Gemini Blueprint Test Bundle: Bundle scoping test bundle - A 2.1.0.M1-SNAPSHOT
[INFO] [INFO] ------------------------------------------------------------------------
[INFO] [INFO] 
[INFO] [INFO] --- maven-clean-plugin:3.0.0:clean (default-clean) @ scoped.bundle.a ---
[INFO] [INFO] 
[INFO] [INFO] --- git-commit-id-plugin:2.1.5:revision (default) @ scoped.bundle.a ---
[INFO] [info] 
[INFO] [info] /jobs/genie.gemini/gemini-blueprint-stage-release/workspace/.git
[INFO] [info] 
[INFO] [info] 
[INFO] [info] 
[INFO] [info] 
[INFO] [info] 
[INFO] [info] 
[INFO] [info] 
[INFO] [info] 
[INFO] [info] 
[INFO] [info] 
[INFO] [info] 
[INFO] [info] 
[INFO] [info] 
[INFO] [info] 
[INFO] [info] 
[INFO] [INFO] 
[INFO] [INFO] --- maven-resources-plugin:3.0.2:resources (default-resources) @ scoped.bundle.a ---
[INFO] [INFO] Using 'UTF-8' encoding to copy filtered resources.
[INFO] [INFO] Copying 2 resources
[INFO] [INFO] 
[INFO] [INFO] --- maven-compiler-plugin:3.6.1:compile (default-compile) @ scoped.bundle.a ---
[INFO] [INFO] Changes detected - recompiling the module!
[INFO] [INFO] Compiling 1 source file to /jobs/genie.gemini/gemini-blueprint-stage-release/workspace/integration-tests/bundles/scoped.a.bundle/target/classes
[INFO] [INFO] 
[INFO] [INFO] --- maven-resources-plugin:3.0.2:testResources (default-testResources) @ scoped.bundle.a ---
[INFO] [INFO] Using 'UTF-8' encoding to copy filtered resources.
[INFO] [INFO] skip non existing resourceDirectory /jobs/genie.gemini/gemini-blueprint-stage-release/workspace/integration-tests/bundles/scoped.a.bundle/src/test/resources
[INFO] [INFO] 
[INFO] [INFO] --- maven-compiler-plugin:3.6.1:testCompile (default-testCompile) @ scoped.bundle.a ---
[INFO] [INFO] No sources to compile
[INFO] [INFO] 
[INFO] [INFO] --- maven-surefire-plugin:2.19.1:test (default-test) @ scoped.bundle.a ---
[INFO] [INFO] Tests are skipped.
[INFO] [INFO] 
[INFO] [INFO] --- maven-site-plugin:3.6:site (site) @ scoped.bundle.a ---
[INFO] [INFO] maven.site.skip = true: Skipping site generation
[INFO] [INFO] 
[INFO] [INFO] --- maven-jar-plugin:3.0.2:jar (default-jar) @ scoped.bundle.a ---
[INFO] [INFO] Building jar: /jobs/genie.gemini/gemini-blueprint-stage-release/workspace/integration-tests/bundles/scoped.a.bundle/target/scoped.bundle.a-2.1.0.M1-SNAPSHOT.jar
[INFO] [INFO] 
[INFO] [INFO] --- maven-source-plugin:2.2.1:jar-no-fork (attach-sources) @ scoped.bundle.a ---
[INFO] [INFO] Skipping source per configuration.
[INFO] [INFO] 
[INFO] [INFO] --- maven-gpg-plugin:1.6:sign (sign-artifacts) @ scoped.bundle.a ---
[INFO] [INFO]                                                                         
[INFO] [INFO] ------------------------------------------------------------------------
[INFO] [INFO] Building Gemini Blueprint Test Bundle: Bundle scoping test bundle - B 2.1.0.M1-SNAPSHOT
[INFO] [INFO] ------------------------------------------------------------------------
[INFO] [INFO] 
[INFO] [INFO] --- maven-clean-plugin:3.0.0:clean (default-clean) @ scoped.bundle.b ---
[INFO] [INFO] 
[INFO] [INFO] --- git-commit-id-plugin:2.1.5:revision (default) @ scoped.bundle.b ---
[INFO] [info] 
[INFO] [info] /jobs/genie.gemini/gemini-blueprint-stage-release/workspace/.git
[INFO] [info] 
[INFO] [info] 
[INFO] [info] 
[INFO] [info] 
[INFO] [info] 
[INFO] [info] 
[INFO] [info] 
[INFO] [info] 
[INFO] [info] 
[INFO] [info] 
[INFO] [info] 
[INFO] [info] 
[INFO] [info] 
[INFO] [info] 
[INFO] [info] 
[INFO] [INFO] 
[INFO] [INFO] --- maven-resources-plugin:3.0.2:resources (default-resources) @ scoped.bundle.b ---
[INFO] [INFO] Using 'UTF-8' encoding to copy filtered resources.
[INFO] [INFO] Copying 2 resources
[INFO] [INFO] 
[INFO] [INFO] --- maven-compiler-plugin:3.6.1:compile (default-compile) @ scoped.bundle.b ---
[INFO] [INFO] Changes detected - recompiling the module!
[INFO] [INFO] Compiling 1 source file to /jobs/genie.gemini/gemini-blueprint-stage-release/workspace/integration-tests/bundles/scoped.b.bundle/target/classes
[INFO] [INFO] 
[INFO] [INFO] --- maven-resources-plugin:3.0.2:testResources (default-testResources) @ scoped.bundle.b ---
[INFO] [INFO] Using 'UTF-8' encoding to copy filtered resources.
[INFO] [INFO] skip non existing resourceDirectory /jobs/genie.gemini/gemini-blueprint-stage-release/workspace/integration-tests/bundles/scoped.b.bundle/src/test/resources
[INFO] [INFO] 
[INFO] [INFO] --- maven-compiler-plugin:3.6.1:testCompile (default-testCompile) @ scoped.bundle.b ---
[INFO] [INFO] No sources to compile
[INFO] [INFO] 
[INFO] [INFO] --- maven-surefire-plugin:2.19.1:test (default-test) @ scoped.bundle.b ---
[INFO] [INFO] Tests are skipped.
[INFO] [INFO] 
[INFO] [INFO] --- maven-site-plugin:3.6:site (site) @ scoped.bundle.b ---
[INFO] [INFO] maven.site.skip = true: Skipping site generation
[INFO] [INFO] 
[INFO] [INFO] --- maven-jar-plugin:3.0.2:jar (default-jar) @ scoped.bundle.b ---
[INFO] [INFO] Building jar: /jobs/genie.gemini/gemini-blueprint-stage-release/workspace/integration-tests/bundles/scoped.b.bundle/target/scoped.bundle.b-2.1.0.M1-SNAPSHOT.jar
[INFO] [INFO] 
[INFO] [INFO] --- maven-source-plugin:2.2.1:jar-no-fork (attach-sources) @ scoped.bundle.b ---
[INFO] [INFO] Skipping source per configuration.
[INFO] [INFO] 
[INFO] [INFO] --- maven-gpg-plugin:1.6:sign (sign-artifacts) @ scoped.bundle.b ---
[INFO] [INFO]                                                                         
[INFO] [INFO] ------------------------------------------------------------------------
[INFO] [INFO] Building Gemini Blueprint Test Bundle: Bundle scoping test bundle - Common 2.1.0.M1-SNAPSHOT
[INFO] [INFO] ------------------------------------------------------------------------
[INFO] [INFO] 
[INFO] [INFO] --- maven-clean-plugin:3.0.0:clean (default-clean) @ scoped.bundle.common ---
[INFO] [INFO] 
[INFO] [INFO] --- git-commit-id-plugin:2.1.5:revision (default) @ scoped.bundle.common ---
[INFO] [info] 
[INFO] [info] /jobs/genie.gemini/gemini-blueprint-stage-release/workspace/.git
[INFO] [info] 
[INFO] [info] 
[INFO] [info] 
[INFO] [info] 
[INFO] [info] 
[INFO] [info] 
[INFO] [info] 
[INFO] [info] 
[INFO] [info] 
[INFO] [info] 
[INFO] [info] 
[INFO] [info] 
[INFO] [info] 
[INFO] [info] 
[INFO] [info] 
[INFO] [INFO] 
[INFO] [INFO] --- maven-resources-plugin:3.0.2:resources (default-resources) @ scoped.bundle.common ---
[INFO] [INFO] Using 'UTF-8' encoding to copy filtered resources.
[INFO] [INFO] Copying 1 resource
[INFO] [INFO] 
[INFO] [INFO] --- maven-compiler-plugin:3.6.1:compile (default-compile) @ scoped.bundle.common ---
[INFO] [INFO] Changes detected - recompiling the module!
[INFO] [INFO] Compiling 2 source files to /jobs/genie.gemini/gemini-blueprint-stage-release/workspace/integration-tests/bundles/scoped.common.bundle/target/classes
[INFO] [INFO] 
[INFO] [INFO] --- maven-resources-plugin:3.0.2:testResources (default-testResources) @ scoped.bundle.common ---
[INFO] [INFO] Using 'UTF-8' encoding to copy filtered resources.
[INFO] [INFO] skip non existing resourceDirectory /jobs/genie.gemini/gemini-blueprint-stage-release/workspace/integration-tests/bundles/scoped.common.bundle/src/test/resources
[INFO] [INFO] 
[INFO] [INFO] --- maven-compiler-plugin:3.6.1:testCompile (default-testCompile) @ scoped.bundle.common ---
[INFO] [INFO] No sources to compile
[INFO] [INFO] 
[INFO] [INFO] --- maven-surefire-plugin:2.19.1:test (default-test) @ scoped.bundle.common ---
[INFO] [INFO] Tests are skipped.
[INFO] [INFO] 
[INFO] [INFO] --- maven-site-plugin:3.6:site (site) @ scoped.bundle.common ---
[INFO] [INFO] maven.site.skip = true: Skipping site generation
[INFO] [INFO] 
[INFO] [INFO] --- maven-jar-plugin:3.0.2:jar (default-jar) @ scoped.bundle.common ---
[INFO] [INFO] Building jar: /jobs/genie.gemini/gemini-blueprint-stage-release/workspace/integration-tests/bundles/scoped.common.bundle/target/scoped.bundle.common-2.1.0.M1-SNAPSHOT.jar
[INFO] [INFO] 
[INFO] [INFO] --- maven-source-plugin:2.2.1:jar-no-fork (attach-sources) @ scoped.bundle.common ---
[INFO] [INFO] Skipping source per configuration.
[INFO] [INFO] 
[INFO] [INFO] --- maven-gpg-plugin:1.6:sign (sign-artifacts) @ scoped.bundle.common ---
[INFO] [INFO]                                                                         
[INFO] [INFO] ------------------------------------------------------------------------
[INFO] [INFO] Building Gemini Blueprint Test Bundle: IO fragment 1 bundle 2.1.0.M1-SNAPSHOT
[INFO] [INFO] ------------------------------------------------------------------------
[INFO] [INFO] 
[INFO] [INFO] --- maven-clean-plugin:3.0.0:clean (default-clean) @ io.fragment.1.bundle ---
[INFO] [INFO] 
[INFO] [INFO] --- git-commit-id-plugin:2.1.5:revision (default) @ io.fragment.1.bundle ---
[INFO] [info] 
[INFO] [info] /jobs/genie.gemini/gemini-blueprint-stage-release/workspace/.git
[INFO] [info] 
[INFO] [info] 
[INFO] [info] 
[INFO] [info] 
[INFO] [info] 
[INFO] [info] 
[INFO] [info] 
[INFO] [info] 
[INFO] [info] 
[INFO] [info] 
[INFO] [info] 
[INFO] [info] 
[INFO] [info] 
[INFO] [info] 
[INFO] [info] 
[INFO] [INFO] 
[INFO] [INFO] --- maven-resources-plugin:3.0.2:resources (default-resources) @ io.fragment.1.bundle ---
[INFO] [INFO] Using 'UTF-8' encoding to copy filtered resources.
[INFO] [INFO] Copying 9 resources
[INFO] [INFO] 
[INFO] [INFO] --- maven-compiler-plugin:3.6.1:compile (default-compile) @ io.fragment.1.bundle ---
[INFO] [INFO] No sources to compile
[INFO] [INFO] 
[INFO] [INFO] --- maven-resources-plugin:3.0.2:testResources (default-testResources) @ io.fragment.1.bundle ---
[INFO] [INFO] Using 'UTF-8' encoding to copy filtered resources.
[INFO] [INFO] skip non existing resourceDirectory /jobs/genie.gemini/gemini-blueprint-stage-release/workspace/integration-tests/bundles/io.fragment.1.bundle/src/test/resources
[INFO] [INFO] 
[INFO] [INFO] --- maven-compiler-plugin:3.6.1:testCompile (default-testCompile) @ io.fragment.1.bundle ---
[INFO] [INFO] No sources to compile
[INFO] [INFO] 
[INFO] [INFO] --- maven-surefire-plugin:2.19.1:test (default-test) @ io.fragment.1.bundle ---
[INFO] [INFO] Tests are skipped.
[INFO] [INFO] 
[INFO] [INFO] --- maven-site-plugin:3.6:site (site) @ io.fragment.1.bundle ---
[INFO] [INFO] maven.site.skip = true: Skipping site generation
[INFO] [INFO] 
[INFO] [INFO] --- maven-jar-plugin:3.0.2:jar (default-jar) @ io.fragment.1.bundle ---
[INFO] [INFO] Building jar: /jobs/genie.gemini/gemini-blueprint-stage-release/workspace/integration-tests/bundles/io.fragment.1.bundle/target/io.fragment.1.bundle-2.1.0.M1-SNAPSHOT.jar
[INFO] [INFO] 
[INFO] [INFO] --- maven-source-plugin:2.2.1:jar-no-fork (attach-sources) @ io.fragment.1.bundle ---
[INFO] [INFO] Skipping source per configuration.
[INFO] [INFO] 
[INFO] [INFO] --- maven-gpg-plugin:1.6:sign (sign-artifacts) @ io.fragment.1.bundle ---
[INFO] [INFO]                                                                         
[INFO] [INFO] ------------------------------------------------------------------------
[INFO] [INFO] Building Gemini Blueprint Test Bundle: IO fragment 2 bundle 2.1.0.M1-SNAPSHOT
[INFO] [INFO] ------------------------------------------------------------------------
[INFO] [INFO] 
[INFO] [INFO] --- maven-clean-plugin:3.0.0:clean (default-clean) @ io.fragment.2.bundle ---
[INFO] [INFO] 
[INFO] [INFO] --- git-commit-id-plugin:2.1.5:revision (default) @ io.fragment.2.bundle ---
[INFO] [info] 
[INFO] [info] /jobs/genie.gemini/gemini-blueprint-stage-release/workspace/.git
[INFO] [info] 
[INFO] [info] 
[INFO] [info] 
[INFO] [info] 
[INFO] [info] 
[INFO] [info] 
[INFO] [info] 
[INFO] [info] 
[INFO] [info] 
[INFO] [info] 
[INFO] [info] 
[INFO] [info] 
[INFO] [info] 
[INFO] [info] 
[INFO] [info] 
[INFO] [INFO] 
[INFO] [INFO] --- maven-resources-plugin:3.0.2:resources (default-resources) @ io.fragment.2.bundle ---
[INFO] [INFO] Using 'UTF-8' encoding to copy filtered resources.
[INFO] [INFO] Copying 9 resources
[INFO] [INFO] 
[INFO] [INFO] --- maven-compiler-plugin:3.6.1:compile (default-compile) @ io.fragment.2.bundle ---
[INFO] [INFO] No sources to compile
[INFO] [INFO] 
[INFO] [INFO] --- maven-resources-plugin:3.0.2:testResources (default-testResources) @ io.fragment.2.bundle ---
[INFO] [INFO] Using 'UTF-8' encoding to copy filtered resources.
[INFO] [INFO] skip non existing resourceDirectory /jobs/genie.gemini/gemini-blueprint-stage-release/workspace/integration-tests/bundles/io.fragment.2.bundle/src/test/resources
[INFO] [INFO] 
[INFO] [INFO] --- maven-compiler-plugin:3.6.1:testCompile (default-testCompile) @ io.fragment.2.bundle ---
[INFO] [INFO] No sources to compile
[INFO] [INFO] 
[INFO] [INFO] --- maven-surefire-plugin:2.19.1:test (default-test) @ io.fragment.2.bundle ---
[INFO] [INFO] Tests are skipped.
[INFO] [INFO] 
[INFO] [INFO] --- maven-site-plugin:3.6:site (site) @ io.fragment.2.bundle ---
[INFO] [INFO] maven.site.skip = true: Skipping site generation
[INFO] [INFO] 
[INFO] [INFO] --- maven-jar-plugin:3.0.2:jar (default-jar) @ io.fragment.2.bundle ---
[INFO] [INFO] Building jar: /jobs/genie.gemini/gemini-blueprint-stage-release/workspace/integration-tests/bundles/io.fragment.2.bundle/target/io.fragment.2.bundle-2.1.0.M1-SNAPSHOT.jar
[INFO] [INFO] 
[INFO] [INFO] --- maven-source-plugin:2.2.1:jar-no-fork (attach-sources) @ io.fragment.2.bundle ---
[INFO] [INFO] Skipping source per configuration.
[INFO] [INFO] 
[INFO] [INFO] --- maven-gpg-plugin:1.6:sign (sign-artifacts) @ io.fragment.2.bundle ---
[INFO] [INFO]                                                                         
[INFO] [INFO] ------------------------------------------------------------------------
[INFO] [INFO] Building Gemini Blueprint Test Bundle: Error bundle 2.1.0.M1-SNAPSHOT
[INFO] [INFO] ------------------------------------------------------------------------
[INFO] [INFO] 
[INFO] [INFO] --- maven-clean-plugin:3.0.0:clean (default-clean) @ error ---
[INFO] [INFO] 
[INFO] [INFO] --- git-commit-id-plugin:2.1.5:revision (default) @ error ---
[INFO] [info] 
[INFO] [info] /jobs/genie.gemini/gemini-blueprint-stage-release/workspace/.git
[INFO] [info] 
[INFO] [info] 
[INFO] [info] 
[INFO] [info] 
[INFO] [info] 
[INFO] [info] 
[INFO] [info] 
[INFO] [info] 
[INFO] [info] 
[INFO] [info] 
[INFO] [info] 
[INFO] [info] 
[INFO] [info] 
[INFO] [info] 
[INFO] [info] 
[INFO] [INFO] 
[INFO] [INFO] --- maven-resources-plugin:3.0.2:resources (default-resources) @ error ---
[INFO] [INFO] Using 'UTF-8' encoding to copy filtered resources.
[INFO] [INFO] Copying 3 resources
[INFO] [INFO] 
[INFO] [INFO] --- maven-compiler-plugin:3.6.1:compile (default-compile) @ error ---
[INFO] [INFO] Changes detected - recompiling the module!
[INFO] [INFO] Compiling 1 source file to /jobs/genie.gemini/gemini-blueprint-stage-release/workspace/integration-tests/bundles/error.bundle/target/classes
[INFO] [INFO] 
[INFO] [INFO] --- maven-resources-plugin:3.0.2:testResources (default-testResources) @ error ---
[INFO] [INFO] Using 'UTF-8' encoding to copy filtered resources.
[INFO] [INFO] skip non existing resourceDirectory /jobs/genie.gemini/gemini-blueprint-stage-release/workspace/integration-tests/bundles/error.bundle/src/test/resources
[INFO] [INFO] 
[INFO] [INFO] --- maven-compiler-plugin:3.6.1:testCompile (default-testCompile) @ error ---
[INFO] [INFO] No sources to compile
[INFO] [INFO] 
[INFO] [INFO] --- maven-surefire-plugin:2.19.1:test (default-test) @ error ---
[INFO] [INFO] Tests are skipped.
[INFO] [INFO] 
[INFO] [INFO] --- maven-site-plugin:3.6:site (site) @ error ---
[INFO] [INFO] maven.site.skip = true: Skipping site generation
[INFO] [INFO] 
[INFO] [INFO] --- maven-jar-plugin:3.0.2:jar (default-jar) @ error ---
[INFO] [INFO] Building jar: /jobs/genie.gemini/gemini-blueprint-stage-release/workspace/integration-tests/bundles/error.bundle/target/error-2.1.0.M1-SNAPSHOT.jar
[INFO] [INFO] 
[INFO] [INFO] --- maven-source-plugin:2.2.1:jar-no-fork (attach-sources) @ error ---
[INFO] [INFO] Skipping source per configuration.
[INFO] [INFO] 
[INFO] [INFO] --- maven-gpg-plugin:1.6:sign (sign-artifacts) @ error ---
[INFO] [INFO]                                                                         
[INFO] [INFO] ------------------------------------------------------------------------
[INFO] [INFO] Building Gemini Blueprint Test Bundle: Deadlock bundle 2.1.0.M1-SNAPSHOT
[INFO] [INFO] ------------------------------------------------------------------------
[INFO] [INFO] 
[INFO] [INFO] --- maven-clean-plugin:3.0.0:clean (default-clean) @ deadlock ---
[INFO] [INFO] 
[INFO] [INFO] --- git-commit-id-plugin:2.1.5:revision (default) @ deadlock ---
[INFO] [info] 
[INFO] [info] /jobs/genie.gemini/gemini-blueprint-stage-release/workspace/.git
[INFO] [info] 
[INFO] [info] 
[INFO] [info] 
[INFO] [info] 
[INFO] [info] 
[INFO] [info] 
[INFO] [info] 
[INFO] [info] 
[INFO] [info] 
[INFO] [info] 
[INFO] [info] 
[INFO] [info] 
[INFO] [info] 
[INFO] [info] 
[INFO] [info] 
[INFO] [INFO] 
[INFO] [INFO] --- maven-resources-plugin:3.0.2:resources (default-resources) @ deadlock ---
[INFO] [INFO] Using 'UTF-8' encoding to copy filtered resources.
[INFO] [INFO] Copying 2 resources
[INFO] [INFO] 
[INFO] [INFO] --- maven-compiler-plugin:3.6.1:compile (default-compile) @ deadlock ---
[INFO] [INFO] Changes detected - recompiling the module!
[INFO] [INFO] Compiling 3 source files to /jobs/genie.gemini/gemini-blueprint-stage-release/workspace/integration-tests/bundles/deadlock.bundle/target/classes
[INFO] [INFO] 
[INFO] [INFO] --- maven-resources-plugin:3.0.2:testResources (default-testResources) @ deadlock ---
[INFO] [INFO] Using 'UTF-8' encoding to copy filtered resources.
[INFO] [INFO] skip non existing resourceDirectory /jobs/genie.gemini/gemini-blueprint-stage-release/workspace/integration-tests/bundles/deadlock.bundle/src/test/resources
[INFO] [INFO] 
[INFO] [INFO] --- maven-compiler-plugin:3.6.1:testCompile (default-testCompile) @ deadlock ---
[INFO] [INFO] No sources to compile
[INFO] [INFO] 
[INFO] [INFO] --- maven-surefire-plugin:2.19.1:test (default-test) @ deadlock ---
[INFO] [INFO] Tests are skipped.
[INFO] [INFO] 
[INFO] [INFO] --- maven-site-plugin:3.6:site (site) @ deadlock ---
[INFO] [INFO] maven.site.skip = true: Skipping site generation
[INFO] [INFO] 
[INFO] [INFO] --- maven-jar-plugin:3.0.2:jar (default-jar) @ deadlock ---
[INFO] [INFO] Building jar: /jobs/genie.gemini/gemini-blueprint-stage-release/workspace/integration-tests/bundles/deadlock.bundle/target/deadlock-2.1.0.M1-SNAPSHOT.jar
[INFO] [INFO] 
[INFO] [INFO] --- maven-source-plugin:2.2.1:jar-no-fork (attach-sources) @ deadlock ---
[INFO] [INFO] Skipping source per configuration.
[INFO] [INFO] 
[INFO] [INFO] --- maven-gpg-plugin:1.6:sign (sign-artifacts) @ deadlock ---
[INFO] [INFO]                                                                         
[INFO] [INFO] ------------------------------------------------------------------------
[INFO] [INFO] Building Gemini Blueprint Test Bundle: Configuration test bundle 2.1.0.M1-SNAPSHOT
[INFO] [INFO] ------------------------------------------------------------------------
[INFO] [INFO] 
[INFO] [INFO] --- maven-clean-plugin:3.0.0:clean (default-clean) @ configuration ---
[INFO] [INFO] 
[INFO] [INFO] --- git-commit-id-plugin:2.1.5:revision (default) @ configuration ---
[INFO] [info] 
[INFO] [info] /jobs/genie.gemini/gemini-blueprint-stage-release/workspace/.git
[INFO] [info] 
[INFO] [info] 
[INFO] [info] 
[INFO] [info] 
[INFO] [info] 
[INFO] [info] 
[INFO] [info] 
[INFO] [info] 
[INFO] [info] 
[INFO] [info] 
[INFO] [info] 
[INFO] [info] 
[INFO] [info] 
[INFO] [info] 
[INFO] [info] 
[INFO] [INFO] 
[INFO] [INFO] --- maven-resources-plugin:3.0.2:resources (default-resources) @ configuration ---
[INFO] [INFO] Using 'UTF-8' encoding to copy filtered resources.
[INFO] [INFO] Copying 2 resources
[INFO] [INFO] 
[INFO] [INFO] --- maven-compiler-plugin:3.6.1:compile (default-compile) @ configuration ---
[INFO] [INFO] Changes detected - recompiling the module!
[INFO] [INFO] Compiling 2 source files to /jobs/genie.gemini/gemini-blueprint-stage-release/workspace/integration-tests/bundles/configuration.test.bundle/target/classes
[INFO] [INFO] 
[INFO] [INFO] --- maven-resources-plugin:3.0.2:testResources (default-testResources) @ configuration ---
[INFO] [INFO] Using 'UTF-8' encoding to copy filtered resources.
[INFO] [INFO] skip non existing resourceDirectory /jobs/genie.gemini/gemini-blueprint-stage-release/workspace/integration-tests/bundles/configuration.test.bundle/src/test/resources
[INFO] [INFO] 
[INFO] [INFO] --- maven-compiler-plugin:3.6.1:testCompile (default-testCompile) @ configuration ---
[INFO] [INFO] No sources to compile
[INFO] [INFO] 
[INFO] [INFO] --- maven-surefire-plugin:2.19.1:test (default-test) @ configuration ---
[INFO] [INFO] Tests are skipped.
[INFO] [INFO] 
[INFO] [INFO] --- maven-site-plugin:3.6:site (site) @ configuration ---
[INFO] [INFO] maven.site.skip = true: Skipping site generation
[INFO] [INFO] 
[INFO] [INFO] --- maven-jar-plugin:3.0.2:jar (default-jar) @ configuration ---
[INFO] [INFO] Building jar: /jobs/genie.gemini/gemini-blueprint-stage-release/workspace/integration-tests/bundles/configuration.test.bundle/target/configuration-2.1.0.M1-SNAPSHOT.jar
[INFO] [INFO] 
[INFO] [INFO] --- maven-source-plugin:2.2.1:jar-no-fork (attach-sources) @ configuration ---
[INFO] [INFO] Skipping source per configuration.
[INFO] [INFO] 
[INFO] [INFO] --- maven-gpg-plugin:1.6:sign (sign-artifacts) @ configuration ---
[INFO] [INFO]                                                                         
[INFO] [INFO] ------------------------------------------------------------------------
[INFO] [INFO] Building Gemini Blueprint Test Bundle: ExtenderVersion-Test-Bundle 2.1.0.M1-SNAPSHOT
[INFO] [INFO] ------------------------------------------------------------------------
[INFO] [INFO] 
[INFO] [INFO] --- maven-clean-plugin:3.0.0:clean (default-clean) @ extender-version-bundle ---
[INFO] [INFO] 
[INFO] [INFO] --- git-commit-id-plugin:2.1.5:revision (default) @ extender-version-bundle ---
[INFO] [info] 
[INFO] [info] /jobs/genie.gemini/gemini-blueprint-stage-release/workspace/.git
[INFO] [info] 
[INFO] [info] 
[INFO] [info] 
[INFO] [info] 
[INFO] [info] 
[INFO] [info] 
[INFO] [info] 
[INFO] [info] 
[INFO] [info] 
[INFO] [info] 
[INFO] [info] 
[INFO] [info] 
[INFO] [info] 
[INFO] [info] 
[INFO] [info] 
[INFO] [INFO] 
[INFO] [INFO] --- maven-resources-plugin:3.0.2:resources (default-resources) @ extender-version-bundle ---
[INFO] [INFO] Using 'UTF-8' encoding to copy filtered resources.
[INFO] [INFO] Copying 2 resources
[INFO] [INFO] 
[INFO] [INFO] --- maven-compiler-plugin:3.6.1:compile (default-compile) @ extender-version-bundle ---
[INFO] [INFO] Nothing to compile - all classes are up to date
[INFO] [INFO] 
[INFO] [INFO] --- maven-resources-plugin:3.0.2:testResources (default-testResources) @ extender-version-bundle ---
[INFO] [INFO] Using 'UTF-8' encoding to copy filtered resources.
[INFO] [INFO] skip non existing resourceDirectory /jobs/genie.gemini/gemini-blueprint-stage-release/workspace/integration-tests/bundles/extender.version.bundle/src/test/resources
[INFO] [INFO] 
[INFO] [INFO] --- maven-compiler-plugin:3.6.1:testCompile (default-testCompile) @ extender-version-bundle ---
[INFO] [INFO] No sources to compile
[INFO] [INFO] 
[INFO] [INFO] --- maven-surefire-plugin:2.19.1:test (default-test) @ extender-version-bundle ---
[INFO] [INFO] Tests are skipped.
[INFO] [INFO] 
[INFO] [INFO] --- maven-site-plugin:3.6:site (site) @ extender-version-bundle ---
[INFO] [INFO] maven.site.skip = true: Skipping site generation
[INFO] [INFO] 
[INFO] [INFO] --- maven-jar-plugin:3.0.2:jar (default-jar) @ extender-version-bundle ---
[INFO] [INFO] Building jar: /jobs/genie.gemini/gemini-blueprint-stage-release/workspace/integration-tests/bundles/extender.version.bundle/target/extender-version-bundle-2.1.0.M1-SNAPSHOT.jar
[INFO] [INFO] 
[INFO] [INFO] --- maven-source-plugin:2.2.1:jar-no-fork (attach-sources) @ extender-version-bundle ---
[INFO] [INFO] Skipping source per configuration.
[INFO] [INFO] 
[INFO] [INFO] --- maven-gpg-plugin:1.6:sign (sign-artifacts) @ extender-version-bundle ---
[INFO] [INFO]                                                                         
[INFO] [INFO] ------------------------------------------------------------------------
[INFO] [INFO] Building Gemini Blueprint Test Bundle: Integration testing bundles for configuration options 2.1.0.M1-SNAPSHOT
[INFO] [INFO] ------------------------------------------------------------------------
[INFO] [INFO] 
[INFO] [INFO] --- maven-clean-plugin:3.0.0:clean (default-clean) @ config.bundle ---
[INFO] [INFO] 
[INFO] [INFO] --- git-commit-id-plugin:2.1.5:revision (default) @ config.bundle ---
[INFO] [info] 
[INFO] [info] 
[INFO] [INFO] 
[INFO] [INFO] --- maven-site-plugin:3.6:site (site) @ config.bundle ---
[INFO] [INFO] maven.site.skip = true: Skipping site generation
[INFO] [INFO] 
[INFO] [INFO] --- maven-source-plugin:2.2.1:jar-no-fork (attach-sources) @ config.bundle ---
[INFO] [INFO] Skipping source per configuration.
[INFO] [INFO] 
[INFO] [INFO] --- maven-gpg-plugin:1.6:sign (sign-artifacts) @ config.bundle ---
[INFO] [INFO]                                                                         
[INFO] [INFO] ------------------------------------------------------------------------
[INFO] [INFO] Building Gemini Blueprint Test Bundle: NoPublish-Bundle 2.1.0.M1-SNAPSHOT
[INFO] [INFO] ------------------------------------------------------------------------
[INFO] [INFO] 
[INFO] [INFO] --- maven-clean-plugin:3.0.0:clean (default-clean) @ nopublish-bundle ---
[INFO] [INFO] 
[INFO] [INFO] --- git-commit-id-plugin:2.1.5:revision (default) @ nopublish-bundle ---
[INFO] [info] 
[INFO] [info] /jobs/genie.gemini/gemini-blueprint-stage-release/workspace/.git
[INFO] [info] 
[INFO] [info] 
[INFO] [info] 
[INFO] [info] 
[INFO] [info] 
[INFO] [info] 
[INFO] [info] 
[INFO] [info] 
[INFO] [info] 
[INFO] [info] 
[INFO] [info] 
[INFO] [info] 
[INFO] [info] 
[INFO] [info] 
[INFO] [info] 
[INFO] [INFO] 
[INFO] [INFO] --- maven-resources-plugin:3.0.2:resources (default-resources) @ nopublish-bundle ---
[INFO] [INFO] Using 'UTF-8' encoding to copy filtered resources.
[INFO] [INFO] Copying 2 resources
[INFO] [INFO] 
[INFO] [INFO] --- maven-compiler-plugin:3.6.1:compile (default-compile) @ nopublish-bundle ---
[INFO] [INFO] No sources to compile
[INFO] [INFO] 
[INFO] [INFO] --- maven-resources-plugin:3.0.2:testResources (default-testResources) @ nopublish-bundle ---
[INFO] [INFO] Using 'UTF-8' encoding to copy filtered resources.
[INFO] [INFO] skip non existing resourceDirectory /jobs/genie.gemini/gemini-blueprint-stage-release/workspace/integration-tests/bundles/config.bundle/no.publish.bundle/src/test/resources
[INFO] [INFO] 
[INFO] [INFO] --- maven-compiler-plugin:3.6.1:testCompile (default-testCompile) @ nopublish-bundle ---
[INFO] [INFO] No sources to compile
[INFO] [INFO] 
[INFO] [INFO] --- maven-surefire-plugin:2.19.1:test (default-test) @ nopublish-bundle ---
[INFO] [INFO] Tests are skipped.
[INFO] [INFO] 
[INFO] [INFO] --- maven-site-plugin:3.6:site (site) @ nopublish-bundle ---
[INFO] [INFO] maven.site.skip = true: Skipping site generation
[INFO] [INFO] 
[INFO] [INFO] --- maven-jar-plugin:3.0.2:jar (default-jar) @ nopublish-bundle ---
[INFO] [INFO] Building jar: /jobs/genie.gemini/gemini-blueprint-stage-release/workspace/integration-tests/bundles/config.bundle/no.publish.bundle/target/nopublish-bundle-2.1.0.M1-SNAPSHOT.jar
[INFO] [INFO] 
[INFO] [INFO] --- maven-source-plugin:2.2.1:jar-no-fork (attach-sources) @ nopublish-bundle ---
[INFO] [INFO] Skipping source per configuration.
[INFO] [INFO] 
[INFO] [INFO] --- maven-gpg-plugin:1.6:sign (sign-artifacts) @ nopublish-bundle ---
[INFO] [INFO]                                                                         
[INFO] [INFO] ------------------------------------------------------------------------
[INFO] [INFO] Building Gemini Blueprint Test Bundle: Async-NoWait-Bundle 2.1.0.M1-SNAPSHOT
[INFO] [INFO] ------------------------------------------------------------------------
[INFO] [INFO] 
[INFO] [INFO] --- maven-clean-plugin:3.0.0:clean (default-clean) @ async-nowait-bundle ---
[INFO] [INFO] 
[INFO] [INFO] --- git-commit-id-plugin:2.1.5:revision (default) @ async-nowait-bundle ---
[INFO] [info] 
[INFO] [info] /jobs/genie.gemini/gemini-blueprint-stage-release/workspace/.git
[INFO] [info] 
[INFO] [info] 
[INFO] [info] 
[INFO] [info] 
[INFO] [info] 
[INFO] [info] 
[INFO] [info] 
[INFO] [info] 
[INFO] [info] 
[INFO] [info] 
[INFO] [info] 
[INFO] [info] 
[INFO] [info] 
[INFO] [info] 
[INFO] [info] 
[INFO] [INFO] 
[INFO] [INFO] --- maven-resources-plugin:3.0.2:resources (default-resources) @ async-nowait-bundle ---
[INFO] [INFO] Using 'UTF-8' encoding to copy filtered resources.
[INFO] [INFO] Copying 2 resources
[INFO] [INFO] 
[INFO] [INFO] --- maven-compiler-plugin:3.6.1:compile (default-compile) @ async-nowait-bundle ---
[INFO] [INFO] No sources to compile
[INFO] [INFO] 
[INFO] [INFO] --- maven-resources-plugin:3.0.2:testResources (default-testResources) @ async-nowait-bundle ---
[INFO] [INFO] Using 'UTF-8' encoding to copy filtered resources.
[INFO] [INFO] skip non existing resourceDirectory /jobs/genie.gemini/gemini-blueprint-stage-release/workspace/integration-tests/bundles/config.bundle/async.nowait.bundle/src/test/resources
[INFO] [INFO] 
[INFO] [INFO] --- maven-compiler-plugin:3.6.1:testCompile (default-testCompile) @ async-nowait-bundle ---
[INFO] [INFO] No sources to compile
[INFO] [INFO] 
[INFO] [INFO] --- maven-surefire-plugin:2.19.1:test (default-test) @ async-nowait-bundle ---
[INFO] [INFO] Tests are skipped.
[INFO] [INFO] 
[INFO] [INFO] --- maven-site-plugin:3.6:site (site) @ async-nowait-bundle ---
[INFO] [INFO] maven.site.skip = true: Skipping site generation
[INFO] [INFO] 
[INFO] [INFO] --- maven-jar-plugin:3.0.2:jar (default-jar) @ async-nowait-bundle ---
[INFO] [INFO] Building jar: /jobs/genie.gemini/gemini-blueprint-stage-release/workspace/integration-tests/bundles/config.bundle/async.nowait.bundle/target/async-nowait-bundle-2.1.0.M1-SNAPSHOT.jar
[INFO] [INFO] 
[INFO] [INFO] --- maven-source-plugin:2.2.1:jar-no-fork (attach-sources) @ async-nowait-bundle ---
[INFO] [INFO] Skipping source per configuration.
[INFO] [INFO] 
[INFO] [INFO] --- maven-gpg-plugin:1.6:sign (sign-artifacts) @ async-nowait-bundle ---
[INFO] [INFO]                                                                         
[INFO] [INFO] ------------------------------------------------------------------------
[INFO] [INFO] Building Gemini Blueprint Test Bundle: Async-Wait-Bundle 2.1.0.M1-SNAPSHOT
[INFO] [INFO] ------------------------------------------------------------------------
[INFO] [INFO] 
[INFO] [INFO] --- maven-clean-plugin:3.0.0:clean (default-clean) @ async-wait-bundle ---
[INFO] [INFO] 
[INFO] [INFO] --- git-commit-id-plugin:2.1.5:revision (default) @ async-wait-bundle ---
[INFO] [info] 
[INFO] [info] /jobs/genie.gemini/gemini-blueprint-stage-release/workspace/.git
[INFO] [info] 
[INFO] [info] 
[INFO] [info] 
[INFO] [info] 
[INFO] [info] 
[INFO] [info] 
[INFO] [info] 
[INFO] [info] 
[INFO] [info] 
[INFO] [info] 
[INFO] [info] 
[INFO] [info] 
[INFO] [info] 
[INFO] [info] 
[INFO] [info] 
[INFO] [INFO] 
[INFO] [INFO] --- maven-resources-plugin:3.0.2:resources (default-resources) @ async-wait-bundle ---
[INFO] [INFO] Using 'UTF-8' encoding to copy filtered resources.
[INFO] [INFO] Copying 2 resources
[INFO] [INFO] 
[INFO] [INFO] --- maven-compiler-plugin:3.6.1:compile (default-compile) @ async-wait-bundle ---
[INFO] [INFO] No sources to compile
[INFO] [INFO] 
[INFO] [INFO] --- maven-resources-plugin:3.0.2:testResources (default-testResources) @ async-wait-bundle ---
[INFO] [INFO] Using 'UTF-8' encoding to copy filtered resources.
[INFO] [INFO] skip non existing resourceDirectory /jobs/genie.gemini/gemini-blueprint-stage-release/workspace/integration-tests/bundles/config.bundle/async.wait.bundle/src/test/resources
[INFO] [INFO] 
[INFO] [INFO] --- maven-compiler-plugin:3.6.1:testCompile (default-testCompile) @ async-wait-bundle ---
[INFO] [INFO] No sources to compile
[INFO] [INFO] 
[INFO] [INFO] --- maven-surefire-plugin:2.19.1:test (default-test) @ async-wait-bundle ---
[INFO] [INFO] Tests are skipped.
[INFO] [INFO] 
[INFO] [INFO] --- maven-site-plugin:3.6:site (site) @ async-wait-bundle ---
[INFO] [INFO] maven.site.skip = true: Skipping site generation
[INFO] [INFO] 
[INFO] [INFO] --- maven-jar-plugin:3.0.2:jar (default-jar) @ async-wait-bundle ---
[INFO] [INFO] Building jar: /jobs/genie.gemini/gemini-blueprint-stage-release/workspace/integration-tests/bundles/config.bundle/async.wait.bundle/target/async-wait-bundle-2.1.0.M1-SNAPSHOT.jar
[INFO] [INFO] 
[INFO] [INFO] --- maven-source-plugin:2.2.1:jar-no-fork (attach-sources) @ async-wait-bundle ---
[INFO] [INFO] Skipping source per configuration.
[INFO] [INFO] 
[INFO] [INFO] --- maven-gpg-plugin:1.6:sign (sign-artifacts) @ async-wait-bundle ---
[INFO] [INFO]                                                                         
[INFO] [INFO] ------------------------------------------------------------------------
[INFO] [INFO] Building Gemini Blueprint Test Bundle: Sync-NoWait-Bundle 2.1.0.M1-SNAPSHOT
[INFO] [INFO] ------------------------------------------------------------------------
[INFO] [INFO] 
[INFO] [INFO] --- maven-clean-plugin:3.0.0:clean (default-clean) @ sync-nowait-bundle ---
[INFO] [INFO] 
[INFO] [INFO] --- git-commit-id-plugin:2.1.5:revision (default) @ sync-nowait-bundle ---
[INFO] [info] 
[INFO] [info] /jobs/genie.gemini/gemini-blueprint-stage-release/workspace/.git
[INFO] [info] 
[INFO] [info] 
[INFO] [info] 
[INFO] [info] 
[INFO] [info] 
[INFO] [info] 
[INFO] [info] 
[INFO] [info] 
[INFO] [info] 
[INFO] [info] 
[INFO] [info] 
[INFO] [info] 
[INFO] [info] 
[INFO] [info] 
[INFO] [info] 
[INFO] [INFO] 
[INFO] [INFO] --- maven-resources-plugin:3.0.2:resources (default-resources) @ sync-nowait-bundle ---
[INFO] [INFO] Using 'UTF-8' encoding to copy filtered resources.
[INFO] [INFO] Copying 2 resources
[INFO] [INFO] 
[INFO] [INFO] --- maven-compiler-plugin:3.6.1:compile (default-compile) @ sync-nowait-bundle ---
[INFO] [INFO] Changes detected - recompiling the module!
[INFO] [INFO] Compiling 1 source file to /jobs/genie.gemini/gemini-blueprint-stage-release/workspace/integration-tests/bundles/config.bundle/sync.nowait.bundle/target/classes
[INFO] [INFO] 
[INFO] [INFO] --- maven-resources-plugin:3.0.2:testResources (default-testResources) @ sync-nowait-bundle ---
[INFO] [INFO] Using 'UTF-8' encoding to copy filtered resources.
[INFO] [INFO] skip non existing resourceDirectory /jobs/genie.gemini/gemini-blueprint-stage-release/workspace/integration-tests/bundles/config.bundle/sync.nowait.bundle/src/test/resources
[INFO] [INFO] 
[INFO] [INFO] --- maven-compiler-plugin:3.6.1:testCompile (default-testCompile) @ sync-nowait-bundle ---
[INFO] [INFO] No sources to compile
[INFO] [INFO] 
[INFO] [INFO] --- maven-surefire-plugin:2.19.1:test (default-test) @ sync-nowait-bundle ---
[INFO] [INFO] Tests are skipped.
[INFO] [INFO] 
[INFO] [INFO] --- maven-site-plugin:3.6:site (site) @ sync-nowait-bundle ---
[INFO] [INFO] maven.site.skip = true: Skipping site generation
[INFO] [INFO] 
[INFO] [INFO] --- maven-jar-plugin:3.0.2:jar (default-jar) @ sync-nowait-bundle ---
[INFO] [INFO] Building jar: /jobs/genie.gemini/gemini-blueprint-stage-release/workspace/integration-tests/bundles/config.bundle/sync.nowait.bundle/target/sync-nowait-bundle-2.1.0.M1-SNAPSHOT.jar
[INFO] [INFO] 
[INFO] [INFO] --- maven-source-plugin:2.2.1:jar-no-fork (attach-sources) @ sync-nowait-bundle ---
[INFO] [INFO] Skipping source per configuration.
[INFO] [INFO] 
[INFO] [INFO] --- maven-gpg-plugin:1.6:sign (sign-artifacts) @ sync-nowait-bundle ---
[INFO] [INFO]                                                                         
[INFO] [INFO] ------------------------------------------------------------------------
[INFO] [INFO] Building Gemini Blueprint Test Bundle: Sync-Tail-Bundle 2.1.0.M1-SNAPSHOT
[INFO] [INFO] ------------------------------------------------------------------------
[INFO] [INFO] 
[INFO] [INFO] --- maven-clean-plugin:3.0.0:clean (default-clean) @ sync-tail-bundle ---
[INFO] [INFO] 
[INFO] [INFO] --- git-commit-id-plugin:2.1.5:revision (default) @ sync-tail-bundle ---
[INFO] [info] 
[INFO] [info] /jobs/genie.gemini/gemini-blueprint-stage-release/workspace/.git
[INFO] [info] 
[INFO] [info] 
[INFO] [info] 
[INFO] [info] 
[INFO] [info] 
[INFO] [info] 
[INFO] [info] 
[INFO] [info] 
[INFO] [info] 
[INFO] [info] 
[INFO] [info] 
[INFO] [info] 
[INFO] [info] 
[INFO] [info] 
[INFO] [info] 
[INFO] [INFO] 
[INFO] [INFO] --- maven-resources-plugin:3.0.2:resources (default-resources) @ sync-tail-bundle ---
[INFO] [INFO] Using 'UTF-8' encoding to copy filtered resources.
[INFO] [INFO] Copying 2 resources
[INFO] [INFO] 
[INFO] [INFO] --- maven-compiler-plugin:3.6.1:compile (default-compile) @ sync-tail-bundle ---
[INFO] [INFO] No sources to compile
[INFO] [INFO] 
[INFO] [INFO] --- maven-resources-plugin:3.0.2:testResources (default-testResources) @ sync-tail-bundle ---
[INFO] [INFO] Using 'UTF-8' encoding to copy filtered resources.
[INFO] [INFO] skip non existing resourceDirectory /jobs/genie.gemini/gemini-blueprint-stage-release/workspace/integration-tests/bundles/config.bundle/sync.tail.bundle/src/test/resources
[INFO] [INFO] 
[INFO] [INFO] --- maven-compiler-plugin:3.6.1:testCompile (default-testCompile) @ sync-tail-bundle ---
[INFO] [INFO] No sources to compile
[INFO] [INFO] 
[INFO] [INFO] --- maven-surefire-plugin:2.19.1:test (default-test) @ sync-tail-bundle ---
[INFO] [INFO] Tests are skipped.
[INFO] [INFO] 
[INFO] [INFO] --- maven-site-plugin:3.6:site (site) @ sync-tail-bundle ---
[INFO] [INFO] maven.site.skip = true: Skipping site generation
[INFO] [INFO] 
[INFO] [INFO] --- maven-jar-plugin:3.0.2:jar (default-jar) @ sync-tail-bundle ---
[INFO] [INFO] Building jar: /jobs/genie.gemini/gemini-blueprint-stage-release/workspace/integration-tests/bundles/config.bundle/sync.tail.bundle/target/sync-tail-bundle-2.1.0.M1-SNAPSHOT.jar
[INFO] [INFO] 
[INFO] [INFO] --- maven-source-plugin:2.2.1:jar-no-fork (attach-sources) @ sync-tail-bundle ---
[INFO] [INFO] Skipping source per configuration.
[INFO] [INFO] 
[INFO] [INFO] --- maven-gpg-plugin:1.6:sign (sign-artifacts) @ sync-tail-bundle ---
[INFO] [INFO]                                                                         
[INFO] [INFO] ------------------------------------------------------------------------
[INFO] [INFO] Building Gemini Blueprint Test Bundle: Sync-Wait-Bundle 2.1.0.M1-SNAPSHOT
[INFO] [INFO] ------------------------------------------------------------------------
[INFO] [INFO] 
[INFO] [INFO] --- maven-clean-plugin:3.0.0:clean (default-clean) @ sync-wait-bundle ---
[INFO] [INFO] 
[INFO] [INFO] --- git-commit-id-plugin:2.1.5:revision (default) @ sync-wait-bundle ---
[INFO] [info] 
[INFO] [info] /jobs/genie.gemini/gemini-blueprint-stage-release/workspace/.git
[INFO] [info] 
[INFO] [info] 
[INFO] [info] 
[INFO] [info] 
[INFO] [info] 
[INFO] [info] 
[INFO] [info] 
[INFO] [info] 
[INFO] [info] 
[INFO] [info] 
[INFO] [info] 
[INFO] [info] 
[INFO] [info] 
[INFO] [info] 
[INFO] [info] 
[INFO] [INFO] 
[INFO] [INFO] --- maven-resources-plugin:3.0.2:resources (default-resources) @ sync-wait-bundle ---
[INFO] [INFO] Using 'UTF-8' encoding to copy filtered resources.
[INFO] [INFO] Copying 2 resources
[INFO] [INFO] 
[INFO] [INFO] --- maven-compiler-plugin:3.6.1:compile (default-compile) @ sync-wait-bundle ---
[INFO] [INFO] No sources to compile
[INFO] [INFO] 
[INFO] [INFO] --- maven-resources-plugin:3.0.2:testResources (default-testResources) @ sync-wait-bundle ---
[INFO] [INFO] Using 'UTF-8' encoding to copy filtered resources.
[INFO] [INFO] skip non existing resourceDirectory /jobs/genie.gemini/gemini-blueprint-stage-release/workspace/integration-tests/bundles/config.bundle/sync.wait.bundle/src/test/resources
[INFO] [INFO] 
[INFO] [INFO] --- maven-compiler-plugin:3.6.1:testCompile (default-testCompile) @ sync-wait-bundle ---
[INFO] [INFO] No sources to compile
[INFO] [INFO] 
[INFO] [INFO] --- maven-surefire-plugin:2.19.1:test (default-test) @ sync-wait-bundle ---
[INFO] [INFO] Tests are skipped.
[INFO] [INFO] 
[INFO] [INFO] --- maven-site-plugin:3.6:site (site) @ sync-wait-bundle ---
[INFO] [INFO] maven.site.skip = true: Skipping site generation
[INFO] [INFO] 
[INFO] [INFO] --- maven-jar-plugin:3.0.2:jar (default-jar) @ sync-wait-bundle ---
[INFO] [INFO] Building jar: /jobs/genie.gemini/gemini-blueprint-stage-release/workspace/integration-tests/bundles/config.bundle/sync.wait.bundle/target/sync-wait-bundle-2.1.0.M1-SNAPSHOT.jar
[INFO] [INFO] 
[INFO] [INFO] --- maven-source-plugin:2.2.1:jar-no-fork (attach-sources) @ sync-wait-bundle ---
[INFO] [INFO] Skipping source per configuration.
[INFO] [INFO] 
[INFO] [INFO] --- maven-gpg-plugin:1.6:sign (sign-artifacts) @ sync-wait-bundle ---
[INFO] [INFO]                                                                         
[INFO] [INFO] ------------------------------------------------------------------------
[INFO] [INFO] Building Gemini Blueprint Test Bundle: Spring service TCCL management inteface test bundle 2.1.0.M1-SNAPSHOT
[INFO] [INFO] ------------------------------------------------------------------------
[INFO] [INFO] 
[INFO] [INFO] --- maven-clean-plugin:3.0.0:clean (default-clean) @ tccl.intf ---
[INFO] [INFO] 
[INFO] [INFO] --- git-commit-id-plugin:2.1.5:revision (default) @ tccl.intf ---
[INFO] [info] 
[INFO] [info] /jobs/genie.gemini/gemini-blueprint-stage-release/workspace/.git
[INFO] [info] 
[INFO] [info] 
[INFO] [info] 
[INFO] [info] 
[INFO] [info] 
[INFO] [info] 
[INFO] [info] 
[INFO] [info] 
[INFO] [info] 
[INFO] [info] 
[INFO] [info] 
[INFO] [info] 
[INFO] [info] 
[INFO] [info] 
[INFO] [info] 
[INFO] [INFO] 
[INFO] [INFO] --- maven-resources-plugin:3.0.2:resources (default-resources) @ tccl.intf ---
[INFO] [INFO] Using 'UTF-8' encoding to copy filtered resources.
[INFO] [INFO] Copying 1 resource
[INFO] [INFO] 
[INFO] [INFO] --- maven-compiler-plugin:3.6.1:compile (default-compile) @ tccl.intf ---
[INFO] [INFO] Changes detected - recompiling the module!
[INFO] [INFO] Compiling 1 source file to /jobs/genie.gemini/gemini-blueprint-stage-release/workspace/integration-tests/bundles/tccl.intf.bundle/target/classes
[INFO] [INFO] 
[INFO] [INFO] --- maven-resources-plugin:3.0.2:testResources (default-testResources) @ tccl.intf ---
[INFO] [INFO] Using 'UTF-8' encoding to copy filtered resources.
[INFO] [INFO] skip non existing resourceDirectory /jobs/genie.gemini/gemini-blueprint-stage-release/workspace/integration-tests/bundles/tccl.intf.bundle/src/test/resources
[INFO] [INFO] 
[INFO] [INFO] --- maven-compiler-plugin:3.6.1:testCompile (default-testCompile) @ tccl.intf ---
[INFO] [INFO] No sources to compile
[INFO] [INFO] 
[INFO] [INFO] --- maven-surefire-plugin:2.19.1:test (default-test) @ tccl.intf ---
[INFO] [INFO] Tests are skipped.
[INFO] [INFO] 
[INFO] [INFO] --- maven-site-plugin:3.6:site (site) @ tccl.intf ---
[INFO] [INFO] maven.site.skip = true: Skipping site generation
[INFO] [INFO] 
[INFO] [INFO] --- maven-jar-plugin:3.0.2:jar (default-jar) @ tccl.intf ---
[INFO] [INFO] Building jar: /jobs/genie.gemini/gemini-blueprint-stage-release/workspace/integration-tests/bundles/tccl.intf.bundle/target/tccl.intf-2.1.0.M1-SNAPSHOT.jar
[INFO] [INFO] 
[INFO] [INFO] --- maven-source-plugin:2.2.1:jar-no-fork (attach-sources) @ tccl.intf ---
[INFO] [INFO] Skipping source per configuration.
[INFO] [INFO] 
[INFO] [INFO] --- maven-gpg-plugin:1.6:sign (sign-artifacts) @ tccl.intf ---
[INFO] [INFO]                                                                         
[INFO] [INFO] ------------------------------------------------------------------------
[INFO] [INFO] Building Gemini Blueprint Test Bundle: Spring service TCCL management test bundle 2.1.0.M1-SNAPSHOT
[INFO] [INFO] ------------------------------------------------------------------------
[INFO] [INFO] 
[INFO] [INFO] --- maven-clean-plugin:3.0.0:clean (default-clean) @ tccl ---
[INFO] [INFO] 
[INFO] [INFO] --- git-commit-id-plugin:2.1.5:revision (default) @ tccl ---
[INFO] [info] 
[INFO] [info] /jobs/genie.gemini/gemini-blueprint-stage-release/workspace/.git
[INFO] [info] 
[INFO] [info] 
[INFO] [info] 
[INFO] [info] 
[INFO] [info] 
[INFO] [info] 
[INFO] [info] 
[INFO] [info] 
[INFO] [info] 
[INFO] [info] 
[INFO] [info] 
[INFO] [info] 
[INFO] [info] 
[INFO] [info] 
[INFO] [info] 
[INFO] [INFO] 
[INFO] [INFO] --- maven-resources-plugin:3.0.2:resources (default-resources) @ tccl ---
[INFO] [INFO] Using 'UTF-8' encoding to copy filtered resources.
[INFO] [INFO] Copying 4 resources
[INFO] [INFO] 
[INFO] [INFO] --- maven-compiler-plugin:3.6.1:compile (default-compile) @ tccl ---
[INFO] [INFO] Changes detected - recompiling the module!
[INFO] [INFO] Compiling 1 source file to /jobs/genie.gemini/gemini-blueprint-stage-release/workspace/integration-tests/bundles/tccl.bundle/target/classes
[INFO] [INFO] 
[INFO] [INFO] --- maven-resources-plugin:3.0.2:testResources (default-testResources) @ tccl ---
[INFO] [INFO] Using 'UTF-8' encoding to copy filtered resources.
[INFO] [INFO] skip non existing resourceDirectory /jobs/genie.gemini/gemini-blueprint-stage-release/workspace/integration-tests/bundles/tccl.bundle/src/test/resources
[INFO] [INFO] 
[INFO] [INFO] --- maven-compiler-plugin:3.6.1:testCompile (default-testCompile) @ tccl ---
[INFO] [INFO] No sources to compile
[INFO] [INFO] 
[INFO] [INFO] --- maven-surefire-plugin:2.19.1:test (default-test) @ tccl ---
[INFO] [INFO] Tests are skipped.
[INFO] [INFO] 
[INFO] [INFO] --- maven-site-plugin:3.6:site (site) @ tccl ---
[INFO] [INFO] maven.site.skip = true: Skipping site generation
[INFO] [INFO] 
[INFO] [INFO] --- maven-jar-plugin:3.0.2:jar (default-jar) @ tccl ---
[INFO] [INFO] Building jar: /jobs/genie.gemini/gemini-blueprint-stage-release/workspace/integration-tests/bundles/tccl.bundle/target/tccl-2.1.0.M1-SNAPSHOT.jar
[INFO] [INFO] 
[INFO] [INFO] --- maven-source-plugin:2.2.1:jar-no-fork (attach-sources) @ tccl ---
[INFO] [INFO] Skipping source per configuration.
[INFO] [INFO] 
[INFO] [INFO] --- maven-gpg-plugin:1.6:sign (sign-artifacts) @ tccl ---
[INFO] [INFO]                                                                         
[INFO] [INFO] ------------------------------------------------------------------------
[INFO] [INFO] Building Gemini Blueprint Test Bundle: Config File With Dots bundle 2.1.0.M1-SNAPSHOT
[INFO] [INFO] ------------------------------------------------------------------------
[INFO] [INFO] 
[INFO] [INFO] --- maven-clean-plugin:3.0.0:clean (default-clean) @ config-with-dots.bundle ---
[INFO] [INFO] 
[INFO] [INFO] --- git-commit-id-plugin:2.1.5:revision (default) @ config-with-dots.bundle ---
[INFO] [info] 
[INFO] [info] /jobs/genie.gemini/gemini-blueprint-stage-release/workspace/.git
[INFO] [info] 
[INFO] [info] 
[INFO] [info] 
[INFO] [info] 
[INFO] [info] 
[INFO] [info] 
[INFO] [info] 
[INFO] [info] 
[INFO] [info] 
[INFO] [info] 
[INFO] [info] 
[INFO] [info] 
[INFO] [info] 
[INFO] [info] 
[INFO] [info] 
[INFO] [INFO] 
[INFO] [INFO] --- maven-resources-plugin:3.0.2:resources (default-resources) @ config-with-dots.bundle ---
[INFO] [INFO] Using 'UTF-8' encoding to copy filtered resources.
[INFO] [INFO] Copying 2 resources
[INFO] [INFO] 
[INFO] [INFO] --- maven-compiler-plugin:3.6.1:compile (default-compile) @ config-with-dots.bundle ---
[INFO] [INFO] No sources to compile
[INFO] [INFO] 
[INFO] [INFO] --- maven-resources-plugin:3.0.2:testResources (default-testResources) @ config-with-dots.bundle ---
[INFO] [INFO] Using 'UTF-8' encoding to copy filtered resources.
[INFO] [INFO] skip non existing resourceDirectory /jobs/genie.gemini/gemini-blueprint-stage-release/workspace/integration-tests/bundles/config.file.with.dots.bundle/src/test/resources
[INFO] [INFO] 
[INFO] [INFO] --- maven-compiler-plugin:3.6.1:testCompile (default-testCompile) @ config-with-dots.bundle ---
[INFO] [INFO] No sources to compile
[INFO] [INFO] 
[INFO] [INFO] --- maven-surefire-plugin:2.19.1:test (default-test) @ config-with-dots.bundle ---
[INFO] [INFO] Tests are skipped.
[INFO] [INFO] 
[INFO] [INFO] --- maven-site-plugin:3.6:site (site) @ config-with-dots.bundle ---
[INFO] [INFO] maven.site.skip = true: Skipping site generation
[INFO] [INFO] 
[INFO] [INFO] --- maven-jar-plugin:3.0.2:jar (default-jar) @ config-with-dots.bundle ---
[INFO] [INFO] Building jar: /jobs/genie.gemini/gemini-blueprint-stage-release/workspace/integration-tests/bundles/config.file.with.dots.bundle/target/config-with-dots.bundle-2.1.0.M1-SNAPSHOT.jar
[INFO] [INFO] 
[INFO] [INFO] --- maven-source-plugin:2.2.1:jar-no-fork (attach-sources) @ config-with-dots.bundle ---
[INFO] [INFO] Skipping source per configuration.
[INFO] [INFO] 
[INFO] [INFO] --- maven-gpg-plugin:1.6:sign (sign-artifacts) @ config-with-dots.bundle ---
[INFO] [INFO]                                                                         
[INFO] [INFO] ------------------------------------------------------------------------
[INFO] [INFO] Building Gemini Blueprint Test Bundle: Spring Proxy Creator bundle 2.1.0.M1-SNAPSHOT
[INFO] [INFO] ------------------------------------------------------------------------
[INFO] [INFO] 
[INFO] [INFO] --- maven-clean-plugin:3.0.0:clean (default-clean) @ proxy.creator ---
[INFO] [INFO] 
[INFO] [INFO] --- git-commit-id-plugin:2.1.5:revision (default) @ proxy.creator ---
[INFO] [info] 
[INFO] [info] /jobs/genie.gemini/gemini-blueprint-stage-release/workspace/.git
[INFO] [info] 
[INFO] [info] 
[INFO] [info] 
[INFO] [info] 
[INFO] [info] 
[INFO] [info] 
[INFO] [info] 
[INFO] [info] 
[INFO] [info] 
[INFO] [info] 
[INFO] [info] 
[INFO] [info] 
[INFO] [info] 
[INFO] [info] 
[INFO] [info] 
[INFO] [INFO] 
[INFO] [INFO] --- maven-resources-plugin:3.0.2:resources (default-resources) @ proxy.creator ---
[INFO] [INFO] Using 'UTF-8' encoding to copy filtered resources.
[INFO] [INFO] Copying 2 resources
[INFO] [INFO] 
[INFO] [INFO] --- maven-compiler-plugin:3.6.1:compile (default-compile) @ proxy.creator ---
[INFO] [INFO] Changes detected - recompiling the module!
[INFO] [INFO] Compiling 3 source files to /jobs/genie.gemini/gemini-blueprint-stage-release/workspace/integration-tests/bundles/proxy.creator.bundle/target/classes
[INFO] [INFO] 
[INFO] [INFO] --- maven-resources-plugin:3.0.2:testResources (default-testResources) @ proxy.creator ---
[INFO] [INFO] Using 'UTF-8' encoding to copy filtered resources.
[INFO] [INFO] skip non existing resourceDirectory /jobs/genie.gemini/gemini-blueprint-stage-release/workspace/integration-tests/bundles/proxy.creator.bundle/src/test/resources
[INFO] [INFO] 
[INFO] [INFO] --- maven-compiler-plugin:3.6.1:testCompile (default-testCompile) @ proxy.creator ---
[INFO] [INFO] No sources to compile
[INFO] [INFO] 
[INFO] [INFO] --- maven-surefire-plugin:2.19.1:test (default-test) @ proxy.creator ---
[INFO] [INFO] Tests are skipped.
[INFO] [INFO] 
[INFO] [INFO] --- maven-site-plugin:3.6:site (site) @ proxy.creator ---
[INFO] [INFO] maven.site.skip = true: Skipping site generation
[INFO] [INFO] 
[INFO] [INFO] --- maven-jar-plugin:3.0.2:jar (default-jar) @ proxy.creator ---
[INFO] [INFO] Building jar: /jobs/genie.gemini/gemini-blueprint-stage-release/workspace/integration-tests/bundles/proxy.creator.bundle/target/proxy.creator-2.1.0.M1-SNAPSHOT.jar
[INFO] [INFO] 
[INFO] [INFO] --- maven-source-plugin:2.2.1:jar-no-fork (attach-sources) @ proxy.creator ---
[INFO] [INFO] Skipping source per configuration.
[INFO] [INFO] 
[INFO] [INFO] --- maven-gpg-plugin:1.6:sign (sign-artifacts) @ proxy.creator ---
[INFO] [INFO]                                                                         
[INFO] [INFO] ------------------------------------------------------------------------
[INFO] [INFO] Building Gemini Blueprint Test Bundle: Extender Configuration Fragment Bundle 2.1.0.M1-SNAPSHOT
[INFO] [INFO] ------------------------------------------------------------------------
[INFO] [INFO] 
[INFO] [INFO] --- maven-clean-plugin:3.0.0:clean (default-clean) @ extender-fragment-bundle ---
[INFO] [INFO] 
[INFO] [INFO] --- git-commit-id-plugin:2.1.5:revision (default) @ extender-fragment-bundle ---
[INFO] [info] 
[INFO] [info] /jobs/genie.gemini/gemini-blueprint-stage-release/workspace/.git
[INFO] [info] 
[INFO] [info] 
[INFO] [info] 
[INFO] [info] 
[INFO] [info] 
[INFO] [info] 
[INFO] [info] 
[INFO] [info] 
[INFO] [info] 
[INFO] [info] 
[INFO] [info] 
[INFO] [info] 
[INFO] [info] 
[INFO] [info] 
[INFO] [info] 
[INFO] [INFO] 
[INFO] [INFO] --- maven-resources-plugin:3.0.2:resources (default-resources) @ extender-fragment-bundle ---
[INFO] [INFO] Using 'UTF-8' encoding to copy filtered resources.
[INFO] [INFO] Copying 2 resources
[INFO] [INFO] 
[INFO] [INFO] --- maven-compiler-plugin:3.6.1:compile (default-compile) @ extender-fragment-bundle ---
[INFO] [INFO] No sources to compile
[INFO] [INFO] 
[INFO] [INFO] --- maven-resources-plugin:3.0.2:testResources (default-testResources) @ extender-fragment-bundle ---
[INFO] [INFO] Using 'UTF-8' encoding to copy filtered resources.
[INFO] [INFO] skip non existing resourceDirectory /jobs/genie.gemini/gemini-blueprint-stage-release/workspace/integration-tests/bundles/extender.fragment.bundle/src/test/resources
[INFO] [INFO] 
[INFO] [INFO] --- maven-compiler-plugin:3.6.1:testCompile (default-testCompile) @ extender-fragment-bundle ---
[INFO] [INFO] No sources to compile
[INFO] [INFO] 
[INFO] [INFO] --- maven-surefire-plugin:2.19.1:test (default-test) @ extender-fragment-bundle ---
[INFO] [INFO] Tests are skipped.
[INFO] [INFO] 
[INFO] [INFO] --- maven-site-plugin:3.6:site (site) @ extender-fragment-bundle ---
[INFO] [INFO] maven.site.skip = true: Skipping site generation
[INFO] [INFO] 
[INFO] [INFO] --- maven-jar-plugin:3.0.2:jar (default-jar) @ extender-fragment-bundle ---
[INFO] [INFO] Building jar: /jobs/genie.gemini/gemini-blueprint-stage-release/workspace/integration-tests/bundles/extender.fragment.bundle/target/extender-fragment-bundle-2.1.0.M1-SNAPSHOT.jar
[INFO] [INFO] 
[INFO] [INFO] --- maven-source-plugin:2.2.1:jar-no-fork (attach-sources) @ extender-fragment-bundle ---
[INFO] [INFO] Skipping source per configuration.
[INFO] [INFO] 
[INFO] [INFO] --- maven-gpg-plugin:1.6:sign (sign-artifacts) @ extender-fragment-bundle ---
[INFO] [INFO]                                                                         
[INFO] [INFO] ------------------------------------------------------------------------
[INFO] [INFO] Building Gemini Blueprint Test Bundle: JDK proxy test 2.1.0.M1-SNAPSHOT
[INFO] [INFO] ------------------------------------------------------------------------
[INFO] [INFO] 
[INFO] [INFO] --- maven-clean-plugin:3.0.0:clean (default-clean) @ jdk.proxy ---
[INFO] [INFO] 
[INFO] [INFO] --- git-commit-id-plugin:2.1.5:revision (default) @ jdk.proxy ---
[INFO] [info] 
[INFO] [info] /jobs/genie.gemini/gemini-blueprint-stage-release/workspace/.git
[INFO] [info] 
[INFO] [info] 
[INFO] [info] 
[INFO] [info] 
[INFO] [info] 
[INFO] [info] 
[INFO] [info] 
[INFO] [info] 
[INFO] [info] 
[INFO] [info] 
[INFO] [info] 
[INFO] [info] 
[INFO] [info] 
[INFO] [info] 
[INFO] [info] 
[INFO] [INFO] 
[INFO] [INFO] --- maven-resources-plugin:3.0.2:resources (default-resources) @ jdk.proxy ---
[INFO] [INFO] Using 'UTF-8' encoding to copy filtered resources.
[INFO] [INFO] Copying 2 resources
[INFO] [INFO] 
[INFO] [INFO] --- maven-compiler-plugin:3.6.1:compile (default-compile) @ jdk.proxy ---
[INFO] [INFO] Changes detected - recompiling the module!
[INFO] [INFO] Compiling 2 source files to /jobs/genie.gemini/gemini-blueprint-stage-release/workspace/integration-tests/bundles/jdk.proxy.bundle/target/classes
[INFO] [INFO] 
[INFO] [INFO] --- maven-resources-plugin:3.0.2:testResources (default-testResources) @ jdk.proxy ---
[INFO] [INFO] Using 'UTF-8' encoding to copy filtered resources.
[INFO] [INFO] skip non existing resourceDirectory /jobs/genie.gemini/gemini-blueprint-stage-release/workspace/integration-tests/bundles/jdk.proxy.bundle/src/test/resources
[INFO] [INFO] 
[INFO] [INFO] --- maven-compiler-plugin:3.6.1:testCompile (default-testCompile) @ jdk.proxy ---
[INFO] [INFO] No sources to compile
[INFO] [INFO] 
[INFO] [INFO] --- maven-surefire-plugin:2.19.1:test (default-test) @ jdk.proxy ---
[INFO] [INFO] Tests are skipped.
[INFO] [INFO] 
[INFO] [INFO] --- maven-site-plugin:3.6:site (site) @ jdk.proxy ---
[INFO] [INFO] maven.site.skip = true: Skipping site generation
[INFO] [INFO] 
[INFO] [INFO] --- maven-jar-plugin:3.0.2:jar (default-jar) @ jdk.proxy ---
[INFO] [INFO] Building jar: /jobs/genie.gemini/gemini-blueprint-stage-release/workspace/integration-tests/bundles/jdk.proxy.bundle/target/jdk.proxy-2.1.0.M1-SNAPSHOT.jar
[INFO] [INFO] 
[INFO] [INFO] --- maven-source-plugin:2.2.1:jar-no-fork (attach-sources) @ jdk.proxy ---
[INFO] [INFO] Skipping source per configuration.
[INFO] [INFO] 
[INFO] [INFO] --- maven-gpg-plugin:1.6:sign (sign-artifacts) @ jdk.proxy ---
[INFO] [INFO]                                                                         
[INFO] [INFO] ------------------------------------------------------------------------
[INFO] [INFO] Building Gemini Blueprint Test Bundle: Extender Event listener bundle Bundle 2.1.0.M1-SNAPSHOT
[INFO] [INFO] ------------------------------------------------------------------------
[INFO] [INFO] 
[INFO] [INFO] --- maven-clean-plugin:3.0.0:clean (default-clean) @ extender.listener.bundle ---
[INFO] [INFO] 
[INFO] [INFO] --- git-commit-id-plugin:2.1.5:revision (default) @ extender.listener.bundle ---
[INFO] [info] 
[INFO] [info] /jobs/genie.gemini/gemini-blueprint-stage-release/workspace/.git
[INFO] [info] 
[INFO] [info] 
[INFO] [info] 
[INFO] [info] 
[INFO] [info] 
[INFO] [info] 
[INFO] [info] 
[INFO] [info] 
[INFO] [info] 
[INFO] [info] 
[INFO] [info] 
[INFO] [info] 
[INFO] [info] 
[INFO] [info] 
[INFO] [info] 
[INFO] [INFO] 
[INFO] [INFO] --- maven-resources-plugin:3.0.2:resources (default-resources) @ extender.listener.bundle ---
[INFO] [INFO] Using 'UTF-8' encoding to copy filtered resources.
[INFO] [INFO] Copying 2 resources
[INFO] [INFO] 
[INFO] [INFO] --- maven-compiler-plugin:3.6.1:compile (default-compile) @ extender.listener.bundle ---
[INFO] [INFO] Changes detected - recompiling the module!
[INFO] [INFO] Compiling 1 source file to /jobs/genie.gemini/gemini-blueprint-stage-release/workspace/integration-tests/bundles/extender.listener.bundle/target/classes
[INFO] [INFO] 
[INFO] [INFO] --- maven-resources-plugin:3.0.2:testResources (default-testResources) @ extender.listener.bundle ---
[INFO] [INFO] Using 'UTF-8' encoding to copy filtered resources.
[INFO] [INFO] skip non existing resourceDirectory /jobs/genie.gemini/gemini-blueprint-stage-release/workspace/integration-tests/bundles/extender.listener.bundle/src/test/resources
[INFO] [INFO] 
[INFO] [INFO] --- maven-compiler-plugin:3.6.1:testCompile (default-testCompile) @ extender.listener.bundle ---
[INFO] [INFO] No sources to compile
[INFO] [INFO] 
[INFO] [INFO] --- maven-surefire-plugin:2.19.1:test (default-test) @ extender.listener.bundle ---
[INFO] [INFO] Tests are skipped.
[INFO] [INFO] 
[INFO] [INFO] --- maven-site-plugin:3.6:site (site) @ extender.listener.bundle ---
[INFO] [INFO] maven.site.skip = true: Skipping site generation
[INFO] [INFO] 
[INFO] [INFO] --- maven-jar-plugin:3.0.2:jar (default-jar) @ extender.listener.bundle ---
[INFO] [INFO] Building jar: /jobs/genie.gemini/gemini-blueprint-stage-release/workspace/integration-tests/bundles/extender.listener.bundle/target/extender.listener.bundle-2.1.0.M1-SNAPSHOT.jar
[INFO] [INFO] 
[INFO] [INFO] --- maven-source-plugin:2.2.1:jar-no-fork (attach-sources) @ extender.listener.bundle ---
[INFO] [INFO] Skipping source per configuration.
[INFO] [INFO] 
[INFO] [INFO] --- maven-gpg-plugin:1.6:sign (sign-artifacts) @ extender.listener.bundle ---
[INFO] [INFO]                                                                         
[INFO] [INFO] ------------------------------------------------------------------------
[INFO] [INFO] Building Gemini Blueprint Test Bundle: namespace provider and consumer bundle 2.1.0.M1-SNAPSHOT
[INFO] [INFO] ------------------------------------------------------------------------
[INFO] [INFO] 
[INFO] [INFO] --- maven-clean-plugin:3.0.0:clean (default-clean) @ ns.own.consumer ---
[INFO] [INFO] 
[INFO] [INFO] --- git-commit-id-plugin:2.1.5:revision (default) @ ns.own.consumer ---
[INFO] [info] 
[INFO] [info] /jobs/genie.gemini/gemini-blueprint-stage-release/workspace/.git
[INFO] [info] 
[INFO] [info] 
[INFO] [info] 
[INFO] [info] 
[INFO] [info] 
[INFO] [info] 
[INFO] [info] 
[INFO] [info] 
[INFO] [info] 
[INFO] [info] 
[INFO] [info] 
[INFO] [info] 
[INFO] [info] 
[INFO] [info] 
[INFO] [info] 
[INFO] [INFO] 
[INFO] [INFO] --- maven-resources-plugin:3.0.2:resources (default-resources) @ ns.own.consumer ---
[INFO] [INFO] Using 'UTF-8' encoding to copy filtered resources.
[INFO] [INFO] Copying 5 resources
[INFO] [INFO] 
[INFO] [INFO] --- maven-compiler-plugin:3.6.1:compile (default-compile) @ ns.own.consumer ---
[INFO] [INFO] Changes detected - recompiling the module!
[INFO] [INFO] Compiling 1 source file to /jobs/genie.gemini/gemini-blueprint-stage-release/workspace/integration-tests/bundles/namespace.own.consumer.bundle/target/classes
[INFO] [INFO] 
[INFO] [INFO] --- maven-resources-plugin:3.0.2:testResources (default-testResources) @ ns.own.consumer ---
[INFO] [INFO] Using 'UTF-8' encoding to copy filtered resources.
[INFO] [INFO] skip non existing resourceDirectory /jobs/genie.gemini/gemini-blueprint-stage-release/workspace/integration-tests/bundles/namespace.own.consumer.bundle/src/test/resources
[INFO] [INFO] 
[INFO] [INFO] --- maven-compiler-plugin:3.6.1:testCompile (default-testCompile) @ ns.own.consumer ---
[INFO] [INFO] No sources to compile
[INFO] [INFO] 
[INFO] [INFO] --- maven-surefire-plugin:2.19.1:test (default-test) @ ns.own.consumer ---
[INFO] [INFO] Tests are skipped.
[INFO] [INFO] 
[INFO] [INFO] --- maven-site-plugin:3.6:site (site) @ ns.own.consumer ---
[INFO] [INFO] maven.site.skip = true: Skipping site generation
[INFO] [INFO] 
[INFO] [INFO] --- maven-jar-plugin:3.0.2:jar (default-jar) @ ns.own.consumer ---
[INFO] [INFO] Building jar: /jobs/genie.gemini/gemini-blueprint-stage-release/workspace/integration-tests/bundles/namespace.own.consumer.bundle/target/ns.own.consumer-2.1.0.M1-SNAPSHOT.jar
[INFO] [INFO] 
[INFO] [INFO] --- maven-source-plugin:2.2.1:jar-no-fork (attach-sources) @ ns.own.consumer ---
[INFO] [INFO] Skipping source per configuration.
[INFO] [INFO] 
[INFO] [INFO] --- maven-gpg-plugin:1.6:sign (sign-artifacts) @ ns.own.consumer ---
[INFO] [INFO]                                                                         
[INFO] [INFO] ------------------------------------------------------------------------
[INFO] [INFO] Building Gemini Blueprint Test Bundle: Just a listener exported as a service 2.1.0.M1-SNAPSHOT
[INFO] [INFO] ------------------------------------------------------------------------
[INFO] [INFO] 
[INFO] [INFO] --- maven-clean-plugin:3.0.0:clean (default-clean) @ proxy.listener ---
[INFO] [INFO] 
[INFO] [INFO] --- git-commit-id-plugin:2.1.5:revision (default) @ proxy.listener ---
[INFO] [info] 
[INFO] [info] /jobs/genie.gemini/gemini-blueprint-stage-release/workspace/.git
[INFO] [info] 
[INFO] [info] 
[INFO] [info] 
[INFO] [info] 
[INFO] [info] 
[INFO] [info] 
[INFO] [info] 
[INFO] [info] 
[INFO] [info] 
[INFO] [info] 
[INFO] [info] 
[INFO] [info] 
[INFO] [info] 
[INFO] [info] 
[INFO] [info] 
[INFO] [INFO] 
[INFO] [INFO] --- maven-resources-plugin:3.0.2:resources (default-resources) @ proxy.listener ---
[INFO] [INFO] Using 'UTF-8' encoding to copy filtered resources.
[INFO] [INFO] Copying 2 resources
[INFO] [INFO] 
[INFO] [INFO] --- maven-compiler-plugin:3.6.1:compile (default-compile) @ proxy.listener ---
[INFO] [INFO] Changes detected - recompiling the module!
[INFO] [INFO] Compiling 2 source files to /jobs/genie.gemini/gemini-blueprint-stage-release/workspace/integration-tests/bundles/proxy.listener/target/classes
[INFO] [INFO] 
[INFO] [INFO] --- maven-resources-plugin:3.0.2:testResources (default-testResources) @ proxy.listener ---
[INFO] [INFO] Using 'UTF-8' encoding to copy filtered resources.
[INFO] [INFO] skip non existing resourceDirectory /jobs/genie.gemini/gemini-blueprint-stage-release/workspace/integration-tests/bundles/proxy.listener/src/test/resources
[INFO] [INFO] 
[INFO] [INFO] --- maven-compiler-plugin:3.6.1:testCompile (default-testCompile) @ proxy.listener ---
[INFO] [INFO] No sources to compile
[INFO] [INFO] 
[INFO] [INFO] --- maven-surefire-plugin:2.19.1:test (default-test) @ proxy.listener ---
[INFO] [INFO] Tests are skipped.
[INFO] [INFO] 
[INFO] [INFO] --- maven-site-plugin:3.6:site (site) @ proxy.listener ---
[INFO] [INFO] maven.site.skip = true: Skipping site generation
[INFO] [INFO] 
[INFO] [INFO] --- maven-jar-plugin:3.0.2:jar (default-jar) @ proxy.listener ---
[INFO] [INFO] Building jar: /jobs/genie.gemini/gemini-blueprint-stage-release/workspace/integration-tests/bundles/proxy.listener/target/proxy.listener-2.1.0.M1-SNAPSHOT.jar
[INFO] [INFO] 
[INFO] [INFO] --- maven-source-plugin:2.2.1:jar-no-fork (attach-sources) @ proxy.listener ---
[INFO] [INFO] Skipping source per configuration.
[INFO] [INFO] 
[INFO] [INFO] --- maven-gpg-plugin:1.6:sign (sign-artifacts) @ proxy.listener ---
[INFO] [INFO]                                                                         
[INFO] [INFO] ------------------------------------------------------------------------
[INFO] [INFO] Building Gemini Blueprint Test Bundle: Export Import Dependency Bundle 2.1.0.M1-SNAPSHOT
[INFO] [INFO] ------------------------------------------------------------------------
[INFO] [INFO] 
[INFO] [INFO] --- maven-clean-plugin:3.0.0:clean (default-clean) @ export-import-dependency-bundle ---
[INFO] [INFO] 
[INFO] [INFO] --- git-commit-id-plugin:2.1.5:revision (default) @ export-import-dependency-bundle ---
[INFO] [info] 
[INFO] [info] /jobs/genie.gemini/gemini-blueprint-stage-release/workspace/.git
[INFO] [info] 
[INFO] [info] 
[INFO] [info] 
[INFO] [info] 
[INFO] [info] 
[INFO] [info] 
[INFO] [info] 
[INFO] [info] 
[INFO] [info] 
[INFO] [info] 
[INFO] [info] 
[INFO] [info] 
[INFO] [info] 
[INFO] [info] 
[INFO] [info] 
[INFO] [INFO] 
[INFO] [INFO] --- maven-resources-plugin:3.0.2:resources (default-resources) @ export-import-dependency-bundle ---
[INFO] [INFO] Using 'UTF-8' encoding to copy filtered resources.
[INFO] [INFO] Copying 2 resources
[INFO] [INFO] 
[INFO] [INFO] --- maven-compiler-plugin:3.6.1:compile (default-compile) @ export-import-dependency-bundle ---
[INFO] [INFO] Changes detected - recompiling the module!
[INFO] [INFO] Compiling 1 source file to /jobs/genie.gemini/gemini-blueprint-stage-release/workspace/integration-tests/bundles/export.import.dependency.bundle/target/classes
[INFO] [INFO] 
[INFO] [INFO] --- maven-resources-plugin:3.0.2:testResources (default-testResources) @ export-import-dependency-bundle ---
[INFO] [INFO] Using 'UTF-8' encoding to copy filtered resources.
[INFO] [INFO] skip non existing resourceDirectory /jobs/genie.gemini/gemini-blueprint-stage-release/workspace/integration-tests/bundles/export.import.dependency.bundle/src/test/resources
[INFO] [INFO] 
[INFO] [INFO] --- maven-compiler-plugin:3.6.1:testCompile (default-testCompile) @ export-import-dependency-bundle ---
[INFO] [INFO] No sources to compile
[INFO] [INFO] 
[INFO] [INFO] --- maven-surefire-plugin:2.19.1:test (default-test) @ export-import-dependency-bundle ---
[INFO] [INFO] Tests are skipped.
[INFO] [INFO] 
[INFO] [INFO] --- maven-site-plugin:3.6:site (site) @ export-import-dependency-bundle ---
[INFO] [INFO] maven.site.skip = true: Skipping site generation
[INFO] [INFO] 
[INFO] [INFO] --- maven-jar-plugin:3.0.2:jar (default-jar) @ export-import-dependency-bundle ---
[INFO] [INFO] Building jar: /jobs/genie.gemini/gemini-blueprint-stage-release/workspace/integration-tests/bundles/export.import.dependency.bundle/target/export-import-dependency-bundle-2.1.0.M1-SNAPSHOT.jar
[INFO] [INFO] 
[INFO] [INFO] --- maven-source-plugin:2.2.1:jar-no-fork (attach-sources) @ export-import-dependency-bundle ---
[INFO] [INFO] Skipping source per configuration.
[INFO] [INFO] 
[INFO] [INFO] --- maven-gpg-plugin:1.6:sign (sign-artifacts) @ export-import-dependency-bundle ---
[INFO] [INFO]                                                                         
[INFO] [INFO] ------------------------------------------------------------------------
[INFO] [INFO] Building Eclipse Gemini Blueprint JDK5 Integration Testing Bundles 2.1.0.M1-SNAPSHOT
[INFO] [INFO] ------------------------------------------------------------------------
[INFO] [INFO] 
[INFO] [INFO] --- maven-clean-plugin:3.0.0:clean (default-clean) @ spring-osgi-jdk5-integration-test-bundles ---
[INFO] [INFO] 
[INFO] [INFO] --- git-commit-id-plugin:2.1.5:revision (default) @ spring-osgi-jdk5-integration-test-bundles ---
[INFO] [info] 
[INFO] [info] 
[INFO] [INFO] 
[INFO] [INFO] --- maven-site-plugin:3.6:site (site) @ spring-osgi-jdk5-integration-test-bundles ---
[INFO] [INFO] maven.site.skip = true: Skipping site generation
[INFO] [INFO] 
[INFO] [INFO] --- maven-source-plugin:2.2.1:jar-no-fork (attach-sources) @ spring-osgi-jdk5-integration-test-bundles ---
[INFO] [INFO] Skipping source per configuration.
[INFO] [INFO] 
[INFO] [INFO] --- maven-gpg-plugin:1.6:sign (sign-artifacts) @ spring-osgi-jdk5-integration-test-bundles ---
[INFO] [INFO]                                                                         
[INFO] [INFO] ------------------------------------------------------------------------
[INFO] [INFO] Building Gemini Blueprint Test Bundle: @Component beans bundle 2.1.0.M1-SNAPSHOT
[INFO] [INFO] ------------------------------------------------------------------------
[INFO] [INFO] 
[INFO] [INFO] --- maven-clean-plugin:3.0.0:clean (default-clean) @ component.scan.bundle ---
[INFO] [INFO] 
[INFO] [INFO] --- git-commit-id-plugin:2.1.5:revision (default) @ component.scan.bundle ---
[INFO] [info] 
[INFO] [info] /jobs/genie.gemini/gemini-blueprint-stage-release/workspace/.git
[INFO] [info] 
[INFO] [info] 
[INFO] [info] 
[INFO] [info] 
[INFO] [info] 
[INFO] [info] 
[INFO] [info] 
[INFO] [info] 
[INFO] [info] 
[INFO] [info] 
[INFO] [info] 
[INFO] [info] 
[INFO] [info] 
[INFO] [info] 
[INFO] [info] 
[INFO] [INFO] 
[INFO] [INFO] --- maven-resources-plugin:3.0.2:resources (default-resources) @ component.scan.bundle ---
[INFO] [INFO] Using 'UTF-8' encoding to copy filtered resources.
[INFO] [INFO] Copying 1 resource
[INFO] [INFO] 
[INFO] [INFO] --- maven-compiler-plugin:3.6.1:compile (default-compile) @ component.scan.bundle ---
[INFO] [INFO] Changes detected - recompiling the module!
[INFO] [INFO] Compiling 2 source files to /jobs/genie.gemini/gemini-blueprint-stage-release/workspace/integration-tests/bundles/jdk5/component.scan.bundle/target/classes
[INFO] [INFO] 
[INFO] [INFO] --- maven-resources-plugin:3.0.2:testResources (default-testResources) @ component.scan.bundle ---
[INFO] [INFO] Using 'UTF-8' encoding to copy filtered resources.
[INFO] [INFO] skip non existing resourceDirectory /jobs/genie.gemini/gemini-blueprint-stage-release/workspace/integration-tests/bundles/jdk5/component.scan.bundle/src/test/resources
[INFO] [INFO] 
[INFO] [INFO] --- maven-compiler-plugin:3.6.1:testCompile (default-testCompile) @ component.scan.bundle ---
[INFO] [INFO] No sources to compile
[INFO] [INFO] 
[INFO] [INFO] --- maven-surefire-plugin:2.19.1:test (default-test) @ component.scan.bundle ---
[INFO] [INFO] Tests are skipped.
[INFO] [INFO] 
[INFO] [INFO] --- maven-site-plugin:3.6:site (site) @ component.scan.bundle ---
[INFO] [INFO] maven.site.skip = true: Skipping site generation
[INFO] [INFO] 
[INFO] [INFO] --- maven-jar-plugin:3.0.2:jar (default-jar) @ component.scan.bundle ---
[INFO] [INFO] Building jar: /jobs/genie.gemini/gemini-blueprint-stage-release/workspace/integration-tests/bundles/jdk5/component.scan.bundle/target/component.scan.bundle-2.1.0.M1-SNAPSHOT.jar
[INFO] [INFO] 
[INFO] [INFO] --- maven-source-plugin:2.2.1:jar-no-fork (attach-sources) @ component.scan.bundle ---
[INFO] [INFO] Skipping source per configuration.
[INFO] [INFO] 
[INFO] [INFO] --- maven-gpg-plugin:1.6:sign (sign-artifacts) @ component.scan.bundle ---
[INFO] [INFO]                                                                         
[INFO] [INFO] ------------------------------------------------------------------------
[INFO] [INFO] Building Eclipse Gemini Blueprint Test Bundle: Recursive Type test bundle 2.1.0.M1-SNAPSHOT
[INFO] [INFO] ------------------------------------------------------------------------
[INFO] [INFO] 
[INFO] [INFO] --- maven-clean-plugin:3.0.0:clean (default-clean) @ recursive ---
[INFO] [INFO] 
[INFO] [INFO] --- git-commit-id-plugin:2.1.5:revision (default) @ recursive ---
[INFO] [info] 
[INFO] [info] /jobs/genie.gemini/gemini-blueprint-stage-release/workspace/.git
[INFO] [info] 
[INFO] [info] 
[INFO] [info] 
[INFO] [info] 
[INFO] [info] 
[INFO] [info] 
[INFO] [info] 
[INFO] [info] 
[INFO] [info] 
[INFO] [info] 
[INFO] [info] 
[INFO] [info] 
[INFO] [info] 
[INFO] [info] 
[INFO] [info] 
[INFO] [INFO] 
[INFO] [INFO] --- maven-resources-plugin:3.0.2:resources (default-resources) @ recursive ---
[INFO] [INFO] Using 'UTF-8' encoding to copy filtered resources.
[INFO] [INFO] Copying 2 resources
[INFO] [INFO] 
[INFO] [INFO] --- maven-compiler-plugin:3.6.1:compile (default-compile) @ recursive ---
[INFO] [INFO] Changes detected - recompiling the module!
[INFO] [INFO] Compiling 2 source files to /jobs/genie.gemini/gemini-blueprint-stage-release/workspace/integration-tests/bundles/recursive.type.bundle/target/classes
[INFO] [INFO] 
[INFO] [INFO] --- maven-resources-plugin:3.0.2:testResources (default-testResources) @ recursive ---
[INFO] [INFO] Using 'UTF-8' encoding to copy filtered resources.
[INFO] [INFO] skip non existing resourceDirectory /jobs/genie.gemini/gemini-blueprint-stage-release/workspace/integration-tests/bundles/recursive.type.bundle/src/test/resources
[INFO] [INFO] 
[INFO] [INFO] --- maven-compiler-plugin:3.6.1:testCompile (default-testCompile) @ recursive ---
[INFO] [INFO] No sources to compile
[INFO] [INFO] 
[INFO] [INFO] --- maven-surefire-plugin:2.19.1:test (default-test) @ recursive ---
[INFO] [INFO] Tests are skipped.
[INFO] [INFO] 
[INFO] [INFO] --- maven-site-plugin:3.6:site (site) @ recursive ---
[INFO] [INFO] maven.site.skip = true: Skipping site generation
[INFO] [INFO] 
[INFO] [INFO] --- maven-jar-plugin:3.0.2:jar (default-jar) @ recursive ---
[INFO] [INFO] Building jar: /jobs/genie.gemini/gemini-blueprint-stage-release/workspace/integration-tests/bundles/recursive.type.bundle/target/recursive-2.1.0.M1-SNAPSHOT.jar
[INFO] [INFO] 
[INFO] [INFO] --- maven-source-plugin:2.2.1:jar-no-fork (attach-sources) @ recursive ---
[INFO] [INFO] Skipping source per configuration.
[INFO] [INFO] 
[INFO] [INFO] --- maven-gpg-plugin:1.6:sign (sign-artifacts) @ recursive ---
[INFO] [INFO]                                                                         
[INFO] [INFO] ------------------------------------------------------------------------
[INFO] [INFO] Building Gemini Blueprint Integration Testing Bundles 2.1.0.M1-SNAPSHOT
[INFO] [INFO] ------------------------------------------------------------------------
[INFO] [INFO] 
[INFO] [INFO] --- maven-clean-plugin:3.0.0:clean (default-clean) @ bundles ---
[INFO] [INFO] 
[INFO] [INFO] --- git-commit-id-plugin:2.1.5:revision (default) @ bundles ---
[INFO] [info] 
[INFO] [info] 
[INFO] [INFO] 
[INFO] [INFO] --- maven-site-plugin:3.6:site (site) @ bundles ---
[INFO] [INFO] maven.site.skip = true: Skipping site generation
[INFO] [INFO] 
[INFO] [INFO] --- maven-source-plugin:2.2.1:jar-no-fork (attach-sources) @ bundles ---
[INFO] [INFO] Skipping source per configuration.
[INFO] [INFO] 
[INFO] [INFO] --- maven-gpg-plugin:1.6:sign (sign-artifacts) @ bundles ---
[INFO] [INFO]                                                                         
[INFO] [INFO] ------------------------------------------------------------------------
[INFO] [INFO] Building Eclipse Gemini Blueprint Test Bundle: Simple service test bundle 2.1.0.M1-SNAPSHOT
[INFO] [INFO] ------------------------------------------------------------------------
[INFO] [INFO] 
[INFO] [INFO] --- maven-clean-plugin:3.0.0:clean (default-clean) @ simple.bundle ---
[INFO] [INFO] 
[INFO] [INFO] --- git-commit-id-plugin:2.1.5:revision (default) @ simple.bundle ---
[INFO] [info] 
[INFO] [info] /jobs/genie.gemini/gemini-blueprint-stage-release/workspace/.git
[INFO] [info] 
[INFO] [info] 
[INFO] [info] 
[INFO] [info] 
[INFO] [info] 
[INFO] [info] 
[INFO] [info] 
[INFO] [info] 
[INFO] [info] 
[INFO] [info] 
[INFO] [info] 
[INFO] [info] 
[INFO] [info] 
[INFO] [info] 
[INFO] [info] 
[INFO] [INFO] 
[INFO] [INFO] --- maven-resources-plugin:3.0.2:resources (default-resources) @ simple.bundle ---
[INFO] [INFO] Using 'UTF-8' encoding to copy filtered resources.
[INFO] [INFO] Copying 2 resources
[INFO] [INFO] 
[INFO] [INFO] --- maven-compiler-plugin:3.6.1:compile (default-compile) @ simple.bundle ---
[INFO] [INFO] Nothing to compile - all classes are up to date
[INFO] [INFO] 
[INFO] [INFO] --- maven-resources-plugin:3.0.2:testResources (default-testResources) @ simple.bundle ---
[INFO] [INFO] Using 'UTF-8' encoding to copy filtered resources.
[INFO] [INFO] skip non existing resourceDirectory /jobs/genie.gemini/gemini-blueprint-stage-release/workspace/integration-tests/bundles/blueprint/simple.bundle/src/test/resources
[INFO] [INFO] 
[INFO] [INFO] --- maven-compiler-plugin:3.6.1:testCompile (default-testCompile) @ simple.bundle ---
[INFO] [INFO] No sources to compile
[INFO] [INFO] 
[INFO] [INFO] --- maven-surefire-plugin:2.19.1:test (default-test) @ simple.bundle ---
[INFO] [INFO] Tests are skipped.
[INFO] [INFO] 
[INFO] [INFO] --- maven-site-plugin:3.6:site (site) @ simple.bundle ---
[INFO] [INFO] maven.site.skip = true: Skipping site generation
[INFO] [INFO] 
[INFO] [INFO] --- maven-jar-plugin:3.0.2:jar (default-jar) @ simple.bundle ---
[INFO] [INFO] Building jar: /jobs/genie.gemini/gemini-blueprint-stage-release/workspace/integration-tests/bundles/blueprint/simple.bundle/target/simple.bundle-2.1.0.M1-SNAPSHOT.jar
[INFO] [INFO] 
[INFO] [INFO] --- maven-source-plugin:2.2.1:jar-no-fork (attach-sources) @ simple.bundle ---
[INFO] [INFO] Skipping source per configuration.
[INFO] [INFO] 
[INFO] [INFO] --- maven-gpg-plugin:1.6:sign (sign-artifacts) @ simple.bundle ---
[INFO] [INFO]                                                                         
[INFO] [INFO] ------------------------------------------------------------------------
[INFO] [INFO] Building Eclipse Gemini Blueprint Test Bundle: Error bundle 2.1.0.M1-SNAPSHOT
[INFO] [INFO] ------------------------------------------------------------------------
[INFO] [INFO] 
[INFO] [INFO] --- maven-clean-plugin:3.0.0:clean (default-clean) @ error.bundle ---
[INFO] [INFO] 
[INFO] [INFO] --- git-commit-id-plugin:2.1.5:revision (default) @ error.bundle ---
[INFO] [info] 
[INFO] [info] /jobs/genie.gemini/gemini-blueprint-stage-release/workspace/.git
[INFO] [info] 
[INFO] [info] 
[INFO] [info] 
[INFO] [info] 
[INFO] [info] 
[INFO] [info] 
[INFO] [info] 
[INFO] [info] 
[INFO] [info] 
[INFO] [info] 
[INFO] [info] 
[INFO] [info] 
[INFO] [info] 
[INFO] [info] 
[INFO] [info] 
[INFO] [INFO] 
[INFO] [INFO] --- maven-resources-plugin:3.0.2:resources (default-resources) @ error.bundle ---
[INFO] [INFO] Using 'UTF-8' encoding to copy filtered resources.
[INFO] [INFO] Copying 2 resources
[INFO] [INFO] 
[INFO] [INFO] --- maven-compiler-plugin:3.6.1:compile (default-compile) @ error.bundle ---
[INFO] [INFO] No sources to compile
[INFO] [INFO] 
[INFO] [INFO] --- maven-resources-plugin:3.0.2:testResources (default-testResources) @ error.bundle ---
[INFO] [INFO] Using 'UTF-8' encoding to copy filtered resources.
[INFO] [INFO] skip non existing resourceDirectory /jobs/genie.gemini/gemini-blueprint-stage-release/workspace/integration-tests/bundles/blueprint/error.bundle/src/test/resources
[INFO] [INFO] 
[INFO] [INFO] --- maven-compiler-plugin:3.6.1:testCompile (default-testCompile) @ error.bundle ---
[INFO] [INFO] No sources to compile
[INFO] [INFO] 
[INFO] [INFO] --- maven-surefire-plugin:2.19.1:test (default-test) @ error.bundle ---
[INFO] [INFO] Tests are skipped.
[INFO] [INFO] 
[INFO] [INFO] --- maven-site-plugin:3.6:site (site) @ error.bundle ---
[INFO] [INFO] maven.site.skip = true: Skipping site generation
[INFO] [INFO] 
[INFO] [INFO] --- maven-jar-plugin:3.0.2:jar (default-jar) @ error.bundle ---
[INFO] [INFO] Building jar: /jobs/genie.gemini/gemini-blueprint-stage-release/workspace/integration-tests/bundles/blueprint/error.bundle/target/error.bundle-2.1.0.M1-SNAPSHOT.jar
[INFO] [INFO] 
[INFO] [INFO] --- maven-source-plugin:2.2.1:jar-no-fork (attach-sources) @ error.bundle ---
[INFO] [INFO] Skipping source per configuration.
[INFO] [INFO] 
[INFO] [INFO] --- maven-gpg-plugin:1.6:sign (sign-artifacts) @ error.bundle ---
[INFO] [INFO]                                                                         
[INFO] [INFO] ------------------------------------------------------------------------
[INFO] [INFO] Building Eclipse Gemini Blueprint Test Bundle: Waiting bundle 2.1.0.M1-SNAPSHOT
[INFO] [INFO] ------------------------------------------------------------------------
[INFO] [INFO] 
[INFO] [INFO] --- maven-clean-plugin:3.0.0:clean (default-clean) @ waiting.bundle ---
[INFO] [INFO] 
[INFO] [INFO] --- git-commit-id-plugin:2.1.5:revision (default) @ waiting.bundle ---
[INFO] [info] 
[INFO] [info] /jobs/genie.gemini/gemini-blueprint-stage-release/workspace/.git
[INFO] [info] 
[INFO] [info] 
[INFO] [info] 
[INFO] [info] 
[INFO] [info] 
[INFO] [info] 
[INFO] [info] 
[INFO] [info] 
[INFO] [info] 
[INFO] [info] 
[INFO] [info] 
[INFO] [info] 
[INFO] [info] 
[INFO] [info] 
[INFO] [info] 
[INFO] [INFO] 
[INFO] [INFO] --- maven-resources-plugin:3.0.2:resources (default-resources) @ waiting.bundle ---
[INFO] [INFO] Using 'UTF-8' encoding to copy filtered resources.
[INFO] [INFO] Copying 2 resources
[INFO] [INFO] 
[INFO] [INFO] --- maven-compiler-plugin:3.6.1:compile (default-compile) @ waiting.bundle ---
[INFO] [INFO] No sources to compile
[INFO] [INFO] 
[INFO] [INFO] --- maven-resources-plugin:3.0.2:testResources (default-testResources) @ waiting.bundle ---
[INFO] [INFO] Using 'UTF-8' encoding to copy filtered resources.
[INFO] [INFO] skip non existing resourceDirectory /jobs/genie.gemini/gemini-blueprint-stage-release/workspace/integration-tests/bundles/blueprint/waiting.bundle/src/test/resources
[INFO] [INFO] 
[INFO] [INFO] --- maven-compiler-plugin:3.6.1:testCompile (default-testCompile) @ waiting.bundle ---
[INFO] [INFO] No sources to compile
[INFO] [INFO] 
[INFO] [INFO] --- maven-surefire-plugin:2.19.1:test (default-test) @ waiting.bundle ---
[INFO] [INFO] Tests are skipped.
[INFO] [INFO] 
[INFO] [INFO] --- maven-site-plugin:3.6:site (site) @ waiting.bundle ---
[INFO] [INFO] maven.site.skip = true: Skipping site generation
[INFO] [INFO] 
[INFO] [INFO] --- maven-jar-plugin:3.0.2:jar (default-jar) @ waiting.bundle ---
[INFO] [INFO] Building jar: /jobs/genie.gemini/gemini-blueprint-stage-release/workspace/integration-tests/bundles/blueprint/waiting.bundle/target/waiting.bundle-2.1.0.M1-SNAPSHOT.jar
[INFO] [INFO] 
[INFO] [INFO] --- maven-source-plugin:2.2.1:jar-no-fork (attach-sources) @ waiting.bundle ---
[INFO] [INFO] Skipping source per configuration.
[INFO] [INFO] 
[INFO] [INFO] --- maven-gpg-plugin:1.6:sign (sign-artifacts) @ waiting.bundle ---
[INFO] [INFO]                                                                         
[INFO] [INFO] ------------------------------------------------------------------------
[INFO] [INFO] Building Eclipse Gemini Blueprint Test Bundle: Configuration test bundle 2.1.0.M1-SNAPSHOT
[INFO] [INFO] ------------------------------------------------------------------------
[INFO] [INFO] 
[INFO] [INFO] --- maven-clean-plugin:3.0.0:clean (default-clean) @ config.bundle ---
[INFO] [INFO] 
[INFO] [INFO] --- git-commit-id-plugin:2.1.5:revision (default) @ config.bundle ---
[INFO] [info] 
[INFO] [info] /jobs/genie.gemini/gemini-blueprint-stage-release/workspace/.git
[INFO] [info] 
[INFO] [info] 
[INFO] [info] 
[INFO] [info] 
[INFO] [info] 
[INFO] [info] 
[INFO] [info] 
[INFO] [info] 
[INFO] [info] 
[INFO] [info] 
[INFO] [info] 
[INFO] [info] 
[INFO] [info] 
[INFO] [info] 
[INFO] [info] 
[INFO] [INFO] 
[INFO] [INFO] --- maven-resources-plugin:3.0.2:resources (default-resources) @ config.bundle ---
[INFO] [INFO] Using 'UTF-8' encoding to copy filtered resources.
[INFO] [INFO] Copying 2 resources
[INFO] [INFO] 
[INFO] [INFO] --- maven-compiler-plugin:3.6.1:compile (default-compile) @ config.bundle ---
[INFO] [INFO] No sources to compile
[INFO] [INFO] 
[INFO] [INFO] --- maven-resources-plugin:3.0.2:testResources (default-testResources) @ config.bundle ---
[INFO] [INFO] Using 'UTF-8' encoding to copy filtered resources.
[INFO] [INFO] skip non existing resourceDirectory /jobs/genie.gemini/gemini-blueprint-stage-release/workspace/integration-tests/bundles/blueprint/config.bundle/src/test/resources
[INFO] [INFO] 
[INFO] [INFO] --- maven-compiler-plugin:3.6.1:testCompile (default-testCompile) @ config.bundle ---
[INFO] [INFO] No sources to compile
[INFO] [INFO] 
[INFO] [INFO] --- maven-surefire-plugin:2.19.1:test (default-test) @ config.bundle ---
[INFO] [INFO] Tests are skipped.
[INFO] [INFO] 
[INFO] [INFO] --- maven-site-plugin:3.6:site (site) @ config.bundle ---
[INFO] [INFO] maven.site.skip = true: Skipping site generation
[INFO] [INFO] 
[INFO] [INFO] --- maven-jar-plugin:3.0.2:jar (default-jar) @ config.bundle ---
[INFO] [INFO] Building jar: /jobs/genie.gemini/gemini-blueprint-stage-release/workspace/integration-tests/bundles/blueprint/config.bundle/target/config.bundle-2.1.0.M1-SNAPSHOT.jar
[INFO] [INFO] 
[INFO] [INFO] --- maven-source-plugin:2.2.1:jar-no-fork (attach-sources) @ config.bundle ---
[INFO] [INFO] Skipping source per configuration.
[INFO] [INFO] 
[INFO] [INFO] --- maven-gpg-plugin:1.6:sign (sign-artifacts) @ config.bundle ---
[INFO] [INFO]                                                                         
[INFO] [INFO] ------------------------------------------------------------------------
[INFO] [INFO] Building Eclipse Gemini Blueprint Integration Tests 2.1.0.M1-SNAPSHOT
[INFO] [INFO] ------------------------------------------------------------------------
[INFO] [INFO] 
[INFO] [INFO] --- maven-clean-plugin:3.0.0:clean (default-clean) @ gemini-blueprint-integration-tests ---
[INFO] [INFO] 
[INFO] [INFO] --- git-commit-id-plugin:2.1.5:revision (default) @ gemini-blueprint-integration-tests ---
[INFO] [info] 
[INFO] [info] /jobs/genie.gemini/gemini-blueprint-stage-release/workspace/.git
[INFO] [info] 
[INFO] [info] 
[INFO] [info] 
[INFO] [info] 
[INFO] [info] 
[INFO] [info] 
[INFO] [info] 
[INFO] [info] 
[INFO] [info] 
[INFO] [info] 
[INFO] [info] 
[INFO] [info] 
[INFO] [info] 
[INFO] [info] 
[INFO] [info] 
[INFO] [INFO] 
[INFO] [INFO] --- maven-resources-plugin:3.0.2:resources (default-resources) @ gemini-blueprint-integration-tests ---
[INFO] [INFO] Using 'UTF-8' encoding to copy filtered resources.
[INFO] [INFO] Copying 0 resource
[INFO] [INFO] 
[INFO] [INFO] --- maven-compiler-plugin:3.6.1:compile (default-compile) @ gemini-blueprint-integration-tests ---
[INFO] [INFO] No sources to compile
[INFO] [INFO] 
[INFO] [INFO] --- maven-resources-plugin:3.0.2:testResources (default-testResources) @ gemini-blueprint-integration-tests ---
[INFO] [INFO] Using 'UTF-8' encoding to copy filtered resources.
[INFO] [INFO] Copying 61 resources
[INFO] [INFO] 
[INFO] [INFO] --- maven-compiler-plugin:3.6.1:testCompile (default-testCompile) @ gemini-blueprint-integration-tests ---
[INFO] [INFO] Changes detected - recompiling the module!
[INFO] [INFO] Compiling 101 source files to /jobs/genie.gemini/gemini-blueprint-stage-release/workspace/integration-tests/tests/target/test-classes
[INFO] [INFO] 
[INFO] [INFO] --- maven-surefire-plugin:2.19.1:test (default-test) @ gemini-blueprint-integration-tests ---
[INFO] [INFO] Tests are skipped.
[INFO] [INFO] 
[INFO] [INFO] --- maven-site-plugin:3.6:site (site) @ gemini-blueprint-integration-tests ---
[INFO] [INFO] maven.site.skip = true: Skipping site generation
[INFO] [INFO] 
[INFO] [INFO] --- maven-jar-plugin:3.0.2:jar (default-jar) @ gemini-blueprint-integration-tests ---
[INFO] [INFO] Building jar: /jobs/genie.gemini/gemini-blueprint-stage-release/workspace/integration-tests/tests/target/gemini-blueprint-integration-tests-2.1.0.M1-SNAPSHOT.jar
[INFO] [INFO] 
[INFO] [INFO] --- maven-source-plugin:2.2.1:jar-no-fork (attach-sources) @ gemini-blueprint-integration-tests ---
[INFO] [INFO] Skipping source per configuration.
[INFO] [INFO] 
[INFO] [INFO] --- maven-gpg-plugin:1.6:sign (sign-artifacts) @ gemini-blueprint-integration-tests ---
[INFO] [INFO] ------------------------------------------------------------------------
[INFO] [INFO] Reactor Summary:
[INFO] [INFO] 
[INFO] [INFO] Gemini Blueprint ................................... SUCCESS [ 24.413 s]
[INFO] [INFO] Gemini Blueprint Mocks ............................. SUCCESS [ 26.909 s]
[INFO] [INFO] Gemini Blueprint IO ................................ SUCCESS [01:31 min]
[INFO] [INFO] Gemini Blueprint Core .............................. SUCCESS [01:24 min]
[INFO] [INFO] Gemini Blueprint Extender .......................... SUCCESS [ 42.204 s]
[INFO] [INFO] Gemini Blueprint Testing Framework ................. SUCCESS [ 58.811 s]
[INFO] [INFO] Eclipse Gemini Blueprint Integration Tests Parent .. SUCCESS [  0.018 s]
[INFO] [INFO] Eclipse Gemini Blueprint Integration Testing Bundles SUCCESS [  0.025 s]
[INFO] [INFO] Gemini Blueprint Test Bundle: Simple service test bundle SUCCESS [  1.330 s]
[INFO] [INFO] Gemini Blueprint Test Bundle: Simple service test bundle (impl differs) SUCCESS [  1.356 s]
[INFO] [INFO] Gemini Blueprint Test Bundle: Simple service test bundle (impl differs) SUCCESS [  1.370 s]
[INFO] [INFO] Gemini Blueprint Test Bundle: Simple service test bundle 2 SUCCESS [  0.524 s]
[INFO] [INFO] Gemini Blueprint Test Bundle: Simple service test bundle 3 SUCCESS [  0.528 s]
[INFO] [INFO] Gemini Blueprint Test Bundle: Simple service created by a factory which has a non trivial delay in createObject() SUCCESS [  1.286 s]
[INFO] [INFO] Gemini Blueprint Test Bundle: Trivial OSGi bundle .. SUCCESS [  1.164 s]
[INFO] [INFO] Gemini Blueprint Test Bundle: Simple test that uses trivial bundle SUCCESS [  1.177 s]
[INFO] [INFO] Gemini Blueprint Test Bundle: Spring context lifecycle test bundle SUCCESS [  1.244 s]
[INFO] [INFO] Gemini Blueprint Test Bundle: Spring context service listener test bundle SUCCESS [  1.177 s]
[INFO] [INFO] Gemini Blueprint Test Bundle: Spring context service reference lifecycle test bundle SUCCESS [  1.183 s]
[INFO] [INFO] Gemini Blueprint Test Bundle: Spring context service reference destruction test bundle SUCCESS [  1.212 s]
[INFO] [INFO] Gemini Blueprint Test Bundle: Spring context dependencies test bundle SUCCESS [  1.285 s]
[INFO] [INFO] Gemini Blueprint Test Bundle: Spring context service reference cardinality 0..1 bundle SUCCESS [  1.330 s]
[INFO] [INFO] Gemini Blueprint Test Bundle: Bundle scoping test bundle - A SUCCESS [  1.329 s]
[INFO] [INFO] Gemini Blueprint Test Bundle: Bundle scoping test bundle - B SUCCESS [  1.288 s]
[INFO] [INFO] Gemini Blueprint Test Bundle: Bundle scoping test bundle - Common SUCCESS [  1.213 s]
[INFO] [INFO] Gemini Blueprint Test Bundle: IO fragment 1 bundle . SUCCESS [  0.446 s]
[INFO] [INFO] Gemini Blueprint Test Bundle: IO fragment 2 bundle . SUCCESS [  0.419 s]
[INFO] [INFO] Gemini Blueprint Test Bundle: Error bundle ......... SUCCESS [  1.205 s]
[INFO] [INFO] Gemini Blueprint Test Bundle: Deadlock bundle ...... SUCCESS [  1.176 s]
[INFO] [INFO] Gemini Blueprint Test Bundle: Configuration test bundle SUCCESS [  1.248 s]
[INFO] [INFO] Gemini Blueprint Test Bundle: ExtenderVersion-Test-Bundle SUCCESS [  0.403 s]
[INFO] [INFO] Gemini Blueprint Test Bundle: Integration testing bundles for configuration options SUCCESS [  0.020 s]
[INFO] [INFO] Gemini Blueprint Test Bundle: NoPublish-Bundle ..... SUCCESS [  0.402 s]
[INFO] [INFO] Gemini Blueprint Test Bundle: Async-NoWait-Bundle .. SUCCESS [  0.412 s]
[INFO] [INFO] Gemini Blueprint Test Bundle: Async-Wait-Bundle .... SUCCESS [  0.445 s]
[INFO] [INFO] Gemini Blueprint Test Bundle: Sync-NoWait-Bundle ... SUCCESS [  1.275 s]
[INFO] [INFO] Gemini Blueprint Test Bundle: Sync-Tail-Bundle ..... SUCCESS [  0.493 s]
[INFO] [INFO] Gemini Blueprint Test Bundle: Sync-Wait-Bundle ..... SUCCESS [  0.477 s]
[INFO] [INFO] Gemini Blueprint Test Bundle: Spring service TCCL management inteface test bundle SUCCESS [  1.230 s]
[INFO] [INFO] Gemini Blueprint Test Bundle: Spring service TCCL management test bundle SUCCESS [  1.193 s]
[INFO] [INFO] Gemini Blueprint Test Bundle: Config File With Dots bundle SUCCESS [  0.410 s]
[INFO] [INFO] Gemini Blueprint Test Bundle: Spring Proxy Creator bundle SUCCESS [  1.230 s]
[INFO] [INFO] Gemini Blueprint Test Bundle: Extender Configuration Fragment Bundle SUCCESS [  0.418 s]
[INFO] [INFO] Gemini Blueprint Test Bundle: JDK proxy test ....... SUCCESS [  1.260 s]
[INFO] [INFO] Gemini Blueprint Test Bundle: Extender Event listener bundle Bundle SUCCESS [  1.199 s]
[INFO] [INFO] Gemini Blueprint Test Bundle: namespace provider and consumer bundle SUCCESS [  1.258 s]
[INFO] [INFO] Gemini Blueprint Test Bundle: Just a listener exported as a service SUCCESS [  1.238 s]
[INFO] [INFO] Gemini Blueprint Test Bundle: Export Import Dependency Bundle SUCCESS [  1.317 s]
[INFO] [INFO] Eclipse Gemini Blueprint JDK5 Integration Testing Bundles SUCCESS [  0.021 s]
[INFO] [INFO] Gemini Blueprint Test Bundle: @Component beans bundle SUCCESS [  1.368 s]
[INFO] [INFO] Eclipse Gemini Blueprint Test Bundle: Recursive Type test bundle SUCCESS [  1.209 s]
[INFO] [INFO] Gemini Blueprint Integration Testing Bundles ....... SUCCESS [  0.022 s]
[INFO] [INFO] Eclipse Gemini Blueprint Test Bundle: Simple service test bundle SUCCESS [  0.396 s]
[INFO] [INFO] Eclipse Gemini Blueprint Test Bundle: Error bundle . SUCCESS [  0.400 s]
[INFO] [INFO] Eclipse Gemini Blueprint Test Bundle: Waiting bundle SUCCESS [  0.429 s]
[INFO] [INFO] Eclipse Gemini Blueprint Test Bundle: Configuration test bundle SUCCESS [  0.410 s]
[INFO] [INFO] Eclipse Gemini Blueprint Integration Tests ......... SUCCESS [  3.218 s]
[INFO] [INFO] ------------------------------------------------------------------------
[INFO] [INFO] BUILD SUCCESS
[INFO] [INFO] ------------------------------------------------------------------------
[INFO] [INFO] Total time: 06:17 min
[INFO] [INFO] Finished at: 2017-03-02T08:13:08-05:00
[INFO] [INFO] Final Memory: 120M/2033M
[INFO] [INFO] ------------------------------------------------------------------------
[INFO] Checking in modified POMs...
[INFO] Executing: /bin/sh -c cd /jobs/genie.gemini/gemini-blueprint-stage-release/workspace && git add -- pom.xml mock/pom.xml io/pom.xml core/pom.xml extender/pom.xml test-support/pom.xml integration-tests/pom.xml integration-tests/bundles/pom.xml integration-tests/bundles/simple.service.bundle/pom.xml integration-tests/bundles/simple.service.bundle.identical/pom.xml integration-tests/bundles/simple.service.bundle.2.identical/pom.xml integration-tests/bundles/simple.service.2.bundle/pom.xml integration-tests/bundles/simple.service.3.bundle/pom.xml integration-tests/bundles/dependency.factory.bundle/pom.xml integration-tests/bundles/trivial.bundle/pom.xml integration-tests/bundles/trivial.test.bundle/pom.xml integration-tests/bundles/lifecycle.test.bundle/pom.xml integration-tests/bundles/service.listener.bundle/pom.xml integration-tests/bundles/reference.test.bundle/pom.xml integration-tests/bundles/proxy.destruction.test.bundle/pom.xml integration-tests/bundles/dependency.test.bundle/pom.xml integration-tests/bundles/cardinality.0to1.bundle/pom.xml integration-tests/bundles/scoped.a.bundle/pom.xml integration-tests/bundles/scoped.b.bundle/pom.xml integration-tests/bundles/scoped.common.bundle/pom.xml integration-tests/bundles/io.fragment.1.bundle/pom.xml integration-tests/bundles/io.fragment.2.bundle/pom.xml integration-tests/bundles/error.bundle/pom.xml integration-tests/bundles/deadlock.bundle/pom.xml integration-tests/bundles/configuration.test.bundle/pom.xml integration-tests/bundles/extender.version.bundle/pom.xml integration-tests/bundles/config.bundle/pom.xml integration-tests/bundles/config.bundle/no.publish.bundle/pom.xml integration-tests/bundles/config.bundle/async.nowait.bundle/pom.xml integration-tests/bundles/config.bundle/async.wait.bundle/pom.xml integration-tests/bundles/config.bundle/sync.nowait.bundle/pom.xml integration-tests/bundles/config.bundle/sync.tail.bundle/pom.xml integration-tests/bundles/config.bundle/sync.wait.bundle/pom.xml integration-tests/bundles/tccl.intf.bundle/pom.xml integration-tests/bundles/tccl.bundle/pom.xml integration-tests/bundles/config.file.with.dots.bundle/pom.xml integration-tests/bundles/proxy.creator.bundle/pom.xml integration-tests/bundles/extender.fragment.bundle/pom.xml integration-tests/bundles/jdk.proxy.bundle/pom.xml integration-tests/bundles/extender.listener.bundle/pom.xml integration-tests/bundles/namespace.own.consumer.bundle/pom.xml integration-tests/bundles/proxy.listener/pom.xml integration-tests/bundles/export.import.dependency.bundle/pom.xml integration-tests/bundles/jdk5/pom.xml integration-tests/bundles/jdk5/component.scan.bundle/pom.xml integration-tests/bundles/recursive.type.bundle/pom.xml integration-tests/bundles/blueprint/pom.xml integration-tests/bundles/blueprint/simple.bundle/pom.xml integration-tests/bundles/blueprint/error.bundle/pom.xml integration-tests/bundles/blueprint/waiting.bundle/pom.xml integration-tests/bundles/blueprint/config.bundle/pom.xml integration-tests/tests/pom.xml
[INFO] Working directory: /jobs/genie.gemini/gemini-blueprint-stage-release/workspace
[INFO] Executing: /bin/sh -c cd /jobs/genie.gemini/gemini-blueprint-stage-release/workspace && git rev-parse --show-toplevel
[INFO] Working directory: /jobs/genie.gemini/gemini-blueprint-stage-release/workspace
[INFO] Executing: /bin/sh -c cd /jobs/genie.gemini/gemini-blueprint-stage-release/workspace && git status --porcelain .
[INFO] Working directory: /jobs/genie.gemini/gemini-blueprint-stage-release/workspace
[WARNING] Ignoring unrecognized line: ?? .maven/
[WARNING] Ignoring unrecognized line: ?? core/pom.xml.releaseBackup
[WARNING] Ignoring unrecognized line: ?? extender/pom.xml.releaseBackup
[WARNING] Ignoring unrecognized line: ?? integration-tests/bundles/blueprint/config.bundle/pom.xml.releaseBackup
[WARNING] Ignoring unrecognized line: ?? integration-tests/bundles/blueprint/error.bundle/pom.xml.releaseBackup
[WARNING] Ignoring unrecognized line: ?? integration-tests/bundles/blueprint/pom.xml.releaseBackup
[WARNING] Ignoring unrecognized line: ?? integration-tests/bundles/blueprint/simple.bundle/pom.xml.releaseBackup
[WARNING] Ignoring unrecognized line: ?? integration-tests/bundles/blueprint/waiting.bundle/pom.xml.releaseBackup
[WARNING] Ignoring unrecognized line: ?? integration-tests/bundles/cardinality.0to1.bundle/pom.xml.releaseBackup
[WARNING] Ignoring unrecognized line: ?? integration-tests/bundles/config.bundle/async.nowait.bundle/pom.xml.releaseBackup
[WARNING] Ignoring unrecognized line: ?? integration-tests/bundles/config.bundle/async.wait.bundle/pom.xml.releaseBackup
[WARNING] Ignoring unrecognized line: ?? integration-tests/bundles/config.bundle/no.publish.bundle/pom.xml.releaseBackup
[WARNING] Ignoring unrecognized line: ?? integration-tests/bundles/config.bundle/pom.xml.releaseBackup
[WARNING] Ignoring unrecognized line: ?? integration-tests/bundles/config.bundle/sync.nowait.bundle/pom.xml.releaseBackup
[WARNING] Ignoring unrecognized line: ?? integration-tests/bundles/config.bundle/sync.tail.bundle/pom.xml.releaseBackup
[WARNING] Ignoring unrecognized line: ?? integration-tests/bundles/config.bundle/sync.wait.bundle/pom.xml.releaseBackup
[WARNING] Ignoring unrecognized line: ?? integration-tests/bundles/config.file.with.dots.bundle/pom.xml.releaseBackup
[WARNING] Ignoring unrecognized line: ?? integration-tests/bundles/configuration.test.bundle/pom.xml.releaseBackup
[WARNING] Ignoring unrecognized line: ?? integration-tests/bundles/deadlock.bundle/pom.xml.releaseBackup
[WARNING] Ignoring unrecognized line: ?? integration-tests/bundles/dependency.factory.bundle/pom.xml.releaseBackup
[WARNING] Ignoring unrecognized line: ?? integration-tests/bundles/dependency.test.bundle/pom.xml.releaseBackup
[WARNING] Ignoring unrecognized line: ?? integration-tests/bundles/error.bundle/pom.xml.releaseBackup
[WARNING] Ignoring unrecognized line: ?? integration-tests/bundles/export.import.dependency.bundle/pom.xml.releaseBackup
[WARNING] Ignoring unrecognized line: ?? integration-tests/bundles/extender.fragment.bundle/pom.xml.releaseBackup
[WARNING] Ignoring unrecognized line: ?? integration-tests/bundles/extender.listener.bundle/pom.xml.releaseBackup
[WARNING] Ignoring unrecognized line: ?? integration-tests/bundles/extender.version.bundle/pom.xml.releaseBackup
[WARNING] Ignoring unrecognized line: ?? integration-tests/bundles/io.fragment.1.bundle/pom.xml.releaseBackup
[WARNING] Ignoring unrecognized line: ?? integration-tests/bundles/io.fragment.2.bundle/pom.xml.releaseBackup
[WARNING] Ignoring unrecognized line: ?? integration-tests/bundles/jdk.proxy.bundle/pom.xml.releaseBackup
[WARNING] Ignoring unrecognized line: ?? integration-tests/bundles/jdk5/component.scan.bundle/pom.xml.releaseBackup
[WARNING] Ignoring unrecognized line: ?? integration-tests/bundles/jdk5/pom.xml.releaseBackup
[WARNING] Ignoring unrecognized line: ?? integration-tests/bundles/lifecycle.test.bundle/pom.xml.releaseBackup
[WARNING] Ignoring unrecognized line: ?? integration-tests/bundles/namespace.own.consumer.bundle/pom.xml.releaseBackup
[WARNING] Ignoring unrecognized line: ?? integration-tests/bundles/pom.xml.releaseBackup
[WARNING] Ignoring unrecognized line: ?? integration-tests/bundles/proxy.creator.bundle/pom.xml.releaseBackup
[WARNING] Ignoring unrecognized line: ?? integration-tests/bundles/proxy.destruction.test.bundle/pom.xml.releaseBackup
[WARNING] Ignoring unrecognized line: ?? integration-tests/bundles/proxy.listener/pom.xml.releaseBackup
[WARNING] Ignoring unrecognized line: ?? integration-tests/bundles/recursive.type.bundle/pom.xml.releaseBackup
[WARNING] Ignoring unrecognized line: ?? integration-tests/bundles/reference.test.bundle/pom.xml.releaseBackup
[WARNING] Ignoring unrecognized line: ?? integration-tests/bundles/scoped.a.bundle/pom.xml.releaseBackup
[WARNING] Ignoring unrecognized line: ?? integration-tests/bundles/scoped.b.bundle/pom.xml.releaseBackup
[WARNING] Ignoring unrecognized line: ?? integration-tests/bundles/scoped.common.bundle/pom.xml.releaseBackup
[WARNING] Ignoring unrecognized line: ?? integration-tests/bundles/service.listener.bundle/pom.xml.releaseBackup
[WARNING] Ignoring unrecognized line: ?? integration-tests/bundles/simple.service.2.bundle/pom.xml.releaseBackup
[WARNING] Ignoring unrecognized line: ?? integration-tests/bundles/simple.service.3.bundle/pom.xml.releaseBackup
[WARNING] Ignoring unrecognized line: ?? integration-tests/bundles/simple.service.bundle.2.identical/pom.xml.releaseBackup
[WARNING] Ignoring unrecognized line: ?? integration-tests/bundles/simple.service.bundle.identical/pom.xml.releaseBackup
[WARNING] Ignoring unrecognized line: ?? integration-tests/bundles/simple.service.bundle/pom.xml.releaseBackup
[WARNING] Ignoring unrecognized line: ?? integration-tests/bundles/tccl.bundle/pom.xml.releaseBackup
[WARNING] Ignoring unrecognized line: ?? integration-tests/bundles/tccl.intf.bundle/pom.xml.releaseBackup
[WARNING] Ignoring unrecognized line: ?? integration-tests/bundles/trivial.bundle/pom.xml.releaseBackup
[WARNING] Ignoring unrecognized line: ?? integration-tests/bundles/trivial.test.bundle/pom.xml.releaseBackup
[WARNING] Ignoring unrecognized line: ?? integration-tests/pom.xml.releaseBackup
[WARNING] Ignoring unrecognized line: ?? integration-tests/tests/pom.xml.releaseBackup
[WARNING] Ignoring unrecognized line: ?? io/pom.xml.releaseBackup
[WARNING] Ignoring unrecognized line: ?? mock/pom.xml.releaseBackup
[WARNING] Ignoring unrecognized line: ?? pom.xml.releaseBackup
[WARNING] Ignoring unrecognized line: ?? release.properties
[WARNING] Ignoring unrecognized line: ?? test-support/pom.xml.releaseBackup
[INFO] Tagging release with the label 2.1.0.M1...
[INFO] Executing: /bin/sh -c cd /jobs/genie.gemini/gemini-blueprint-stage-release/workspace && git tag -F /tmp/maven-scm-1043628782.commit 2.1.0.M1
[INFO] Working directory: /jobs/genie.gemini/gemini-blueprint-stage-release/workspace
[INFO] Executing: /bin/sh -c cd /jobs/genie.gemini/gemini-blueprint-stage-release/workspace && git push ssh:********@git.eclipse.org/gitroot/gemini.blueprint/org.eclipse.gemini.blueprint.git refs/tags/2.1.0.M1
[INFO] Working directory: /jobs/genie.gemini/gemini-blueprint-stage-release/workspace
[INFO] ------------------------------------------------------------------------
[INFO] Reactor Summary:
[INFO] 
[INFO] Gemini Blueprint ................................... FAILURE [06:21 min]
[INFO] Gemini Blueprint Mocks ............................. SUCCESS [  0.063 s]
[INFO] Gemini Blueprint IO ................................ SUCCESS [  0.054 s]
[INFO] Gemini Blueprint Core .............................. SUCCESS [  0.133 s]
[INFO] Gemini Blueprint Extender .......................... SUCCESS [  0.070 s]
[INFO] Gemini Blueprint Testing Framework ................. SUCCESS [  0.063 s]
[INFO] Eclipse Gemini Blueprint Integration Tests Parent .. SUCCESS [  0.046 s]
[INFO] Eclipse Gemini Blueprint Integration Testing Bundles SUCCESS [  0.042 s]
[INFO] Gemini Blueprint Test Bundle: Simple service test bundle SUCCESS [  0.048 s]
[INFO] Gemini Blueprint Test Bundle: Simple service test bundle (impl differs) SUCCESS [  0.046 s]
[INFO] Gemini Blueprint Test Bundle: Simple service test bundle (impl differs) SUCCESS [  0.050 s]
[INFO] Gemini Blueprint Test Bundle: Simple service test bundle 2 SUCCESS [  0.044 s]
[INFO] Gemini Blueprint Test Bundle: Simple service test bundle 3 SUCCESS [  0.044 s]
[INFO] Gemini Blueprint Test Bundle: Simple service created by a factory which has a non trivial delay in createObject() SUCCESS [  0.046 s]
[INFO] Gemini Blueprint Test Bundle: Trivial OSGi bundle .. SUCCESS [  0.045 s]
[INFO] Gemini Blueprint Test Bundle: Simple test that uses trivial bundle SUCCESS [  0.052 s]
[INFO] Gemini Blueprint Test Bundle: Spring context lifecycle test bundle SUCCESS [  0.047 s]
[INFO] Gemini Blueprint Test Bundle: Spring context service listener test bundle SUCCESS [  0.047 s]
[INFO] Gemini Blueprint Test Bundle: Spring context service reference lifecycle test bundle SUCCESS [  0.047 s]
[INFO] Gemini Blueprint Test Bundle: Spring context service reference destruction test bundle SUCCESS [  0.046 s]
[INFO] Gemini Blueprint Test Bundle: Spring context dependencies test bundle SUCCESS [  0.047 s]
[INFO] Gemini Blueprint Test Bundle: Spring context service reference cardinality 0..1 bundle SUCCESS [  0.047 s]
[INFO] Gemini Blueprint Test Bundle: Bundle scoping test bundle - A SUCCESS [  0.046 s]
[INFO] Gemini Blueprint Test Bundle: Bundle scoping test bundle - B SUCCESS [  0.046 s]
[INFO] Gemini Blueprint Test Bundle: Bundle scoping test bundle - Common SUCCESS [  0.047 s]
[INFO] Gemini Blueprint Test Bundle: IO fragment 1 bundle . SUCCESS [  0.046 s]
[INFO] Gemini Blueprint Test Bundle: IO fragment 2 bundle . SUCCESS [  0.046 s]
[INFO] Gemini Blueprint Test Bundle: Error bundle ......... SUCCESS [  0.046 s]
[INFO] Gemini Blueprint Test Bundle: Deadlock bundle ...... SUCCESS [  0.046 s]
[INFO] Gemini Blueprint Test Bundle: Configuration test bundle SUCCESS [  0.047 s]
[INFO] Gemini Blueprint Test Bundle: ExtenderVersion-Test-Bundle SUCCESS [  0.045 s]
[INFO] Gemini Blueprint Test Bundle: Integration testing bundles for configuration options SUCCESS [  0.043 s]
[INFO] Gemini Blueprint Test Bundle: NoPublish-Bundle ..... SUCCESS [  0.044 s]
[INFO] Gemini Blueprint Test Bundle: Async-NoWait-Bundle .. SUCCESS [  0.044 s]
[INFO] Gemini Blueprint Test Bundle: Async-Wait-Bundle .... SUCCESS [  0.044 s]
[INFO] Gemini Blueprint Test Bundle: Sync-NoWait-Bundle ... SUCCESS [  0.046 s]
[INFO] Gemini Blueprint Test Bundle: Sync-Tail-Bundle ..... SUCCESS [  0.044 s]
[INFO] Gemini Blueprint Test Bundle: Sync-Wait-Bundle ..... SUCCESS [  0.044 s]
[INFO] Gemini Blueprint Test Bundle: Spring service TCCL management inteface test bundle SUCCESS [  0.046 s]
[INFO] Gemini Blueprint Test Bundle: Spring service TCCL management test bundle SUCCESS [  0.047 s]
[INFO] Gemini Blueprint Test Bundle: Config File With Dots bundle SUCCESS [  0.044 s]
[INFO] Gemini Blueprint Test Bundle: Spring Proxy Creator bundle SUCCESS [  0.046 s]
[INFO] Gemini Blueprint Test Bundle: Extender Configuration Fragment Bundle SUCCESS [  0.044 s]
[INFO] Gemini Blueprint Test Bundle: JDK proxy test ....... SUCCESS [  0.047 s]
[INFO] Gemini Blueprint Test Bundle: Extender Event listener bundle Bundle SUCCESS [  0.047 s]
[INFO] Gemini Blueprint Test Bundle: namespace provider and consumer bundle SUCCESS [  0.047 s]
[INFO] Gemini Blueprint Test Bundle: Just a listener exported as a service SUCCESS [  0.047 s]
[INFO] Gemini Blueprint Test Bundle: Export Import Dependency Bundle SUCCESS [  0.046 s]
[INFO] Eclipse Gemini Blueprint JDK5 Integration Testing Bundles SUCCESS [  0.042 s]
[INFO] Gemini Blueprint Test Bundle: @Component beans bundle SUCCESS [  0.050 s]
[INFO] Eclipse Gemini Blueprint Test Bundle: Recursive Type test bundle SUCCESS [  0.046 s]
[INFO] Gemini Blueprint Integration Testing Bundles ....... SUCCESS [  0.042 s]
[INFO] Eclipse Gemini Blueprint Test Bundle: Simple service test bundle SUCCESS [  0.044 s]
[INFO] Eclipse Gemini Blueprint Test Bundle: Error bundle . SUCCESS [  0.044 s]
[INFO] Eclipse Gemini Blueprint Test Bundle: Waiting bundle SUCCESS [  0.045 s]
[INFO] Eclipse Gemini Blueprint Test Bundle: Configuration test bundle SUCCESS [  0.048 s]
[INFO] Eclipse Gemini Blueprint Integration Tests ......... SUCCESS [  0.082 s]
[INFO] ------------------------------------------------------------------------
[INFO] BUILD FAILURE
[INFO] ------------------------------------------------------------------------
[INFO] Total time: 06:32 min
[INFO] Finished at: 2017-03-02T08:13:09-05:00
[INFO] Final Memory: 38M/1931M
[INFO] ------------------------------------------------------------------------
[INFO] o.h.m.e.h.MavenExecutionResultHandler - Build failed with exception(s)
[INFO] o.h.m.e.h.MavenExecutionResultHandler - [1] org.apache.maven.lifecycle.LifecycleExecutionException: Failed to execute goal org.apache.maven.plugins:maven-release-plugin:2.5.3:prepare (default-cli) on project gemini-blueprint: Unable to tag SCM
Provider message:
The git-push command failed.
Command output:
Host key verification failed.
fatal: Could not read from remote repository.

Please make sure you have the correct access rights
and the repository exists.

[DEBUG] Closing connection to remote
[ERROR] Failed to execute goal org.apache.maven.plugins:maven-release-plugin:2.5.3:prepare (default-cli) on project gemini-blueprint: Unable to tag SCM
[ERROR] Provider message:
[ERROR] The git-push command failed.
[ERROR] Command output:
[ERROR] Host key verification failed.
[ERROR] fatal: Could not read from remote repository.
[ERROR] 
[ERROR] Please make sure you have the correct access rights
[ERROR] and the repository exists.
[ERROR] -> [Help 1]
[ERROR] 
[ERROR] To see the full stack trace of the errors, re-run Maven with the -e switch.
[ERROR] Re-run Maven using the -X switch to enable full debug logging.
[ERROR] 
[ERROR] For more information about the errors and possible solutions, please read the following articles:
[ERROR] [Help 1] http://cwiki.apache.org/confluence/display/MAVEN/MojoFailureException
[DEBUG] Waiting for process to finish
[DEBUG] Result: 1
Recording test results
Sending e-mails to: olaf@x100.de
Finished: FAILURE