FailedConsole Output

Started by user nyoescape@gmail.com
[INFO] Using Maven 3 installation: apache-maven-latest
[INFO] Checking Maven 3 installation environment
[workspace] $ /shared/common/apache-maven-latest/bin/mvn --help
[INFO] Checking Maven 3 installation version
[INFO] Detected Maven 3 installation version: 3.3.9
[workspace] $ /shared/common/apache-maven-latest/bin/mvn -X -V -B -Dmaven.ext.class.path=/home/hudson/genie.epsilon/.hudson/maven/slavebundle/resources:/home/hudson/genie.epsilon/.hudson/maven/slavebundle/lib/maven3-eventspy-3.1.jar:/home/hudson/genie.epsilon/.hudson/war/webapp/WEB-INF/lib/hudson-remoting-3.0.3.jar -Dhudson.eventspy.port=40444 -f pom.xml
[DEBUG] Waiting for connection on port: 40444
Apache Maven 3.3.9 (bb52d8502b132ec0a5a3f4c09453c07478323dc5; 2015-11-10T11:41:47-05:00)
Maven home: /shared/common/apache-maven-latest
Java version: 1.7.0_80, vendor: Oracle Corporation
Java home: /opt/public/common/jdk1.7.0_80/jre
Default locale: en_US, platform encoding: UTF-8
OS name: "linux", version: "3.0.101-0.47.71-default", arch: "amd64", family: "unix"
[DEBUG]   Included /home/hudson/genie.epsilon/.hudson/maven/slavebundle/resources
[DEBUG]   Included /home/hudson/genie.epsilon/.hudson/maven/slavebundle/lib/maven3-eventspy-3.1.jar
[DEBUG]   Included /home/hudson/genie.epsilon/.hudson/war/webapp/WEB-INF/lib/hudson-remoting-3.0.3.jar
[DEBUG] Populating class realm maven.ext
[DEBUG]   Included /home/hudson/genie.epsilon/.hudson/maven/slavebundle/resources
[DEBUG]   Included /home/hudson/genie.epsilon/.hudson/maven/slavebundle/lib/maven3-eventspy-3.1.jar
[DEBUG]   Included /home/hudson/genie.epsilon/.hudson/war/webapp/WEB-INF/lib/hudson-remoting-3.0.3.jar
SLF4J: Class path contains multiple SLF4J bindings.
SLF4J: Found binding in [jar:file:/home/hudson/genie.epsilon/.hudson/maven/slavebundle/lib/maven3-eventspy-runtime.jar!/org/slf4j/impl/StaticLoggerBinder.class]
SLF4J: Found binding in [jar:file:/shared/common/apache-maven-latest/lib/slf4j-simple-1.7.5.jar!/org/slf4j/impl/StaticLoggerBinder.class]
SLF4J: See http://www.slf4j.org/codes.html#multiple_bindings for an explanation.
[DEBUG] Connected to remote
[DEBUG] Created new class realm maven.api
[DEBUG] Importing foreign packages into class realm maven.api
[DEBUG]   Imported: javax.enterprise.inject.* < maven.ext
[DEBUG]   Imported: javax.enterprise.util.* < maven.ext
[DEBUG]   Imported: javax.inject.* < maven.ext
[DEBUG]   Imported: org.apache.maven.* < maven.ext
[DEBUG]   Imported: org.apache.maven.artifact < maven.ext
[DEBUG]   Imported: org.apache.maven.classrealm < maven.ext
[DEBUG]   Imported: org.apache.maven.cli < maven.ext
[DEBUG]   Imported: org.apache.maven.configuration < maven.ext
[DEBUG]   Imported: org.apache.maven.exception < maven.ext
[DEBUG]   Imported: org.apache.maven.execution < maven.ext
[DEBUG]   Imported: org.apache.maven.execution.scope < maven.ext
[DEBUG]   Imported: org.apache.maven.lifecycle < maven.ext
[DEBUG]   Imported: org.apache.maven.model < maven.ext
[DEBUG]   Imported: org.apache.maven.monitor < maven.ext
[DEBUG]   Imported: org.apache.maven.plugin < maven.ext
[DEBUG]   Imported: org.apache.maven.profiles < maven.ext
[DEBUG]   Imported: org.apache.maven.project < maven.ext
[DEBUG]   Imported: org.apache.maven.reporting < maven.ext
[DEBUG]   Imported: org.apache.maven.repository < maven.ext
[DEBUG]   Imported: org.apache.maven.rtinfo < maven.ext
[DEBUG]   Imported: org.apache.maven.settings < maven.ext
[DEBUG]   Imported: org.apache.maven.toolchain < maven.ext
[DEBUG]   Imported: org.apache.maven.usability < maven.ext
[DEBUG]   Imported: org.apache.maven.wagon.* < maven.ext
[DEBUG]   Imported: org.apache.maven.wagon.authentication < maven.ext
[DEBUG]   Imported: org.apache.maven.wagon.authorization < maven.ext
[DEBUG]   Imported: org.apache.maven.wagon.events < maven.ext
[DEBUG]   Imported: org.apache.maven.wagon.observers < maven.ext
[DEBUG]   Imported: org.apache.maven.wagon.proxy < maven.ext
[DEBUG]   Imported: org.apache.maven.wagon.repository < maven.ext
[DEBUG]   Imported: org.apache.maven.wagon.resource < maven.ext
[DEBUG]   Imported: org.codehaus.classworlds < maven.ext
[DEBUG]   Imported: org.codehaus.plexus.* < maven.ext
[DEBUG]   Imported: org.codehaus.plexus.classworlds < maven.ext
[DEBUG]   Imported: org.codehaus.plexus.component < maven.ext
[DEBUG]   Imported: org.codehaus.plexus.configuration < maven.ext
[DEBUG]   Imported: org.codehaus.plexus.container < maven.ext
[DEBUG]   Imported: org.codehaus.plexus.context < maven.ext
[DEBUG]   Imported: org.codehaus.plexus.lifecycle < maven.ext
[DEBUG]   Imported: org.codehaus.plexus.logging < maven.ext
[DEBUG]   Imported: org.codehaus.plexus.personality < maven.ext
[DEBUG]   Imported: org.codehaus.plexus.util.xml.Xpp3Dom < maven.ext
[DEBUG]   Imported: org.codehaus.plexus.util.xml.pull.XmlPullParser < maven.ext
[DEBUG]   Imported: org.codehaus.plexus.util.xml.pull.XmlPullParserException < maven.ext
[DEBUG]   Imported: org.codehaus.plexus.util.xml.pull.XmlSerializer < maven.ext
[DEBUG]   Imported: org.eclipse.aether.* < maven.ext
[DEBUG]   Imported: org.eclipse.aether.artifact < maven.ext
[DEBUG]   Imported: org.eclipse.aether.collection < maven.ext
[DEBUG]   Imported: org.eclipse.aether.deployment < maven.ext
[DEBUG]   Imported: org.eclipse.aether.graph < maven.ext
[DEBUG]   Imported: org.eclipse.aether.impl < maven.ext
[DEBUG]   Imported: org.eclipse.aether.installation < maven.ext
[DEBUG]   Imported: org.eclipse.aether.internal.impl < maven.ext
[DEBUG]   Imported: org.eclipse.aether.metadata < maven.ext
[DEBUG]   Imported: org.eclipse.aether.repository < maven.ext
[DEBUG]   Imported: org.eclipse.aether.resolution < maven.ext
[DEBUG]   Imported: org.eclipse.aether.spi < maven.ext
[DEBUG]   Imported: org.eclipse.aether.transfer < maven.ext
[DEBUG]   Imported: org.eclipse.aether.version < maven.ext
[DEBUG]   Imported: org.slf4j.* < maven.ext
[DEBUG]   Imported: org.slf4j.helpers.* < maven.ext
[DEBUG]   Imported: org.slf4j.spi.* < maven.ext
[DEBUG] Populating class realm maven.api
[INFO] Error stacktraces are turned on.
[INFO] o.h.m.e.h.SettingsBuildingRequestHandler - Using settings document ID: eb27652f-cd10-4734-a605-0ca3e7ca5daf
[DEBUG] Reading global settings from /shared/common/apache-maven-latest/conf/settings.xml
[DEBUG] Reading user settings from (managed-document-id:eb27652f-cd10-4734-a605-0ca3e7ca5daf)
[WARN] o.h.m.e.EventSpyProcessor - Unhandled event: org.apache.maven.toolchain.building.DefaultToolchainsBuildingRequest@4ebb8efa (org.apache.maven.toolchain.building.DefaultToolchainsBuildingRequest)
[DEBUG] Reading global toolchains from /shared/common/apache-maven-latest/conf/toolchains.xml
[DEBUG] Reading user toolchains from /opt/public/hipp/homes/genie.epsilon/.m2/toolchains.xml
[WARN] o.h.m.e.EventSpyProcessor - Unhandled event: org.apache.maven.toolchain.building.DefaultToolchainsBuildingRequest@4ebb8efa (org.apache.maven.toolchain.building.DefaultToolchainsBuildingRequest)
[DEBUG] Using local repository at /opt/public/hipp/homes/genie.epsilon/.m2/repository
[DEBUG] Using manager EnhancedLocalRepositoryManager with priority 10.0 for /opt/public/hipp/homes/genie.epsilon/.m2/repository
[INFO] Scanning for projects...
[ERROR] [ERROR] Some problems were encountered while processing the POMs:
[FATAL] Non-readable POM /jobs/genie.epsilon/test-download-area-editable/workspace/pom.xml: /jobs/genie.epsilon/test-download-area-editable/workspace/pom.xml (No such file or directory) @ 
 @ 
[INFO] o.h.m.e.h.MavenExecutionResultHandler - Build failed with exception(s)
[INFO] o.h.m.e.h.MavenExecutionResultHandler - [1] org.apache.maven.project.ProjectBuildingException: Some problems were encountered while processing the POMs:
[FATAL] Non-readable POM /jobs/genie.epsilon/test-download-area-editable/workspace/pom.xml: /jobs/genie.epsilon/test-download-area-editable/workspace/pom.xml (No such file or directory) @ 

[DEBUG] Closing connection to remote
[ERROR] The build could not read 1 project -> [Help 1]
org.apache.maven.project.ProjectBuildingException: Some problems were encountered while processing the POMs:
[FATAL] Non-readable POM /jobs/genie.epsilon/test-download-area-editable/workspace/pom.xml: /jobs/genie.epsilon/test-download-area-editable/workspace/pom.xml (No such file or directory) @ 

	at org.apache.maven.project.DefaultProjectBuilder.build(DefaultProjectBuilder.java:422)
	at org.apache.maven.graph.DefaultGraphBuilder.collectProjects(DefaultGraphBuilder.java:419)
	at org.apache.maven.graph.DefaultGraphBuilder.getProjectsForMavenReactor(DefaultGraphBuilder.java:410)
	at org.apache.maven.graph.DefaultGraphBuilder.build(DefaultGraphBuilder.java:83)
	at org.apache.maven.DefaultMaven.buildGraph(DefaultMaven.java:491)
	at org.apache.maven.DefaultMaven.doExecute(DefaultMaven.java:219)
	at org.apache.maven.DefaultMaven.doExecute(DefaultMaven.java:193)
	at org.apache.maven.DefaultMaven.execute(DefaultMaven.java:106)
	at org.apache.maven.cli.MavenCli.execute(MavenCli.java:863)
	at org.apache.maven.cli.MavenCli.doMain(MavenCli.java:288)
	at org.apache.maven.cli.MavenCli.main(MavenCli.java:199)
	at sun.reflect.NativeMethodAccessorImpl.invoke0(Native Method)
	at sun.reflect.NativeMethodAccessorImpl.invoke(NativeMethodAccessorImpl.java:57)
	at sun.reflect.DelegatingMethodAccessorImpl.invoke(DelegatingMethodAccessorImpl.java:43)
	at java.lang.reflect.Method.invoke(Method.java:606)
	at org.codehaus.plexus.classworlds.launcher.Launcher.launchEnhanced(Launcher.java:289)
	at org.codehaus.plexus.classworlds.launcher.Launcher.launch(Launcher.java:229)
	at org.codehaus.plexus.classworlds.launcher.Launcher.mainWithExitCode(Launcher.java:415)
	at org.codehaus.plexus.classworlds.launcher.Launcher.main(Launcher.java:356)
[ERROR]   
[ERROR]   The project  (/jobs/genie.epsilon/test-download-area-editable/workspace/pom.xml) has 1 error
[ERROR]     Non-readable POM /jobs/genie.epsilon/test-download-area-editable/workspace/pom.xml: /jobs/genie.epsilon/test-download-area-editable/workspace/pom.xml (No such file or directory)
java.io.FileNotFoundException: /jobs/genie.epsilon/test-download-area-editable/workspace/pom.xml (No such file or directory)
	at java.io.FileInputStream.open(Native Method)
	at java.io.FileInputStream.<init>(FileInputStream.java:146)
	at org.apache.maven.building.FileSource.getInputStream(FileSource.java:53)
	at org.apache.maven.model.building.DefaultModelBuilder.readModel(DefaultModelBuilder.java:533)
	at org.apache.maven.model.building.DefaultModelBuilder.build(DefaultModelBuilder.java:273)
	at org.apache.maven.project.DefaultProjectBuilder.build(DefaultProjectBuilder.java:469)
	at org.apache.maven.project.DefaultProjectBuilder.build(DefaultProjectBuilder.java:438)
	at org.apache.maven.project.DefaultProjectBuilder.build(DefaultProjectBuilder.java:401)
	at org.apache.maven.graph.DefaultGraphBuilder.collectProjects(DefaultGraphBuilder.java:419)
	at org.apache.maven.graph.DefaultGraphBuilder.getProjectsForMavenReactor(DefaultGraphBuilder.java:410)
	at org.apache.maven.graph.DefaultGraphBuilder.build(DefaultGraphBuilder.java:83)
	at org.apache.maven.DefaultMaven.buildGraph(DefaultMaven.java:491)
	at org.apache.maven.DefaultMaven.doExecute(DefaultMaven.java:219)
	at org.apache.maven.DefaultMaven.doExecute(DefaultMaven.java:193)
	at org.apache.maven.DefaultMaven.execute(DefaultMaven.java:106)
	at org.apache.maven.cli.MavenCli.execute(MavenCli.java:863)
	at org.apache.maven.cli.MavenCli.doMain(MavenCli.java:288)
	at org.apache.maven.cli.MavenCli.main(MavenCli.java:199)
	at sun.reflect.NativeMethodAccessorImpl.invoke0(Native Method)
	at sun.reflect.NativeMethodAccessorImpl.invoke(NativeMethodAccessorImpl.java:57)
	at sun.reflect.DelegatingMethodAccessorImpl.invoke(DelegatingMethodAccessorImpl.java:43)
	at java.lang.reflect.Method.invoke(Method.java:606)
	at org.codehaus.plexus.classworlds.launcher.Launcher.launchEnhanced(Launcher.java:289)
	at org.codehaus.plexus.classworlds.launcher.Launcher.launch(Launcher.java:229)
	at org.codehaus.plexus.classworlds.launcher.Launcher.mainWithExitCode(Launcher.java:415)
	at org.codehaus.plexus.classworlds.launcher.Launcher.main(Launcher.java:356)
[ERROR] 
[ERROR] 
[ERROR] For more information about the errors and possible solutions, please read the following articles:
[ERROR] [Help 1] http://cwiki.apache.org/confluence/display/MAVEN/ProjectBuildingException
[DEBUG] Waiting for process to finish
[DEBUG] Result: 1
Finished: FAILURE