FailedConsole Output

Skipping 2,023 KB.. Full Log
bs/RC for 1.5.0/workspace/.repository/org/eclipse/epsilon/org.eclipse.epsilon.ewl.engine.test.acceptance/0.9.0-SNAPSHOT/org.eclipse.epsilon.ewl.engine.test.acceptance-0.9.0-SNAPSHOT-p2artifacts.xml
[INFO] 
[INFO] --- tycho-p2-plugin:1.0.0:update-local-index (default-update-local-index) @ org.eclipse.epsilon.ewl.engine.test.acceptance ---
[INFO]                                                                         
[INFO] ------------------------------------------------------------------------
[INFO] Building org.eclipse.epsilon.flock.engine.test.dependencies 0.0.1-SNAPSHOT
[INFO] ------------------------------------------------------------------------
[INFO] 
[INFO] --- maven-clean-plugin:2.5:clean (default-clean) @ org.eclipse.epsilon.flock.engine.test.dependencies ---
[INFO] 
[INFO] --- tycho-packaging-plugin:1.0.0:build-qualifier (default-build-qualifier) @ org.eclipse.epsilon.flock.engine.test.dependencies ---
[INFO] The project's OSGi version is 0.0.1.201807181629
[INFO] 
[INFO] --- tycho-packaging-plugin:1.0.0:validate-id (default-validate-id) @ org.eclipse.epsilon.flock.engine.test.dependencies ---
[INFO] 
[INFO] --- tycho-packaging-plugin:1.0.0:validate-version (default-validate-version) @ org.eclipse.epsilon.flock.engine.test.dependencies ---
[INFO] 
[INFO] --- maven-resources-plugin:2.4.3:resources (default-resources) @ org.eclipse.epsilon.flock.engine.test.dependencies ---
[INFO] Using 'UTF-8' encoding to copy filtered resources.
[INFO] skip non existing resourceDirectory /jobs/genie.epsilon/RC for 1.5.0/workspace/tests/org.eclipse.epsilon.flock.engine.test.dependencies/src/main/resources
[INFO] 
[INFO] --- tycho-compiler-plugin:1.0.0:compile (default-compile) @ org.eclipse.epsilon.flock.engine.test.dependencies ---
[INFO] 
[INFO] --- maven-resources-plugin:2.4.3:testResources (default-testResources) @ org.eclipse.epsilon.flock.engine.test.dependencies ---
[INFO] Using 'UTF-8' encoding to copy filtered resources.
[INFO] skip non existing resourceDirectory /jobs/genie.epsilon/RC for 1.5.0/workspace/tests/org.eclipse.epsilon.flock.engine.test.dependencies/src/test/resources
[INFO] 
[INFO] --- tycho-source-plugin:1.0.0:plugin-source (plugin-source) @ org.eclipse.epsilon.flock.engine.test.dependencies ---
[INFO] 
[INFO] --- target-platform-configuration:1.0.0:target-platform (default-target-platform) @ org.eclipse.epsilon.flock.engine.test.dependencies ---
[INFO] 
[INFO] --- tycho-packaging-plugin:1.0.0:package-plugin (default-package-plugin) @ org.eclipse.epsilon.flock.engine.test.dependencies ---
[INFO] Building jar: /jobs/genie.epsilon/RC for 1.5.0/workspace/tests/org.eclipse.epsilon.flock.engine.test.dependencies/target/org.eclipse.epsilon.flock.engine.test.dependencies-0.0.1-SNAPSHOT.jar
[INFO] 
[INFO] --- tycho-p2-plugin:1.0.0:p2-metadata-default (default-p2-metadata-default) @ org.eclipse.epsilon.flock.engine.test.dependencies ---
[INFO] 
[INFO] --- maven-install-plugin:2.3.1:install (default-install) @ org.eclipse.epsilon.flock.engine.test.dependencies ---
[INFO] Installing /jobs/genie.epsilon/RC for 1.5.0/workspace/tests/org.eclipse.epsilon.flock.engine.test.dependencies/target/org.eclipse.epsilon.flock.engine.test.dependencies-0.0.1-SNAPSHOT.jar to /home/hudson/genie.epsilon/.jenkins/jobs/RC for 1.5.0/workspace/.repository/org/eclipse/epsilon/org.eclipse.epsilon.flock.engine.test.dependencies/0.0.1-SNAPSHOT/org.eclipse.epsilon.flock.engine.test.dependencies-0.0.1-SNAPSHOT.jar
[INFO] Installing /jobs/genie.epsilon/RC for 1.5.0/workspace/tests/org.eclipse.epsilon.flock.engine.test.dependencies/pom.xml to /home/hudson/genie.epsilon/.jenkins/jobs/RC for 1.5.0/workspace/.repository/org/eclipse/epsilon/org.eclipse.epsilon.flock.engine.test.dependencies/0.0.1-SNAPSHOT/org.eclipse.epsilon.flock.engine.test.dependencies-0.0.1-SNAPSHOT.pom
[INFO] Installing /jobs/genie.epsilon/RC for 1.5.0/workspace/tests/org.eclipse.epsilon.flock.engine.test.dependencies/target/p2content.xml to /home/hudson/genie.epsilon/.jenkins/jobs/RC for 1.5.0/workspace/.repository/org/eclipse/epsilon/org.eclipse.epsilon.flock.engine.test.dependencies/0.0.1-SNAPSHOT/org.eclipse.epsilon.flock.engine.test.dependencies-0.0.1-SNAPSHOT-p2metadata.xml
[INFO] Installing /jobs/genie.epsilon/RC for 1.5.0/workspace/tests/org.eclipse.epsilon.flock.engine.test.dependencies/target/p2artifacts.xml to /home/hudson/genie.epsilon/.jenkins/jobs/RC for 1.5.0/workspace/.repository/org/eclipse/epsilon/org.eclipse.epsilon.flock.engine.test.dependencies/0.0.1-SNAPSHOT/org.eclipse.epsilon.flock.engine.test.dependencies-0.0.1-SNAPSHOT-p2artifacts.xml
[INFO] 
[INFO] --- tycho-p2-plugin:1.0.0:update-local-index (default-update-local-index) @ org.eclipse.epsilon.flock.engine.test.dependencies ---
[INFO]                                                                         
[INFO] ------------------------------------------------------------------------
[INFO] Building org.eclipse.epsilon.flock.engine.test.unit 0.0.1-SNAPSHOT
[INFO] ------------------------------------------------------------------------
[INFO] 
[INFO] --- maven-clean-plugin:2.5:clean (default-clean) @ org.eclipse.epsilon.flock.engine.test.unit ---
[INFO] 
[INFO] --- tycho-packaging-plugin:1.0.0:build-qualifier (default-build-qualifier) @ org.eclipse.epsilon.flock.engine.test.unit ---
[INFO] The project's OSGi version is 0.0.1.201807181629
[INFO] 
[INFO] --- tycho-packaging-plugin:1.0.0:validate-id (default-validate-id) @ org.eclipse.epsilon.flock.engine.test.unit ---
[INFO] 
[INFO] --- tycho-packaging-plugin:1.0.0:validate-version (default-validate-version) @ org.eclipse.epsilon.flock.engine.test.unit ---
[INFO] 
[INFO] --- maven-resources-plugin:2.4.3:resources (default-resources) @ org.eclipse.epsilon.flock.engine.test.unit ---
[INFO] Using 'UTF-8' encoding to copy filtered resources.
[INFO] skip non existing resourceDirectory /jobs/genie.epsilon/RC for 1.5.0/workspace/tests/org.eclipse.epsilon.flock.engine.test.unit/src/main/resources
[INFO] 
[INFO] --- tycho-compiler-plugin:1.0.0:compile (default-compile) @ org.eclipse.epsilon.flock.engine.test.unit ---
[WARNING] Parameter 'useProjectSettings' is set to true, but preferences file '/jobs/genie.epsilon/RC for 1.5.0/workspace/tests/org.eclipse.epsilon.flock.engine.test.unit/.settings/org.eclipse.jdt.core.prefs' could not be found!
[INFO] Compiling 24 source files to /jobs/genie.epsilon/RC for 1.5.0/workspace/tests/org.eclipse.epsilon.flock.engine.test.unit/target/classes
[INFO] 
[INFO] --- maven-resources-plugin:2.4.3:testResources (default-testResources) @ org.eclipse.epsilon.flock.engine.test.unit ---
[INFO] Using 'UTF-8' encoding to copy filtered resources.
[INFO] skip non existing resourceDirectory /jobs/genie.epsilon/RC for 1.5.0/workspace/tests/org.eclipse.epsilon.flock.engine.test.unit/src/test/resources
[INFO] 
[INFO] --- tycho-source-plugin:1.0.0:plugin-source (plugin-source) @ org.eclipse.epsilon.flock.engine.test.unit ---
[WARNING] bundle localization file /jobs/genie.epsilon/RC for 1.5.0/workspace/tests/org.eclipse.epsilon.flock.engine.test.unit/plugin.properties not found
[INFO] Building jar: /jobs/genie.epsilon/RC for 1.5.0/workspace/tests/org.eclipse.epsilon.flock.engine.test.unit/target/org.eclipse.epsilon.flock.engine.test.unit-0.0.1-SNAPSHOT-sources.jar
[INFO] 
[INFO] --- target-platform-configuration:1.0.0:target-platform (default-target-platform) @ org.eclipse.epsilon.flock.engine.test.unit ---
[INFO] 
[INFO] --- tycho-packaging-plugin:1.0.0:package-plugin (default-package-plugin) @ org.eclipse.epsilon.flock.engine.test.unit ---
[INFO] Building jar: /jobs/genie.epsilon/RC for 1.5.0/workspace/tests/org.eclipse.epsilon.flock.engine.test.unit/target/org.eclipse.epsilon.flock.engine.test.unit-0.0.1-SNAPSHOT.jar
[INFO] 
[INFO] --- tycho-p2-plugin:1.0.0:p2-metadata-default (default-p2-metadata-default) @ org.eclipse.epsilon.flock.engine.test.unit ---
[INFO] 
[INFO] --- maven-install-plugin:2.3.1:install (default-install) @ org.eclipse.epsilon.flock.engine.test.unit ---
[INFO] Installing /jobs/genie.epsilon/RC for 1.5.0/workspace/tests/org.eclipse.epsilon.flock.engine.test.unit/target/org.eclipse.epsilon.flock.engine.test.unit-0.0.1-SNAPSHOT.jar to /home/hudson/genie.epsilon/.jenkins/jobs/RC for 1.5.0/workspace/.repository/org/eclipse/epsilon/org.eclipse.epsilon.flock.engine.test.unit/0.0.1-SNAPSHOT/org.eclipse.epsilon.flock.engine.test.unit-0.0.1-SNAPSHOT.jar
[INFO] Installing /jobs/genie.epsilon/RC for 1.5.0/workspace/tests/org.eclipse.epsilon.flock.engine.test.unit/pom.xml to /home/hudson/genie.epsilon/.jenkins/jobs/RC for 1.5.0/workspace/.repository/org/eclipse/epsilon/org.eclipse.epsilon.flock.engine.test.unit/0.0.1-SNAPSHOT/org.eclipse.epsilon.flock.engine.test.unit-0.0.1-SNAPSHOT.pom
[INFO] Installing /jobs/genie.epsilon/RC for 1.5.0/workspace/tests/org.eclipse.epsilon.flock.engine.test.unit/target/org.eclipse.epsilon.flock.engine.test.unit-0.0.1-SNAPSHOT-sources.jar to /home/hudson/genie.epsilon/.jenkins/jobs/RC for 1.5.0/workspace/.repository/org/eclipse/epsilon/org.eclipse.epsilon.flock.engine.test.unit/0.0.1-SNAPSHOT/org.eclipse.epsilon.flock.engine.test.unit-0.0.1-SNAPSHOT-sources.jar
[INFO] Installing /jobs/genie.epsilon/RC for 1.5.0/workspace/tests/org.eclipse.epsilon.flock.engine.test.unit/target/p2content.xml to /home/hudson/genie.epsilon/.jenkins/jobs/RC for 1.5.0/workspace/.repository/org/eclipse/epsilon/org.eclipse.epsilon.flock.engine.test.unit/0.0.1-SNAPSHOT/org.eclipse.epsilon.flock.engine.test.unit-0.0.1-SNAPSHOT-p2metadata.xml
[INFO] Installing /jobs/genie.epsilon/RC for 1.5.0/workspace/tests/org.eclipse.epsilon.flock.engine.test.unit/target/p2artifacts.xml to /home/hudson/genie.epsilon/.jenkins/jobs/RC for 1.5.0/workspace/.repository/org/eclipse/epsilon/org.eclipse.epsilon.flock.engine.test.unit/0.0.1-SNAPSHOT/org.eclipse.epsilon.flock.engine.test.unit-0.0.1-SNAPSHOT-p2artifacts.xml
[INFO] 
[INFO] --- tycho-p2-plugin:1.0.0:update-local-index (default-update-local-index) @ org.eclipse.epsilon.flock.engine.test.unit ---
[INFO]                                                                         
[INFO] ------------------------------------------------------------------------
[INFO] Building org.eclipse.epsilon.flock.engine.test.acceptance 0.0.1-SNAPSHOT
[INFO] ------------------------------------------------------------------------
[INFO] 
[INFO] --- maven-clean-plugin:2.5:clean (default-clean) @ org.eclipse.epsilon.flock.engine.test.acceptance ---
[INFO] 
[INFO] --- tycho-packaging-plugin:1.0.0:build-qualifier (default-build-qualifier) @ org.eclipse.epsilon.flock.engine.test.acceptance ---
[INFO] The project's OSGi version is 0.0.1.201807181629
[INFO] 
[INFO] --- tycho-packaging-plugin:1.0.0:validate-id (default-validate-id) @ org.eclipse.epsilon.flock.engine.test.acceptance ---
[INFO] 
[INFO] --- tycho-packaging-plugin:1.0.0:validate-version (default-validate-version) @ org.eclipse.epsilon.flock.engine.test.acceptance ---
[INFO] 
[INFO] --- maven-resources-plugin:2.4.3:resources (default-resources) @ org.eclipse.epsilon.flock.engine.test.acceptance ---
[INFO] Using 'UTF-8' encoding to copy filtered resources.
[INFO] skip non existing resourceDirectory /jobs/genie.epsilon/RC for 1.5.0/workspace/tests/org.eclipse.epsilon.flock.engine.test.acceptance/src/main/resources
[INFO] 
[INFO] --- tycho-compiler-plugin:1.0.0:compile (default-compile) @ org.eclipse.epsilon.flock.engine.test.acceptance ---
[WARNING] Parameter 'useProjectSettings' is set to true, but preferences file '/jobs/genie.epsilon/RC for 1.5.0/workspace/tests/org.eclipse.epsilon.flock.engine.test.acceptance/.settings/org.eclipse.jdt.core.prefs' could not be found!
[INFO] Compiling 84 source files to /jobs/genie.epsilon/RC for 1.5.0/workspace/tests/org.eclipse.epsilon.flock.engine.test.acceptance/target/classes
[INFO] 
[INFO] --- maven-resources-plugin:2.4.3:testResources (default-testResources) @ org.eclipse.epsilon.flock.engine.test.acceptance ---
[INFO] Using 'UTF-8' encoding to copy filtered resources.
[INFO] skip non existing resourceDirectory /jobs/genie.epsilon/RC for 1.5.0/workspace/tests/org.eclipse.epsilon.flock.engine.test.acceptance/src/test/resources
[INFO] 
[INFO] --- tycho-source-plugin:1.0.0:plugin-source (plugin-source) @ org.eclipse.epsilon.flock.engine.test.acceptance ---
[WARNING] bundle localization file /jobs/genie.epsilon/RC for 1.5.0/workspace/tests/org.eclipse.epsilon.flock.engine.test.acceptance/plugin.properties not found
[INFO] Building jar: /jobs/genie.epsilon/RC for 1.5.0/workspace/tests/org.eclipse.epsilon.flock.engine.test.acceptance/target/org.eclipse.epsilon.flock.engine.test.acceptance-0.0.1-SNAPSHOT-sources.jar
[INFO] 
[INFO] --- target-platform-configuration:1.0.0:target-platform (default-target-platform) @ org.eclipse.epsilon.flock.engine.test.acceptance ---
[INFO] 
[INFO] --- tycho-packaging-plugin:1.0.0:package-plugin (default-package-plugin) @ org.eclipse.epsilon.flock.engine.test.acceptance ---
[INFO] Building jar: /jobs/genie.epsilon/RC for 1.5.0/workspace/tests/org.eclipse.epsilon.flock.engine.test.acceptance/target/org.eclipse.epsilon.flock.engine.test.acceptance-0.0.1-SNAPSHOT.jar
[INFO] 
[INFO] --- tycho-p2-plugin:1.0.0:p2-metadata-default (default-p2-metadata-default) @ org.eclipse.epsilon.flock.engine.test.acceptance ---
[INFO] 
[INFO] --- maven-install-plugin:2.3.1:install (default-install) @ org.eclipse.epsilon.flock.engine.test.acceptance ---
[INFO] Installing /jobs/genie.epsilon/RC for 1.5.0/workspace/tests/org.eclipse.epsilon.flock.engine.test.acceptance/target/org.eclipse.epsilon.flock.engine.test.acceptance-0.0.1-SNAPSHOT.jar to /home/hudson/genie.epsilon/.jenkins/jobs/RC for 1.5.0/workspace/.repository/org/eclipse/epsilon/org.eclipse.epsilon.flock.engine.test.acceptance/0.0.1-SNAPSHOT/org.eclipse.epsilon.flock.engine.test.acceptance-0.0.1-SNAPSHOT.jar
[INFO] Installing /jobs/genie.epsilon/RC for 1.5.0/workspace/tests/org.eclipse.epsilon.flock.engine.test.acceptance/pom.xml to /home/hudson/genie.epsilon/.jenkins/jobs/RC for 1.5.0/workspace/.repository/org/eclipse/epsilon/org.eclipse.epsilon.flock.engine.test.acceptance/0.0.1-SNAPSHOT/org.eclipse.epsilon.flock.engine.test.acceptance-0.0.1-SNAPSHOT.pom
[INFO] Installing /jobs/genie.epsilon/RC for 1.5.0/workspace/tests/org.eclipse.epsilon.flock.engine.test.acceptance/target/org.eclipse.epsilon.flock.engine.test.acceptance-0.0.1-SNAPSHOT-sources.jar to /home/hudson/genie.epsilon/.jenkins/jobs/RC for 1.5.0/workspace/.repository/org/eclipse/epsilon/org.eclipse.epsilon.flock.engine.test.acceptance/0.0.1-SNAPSHOT/org.eclipse.epsilon.flock.engine.test.acceptance-0.0.1-SNAPSHOT-sources.jar
[INFO] Installing /jobs/genie.epsilon/RC for 1.5.0/workspace/tests/org.eclipse.epsilon.flock.engine.test.acceptance/target/p2content.xml to /home/hudson/genie.epsilon/.jenkins/jobs/RC for 1.5.0/workspace/.repository/org/eclipse/epsilon/org.eclipse.epsilon.flock.engine.test.acceptance/0.0.1-SNAPSHOT/org.eclipse.epsilon.flock.engine.test.acceptance-0.0.1-SNAPSHOT-p2metadata.xml
[INFO] Installing /jobs/genie.epsilon/RC for 1.5.0/workspace/tests/org.eclipse.epsilon.flock.engine.test.acceptance/target/p2artifacts.xml to /home/hudson/genie.epsilon/.jenkins/jobs/RC for 1.5.0/workspace/.repository/org/eclipse/epsilon/org.eclipse.epsilon.flock.engine.test.acceptance/0.0.1-SNAPSHOT/org.eclipse.epsilon.flock.engine.test.acceptance-0.0.1-SNAPSHOT-p2artifacts.xml
[INFO] 
[INFO] --- tycho-p2-plugin:1.0.0:update-local-index (default-update-local-index) @ org.eclipse.epsilon.flock.engine.test.acceptance ---
[INFO]                                                                         
[INFO] ------------------------------------------------------------------------
[INFO] Building org.eclipse.epsilon.flock.engine.test 0.0.1-SNAPSHOT
[INFO] ------------------------------------------------------------------------
[INFO] 
[INFO] --- maven-clean-plugin:2.5:clean (default-clean) @ org.eclipse.epsilon.flock.engine.test ---
[INFO] 
[INFO] --- tycho-packaging-plugin:1.0.0:build-qualifier (default-build-qualifier) @ org.eclipse.epsilon.flock.engine.test ---
[INFO] The project's OSGi version is 0.0.1.201807181629
[INFO] 
[INFO] --- tycho-packaging-plugin:1.0.0:validate-id (default-validate-id) @ org.eclipse.epsilon.flock.engine.test ---
[INFO] 
[INFO] --- tycho-packaging-plugin:1.0.0:validate-version (default-validate-version) @ org.eclipse.epsilon.flock.engine.test ---
[INFO] 
[INFO] --- maven-resources-plugin:2.4.3:resources (default-resources) @ org.eclipse.epsilon.flock.engine.test ---
[INFO] Using 'UTF-8' encoding to copy filtered resources.
[INFO] skip non existing resourceDirectory /jobs/genie.epsilon/RC for 1.5.0/workspace/tests/org.eclipse.epsilon.flock.engine.test/src/main/resources
[INFO] 
[INFO] --- tycho-compiler-plugin:1.0.0:compile (default-compile) @ org.eclipse.epsilon.flock.engine.test ---
[WARNING] Parameter 'useProjectSettings' is set to true, but preferences file '/jobs/genie.epsilon/RC for 1.5.0/workspace/tests/org.eclipse.epsilon.flock.engine.test/.settings/org.eclipse.jdt.core.prefs' could not be found!
[INFO] Compiling 1 source file to /jobs/genie.epsilon/RC for 1.5.0/workspace/tests/org.eclipse.epsilon.flock.engine.test/target/classes
[INFO] 
[INFO] --- maven-resources-plugin:2.4.3:testResources (default-testResources) @ org.eclipse.epsilon.flock.engine.test ---
[INFO] Using 'UTF-8' encoding to copy filtered resources.
[INFO] skip non existing resourceDirectory /jobs/genie.epsilon/RC for 1.5.0/workspace/tests/org.eclipse.epsilon.flock.engine.test/src/test/resources
[INFO] 
[INFO] --- tycho-source-plugin:1.0.0:plugin-source (plugin-source) @ org.eclipse.epsilon.flock.engine.test ---
[WARNING] bundle localization file /jobs/genie.epsilon/RC for 1.5.0/workspace/tests/org.eclipse.epsilon.flock.engine.test/plugin.properties not found
[INFO] Building jar: /jobs/genie.epsilon/RC for 1.5.0/workspace/tests/org.eclipse.epsilon.flock.engine.test/target/org.eclipse.epsilon.flock.engine.test-0.0.1-SNAPSHOT-sources.jar
[INFO] 
[INFO] --- target-platform-configuration:1.0.0:target-platform (default-target-platform) @ org.eclipse.epsilon.flock.engine.test ---
[INFO] 
[INFO] --- tycho-packaging-plugin:1.0.0:package-plugin (default-package-plugin) @ org.eclipse.epsilon.flock.engine.test ---
[INFO] Building jar: /jobs/genie.epsilon/RC for 1.5.0/workspace/tests/org.eclipse.epsilon.flock.engine.test/target/org.eclipse.epsilon.flock.engine.test-0.0.1-SNAPSHOT.jar
[INFO] 
[INFO] --- tycho-p2-plugin:1.0.0:p2-metadata-default (default-p2-metadata-default) @ org.eclipse.epsilon.flock.engine.test ---
[INFO] 
[INFO] --- maven-install-plugin:2.3.1:install (default-install) @ org.eclipse.epsilon.flock.engine.test ---
[INFO] Installing /jobs/genie.epsilon/RC for 1.5.0/workspace/tests/org.eclipse.epsilon.flock.engine.test/target/org.eclipse.epsilon.flock.engine.test-0.0.1-SNAPSHOT.jar to /home/hudson/genie.epsilon/.jenkins/jobs/RC for 1.5.0/workspace/.repository/org/eclipse/epsilon/org.eclipse.epsilon.flock.engine.test/0.0.1-SNAPSHOT/org.eclipse.epsilon.flock.engine.test-0.0.1-SNAPSHOT.jar
[INFO] Installing /jobs/genie.epsilon/RC for 1.5.0/workspace/tests/org.eclipse.epsilon.flock.engine.test/pom.xml to /home/hudson/genie.epsilon/.jenkins/jobs/RC for 1.5.0/workspace/.repository/org/eclipse/epsilon/org.eclipse.epsilon.flock.engine.test/0.0.1-SNAPSHOT/org.eclipse.epsilon.flock.engine.test-0.0.1-SNAPSHOT.pom
[INFO] Installing /jobs/genie.epsilon/RC for 1.5.0/workspace/tests/org.eclipse.epsilon.flock.engine.test/target/org.eclipse.epsilon.flock.engine.test-0.0.1-SNAPSHOT-sources.jar to /home/hudson/genie.epsilon/.jenkins/jobs/RC for 1.5.0/workspace/.repository/org/eclipse/epsilon/org.eclipse.epsilon.flock.engine.test/0.0.1-SNAPSHOT/org.eclipse.epsilon.flock.engine.test-0.0.1-SNAPSHOT-sources.jar
[INFO] Installing /jobs/genie.epsilon/RC for 1.5.0/workspace/tests/org.eclipse.epsilon.flock.engine.test/target/p2content.xml to /home/hudson/genie.epsilon/.jenkins/jobs/RC for 1.5.0/workspace/.repository/org/eclipse/epsilon/org.eclipse.epsilon.flock.engine.test/0.0.1-SNAPSHOT/org.eclipse.epsilon.flock.engine.test-0.0.1-SNAPSHOT-p2metadata.xml
[INFO] Installing /jobs/genie.epsilon/RC for 1.5.0/workspace/tests/org.eclipse.epsilon.flock.engine.test/target/p2artifacts.xml to /home/hudson/genie.epsilon/.jenkins/jobs/RC for 1.5.0/workspace/.repository/org/eclipse/epsilon/org.eclipse.epsilon.flock.engine.test/0.0.1-SNAPSHOT/org.eclipse.epsilon.flock.engine.test-0.0.1-SNAPSHOT-p2artifacts.xml
[INFO] 
[INFO] --- tycho-p2-plugin:1.0.0:update-local-index (default-update-local-index) @ org.eclipse.epsilon.flock.engine.test ---
[INFO]                                                                         
[INFO] ------------------------------------------------------------------------
[INFO] Building org.eclipse.epsilon.hutn.dt.test 0.7.7-SNAPSHOT
[INFO] ------------------------------------------------------------------------
[INFO] 
[INFO] --- maven-clean-plugin:2.5:clean (default-clean) @ org.eclipse.epsilon.hutn.dt.test ---
[INFO] 
[INFO] --- tycho-packaging-plugin:1.0.0:build-qualifier (default-build-qualifier) @ org.eclipse.epsilon.hutn.dt.test ---
[INFO] The project's OSGi version is 0.7.7.201807181629
[INFO] 
[INFO] --- tycho-packaging-plugin:1.0.0:validate-id (default-validate-id) @ org.eclipse.epsilon.hutn.dt.test ---
[INFO] 
[INFO] --- tycho-packaging-plugin:1.0.0:validate-version (default-validate-version) @ org.eclipse.epsilon.hutn.dt.test ---
[INFO] 
[INFO] --- maven-resources-plugin:2.4.3:resources (default-resources) @ org.eclipse.epsilon.hutn.dt.test ---
[INFO] Using 'UTF-8' encoding to copy filtered resources.
[INFO] skip non existing resourceDirectory /jobs/genie.epsilon/RC for 1.5.0/workspace/tests/org.eclipse.epsilon.hutn.dt.test/src/main/resources
[INFO] 
[INFO] --- tycho-compiler-plugin:1.0.0:compile (default-compile) @ org.eclipse.epsilon.hutn.dt.test ---
[WARNING] Parameter 'useProjectSettings' is set to true, but preferences file '/jobs/genie.epsilon/RC for 1.5.0/workspace/tests/org.eclipse.epsilon.hutn.dt.test/.settings/org.eclipse.jdt.core.prefs' could not be found!
[INFO] Compiling 6 source files to /jobs/genie.epsilon/RC for 1.5.0/workspace/tests/org.eclipse.epsilon.hutn.dt.test/target/classes
[INFO] 
[INFO] --- maven-resources-plugin:2.4.3:testResources (default-testResources) @ org.eclipse.epsilon.hutn.dt.test ---
[INFO] Using 'UTF-8' encoding to copy filtered resources.
[INFO] skip non existing resourceDirectory /jobs/genie.epsilon/RC for 1.5.0/workspace/tests/org.eclipse.epsilon.hutn.dt.test/src/test/resources
[INFO] 
[INFO] --- tycho-source-plugin:1.0.0:plugin-source (plugin-source) @ org.eclipse.epsilon.hutn.dt.test ---
[WARNING] bundle localization file /jobs/genie.epsilon/RC for 1.5.0/workspace/tests/org.eclipse.epsilon.hutn.dt.test/plugin.properties not found
[INFO] Building jar: /jobs/genie.epsilon/RC for 1.5.0/workspace/tests/org.eclipse.epsilon.hutn.dt.test/target/org.eclipse.epsilon.hutn.dt.test-0.7.7-SNAPSHOT-sources.jar
[INFO] 
[INFO] --- target-platform-configuration:1.0.0:target-platform (default-target-platform) @ org.eclipse.epsilon.hutn.dt.test ---
[INFO] 
[INFO] --- tycho-packaging-plugin:1.0.0:package-plugin (default-package-plugin) @ org.eclipse.epsilon.hutn.dt.test ---
[INFO] Building jar: /jobs/genie.epsilon/RC for 1.5.0/workspace/tests/org.eclipse.epsilon.hutn.dt.test/target/org.eclipse.epsilon.hutn.dt.test-0.7.7-SNAPSHOT.jar
[INFO] 
[INFO] --- tycho-p2-plugin:1.0.0:p2-metadata-default (default-p2-metadata-default) @ org.eclipse.epsilon.hutn.dt.test ---
[INFO] 
[INFO] --- maven-install-plugin:2.3.1:install (default-install) @ org.eclipse.epsilon.hutn.dt.test ---
[INFO] Installing /jobs/genie.epsilon/RC for 1.5.0/workspace/tests/org.eclipse.epsilon.hutn.dt.test/target/org.eclipse.epsilon.hutn.dt.test-0.7.7-SNAPSHOT.jar to /home/hudson/genie.epsilon/.jenkins/jobs/RC for 1.5.0/workspace/.repository/org/eclipse/epsilon/org.eclipse.epsilon.hutn.dt.test/0.7.7-SNAPSHOT/org.eclipse.epsilon.hutn.dt.test-0.7.7-SNAPSHOT.jar
[INFO] Installing /jobs/genie.epsilon/RC for 1.5.0/workspace/tests/org.eclipse.epsilon.hutn.dt.test/pom.xml to /home/hudson/genie.epsilon/.jenkins/jobs/RC for 1.5.0/workspace/.repository/org/eclipse/epsilon/org.eclipse.epsilon.hutn.dt.test/0.7.7-SNAPSHOT/org.eclipse.epsilon.hutn.dt.test-0.7.7-SNAPSHOT.pom
[INFO] Installing /jobs/genie.epsilon/RC for 1.5.0/workspace/tests/org.eclipse.epsilon.hutn.dt.test/target/org.eclipse.epsilon.hutn.dt.test-0.7.7-SNAPSHOT-sources.jar to /home/hudson/genie.epsilon/.jenkins/jobs/RC for 1.5.0/workspace/.repository/org/eclipse/epsilon/org.eclipse.epsilon.hutn.dt.test/0.7.7-SNAPSHOT/org.eclipse.epsilon.hutn.dt.test-0.7.7-SNAPSHOT-sources.jar
[INFO] Installing /jobs/genie.epsilon/RC for 1.5.0/workspace/tests/org.eclipse.epsilon.hutn.dt.test/target/p2content.xml to /home/hudson/genie.epsilon/.jenkins/jobs/RC for 1.5.0/workspace/.repository/org/eclipse/epsilon/org.eclipse.epsilon.hutn.dt.test/0.7.7-SNAPSHOT/org.eclipse.epsilon.hutn.dt.test-0.7.7-SNAPSHOT-p2metadata.xml
[INFO] Installing /jobs/genie.epsilon/RC for 1.5.0/workspace/tests/org.eclipse.epsilon.hutn.dt.test/target/p2artifacts.xml to /home/hudson/genie.epsilon/.jenkins/jobs/RC for 1.5.0/workspace/.repository/org/eclipse/epsilon/org.eclipse.epsilon.hutn.dt.test/0.7.7-SNAPSHOT/org.eclipse.epsilon.hutn.dt.test-0.7.7-SNAPSHOT-p2artifacts.xml
[INFO] 
[INFO] --- tycho-p2-plugin:1.0.0:update-local-index (default-update-local-index) @ org.eclipse.epsilon.hutn.dt.test ---
[INFO]                                                                         
[INFO] ------------------------------------------------------------------------
[INFO] Building org.eclipse.epsilon.hutn.test.acceptance 0.7.4-SNAPSHOT
[INFO] ------------------------------------------------------------------------
[INFO] 
[INFO] --- maven-clean-plugin:2.5:clean (default-clean) @ org.eclipse.epsilon.hutn.test.acceptance ---
[INFO] 
[INFO] --- tycho-packaging-plugin:1.0.0:build-qualifier (default-build-qualifier) @ org.eclipse.epsilon.hutn.test.acceptance ---
[INFO] The project's OSGi version is 0.7.4.201807181629
[INFO] 
[INFO] --- tycho-packaging-plugin:1.0.0:validate-id (default-validate-id) @ org.eclipse.epsilon.hutn.test.acceptance ---
[INFO] 
[INFO] --- tycho-packaging-plugin:1.0.0:validate-version (default-validate-version) @ org.eclipse.epsilon.hutn.test.acceptance ---
[INFO] 
[INFO] --- maven-resources-plugin:2.4.3:resources (default-resources) @ org.eclipse.epsilon.hutn.test.acceptance ---
[INFO] Using 'UTF-8' encoding to copy filtered resources.
[INFO] skip non existing resourceDirectory /jobs/genie.epsilon/RC for 1.5.0/workspace/tests/org.eclipse.epsilon.hutn.test.acceptance/src/main/resources
[INFO] 
[INFO] --- tycho-compiler-plugin:1.0.0:compile (default-compile) @ org.eclipse.epsilon.hutn.test.acceptance ---
[WARNING] Parameter 'useProjectSettings' is set to true, but preferences file '/jobs/genie.epsilon/RC for 1.5.0/workspace/tests/org.eclipse.epsilon.hutn.test.acceptance/.settings/org.eclipse.jdt.core.prefs' could not be found!
[INFO] Compiling 41 source files to /jobs/genie.epsilon/RC for 1.5.0/workspace/tests/org.eclipse.epsilon.hutn.test.acceptance/target/classes
[INFO] 
[INFO] --- maven-resources-plugin:2.4.3:testResources (default-testResources) @ org.eclipse.epsilon.hutn.test.acceptance ---
[INFO] Using 'UTF-8' encoding to copy filtered resources.
[INFO] skip non existing resourceDirectory /jobs/genie.epsilon/RC for 1.5.0/workspace/tests/org.eclipse.epsilon.hutn.test.acceptance/src/test/resources
[INFO] 
[INFO] --- tycho-source-plugin:1.0.0:plugin-source (plugin-source) @ org.eclipse.epsilon.hutn.test.acceptance ---
[WARNING] bundle localization file /jobs/genie.epsilon/RC for 1.5.0/workspace/tests/org.eclipse.epsilon.hutn.test.acceptance/plugin.properties not found
[INFO] Building jar: /jobs/genie.epsilon/RC for 1.5.0/workspace/tests/org.eclipse.epsilon.hutn.test.acceptance/target/org.eclipse.epsilon.hutn.test.acceptance-0.7.4-SNAPSHOT-sources.jar
[INFO] 
[INFO] --- target-platform-configuration:1.0.0:target-platform (default-target-platform) @ org.eclipse.epsilon.hutn.test.acceptance ---
[INFO] 
[INFO] --- tycho-packaging-plugin:1.0.0:package-plugin (default-package-plugin) @ org.eclipse.epsilon.hutn.test.acceptance ---
[INFO] Building jar: /jobs/genie.epsilon/RC for 1.5.0/workspace/tests/org.eclipse.epsilon.hutn.test.acceptance/target/org.eclipse.epsilon.hutn.test.acceptance-0.7.4-SNAPSHOT.jar
[INFO] 
[INFO] --- tycho-p2-plugin:1.0.0:p2-metadata-default (default-p2-metadata-default) @ org.eclipse.epsilon.hutn.test.acceptance ---
[INFO] 
[INFO] --- maven-install-plugin:2.3.1:install (default-install) @ org.eclipse.epsilon.hutn.test.acceptance ---
[INFO] Installing /jobs/genie.epsilon/RC for 1.5.0/workspace/tests/org.eclipse.epsilon.hutn.test.acceptance/target/org.eclipse.epsilon.hutn.test.acceptance-0.7.4-SNAPSHOT.jar to /home/hudson/genie.epsilon/.jenkins/jobs/RC for 1.5.0/workspace/.repository/org/eclipse/epsilon/org.eclipse.epsilon.hutn.test.acceptance/0.7.4-SNAPSHOT/org.eclipse.epsilon.hutn.test.acceptance-0.7.4-SNAPSHOT.jar
[INFO] Installing /jobs/genie.epsilon/RC for 1.5.0/workspace/tests/org.eclipse.epsilon.hutn.test.acceptance/pom.xml to /home/hudson/genie.epsilon/.jenkins/jobs/RC for 1.5.0/workspace/.repository/org/eclipse/epsilon/org.eclipse.epsilon.hutn.test.acceptance/0.7.4-SNAPSHOT/org.eclipse.epsilon.hutn.test.acceptance-0.7.4-SNAPSHOT.pom
[INFO] Installing /jobs/genie.epsilon/RC for 1.5.0/workspace/tests/org.eclipse.epsilon.hutn.test.acceptance/target/org.eclipse.epsilon.hutn.test.acceptance-0.7.4-SNAPSHOT-sources.jar to /home/hudson/genie.epsilon/.jenkins/jobs/RC for 1.5.0/workspace/.repository/org/eclipse/epsilon/org.eclipse.epsilon.hutn.test.acceptance/0.7.4-SNAPSHOT/org.eclipse.epsilon.hutn.test.acceptance-0.7.4-SNAPSHOT-sources.jar
[INFO] Installing /jobs/genie.epsilon/RC for 1.5.0/workspace/tests/org.eclipse.epsilon.hutn.test.acceptance/target/p2content.xml to /home/hudson/genie.epsilon/.jenkins/jobs/RC for 1.5.0/workspace/.repository/org/eclipse/epsilon/org.eclipse.epsilon.hutn.test.acceptance/0.7.4-SNAPSHOT/org.eclipse.epsilon.hutn.test.acceptance-0.7.4-SNAPSHOT-p2metadata.xml
[INFO] Installing /jobs/genie.epsilon/RC for 1.5.0/workspace/tests/org.eclipse.epsilon.hutn.test.acceptance/target/p2artifacts.xml to /home/hudson/genie.epsilon/.jenkins/jobs/RC for 1.5.0/workspace/.repository/org/eclipse/epsilon/org.eclipse.epsilon.hutn.test.acceptance/0.7.4-SNAPSHOT/org.eclipse.epsilon.hutn.test.acceptance-0.7.4-SNAPSHOT-p2artifacts.xml
[INFO] 
[INFO] --- tycho-p2-plugin:1.0.0:update-local-index (default-update-local-index) @ org.eclipse.epsilon.hutn.test.acceptance ---
[INFO]                                                                         
[INFO] ------------------------------------------------------------------------
[INFO] Building org.eclipse.epsilon.hutn.test.unit 0.7.4-SNAPSHOT
[INFO] ------------------------------------------------------------------------
[INFO] 
[INFO] --- maven-clean-plugin:2.5:clean (default-clean) @ org.eclipse.epsilon.hutn.test.unit ---
[INFO] 
[INFO] --- tycho-packaging-plugin:1.0.0:build-qualifier (default-build-qualifier) @ org.eclipse.epsilon.hutn.test.unit ---
[INFO] The project's OSGi version is 0.7.4.201807181629
[INFO] 
[INFO] --- tycho-packaging-plugin:1.0.0:validate-id (default-validate-id) @ org.eclipse.epsilon.hutn.test.unit ---
[INFO] 
[INFO] --- tycho-packaging-plugin:1.0.0:validate-version (default-validate-version) @ org.eclipse.epsilon.hutn.test.unit ---
[INFO] 
[INFO] --- maven-resources-plugin:2.4.3:resources (default-resources) @ org.eclipse.epsilon.hutn.test.unit ---
[INFO] Using 'UTF-8' encoding to copy filtered resources.
[INFO] skip non existing resourceDirectory /jobs/genie.epsilon/RC for 1.5.0/workspace/tests/org.eclipse.epsilon.hutn.test.unit/src/main/resources
[INFO] 
[INFO] --- tycho-compiler-plugin:1.0.0:compile (default-compile) @ org.eclipse.epsilon.hutn.test.unit ---
[WARNING] Parameter 'useProjectSettings' is set to true, but preferences file '/jobs/genie.epsilon/RC for 1.5.0/workspace/tests/org.eclipse.epsilon.hutn.test.unit/.settings/org.eclipse.jdt.core.prefs' could not be found!
[INFO] Compiling 96 source files to /jobs/genie.epsilon/RC for 1.5.0/workspace/tests/org.eclipse.epsilon.hutn.test.unit/target/classes
[INFO] 
[INFO] --- maven-resources-plugin:2.4.3:testResources (default-testResources) @ org.eclipse.epsilon.hutn.test.unit ---
[INFO] Using 'UTF-8' encoding to copy filtered resources.
[INFO] skip non existing resourceDirectory /jobs/genie.epsilon/RC for 1.5.0/workspace/tests/org.eclipse.epsilon.hutn.test.unit/src/test/resources
[INFO] 
[INFO] --- tycho-source-plugin:1.0.0:plugin-source (plugin-source) @ org.eclipse.epsilon.hutn.test.unit ---
[WARNING] bundle localization file /jobs/genie.epsilon/RC for 1.5.0/workspace/tests/org.eclipse.epsilon.hutn.test.unit/plugin.properties not found
[INFO] Building jar: /jobs/genie.epsilon/RC for 1.5.0/workspace/tests/org.eclipse.epsilon.hutn.test.unit/target/org.eclipse.epsilon.hutn.test.unit-0.7.4-SNAPSHOT-sources.jar
[INFO] 
[INFO] --- target-platform-configuration:1.0.0:target-platform (default-target-platform) @ org.eclipse.epsilon.hutn.test.unit ---
[INFO] 
[INFO] --- tycho-packaging-plugin:1.0.0:package-plugin (default-package-plugin) @ org.eclipse.epsilon.hutn.test.unit ---
[INFO] Building jar: /jobs/genie.epsilon/RC for 1.5.0/workspace/tests/org.eclipse.epsilon.hutn.test.unit/target/org.eclipse.epsilon.hutn.test.unit-0.7.4-SNAPSHOT.jar
[INFO] 
[INFO] --- tycho-p2-plugin:1.0.0:p2-metadata-default (default-p2-metadata-default) @ org.eclipse.epsilon.hutn.test.unit ---
[INFO] 
[INFO] --- maven-install-plugin:2.3.1:install (default-install) @ org.eclipse.epsilon.hutn.test.unit ---
[INFO] Installing /jobs/genie.epsilon/RC for 1.5.0/workspace/tests/org.eclipse.epsilon.hutn.test.unit/target/org.eclipse.epsilon.hutn.test.unit-0.7.4-SNAPSHOT.jar to /home/hudson/genie.epsilon/.jenkins/jobs/RC for 1.5.0/workspace/.repository/org/eclipse/epsilon/org.eclipse.epsilon.hutn.test.unit/0.7.4-SNAPSHOT/org.eclipse.epsilon.hutn.test.unit-0.7.4-SNAPSHOT.jar
[INFO] Installing /jobs/genie.epsilon/RC for 1.5.0/workspace/tests/org.eclipse.epsilon.hutn.test.unit/pom.xml to /home/hudson/genie.epsilon/.jenkins/jobs/RC for 1.5.0/workspace/.repository/org/eclipse/epsilon/org.eclipse.epsilon.hutn.test.unit/0.7.4-SNAPSHOT/org.eclipse.epsilon.hutn.test.unit-0.7.4-SNAPSHOT.pom
[INFO] Installing /jobs/genie.epsilon/RC for 1.5.0/workspace/tests/org.eclipse.epsilon.hutn.test.unit/target/org.eclipse.epsilon.hutn.test.unit-0.7.4-SNAPSHOT-sources.jar to /home/hudson/genie.epsilon/.jenkins/jobs/RC for 1.5.0/workspace/.repository/org/eclipse/epsilon/org.eclipse.epsilon.hutn.test.unit/0.7.4-SNAPSHOT/org.eclipse.epsilon.hutn.test.unit-0.7.4-SNAPSHOT-sources.jar
[INFO] Installing /jobs/genie.epsilon/RC for 1.5.0/workspace/tests/org.eclipse.epsilon.hutn.test.unit/target/p2content.xml to /home/hudson/genie.epsilon/.jenkins/jobs/RC for 1.5.0/workspace/.repository/org/eclipse/epsilon/org.eclipse.epsilon.hutn.test.unit/0.7.4-SNAPSHOT/org.eclipse.epsilon.hutn.test.unit-0.7.4-SNAPSHOT-p2metadata.xml
[INFO] Installing /jobs/genie.epsilon/RC for 1.5.0/workspace/tests/org.eclipse.epsilon.hutn.test.unit/target/p2artifacts.xml to /home/hudson/genie.epsilon/.jenkins/jobs/RC for 1.5.0/workspace/.repository/org/eclipse/epsilon/org.eclipse.epsilon.hutn.test.unit/0.7.4-SNAPSHOT/org.eclipse.epsilon.hutn.test.unit-0.7.4-SNAPSHOT-p2artifacts.xml
[INFO] 
[INFO] --- tycho-p2-plugin:1.0.0:update-local-index (default-update-local-index) @ org.eclipse.epsilon.hutn.test.unit ---
[INFO]                                                                         
[INFO] ------------------------------------------------------------------------
[INFO] Building org.eclipse.epsilon.hutn.test 0.7.4-SNAPSHOT
[INFO] ------------------------------------------------------------------------
[INFO] 
[INFO] --- maven-clean-plugin:2.5:clean (default-clean) @ org.eclipse.epsilon.hutn.test ---
[INFO] 
[INFO] --- tycho-packaging-plugin:1.0.0:build-qualifier (default-build-qualifier) @ org.eclipse.epsilon.hutn.test ---
[INFO] The project's OSGi version is 0.7.4.201807181629
[INFO] 
[INFO] --- tycho-packaging-plugin:1.0.0:validate-id (default-validate-id) @ org.eclipse.epsilon.hutn.test ---
[INFO] 
[INFO] --- tycho-packaging-plugin:1.0.0:validate-version (default-validate-version) @ org.eclipse.epsilon.hutn.test ---
[INFO] 
[INFO] --- maven-resources-plugin:2.4.3:resources (default-resources) @ org.eclipse.epsilon.hutn.test ---
[INFO] Using 'UTF-8' encoding to copy filtered resources.
[INFO] skip non existing resourceDirectory /jobs/genie.epsilon/RC for 1.5.0/workspace/tests/org.eclipse.epsilon.hutn.test/src/main/resources
[INFO] 
[INFO] --- tycho-compiler-plugin:1.0.0:compile (default-compile) @ org.eclipse.epsilon.hutn.test ---
[WARNING] Parameter 'useProjectSettings' is set to true, but preferences file '/jobs/genie.epsilon/RC for 1.5.0/workspace/tests/org.eclipse.epsilon.hutn.test/.settings/org.eclipse.jdt.core.prefs' could not be found!
[INFO] Compiling 1 source file to /jobs/genie.epsilon/RC for 1.5.0/workspace/tests/org.eclipse.epsilon.hutn.test/target/classes
[INFO] 
[INFO] --- maven-resources-plugin:2.4.3:testResources (default-testResources) @ org.eclipse.epsilon.hutn.test ---
[INFO] Using 'UTF-8' encoding to copy filtered resources.
[INFO] skip non existing resourceDirectory /jobs/genie.epsilon/RC for 1.5.0/workspace/tests/org.eclipse.epsilon.hutn.test/src/test/resources
[INFO] 
[INFO] --- tycho-source-plugin:1.0.0:plugin-source (plugin-source) @ org.eclipse.epsilon.hutn.test ---
[WARNING] bundle localization file /jobs/genie.epsilon/RC for 1.5.0/workspace/tests/org.eclipse.epsilon.hutn.test/plugin.properties not found
[INFO] Building jar: /jobs/genie.epsilon/RC for 1.5.0/workspace/tests/org.eclipse.epsilon.hutn.test/target/org.eclipse.epsilon.hutn.test-0.7.4-SNAPSHOT-sources.jar
[INFO] 
[INFO] --- target-platform-configuration:1.0.0:target-platform (default-target-platform) @ org.eclipse.epsilon.hutn.test ---
[INFO] 
[INFO] --- tycho-packaging-plugin:1.0.0:package-plugin (default-package-plugin) @ org.eclipse.epsilon.hutn.test ---
[INFO] Building jar: /jobs/genie.epsilon/RC for 1.5.0/workspace/tests/org.eclipse.epsilon.hutn.test/target/org.eclipse.epsilon.hutn.test-0.7.4-SNAPSHOT.jar
[INFO] 
[INFO] --- tycho-p2-plugin:1.0.0:p2-metadata-default (default-p2-metadata-default) @ org.eclipse.epsilon.hutn.test ---
[INFO] 
[INFO] --- maven-install-plugin:2.3.1:install (default-install) @ org.eclipse.epsilon.hutn.test ---
[INFO] Installing /jobs/genie.epsilon/RC for 1.5.0/workspace/tests/org.eclipse.epsilon.hutn.test/target/org.eclipse.epsilon.hutn.test-0.7.4-SNAPSHOT.jar to /home/hudson/genie.epsilon/.jenkins/jobs/RC for 1.5.0/workspace/.repository/org/eclipse/epsilon/org.eclipse.epsilon.hutn.test/0.7.4-SNAPSHOT/org.eclipse.epsilon.hutn.test-0.7.4-SNAPSHOT.jar
[INFO] Installing /jobs/genie.epsilon/RC for 1.5.0/workspace/tests/org.eclipse.epsilon.hutn.test/pom.xml to /home/hudson/genie.epsilon/.jenkins/jobs/RC for 1.5.0/workspace/.repository/org/eclipse/epsilon/org.eclipse.epsilon.hutn.test/0.7.4-SNAPSHOT/org.eclipse.epsilon.hutn.test-0.7.4-SNAPSHOT.pom
[INFO] Installing /jobs/genie.epsilon/RC for 1.5.0/workspace/tests/org.eclipse.epsilon.hutn.test/target/org.eclipse.epsilon.hutn.test-0.7.4-SNAPSHOT-sources.jar to /home/hudson/genie.epsilon/.jenkins/jobs/RC for 1.5.0/workspace/.repository/org/eclipse/epsilon/org.eclipse.epsilon.hutn.test/0.7.4-SNAPSHOT/org.eclipse.epsilon.hutn.test-0.7.4-SNAPSHOT-sources.jar
[INFO] Installing /jobs/genie.epsilon/RC for 1.5.0/workspace/tests/org.eclipse.epsilon.hutn.test/target/p2content.xml to /home/hudson/genie.epsilon/.jenkins/jobs/RC for 1.5.0/workspace/.repository/org/eclipse/epsilon/org.eclipse.epsilon.hutn.test/0.7.4-SNAPSHOT/org.eclipse.epsilon.hutn.test-0.7.4-SNAPSHOT-p2metadata.xml
[INFO] Installing /jobs/genie.epsilon/RC for 1.5.0/workspace/tests/org.eclipse.epsilon.hutn.test/target/p2artifacts.xml to /home/hudson/genie.epsilon/.jenkins/jobs/RC for 1.5.0/workspace/.repository/org/eclipse/epsilon/org.eclipse.epsilon.hutn.test/0.7.4-SNAPSHOT/org.eclipse.epsilon.hutn.test-0.7.4-SNAPSHOT-p2artifacts.xml
[INFO] 
[INFO] --- tycho-p2-plugin:1.0.0:update-local-index (default-update-local-index) @ org.eclipse.epsilon.hutn.test ---
[INFO]                                                                         
[INFO] ------------------------------------------------------------------------
[INFO] Building org.eclipse.epsilon.flexmi.test 0.9.0-SNAPSHOT
[INFO] ------------------------------------------------------------------------
[INFO] 
[INFO] --- maven-clean-plugin:2.5:clean (default-clean) @ org.eclipse.epsilon.flexmi.test ---
[INFO] 
[INFO] --- tycho-packaging-plugin:1.0.0:build-qualifier (default-build-qualifier) @ org.eclipse.epsilon.flexmi.test ---
[INFO] The project's OSGi version is 0.9.0.201807181629
[INFO] 
[INFO] --- tycho-packaging-plugin:1.0.0:validate-id (default-validate-id) @ org.eclipse.epsilon.flexmi.test ---
[INFO] 
[INFO] --- tycho-packaging-plugin:1.0.0:validate-version (default-validate-version) @ org.eclipse.epsilon.flexmi.test ---
[INFO] 
[INFO] --- maven-resources-plugin:2.4.3:resources (default-resources) @ org.eclipse.epsilon.flexmi.test ---
[INFO] Using 'UTF-8' encoding to copy filtered resources.
[INFO] skip non existing resourceDirectory /jobs/genie.epsilon/RC for 1.5.0/workspace/tests/org.eclipse.epsilon.flexmi.test/src/main/resources
[INFO] 
[INFO] --- tycho-compiler-plugin:1.0.0:compile (default-compile) @ org.eclipse.epsilon.flexmi.test ---
[INFO] Compiling 12 source files to /jobs/genie.epsilon/RC for 1.5.0/workspace/tests/org.eclipse.epsilon.flexmi.test/target/classes
[INFO] 
[INFO] --- maven-resources-plugin:2.4.3:testResources (default-testResources) @ org.eclipse.epsilon.flexmi.test ---
[INFO] Using 'UTF-8' encoding to copy filtered resources.
[INFO] skip non existing resourceDirectory /jobs/genie.epsilon/RC for 1.5.0/workspace/tests/org.eclipse.epsilon.flexmi.test/src/test/resources
[INFO] 
[INFO] --- tycho-source-plugin:1.0.0:plugin-source (plugin-source) @ org.eclipse.epsilon.flexmi.test ---
[WARNING] bundle localization file /jobs/genie.epsilon/RC for 1.5.0/workspace/tests/org.eclipse.epsilon.flexmi.test/plugin.properties not found
[WARNING] Bundle-Vendor header not found in /jobs/genie.epsilon/RC for 1.5.0/workspace/tests/org.eclipse.epsilon.flexmi.test/META-INF/MANIFEST.MF, fallback to 'unknown' for source bundle
[INFO] Building jar: /jobs/genie.epsilon/RC for 1.5.0/workspace/tests/org.eclipse.epsilon.flexmi.test/target/org.eclipse.epsilon.flexmi.test-0.9.0-SNAPSHOT-sources.jar
[INFO] 
[INFO] --- target-platform-configuration:1.0.0:target-platform (default-target-platform) @ org.eclipse.epsilon.flexmi.test ---
[INFO] 
[INFO] --- tycho-packaging-plugin:1.0.0:package-plugin (default-package-plugin) @ org.eclipse.epsilon.flexmi.test ---
[INFO] Building jar: /jobs/genie.epsilon/RC for 1.5.0/workspace/tests/org.eclipse.epsilon.flexmi.test/target/org.eclipse.epsilon.flexmi.test-0.9.0-SNAPSHOT.jar
[INFO] 
[INFO] --- tycho-p2-plugin:1.0.0:p2-metadata-default (default-p2-metadata-default) @ org.eclipse.epsilon.flexmi.test ---
[INFO] 
[INFO] --- maven-install-plugin:2.3.1:install (default-install) @ org.eclipse.epsilon.flexmi.test ---
[INFO] Installing /jobs/genie.epsilon/RC for 1.5.0/workspace/tests/org.eclipse.epsilon.flexmi.test/target/org.eclipse.epsilon.flexmi.test-0.9.0-SNAPSHOT.jar to /home/hudson/genie.epsilon/.jenkins/jobs/RC for 1.5.0/workspace/.repository/org/eclipse/epsilon/org.eclipse.epsilon.flexmi.test/0.9.0-SNAPSHOT/org.eclipse.epsilon.flexmi.test-0.9.0-SNAPSHOT.jar
[INFO] Installing /jobs/genie.epsilon/RC for 1.5.0/workspace/tests/org.eclipse.epsilon.flexmi.test/pom.xml to /home/hudson/genie.epsilon/.jenkins/jobs/RC for 1.5.0/workspace/.repository/org/eclipse/epsilon/org.eclipse.epsilon.flexmi.test/0.9.0-SNAPSHOT/org.eclipse.epsilon.flexmi.test-0.9.0-SNAPSHOT.pom
[INFO] Installing /jobs/genie.epsilon/RC for 1.5.0/workspace/tests/org.eclipse.epsilon.flexmi.test/target/org.eclipse.epsilon.flexmi.test-0.9.0-SNAPSHOT-sources.jar to /home/hudson/genie.epsilon/.jenkins/jobs/RC for 1.5.0/workspace/.repository/org/eclipse/epsilon/org.eclipse.epsilon.flexmi.test/0.9.0-SNAPSHOT/org.eclipse.epsilon.flexmi.test-0.9.0-SNAPSHOT-sources.jar
[INFO] Installing /jobs/genie.epsilon/RC for 1.5.0/workspace/tests/org.eclipse.epsilon.flexmi.test/target/p2content.xml to /home/hudson/genie.epsilon/.jenkins/jobs/RC for 1.5.0/workspace/.repository/org/eclipse/epsilon/org.eclipse.epsilon.flexmi.test/0.9.0-SNAPSHOT/org.eclipse.epsilon.flexmi.test-0.9.0-SNAPSHOT-p2metadata.xml
[INFO] Installing /jobs/genie.epsilon/RC for 1.5.0/workspace/tests/org.eclipse.epsilon.flexmi.test/target/p2artifacts.xml to /home/hudson/genie.epsilon/.jenkins/jobs/RC for 1.5.0/workspace/.repository/org/eclipse/epsilon/org.eclipse.epsilon.flexmi.test/0.9.0-SNAPSHOT/org.eclipse.epsilon.flexmi.test-0.9.0-SNAPSHOT-p2artifacts.xml
[INFO] 
[INFO] --- tycho-p2-plugin:1.0.0:update-local-index (default-update-local-index) @ org.eclipse.epsilon.flexmi.test ---
[INFO]                                                                         
[INFO] ------------------------------------------------------------------------
[INFO] Building org.eclipse.epsilon.hutn.unparser.test.unit 0.7.4-SNAPSHOT
[INFO] ------------------------------------------------------------------------
[INFO] 
[INFO] --- maven-clean-plugin:2.5:clean (default-clean) @ org.eclipse.epsilon.hutn.unparser.test.unit ---
[INFO] 
[INFO] --- tycho-packaging-plugin:1.0.0:build-qualifier (default-build-qualifier) @ org.eclipse.epsilon.hutn.unparser.test.unit ---
[INFO] The project's OSGi version is 0.7.4.201807181629
[INFO] 
[INFO] --- tycho-packaging-plugin:1.0.0:validate-id (default-validate-id) @ org.eclipse.epsilon.hutn.unparser.test.unit ---
[INFO] 
[INFO] --- tycho-packaging-plugin:1.0.0:validate-version (default-validate-version) @ org.eclipse.epsilon.hutn.unparser.test.unit ---
[INFO] 
[INFO] --- maven-resources-plugin:2.4.3:resources (default-resources) @ org.eclipse.epsilon.hutn.unparser.test.unit ---
[INFO] Using 'UTF-8' encoding to copy filtered resources.
[INFO] skip non existing resourceDirectory /jobs/genie.epsilon/RC for 1.5.0/workspace/tests/org.eclipse.epsilon.hutn.unparser.test.unit/src/main/resources
[INFO] 
[INFO] --- tycho-compiler-plugin:1.0.0:compile (default-compile) @ org.eclipse.epsilon.hutn.unparser.test.unit ---
[WARNING] Parameter 'useProjectSettings' is set to true, but preferences file '/jobs/genie.epsilon/RC for 1.5.0/workspace/tests/org.eclipse.epsilon.hutn.unparser.test.unit/.settings/org.eclipse.jdt.core.prefs' could not be found!
[INFO] Compiling 34 source files to /jobs/genie.epsilon/RC for 1.5.0/workspace/tests/org.eclipse.epsilon.hutn.unparser.test.unit/target/classes
[INFO] 
[INFO] --- maven-resources-plugin:2.4.3:testResources (default-testResources) @ org.eclipse.epsilon.hutn.unparser.test.unit ---
[INFO] Using 'UTF-8' encoding to copy filtered resources.
[INFO] skip non existing resourceDirectory /jobs/genie.epsilon/RC for 1.5.0/workspace/tests/org.eclipse.epsilon.hutn.unparser.test.unit/src/test/resources
[INFO] 
[INFO] --- tycho-source-plugin:1.0.0:plugin-source (plugin-source) @ org.eclipse.epsilon.hutn.unparser.test.unit ---
[WARNING] bundle localization file /jobs/genie.epsilon/RC for 1.5.0/workspace/tests/org.eclipse.epsilon.hutn.unparser.test.unit/plugin.properties not found
[INFO] Building jar: /jobs/genie.epsilon/RC for 1.5.0/workspace/tests/org.eclipse.epsilon.hutn.unparser.test.unit/target/org.eclipse.epsilon.hutn.unparser.test.unit-0.7.4-SNAPSHOT-sources.jar
[INFO] 
[INFO] --- target-platform-configuration:1.0.0:target-platform (default-target-platform) @ org.eclipse.epsilon.hutn.unparser.test.unit ---
[INFO] 
[INFO] --- tycho-packaging-plugin:1.0.0:package-plugin (default-package-plugin) @ org.eclipse.epsilon.hutn.unparser.test.unit ---
[INFO] Building jar: /jobs/genie.epsilon/RC for 1.5.0/workspace/tests/org.eclipse.epsilon.hutn.unparser.test.unit/target/org.eclipse.epsilon.hutn.unparser.test.unit-0.7.4-SNAPSHOT.jar
[INFO] 
[INFO] --- tycho-p2-plugin:1.0.0:p2-metadata-default (default-p2-metadata-default) @ org.eclipse.epsilon.hutn.unparser.test.unit ---
[INFO] 
[INFO] --- maven-install-plugin:2.3.1:install (default-install) @ org.eclipse.epsilon.hutn.unparser.test.unit ---
[INFO] Installing /jobs/genie.epsilon/RC for 1.5.0/workspace/tests/org.eclipse.epsilon.hutn.unparser.test.unit/target/org.eclipse.epsilon.hutn.unparser.test.unit-0.7.4-SNAPSHOT.jar to /home/hudson/genie.epsilon/.jenkins/jobs/RC for 1.5.0/workspace/.repository/org/eclipse/epsilon/org.eclipse.epsilon.hutn.unparser.test.unit/0.7.4-SNAPSHOT/org.eclipse.epsilon.hutn.unparser.test.unit-0.7.4-SNAPSHOT.jar
[INFO] Installing /jobs/genie.epsilon/RC for 1.5.0/workspace/tests/org.eclipse.epsilon.hutn.unparser.test.unit/pom.xml to /home/hudson/genie.epsilon/.jenkins/jobs/RC for 1.5.0/workspace/.repository/org/eclipse/epsilon/org.eclipse.epsilon.hutn.unparser.test.unit/0.7.4-SNAPSHOT/org.eclipse.epsilon.hutn.unparser.test.unit-0.7.4-SNAPSHOT.pom
[INFO] Installing /jobs/genie.epsilon/RC for 1.5.0/workspace/tests/org.eclipse.epsilon.hutn.unparser.test.unit/target/org.eclipse.epsilon.hutn.unparser.test.unit-0.7.4-SNAPSHOT-sources.jar to /home/hudson/genie.epsilon/.jenkins/jobs/RC for 1.5.0/workspace/.repository/org/eclipse/epsilon/org.eclipse.epsilon.hutn.unparser.test.unit/0.7.4-SNAPSHOT/org.eclipse.epsilon.hutn.unparser.test.unit-0.7.4-SNAPSHOT-sources.jar
[INFO] Installing /jobs/genie.epsilon/RC for 1.5.0/workspace/tests/org.eclipse.epsilon.hutn.unparser.test.unit/target/p2content.xml to /home/hudson/genie.epsilon/.jenkins/jobs/RC for 1.5.0/workspace/.repository/org/eclipse/epsilon/org.eclipse.epsilon.hutn.unparser.test.unit/0.7.4-SNAPSHOT/org.eclipse.epsilon.hutn.unparser.test.unit-0.7.4-SNAPSHOT-p2metadata.xml
[INFO] Installing /jobs/genie.epsilon/RC for 1.5.0/workspace/tests/org.eclipse.epsilon.hutn.unparser.test.unit/target/p2artifacts.xml to /home/hudson/genie.epsilon/.jenkins/jobs/RC for 1.5.0/workspace/.repository/org/eclipse/epsilon/org.eclipse.epsilon.hutn.unparser.test.unit/0.7.4-SNAPSHOT/org.eclipse.epsilon.hutn.unparser.test.unit-0.7.4-SNAPSHOT-p2artifacts.xml
[INFO] 
[INFO] --- tycho-p2-plugin:1.0.0:update-local-index (default-update-local-index) @ org.eclipse.epsilon.hutn.unparser.test.unit ---
[INFO]                                                                         
[INFO] ------------------------------------------------------------------------
[INFO] Building org.eclipse.epsilon.hutn.xmi.test.dependencies 0.7.4-SNAPSHOT
[INFO] ------------------------------------------------------------------------
[INFO] 
[INFO] --- maven-clean-plugin:2.5:clean (default-clean) @ org.eclipse.epsilon.hutn.xmi.test.dependencies ---
[INFO] 
[INFO] --- tycho-packaging-plugin:1.0.0:build-qualifier (default-build-qualifier) @ org.eclipse.epsilon.hutn.xmi.test.dependencies ---
[INFO] The project's OSGi version is 0.7.4.201807181629
[INFO] 
[INFO] --- tycho-packaging-plugin:1.0.0:validate-id (default-validate-id) @ org.eclipse.epsilon.hutn.xmi.test.dependencies ---
[INFO] 
[INFO] --- tycho-packaging-plugin:1.0.0:validate-version (default-validate-version) @ org.eclipse.epsilon.hutn.xmi.test.dependencies ---
[INFO] 
[INFO] --- maven-resources-plugin:2.4.3:resources (default-resources) @ org.eclipse.epsilon.hutn.xmi.test.dependencies ---
[INFO] Using 'UTF-8' encoding to copy filtered resources.
[INFO] skip non existing resourceDirectory /jobs/genie.epsilon/RC for 1.5.0/workspace/tests/org.eclipse.epsilon.hutn.xmi.test.dependencies/src/main/resources
[INFO] 
[INFO] --- tycho-compiler-plugin:1.0.0:compile (default-compile) @ org.eclipse.epsilon.hutn.xmi.test.dependencies ---
[INFO] No sources to compile
[WARNING] Source directory /jobs/genie.epsilon/RC for 1.5.0/workspace/tests/org.eclipse.epsilon.hutn.xmi.test.dependencies/src does not exist
[INFO] 
[INFO] --- maven-resources-plugin:2.4.3:testResources (default-testResources) @ org.eclipse.epsilon.hutn.xmi.test.dependencies ---
[INFO] Using 'UTF-8' encoding to copy filtered resources.
[INFO] skip non existing resourceDirectory /jobs/genie.epsilon/RC for 1.5.0/workspace/tests/org.eclipse.epsilon.hutn.xmi.test.dependencies/src/test/resources
[INFO] 
[INFO] --- tycho-source-plugin:1.0.0:plugin-source (plugin-source) @ org.eclipse.epsilon.hutn.xmi.test.dependencies ---
[WARNING] bundle localization file /jobs/genie.epsilon/RC for 1.5.0/workspace/tests/org.eclipse.epsilon.hutn.xmi.test.dependencies/plugin.properties not found
[INFO] Building jar: /jobs/genie.epsilon/RC for 1.5.0/workspace/tests/org.eclipse.epsilon.hutn.xmi.test.dependencies/target/org.eclipse.epsilon.hutn.xmi.test.dependencies-0.7.4-SNAPSHOT-sources.jar
[INFO] 
[INFO] --- target-platform-configuration:1.0.0:target-platform (default-target-platform) @ org.eclipse.epsilon.hutn.xmi.test.dependencies ---
[INFO] 
[INFO] --- tycho-packaging-plugin:1.0.0:package-plugin (default-package-plugin) @ org.eclipse.epsilon.hutn.xmi.test.dependencies ---
[INFO] Building jar: /jobs/genie.epsilon/RC for 1.5.0/workspace/tests/org.eclipse.epsilon.hutn.xmi.test.dependencies/target/org.eclipse.epsilon.hutn.xmi.test.dependencies-0.7.4-SNAPSHOT.jar
[INFO] 
[INFO] --- tycho-p2-plugin:1.0.0:p2-metadata-default (default-p2-metadata-default) @ org.eclipse.epsilon.hutn.xmi.test.dependencies ---
[INFO] 
[INFO] --- maven-install-plugin:2.3.1:install (default-install) @ org.eclipse.epsilon.hutn.xmi.test.dependencies ---
[INFO] Installing /jobs/genie.epsilon/RC for 1.5.0/workspace/tests/org.eclipse.epsilon.hutn.xmi.test.dependencies/target/org.eclipse.epsilon.hutn.xmi.test.dependencies-0.7.4-SNAPSHOT.jar to /home/hudson/genie.epsilon/.jenkins/jobs/RC for 1.5.0/workspace/.repository/org/eclipse/epsilon/org.eclipse.epsilon.hutn.xmi.test.dependencies/0.7.4-SNAPSHOT/org.eclipse.epsilon.hutn.xmi.test.dependencies-0.7.4-SNAPSHOT.jar
[INFO] Installing /jobs/genie.epsilon/RC for 1.5.0/workspace/tests/org.eclipse.epsilon.hutn.xmi.test.dependencies/pom.xml to /home/hudson/genie.epsilon/.jenkins/jobs/RC for 1.5.0/workspace/.repository/org/eclipse/epsilon/org.eclipse.epsilon.hutn.xmi.test.dependencies/0.7.4-SNAPSHOT/org.eclipse.epsilon.hutn.xmi.test.dependencies-0.7.4-SNAPSHOT.pom
[INFO] Installing /jobs/genie.epsilon/RC for 1.5.0/workspace/tests/org.eclipse.epsilon.hutn.xmi.test.dependencies/target/org.eclipse.epsilon.hutn.xmi.test.dependencies-0.7.4-SNAPSHOT-sources.jar to /home/hudson/genie.epsilon/.jenkins/jobs/RC for 1.5.0/workspace/.repository/org/eclipse/epsilon/org.eclipse.epsilon.hutn.xmi.test.dependencies/0.7.4-SNAPSHOT/org.eclipse.epsilon.hutn.xmi.test.dependencies-0.7.4-SNAPSHOT-sources.jar
[INFO] Installing /jobs/genie.epsilon/RC for 1.5.0/workspace/tests/org.eclipse.epsilon.hutn.xmi.test.dependencies/target/p2content.xml to /home/hudson/genie.epsilon/.jenkins/jobs/RC for 1.5.0/workspace/.repository/org/eclipse/epsilon/org.eclipse.epsilon.hutn.xmi.test.dependencies/0.7.4-SNAPSHOT/org.eclipse.epsilon.hutn.xmi.test.dependencies-0.7.4-SNAPSHOT-p2metadata.xml
[INFO] Installing /jobs/genie.epsilon/RC for 1.5.0/workspace/tests/org.eclipse.epsilon.hutn.xmi.test.dependencies/target/p2artifacts.xml to /home/hudson/genie.epsilon/.jenkins/jobs/RC for 1.5.0/workspace/.repository/org/eclipse/epsilon/org.eclipse.epsilon.hutn.xmi.test.dependencies/0.7.4-SNAPSHOT/org.eclipse.epsilon.hutn.xmi.test.dependencies-0.7.4-SNAPSHOT-p2artifacts.xml
[INFO] 
[INFO] --- tycho-p2-plugin:1.0.0:update-local-index (default-update-local-index) @ org.eclipse.epsilon.hutn.xmi.test.dependencies ---
[INFO]                                                                         
[INFO] ------------------------------------------------------------------------
[INFO] Building org.eclipse.epsilon.hutn.xmi.test.unit 0.7.4-SNAPSHOT
[INFO] ------------------------------------------------------------------------
[INFO] 
[INFO] --- maven-clean-plugin:2.5:clean (default-clean) @ org.eclipse.epsilon.hutn.xmi.test.unit ---
[INFO] 
[INFO] --- tycho-packaging-plugin:1.0.0:build-qualifier (default-build-qualifier) @ org.eclipse.epsilon.hutn.xmi.test.unit ---
[INFO] The project's OSGi version is 0.7.4.201807181629
[INFO] 
[INFO] --- tycho-packaging-plugin:1.0.0:validate-id (default-validate-id) @ org.eclipse.epsilon.hutn.xmi.test.unit ---
[INFO] 
[INFO] --- tycho-packaging-plugin:1.0.0:validate-version (default-validate-version) @ org.eclipse.epsilon.hutn.xmi.test.unit ---
[INFO] 
[INFO] --- maven-resources-plugin:2.4.3:resources (default-resources) @ org.eclipse.epsilon.hutn.xmi.test.unit ---
[INFO] Using 'UTF-8' encoding to copy filtered resources.
[INFO] skip non existing resourceDirectory /jobs/genie.epsilon/RC for 1.5.0/workspace/tests/org.eclipse.epsilon.hutn.xmi.test.unit/src/main/resources
[INFO] 
[INFO] --- tycho-compiler-plugin:1.0.0:compile (default-compile) @ org.eclipse.epsilon.hutn.xmi.test.unit ---
[WARNING] Parameter 'useProjectSettings' is set to true, but preferences file '/jobs/genie.epsilon/RC for 1.5.0/workspace/tests/org.eclipse.epsilon.hutn.xmi.test.unit/.settings/org.eclipse.jdt.core.prefs' could not be found!
[INFO] Compiling 25 source files to /jobs/genie.epsilon/RC for 1.5.0/workspace/tests/org.eclipse.epsilon.hutn.xmi.test.unit/target/classes
[INFO] 
[INFO] --- maven-resources-plugin:2.4.3:testResources (default-testResources) @ org.eclipse.epsilon.hutn.xmi.test.unit ---
[INFO] Using 'UTF-8' encoding to copy filtered resources.
[INFO] skip non existing resourceDirectory /jobs/genie.epsilon/RC for 1.5.0/workspace/tests/org.eclipse.epsilon.hutn.xmi.test.unit/src/test/resources
[INFO] 
[INFO] --- tycho-source-plugin:1.0.0:plugin-source (plugin-source) @ org.eclipse.epsilon.hutn.xmi.test.unit ---
[WARNING] bundle localization file /jobs/genie.epsilon/RC for 1.5.0/workspace/tests/org.eclipse.epsilon.hutn.xmi.test.unit/plugin.properties not found
[INFO] Building jar: /jobs/genie.epsilon/RC for 1.5.0/workspace/tests/org.eclipse.epsilon.hutn.xmi.test.unit/target/org.eclipse.epsilon.hutn.xmi.test.unit-0.7.4-SNAPSHOT-sources.jar
[INFO] 
[INFO] --- target-platform-configuration:1.0.0:target-platform (default-target-platform) @ org.eclipse.epsilon.hutn.xmi.test.unit ---
[INFO] 
[INFO] --- tycho-packaging-plugin:1.0.0:package-plugin (default-package-plugin) @ org.eclipse.epsilon.hutn.xmi.test.unit ---
[INFO] Building jar: /jobs/genie.epsilon/RC for 1.5.0/workspace/tests/org.eclipse.epsilon.hutn.xmi.test.unit/target/org.eclipse.epsilon.hutn.xmi.test.unit-0.7.4-SNAPSHOT.jar
[INFO] 
[INFO] --- tycho-p2-plugin:1.0.0:p2-metadata-default (default-p2-metadata-default) @ org.eclipse.epsilon.hutn.xmi.test.unit ---
[INFO] 
[INFO] --- maven-install-plugin:2.3.1:install (default-install) @ org.eclipse.epsilon.hutn.xmi.test.unit ---
[INFO] Installing /jobs/genie.epsilon/RC for 1.5.0/workspace/tests/org.eclipse.epsilon.hutn.xmi.test.unit/target/org.eclipse.epsilon.hutn.xmi.test.unit-0.7.4-SNAPSHOT.jar to /home/hudson/genie.epsilon/.jenkins/jobs/RC for 1.5.0/workspace/.repository/org/eclipse/epsilon/org.eclipse.epsilon.hutn.xmi.test.unit/0.7.4-SNAPSHOT/org.eclipse.epsilon.hutn.xmi.test.unit-0.7.4-SNAPSHOT.jar
[INFO] Installing /jobs/genie.epsilon/RC for 1.5.0/workspace/tests/org.eclipse.epsilon.hutn.xmi.test.unit/pom.xml to /home/hudson/genie.epsilon/.jenkins/jobs/RC for 1.5.0/workspace/.repository/org/eclipse/epsilon/org.eclipse.epsilon.hutn.xmi.test.unit/0.7.4-SNAPSHOT/org.eclipse.epsilon.hutn.xmi.test.unit-0.7.4-SNAPSHOT.pom
[INFO] Installing /jobs/genie.epsilon/RC for 1.5.0/workspace/tests/org.eclipse.epsilon.hutn.xmi.test.unit/target/org.eclipse.epsilon.hutn.xmi.test.unit-0.7.4-SNAPSHOT-sources.jar to /home/hudson/genie.epsilon/.jenkins/jobs/RC for 1.5.0/workspace/.repository/org/eclipse/epsilon/org.eclipse.epsilon.hutn.xmi.test.unit/0.7.4-SNAPSHOT/org.eclipse.epsilon.hutn.xmi.test.unit-0.7.4-SNAPSHOT-sources.jar
[INFO] Installing /jobs/genie.epsilon/RC for 1.5.0/workspace/tests/org.eclipse.epsilon.hutn.xmi.test.unit/target/p2content.xml to /home/hudson/genie.epsilon/.jenkins/jobs/RC for 1.5.0/workspace/.repository/org/eclipse/epsilon/org.eclipse.epsilon.hutn.xmi.test.unit/0.7.4-SNAPSHOT/org.eclipse.epsilon.hutn.xmi.test.unit-0.7.4-SNAPSHOT-p2metadata.xml
[INFO] Installing /jobs/genie.epsilon/RC for 1.5.0/workspace/tests/org.eclipse.epsilon.hutn.xmi.test.unit/target/p2artifacts.xml to /home/hudson/genie.epsilon/.jenkins/jobs/RC for 1.5.0/workspace/.repository/org/eclipse/epsilon/org.eclipse.epsilon.hutn.xmi.test.unit/0.7.4-SNAPSHOT/org.eclipse.epsilon.hutn.xmi.test.unit-0.7.4-SNAPSHOT-p2artifacts.xml
[INFO] 
[INFO] --- tycho-p2-plugin:1.0.0:update-local-index (default-update-local-index) @ org.eclipse.epsilon.hutn.xmi.test.unit ---
[INFO]                                                                         
[INFO] ------------------------------------------------------------------------
[INFO] Building org.eclipse.epsilon.hutn.xmi.test.integration 0.7.4-SNAPSHOT
[INFO] ------------------------------------------------------------------------
[INFO] 
[INFO] --- maven-clean-plugin:2.5:clean (default-clean) @ org.eclipse.epsilon.hutn.xmi.test.integration ---
[INFO] 
[INFO] --- tycho-packaging-plugin:1.0.0:build-qualifier (default-build-qualifier) @ org.eclipse.epsilon.hutn.xmi.test.integration ---
[INFO] The project's OSGi version is 0.7.4.201807181629
[INFO] 
[INFO] --- tycho-packaging-plugin:1.0.0:validate-id (default-validate-id) @ org.eclipse.epsilon.hutn.xmi.test.integration ---
[INFO] 
[INFO] --- tycho-packaging-plugin:1.0.0:validate-version (default-validate-version) @ org.eclipse.epsilon.hutn.xmi.test.integration ---
[INFO] 
[INFO] --- maven-resources-plugin:2.4.3:resources (default-resources) @ org.eclipse.epsilon.hutn.xmi.test.integration ---
[INFO] Using 'UTF-8' encoding to copy filtered resources.
[INFO] skip non existing resourceDirectory /jobs/genie.epsilon/RC for 1.5.0/workspace/tests/org.eclipse.epsilon.hutn.xmi.test.integration/src/main/resources
[INFO] 
[INFO] --- tycho-compiler-plugin:1.0.0:compile (default-compile) @ org.eclipse.epsilon.hutn.xmi.test.integration ---
[WARNING] Parameter 'useProjectSettings' is set to true, but preferences file '/jobs/genie.epsilon/RC for 1.5.0/workspace/tests/org.eclipse.epsilon.hutn.xmi.test.integration/.settings/org.eclipse.jdt.core.prefs' could not be found!
[INFO] Compiling 66 source files to /jobs/genie.epsilon/RC for 1.5.0/workspace/tests/org.eclipse.epsilon.hutn.xmi.test.integration/target/classes
[INFO] 
[INFO] --- maven-resources-plugin:2.4.3:testResources (default-testResources) @ org.eclipse.epsilon.hutn.xmi.test.integration ---
[INFO] Using 'UTF-8' encoding to copy filtered resources.
[INFO] skip non existing resourceDirectory /jobs/genie.epsilon/RC for 1.5.0/workspace/tests/org.eclipse.epsilon.hutn.xmi.test.integration/src/test/resources
[INFO] 
[INFO] --- tycho-source-plugin:1.0.0:plugin-source (plugin-source) @ org.eclipse.epsilon.hutn.xmi.test.integration ---
[WARNING] bundle localization file /jobs/genie.epsilon/RC for 1.5.0/workspace/tests/org.eclipse.epsilon.hutn.xmi.test.integration/plugin.properties not found
[INFO] Building jar: /jobs/genie.epsilon/RC for 1.5.0/workspace/tests/org.eclipse.epsilon.hutn.xmi.test.integration/target/org.eclipse.epsilon.hutn.xmi.test.integration-0.7.4-SNAPSHOT-sources.jar
[INFO] 
[INFO] --- target-platform-configuration:1.0.0:target-platform (default-target-platform) @ org.eclipse.epsilon.hutn.xmi.test.integration ---
[INFO] 
[INFO] --- tycho-packaging-plugin:1.0.0:package-plugin (default-package-plugin) @ org.eclipse.epsilon.hutn.xmi.test.integration ---
[INFO] Building jar: /jobs/genie.epsilon/RC for 1.5.0/workspace/tests/org.eclipse.epsilon.hutn.xmi.test.integration/target/org.eclipse.epsilon.hutn.xmi.test.integration-0.7.4-SNAPSHOT.jar
[INFO] 
[INFO] --- tycho-p2-plugin:1.0.0:p2-metadata-default (default-p2-metadata-default) @ org.eclipse.epsilon.hutn.xmi.test.integration ---
[INFO] 
[INFO] --- maven-install-plugin:2.3.1:install (default-install) @ org.eclipse.epsilon.hutn.xmi.test.integration ---
[INFO] Installing /jobs/genie.epsilon/RC for 1.5.0/workspace/tests/org.eclipse.epsilon.hutn.xmi.test.integration/target/org.eclipse.epsilon.hutn.xmi.test.integration-0.7.4-SNAPSHOT.jar to /home/hudson/genie.epsilon/.jenkins/jobs/RC for 1.5.0/workspace/.repository/org/eclipse/epsilon/org.eclipse.epsilon.hutn.xmi.test.integration/0.7.4-SNAPSHOT/org.eclipse.epsilon.hutn.xmi.test.integration-0.7.4-SNAPSHOT.jar
[INFO] Installing /jobs/genie.epsilon/RC for 1.5.0/workspace/tests/org.eclipse.epsilon.hutn.xmi.test.integration/pom.xml to /home/hudson/genie.epsilon/.jenkins/jobs/RC for 1.5.0/workspace/.repository/org/eclipse/epsilon/org.eclipse.epsilon.hutn.xmi.test.integration/0.7.4-SNAPSHOT/org.eclipse.epsilon.hutn.xmi.test.integration-0.7.4-SNAPSHOT.pom
[INFO] Installing /jobs/genie.epsilon/RC for 1.5.0/workspace/tests/org.eclipse.epsilon.hutn.xmi.test.integration/target/org.eclipse.epsilon.hutn.xmi.test.integration-0.7.4-SNAPSHOT-sources.jar to /home/hudson/genie.epsilon/.jenkins/jobs/RC for 1.5.0/workspace/.repository/org/eclipse/epsilon/org.eclipse.epsilon.hutn.xmi.test.integration/0.7.4-SNAPSHOT/org.eclipse.epsilon.hutn.xmi.test.integration-0.7.4-SNAPSHOT-sources.jar
[INFO] Installing /jobs/genie.epsilon/RC for 1.5.0/workspace/tests/org.eclipse.epsilon.hutn.xmi.test.integration/target/p2content.xml to /home/hudson/genie.epsilon/.jenkins/jobs/RC for 1.5.0/workspace/.repository/org/eclipse/epsilon/org.eclipse.epsilon.hutn.xmi.test.integration/0.7.4-SNAPSHOT/org.eclipse.epsilon.hutn.xmi.test.integration-0.7.4-SNAPSHOT-p2metadata.xml
[INFO] Installing /jobs/genie.epsilon/RC for 1.5.0/workspace/tests/org.eclipse.epsilon.hutn.xmi.test.integration/target/p2artifacts.xml to /home/hudson/genie.epsilon/.jenkins/jobs/RC for 1.5.0/workspace/.repository/org/eclipse/epsilon/org.eclipse.epsilon.hutn.xmi.test.integration/0.7.4-SNAPSHOT/org.eclipse.epsilon.hutn.xmi.test.integration-0.7.4-SNAPSHOT-p2artifacts.xml
[INFO] 
[INFO] --- tycho-p2-plugin:1.0.0:update-local-index (default-update-local-index) @ org.eclipse.epsilon.hutn.xmi.test.integration ---
[INFO]                                                                         
[INFO] ------------------------------------------------------------------------
[INFO] Building org.eclipse.epsilon.hutn.xmi.test 0.7.4-SNAPSHOT
[INFO] ------------------------------------------------------------------------
[INFO] 
[INFO] --- maven-clean-plugin:2.5:clean (default-clean) @ org.eclipse.epsilon.hutn.xmi.test ---
[INFO] 
[INFO] --- tycho-packaging-plugin:1.0.0:build-qualifier (default-build-qualifier) @ org.eclipse.epsilon.hutn.xmi.test ---
[INFO] The project's OSGi version is 0.7.4.201807181629
[INFO] 
[INFO] --- tycho-packaging-plugin:1.0.0:validate-id (default-validate-id) @ org.eclipse.epsilon.hutn.xmi.test ---
[INFO] 
[INFO] --- tycho-packaging-plugin:1.0.0:validate-version (default-validate-version) @ org.eclipse.epsilon.hutn.xmi.test ---
[INFO] 
[INFO] --- maven-resources-plugin:2.4.3:resources (default-resources) @ org.eclipse.epsilon.hutn.xmi.test ---
[INFO] Using 'UTF-8' encoding to copy filtered resources.
[INFO] skip non existing resourceDirectory /jobs/genie.epsilon/RC for 1.5.0/workspace/tests/org.eclipse.epsilon.hutn.xmi.test/src/main/resources
[INFO] 
[INFO] --- tycho-compiler-plugin:1.0.0:compile (default-compile) @ org.eclipse.epsilon.hutn.xmi.test ---
[WARNING] Parameter 'useProjectSettings' is set to true, but preferences file '/jobs/genie.epsilon/RC for 1.5.0/workspace/tests/org.eclipse.epsilon.hutn.xmi.test/.settings/org.eclipse.jdt.core.prefs' could not be found!
[INFO] Compiling 1 source file to /jobs/genie.epsilon/RC for 1.5.0/workspace/tests/org.eclipse.epsilon.hutn.xmi.test/target/classes
[INFO] 
[INFO] --- maven-resources-plugin:2.4.3:testResources (default-testResources) @ org.eclipse.epsilon.hutn.xmi.test ---
[INFO] Using 'UTF-8' encoding to copy filtered resources.
[INFO] skip non existing resourceDirectory /jobs/genie.epsilon/RC for 1.5.0/workspace/tests/org.eclipse.epsilon.hutn.xmi.test/src/test/resources
[INFO] 
[INFO] --- tycho-source-plugin:1.0.0:plugin-source (plugin-source) @ org.eclipse.epsilon.hutn.xmi.test ---
[WARNING] bundle localization file /jobs/genie.epsilon/RC for 1.5.0/workspace/tests/org.eclipse.epsilon.hutn.xmi.test/plugin.properties not found
[INFO] Building jar: /jobs/genie.epsilon/RC for 1.5.0/workspace/tests/org.eclipse.epsilon.hutn.xmi.test/target/org.eclipse.epsilon.hutn.xmi.test-0.7.4-SNAPSHOT-sources.jar
[INFO] 
[INFO] --- target-platform-configuration:1.0.0:target-platform (default-target-platform) @ org.eclipse.epsilon.hutn.xmi.test ---
[INFO] 
[INFO] --- tycho-packaging-plugin:1.0.0:package-plugin (default-package-plugin) @ org.eclipse.epsilon.hutn.xmi.test ---
[INFO] Building jar: /jobs/genie.epsilon/RC for 1.5.0/workspace/tests/org.eclipse.epsilon.hutn.xmi.test/target/org.eclipse.epsilon.hutn.xmi.test-0.7.4-SNAPSHOT.jar
[INFO] 
[INFO] --- tycho-p2-plugin:1.0.0:p2-metadata-default (default-p2-metadata-default) @ org.eclipse.epsilon.hutn.xmi.test ---
[INFO] 
[INFO] --- maven-install-plugin:2.3.1:install (default-install) @ org.eclipse.epsilon.hutn.xmi.test ---
[INFO] Installing /jobs/genie.epsilon/RC for 1.5.0/workspace/tests/org.eclipse.epsilon.hutn.xmi.test/target/org.eclipse.epsilon.hutn.xmi.test-0.7.4-SNAPSHOT.jar to /home/hudson/genie.epsilon/.jenkins/jobs/RC for 1.5.0/workspace/.repository/org/eclipse/epsilon/org.eclipse.epsilon.hutn.xmi.test/0.7.4-SNAPSHOT/org.eclipse.epsilon.hutn.xmi.test-0.7.4-SNAPSHOT.jar
[INFO] Installing /jobs/genie.epsilon/RC for 1.5.0/workspace/tests/org.eclipse.epsilon.hutn.xmi.test/pom.xml to /home/hudson/genie.epsilon/.jenkins/jobs/RC for 1.5.0/workspace/.repository/org/eclipse/epsilon/org.eclipse.epsilon.hutn.xmi.test/0.7.4-SNAPSHOT/org.eclipse.epsilon.hutn.xmi.test-0.7.4-SNAPSHOT.pom
[INFO] Installing /jobs/genie.epsilon/RC for 1.5.0/workspace/tests/org.eclipse.epsilon.hutn.xmi.test/target/org.eclipse.epsilon.hutn.xmi.test-0.7.4-SNAPSHOT-sources.jar to /home/hudson/genie.epsilon/.jenkins/jobs/RC for 1.5.0/workspace/.repository/org/eclipse/epsilon/org.eclipse.epsilon.hutn.xmi.test/0.7.4-SNAPSHOT/org.eclipse.epsilon.hutn.xmi.test-0.7.4-SNAPSHOT-sources.jar
[INFO] Installing /jobs/genie.epsilon/RC for 1.5.0/workspace/tests/org.eclipse.epsilon.hutn.xmi.test/target/p2content.xml to /home/hudson/genie.epsilon/.jenkins/jobs/RC for 1.5.0/workspace/.repository/org/eclipse/epsilon/org.eclipse.epsilon.hutn.xmi.test/0.7.4-SNAPSHOT/org.eclipse.epsilon.hutn.xmi.test-0.7.4-SNAPSHOT-p2metadata.xml
[INFO] Installing /jobs/genie.epsilon/RC for 1.5.0/workspace/tests/org.eclipse.epsilon.hutn.xmi.test/target/p2artifacts.xml to /home/hudson/genie.epsilon/.jenkins/jobs/RC for 1.5.0/workspace/.repository/org/eclipse/epsilon/org.eclipse.epsilon.hutn.xmi.test/0.7.4-SNAPSHOT/org.eclipse.epsilon.hutn.xmi.test-0.7.4-SNAPSHOT-p2artifacts.xml
[INFO] 
[INFO] --- tycho-p2-plugin:1.0.0:update-local-index (default-update-local-index) @ org.eclipse.epsilon.hutn.xmi.test ---
[INFO]                                                                         
[INFO] ------------------------------------------------------------------------
[INFO] Building org.eclipse.epsilon.workflow.test 1.5.0-SNAPSHOT
[INFO] ------------------------------------------------------------------------
[INFO] 
[INFO] --- maven-clean-plugin:2.5:clean (default-clean) @ org.eclipse.epsilon.workflow.test ---
[INFO] 
[INFO] --- tycho-packaging-plugin:1.0.0:build-qualifier (default-build-qualifier) @ org.eclipse.epsilon.workflow.test ---
[INFO] The project's OSGi version is 1.5.0.201807181629
[INFO] 
[INFO] --- tycho-packaging-plugin:1.0.0:validate-id (default-validate-id) @ org.eclipse.epsilon.workflow.test ---
[INFO] 
[INFO] --- tycho-packaging-plugin:1.0.0:validate-version (default-validate-version) @ org.eclipse.epsilon.workflow.test ---
[INFO] 
[INFO] --- maven-resources-plugin:2.4.3:resources (default-resources) @ org.eclipse.epsilon.workflow.test ---
[INFO] Using 'UTF-8' encoding to copy filtered resources.
[INFO] skip non existing resourceDirectory /jobs/genie.epsilon/RC for 1.5.0/workspace/tests/org.eclipse.epsilon.workflow.test/src/main/resources
[INFO] 
[INFO] --- tycho-compiler-plugin:1.0.0:compile (default-compile) @ org.eclipse.epsilon.workflow.test ---
[WARNING] Parameter 'useProjectSettings' is set to true, but preferences file '/jobs/genie.epsilon/RC for 1.5.0/workspace/tests/org.eclipse.epsilon.workflow.test/.settings/org.eclipse.jdt.core.prefs' could not be found!
[INFO] Compiling 21 source files to /jobs/genie.epsilon/RC for 1.5.0/workspace/tests/org.eclipse.epsilon.workflow.test/target/classes
[INFO] 
[INFO] --- maven-resources-plugin:2.4.3:testResources (default-testResources) @ org.eclipse.epsilon.workflow.test ---
[INFO] Using 'UTF-8' encoding to copy filtered resources.
[INFO] skip non existing resourceDirectory /jobs/genie.epsilon/RC for 1.5.0/workspace/tests/org.eclipse.epsilon.workflow.test/src/test/resources
[INFO] 
[INFO] --- tycho-source-plugin:1.0.0:plugin-source (plugin-source) @ org.eclipse.epsilon.workflow.test ---
[WARNING] bundle localization file /jobs/genie.epsilon/RC for 1.5.0/workspace/tests/org.eclipse.epsilon.workflow.test/plugin.properties not found
[INFO] Building jar: /jobs/genie.epsilon/RC for 1.5.0/workspace/tests/org.eclipse.epsilon.workflow.test/target/org.eclipse.epsilon.workflow.test-1.5.0-SNAPSHOT-sources.jar
[INFO] 
[INFO] --- target-platform-configuration:1.0.0:target-platform (default-target-platform) @ org.eclipse.epsilon.workflow.test ---
[INFO] 
[INFO] --- tycho-packaging-plugin:1.0.0:package-plugin (default-package-plugin) @ org.eclipse.epsilon.workflow.test ---
[INFO] Building jar: /jobs/genie.epsilon/RC for 1.5.0/workspace/tests/org.eclipse.epsilon.workflow.test/target/org.eclipse.epsilon.workflow.test-1.5.0-SNAPSHOT.jar
[INFO] 
[INFO] --- tycho-p2-plugin:1.0.0:p2-metadata-default (default-p2-metadata-default) @ org.eclipse.epsilon.workflow.test ---
[INFO] 
[INFO] --- maven-install-plugin:2.3.1:install (default-install) @ org.eclipse.epsilon.workflow.test ---
[INFO] Installing /jobs/genie.epsilon/RC for 1.5.0/workspace/tests/org.eclipse.epsilon.workflow.test/target/org.eclipse.epsilon.workflow.test-1.5.0-SNAPSHOT.jar to /home/hudson/genie.epsilon/.jenkins/jobs/RC for 1.5.0/workspace/.repository/org/eclipse/epsilon/org.eclipse.epsilon.workflow.test/1.5.0-SNAPSHOT/org.eclipse.epsilon.workflow.test-1.5.0-SNAPSHOT.jar
[INFO] Installing /jobs/genie.epsilon/RC for 1.5.0/workspace/tests/org.eclipse.epsilon.workflow.test/pom.xml to /home/hudson/genie.epsilon/.jenkins/jobs/RC for 1.5.0/workspace/.repository/org/eclipse/epsilon/org.eclipse.epsilon.workflow.test/1.5.0-SNAPSHOT/org.eclipse.epsilon.workflow.test-1.5.0-SNAPSHOT.pom
[INFO] Installing /jobs/genie.epsilon/RC for 1.5.0/workspace/tests/org.eclipse.epsilon.workflow.test/target/org.eclipse.epsilon.workflow.test-1.5.0-SNAPSHOT-sources.jar to /home/hudson/genie.epsilon/.jenkins/jobs/RC for 1.5.0/workspace/.repository/org/eclipse/epsilon/org.eclipse.epsilon.workflow.test/1.5.0-SNAPSHOT/org.eclipse.epsilon.workflow.test-1.5.0-SNAPSHOT-sources.jar
[INFO] Installing /jobs/genie.epsilon/RC for 1.5.0/workspace/tests/org.eclipse.epsilon.workflow.test/target/p2content.xml to /home/hudson/genie.epsilon/.jenkins/jobs/RC for 1.5.0/workspace/.repository/org/eclipse/epsilon/org.eclipse.epsilon.workflow.test/1.5.0-SNAPSHOT/org.eclipse.epsilon.workflow.test-1.5.0-SNAPSHOT-p2metadata.xml
[INFO] Installing /jobs/genie.epsilon/RC for 1.5.0/workspace/tests/org.eclipse.epsilon.workflow.test/target/p2artifacts.xml to /home/hudson/genie.epsilon/.jenkins/jobs/RC for 1.5.0/workspace/.repository/org/eclipse/epsilon/org.eclipse.epsilon.workflow.test/1.5.0-SNAPSHOT/org.eclipse.epsilon.workflow.test-1.5.0-SNAPSHOT-p2artifacts.xml
[INFO] 
[INFO] --- tycho-p2-plugin:1.0.0:update-local-index (default-update-local-index) @ org.eclipse.epsilon.workflow.test ---
[INFO]                                                                         
[INFO] ------------------------------------------------------------------------
[INFO] Building org.eclipse.epsilon.test 1.5.0-SNAPSHOT
[INFO] ------------------------------------------------------------------------
[INFO] 
[INFO] --- maven-clean-plugin:2.5:clean (default-clean) @ org.eclipse.epsilon.test ---
[INFO] 
[INFO] --- tycho-packaging-plugin:1.0.0:build-qualifier (default-build-qualifier) @ org.eclipse.epsilon.test ---
[INFO] The project's OSGi version is 1.5.0.201807181629
[INFO] 
[INFO] --- tycho-packaging-plugin:1.0.0:validate-id (default-validate-id) @ org.eclipse.epsilon.test ---
[INFO] 
[INFO] --- tycho-packaging-plugin:1.0.0:validate-version (default-validate-version) @ org.eclipse.epsilon.test ---
[INFO] 
[INFO] --- maven-resources-plugin:2.4.3:resources (default-resources) @ org.eclipse.epsilon.test ---
[INFO] Using 'UTF-8' encoding to copy filtered resources.
[INFO] skip non existing resourceDirectory /jobs/genie.epsilon/RC for 1.5.0/workspace/tests/org.eclipse.epsilon.test/src/main/resources
[INFO] 
[INFO] --- tycho-compiler-plugin:1.0.0:compile (default-compile) @ org.eclipse.epsilon.test ---
[WARNING] Parameter 'useProjectSettings' is set to true, but preferences file '/jobs/genie.epsilon/RC for 1.5.0/workspace/tests/org.eclipse.epsilon.test/.settings/org.eclipse.jdt.core.prefs' could not be found!
[INFO] Compiling 3 source files to /jobs/genie.epsilon/RC for 1.5.0/workspace/tests/org.eclipse.epsilon.test/target/classes
[INFO] 
[INFO] --- maven-resources-plugin:2.4.3:testResources (default-testResources) @ org.eclipse.epsilon.test ---
[INFO] Using 'UTF-8' encoding to copy filtered resources.
[INFO] skip non existing resourceDirectory /jobs/genie.epsilon/RC for 1.5.0/workspace/tests/org.eclipse.epsilon.test/src/test/resources
[INFO] 
[INFO] --- tycho-source-plugin:1.0.0:plugin-source (plugin-source) @ org.eclipse.epsilon.test ---
[WARNING] bundle localization file /jobs/genie.epsilon/RC for 1.5.0/workspace/tests/org.eclipse.epsilon.test/plugin.properties not found
[INFO] Building jar: /jobs/genie.epsilon/RC for 1.5.0/workspace/tests/org.eclipse.epsilon.test/target/org.eclipse.epsilon.test-1.5.0-SNAPSHOT-sources.jar
[INFO] 
[INFO] --- target-platform-configuration:1.0.0:target-platform (default-target-platform) @ org.eclipse.epsilon.test ---
[INFO] 
[INFO] --- tycho-packaging-plugin:1.0.0:package-plugin (default-package-plugin) @ org.eclipse.epsilon.test ---
[INFO] Building jar: /jobs/genie.epsilon/RC for 1.5.0/workspace/tests/org.eclipse.epsilon.test/target/org.eclipse.epsilon.test-1.5.0-SNAPSHOT.jar
[INFO] 
[INFO] --- tycho-p2-plugin:1.0.0:p2-metadata-default (default-p2-metadata-default) @ org.eclipse.epsilon.test ---
[INFO] 
[INFO] --- tycho-surefire-plugin:1.0.0:test (default-test) @ org.eclipse.epsilon.test ---
[INFO] Expected eclipse log file: /jobs/genie.epsilon/RC for 1.5.0/workspace/tests/org.eclipse.epsilon.test/target/work/data/.metadata/.log
[INFO] Command line:
	[/opt/public/common/java/oracle/jdk1.8.0_162_x64/jre/bin/java, -Dosgi.noShutdown=false, -Dosgi.os=linux, -Dosgi.ws=gtk, -Dosgi.arch=x86_64, -XX:MaxPermSize=256m, -Dosgi.clean=true, -jar, /jobs/genie.epsilon/RC for 1.5.0/workspace/.repository/p2/osgi/bundle/org.eclipse.equinox.launcher/1.5.0.v20180512-1130/org.eclipse.equinox.launcher-1.5.0.v20180512-1130.jar, -data, /jobs/genie.epsilon/RC for 1.5.0/workspace/tests/org.eclipse.epsilon.test/target/work/data, -install, /jobs/genie.epsilon/RC for 1.5.0/workspace/tests/org.eclipse.epsilon.test/target/work, -configuration, /jobs/genie.epsilon/RC for 1.5.0/workspace/tests/org.eclipse.epsilon.test/target/work/configuration, -application, org.eclipse.tycho.surefire.osgibooter.uitest, -testproperties, /jobs/genie.epsilon/RC for 1.5.0/workspace/tests/org.eclipse.epsilon.test/target/surefire.properties, -testApplication, org.eclipse.ui.ide.workbench]
Picked up JAVA_TOOL_OPTIONS: -Xmx2G -Djava.io.tmpdir=/tmp/genie.epsilon
Java HotSpot(TM) 64-Bit Server VM warning: ignoring option MaxPermSize=256m; support was removed in 8.0
Launching application org.eclipse.ui.ide.workbench...

-------------------------------------------------------
 T E S T S
-------------------------------------------------------
Running org.eclipse.epsilon.test.EpsilonHudsonPluggedInTestSuite
Tests run: 34, Failures: 0, Errors: 1, Skipped: 0, Time elapsed: 31.095 sec <<< FAILURE! - in org.eclipse.epsilon.test.EpsilonHudsonPluggedInTestSuite
checksProxyWhenSelectionAProjectThatDoesHaveNature(org.eclipse.epsilon.common.dt.nature.ToggleNatureActionTests)  Time elapsed: 0.124 sec
removesNatureWhenProjectHasNature(org.eclipse.epsilon.common.dt.nature.ToggleNatureActionTests)  Time elapsed: 0.018 sec
addsNatureWhenProjectDoesNotHaveNature(org.eclipse.epsilon.common.dt.nature.ToggleNatureActionTests)  Time elapsed: 0.017 sec
unchecksProxyWhenSelectingAProjectThatDoesNotHaveNature(org.eclipse.epsilon.common.dt.nature.ToggleNatureActionTests)  Time elapsed: 0.009 sec
addsBuilderToNatureOnConfigure(org.eclipse.epsilon.common.dt.nature.BuilderConfiguringNatureTests)  Time elapsed: 0.014 sec
doesNotAddSecondBuilderToNatureOnSecondCallToConfigure(org.eclipse.epsilon.common.dt.nature.BuilderConfiguringNatureTests)  Time elapsed: 0.011 sec
registeredMetamodelTest(org.eclipse.epsilon.emc.emf.EmfModelLoadPropertiesTests$MetamodelsCanBeLoadedFromTheEPackageRegistry)  Time elapsed: 0.046 sec
modelInAPlatformPlugin(org.eclipse.epsilon.emc.emf.EmfModelLoadPropertiesTests$ModelsCanBeLoadedFromPlatformAndFileBasedURIs)  Time elapsed: 0.017 sec
modelInAPlatformResource(org.eclipse.epsilon.emc.emf.EmfModelLoadPropertiesTests$ModelsCanBeLoadedFromPlatformAndFileBasedURIs)  Time elapsed: 0.022 sec
modelOnFileSystem(org.eclipse.epsilon.emc.emf.EmfModelLoadPropertiesTests$ModelsCanBeLoadedFromPlatformAndFileBasedURIs)  Time elapsed: 0.015 sec
metamodelOnFileSystem(org.eclipse.epsilon.emc.emf.EmfModelLoadPropertiesTests$MetamodelsCanBeLoadedFromPlatformAndFileBasedURIs)  Time elapsed: 0.017 sec
metamodelInAPlatformPlugin(org.eclipse.epsilon.emc.emf.EmfModelLoadPropertiesTests$MetamodelsCanBeLoadedFromPlatformAndFileBasedURIs)  Time elapsed: 0.014 sec
metamodelInAPlatformResource(org.eclipse.epsilon.emc.emf.EmfModelLoadPropertiesTests$MetamodelsCanBeLoadedFromPlatformAndFileBasedURIs)  Time elapsed: 0.012 sec
useExtraModelForGmfGraph(org.eclipse.epsilon.workflow.tasks.eugenia.EugeniaExtraModelsTest)  Time elapsed: 6.49 sec
firstAndLastStepsFromGenmodel(org.eclipse.epsilon.workflow.tasks.eugenia.EugeniaOptionalAttributeTest)  Time elapsed: 1.878 sec
lastStep(org.eclipse.epsilon.workflow.tasks.eugenia.EugeniaOptionalAttributeTest)  Time elapsed: 1.616 sec
firstAndLastStepsFromEcore(org.eclipse.epsilon.workflow.tasks.eugenia.EugeniaOptionalAttributeTest)  Time elapsed: 1.506 sec
obtainExpectedModels[0](org.eclipse.epsilon.workflow.tasks.eugenia.EugeniaRegressionTest)  Time elapsed: 3.573 sec
obtainExpectedModels[1](org.eclipse.epsilon.workflow.tasks.eugenia.EugeniaRegressionTest)  Time elapsed: 1.535 sec
obtainExpectedModels[2](org.eclipse.epsilon.workflow.tasks.eugenia.EugeniaRegressionTest)  Time elapsed: 2.773 sec
worksWithEmfInRoot(org.eclipse.epsilon.workflow.tasks.eugenia.EugeniaEmfInRootTest)  Time elapsed: 0.933 sec
compareEMFInMemoryModels(org.eclipse.epsilon.workflow.tasks.eunit.EUnitModelComparisonTests)  Time elapsed: 0.417 sec
umlAgainstItself(org.eclipse.epsilon.workflow.tasks.eunit.EUnitModelComparisonTests)  Time elapsed: 0.511 sec
rightModelIsEmptyNotEquals(org.eclipse.epsilon.workflow.tasks.eunit.EUnitModelComparisonTests)  Time elapsed: 0.342 sec
inlineHutnModelsCanBeCompared(org.eclipse.epsilon.workflow.tasks.eunit.EUnitModelComparisonTests)  Time elapsed: 0.73 sec
bothModelsAreEmptyNotEquals(org.eclipse.epsilon.workflow.tasks.eunit.EUnitModelComparisonTests)  Time elapsed: 0.407 sec
rightModelIsEmpty(org.eclipse.epsilon.workflow.tasks.eunit.EUnitModelComparisonTests)  Time elapsed: 0.418 sec
leftModelIsEmptyNotEquals(org.eclipse.epsilon.workflow.tasks.eunit.EUnitModelComparisonTests)  Time elapsed: 0.41 sec
compareEMFWithEMFCopy(org.eclipse.epsilon.workflow.tasks.eunit.EUnitModelComparisonTests)  Time elapsed: 0.551 sec  <<< ERROR!
org.apache.tools.ant.BuildException: org.eclipse.core.runtime.CoreException: /jobs/genie.epsilon/RC for 1.5.0/workspace/tests/org.eclipse.epsilon.workflow.test/resources/eunit/eunit.xml:289: At least one test case had a failure or an error: java.net.URISyntaxException: Illegal character in path at index 28: file://jobs/genie.epsilon/RC for 1.5.0/workspace/tests/org.eclipse.epsilon.workflow.test/resources/eunit/null1060555800
	at java.net.URI$Parser.fail(URI.java:2848)
	at java.net.URI$Parser.checkChars(URI.java:3021)
	at java.net.URI$Parser.parseHierarchical(URI.java:3105)
	at java.net.URI$Parser.parse(URI.java:3053)
	at java.net.URI.<init>(URI.java:588)
	at sun.reflect.NativeConstructorAccessorImpl.newInstance0(Native Method)
	at sun.reflect.NativeConstructorAccessorImpl.newInstance(NativeConstructorAccessorImpl.java:62)
	at sun.reflect.DelegatingConstructorAccessorImpl.newInstance(DelegatingConstructorAccessorImpl.java:45)
	at java.lang.reflect.Constructor.newInstance(Constructor.java:423)
	at org.apache.tools.ant.IntrospectionHelper$12.set(IntrospectionHelper.java:1216)
	at org.apache.tools.ant.IntrospectionHelper$AttributeSetter.setObject(IntrospectionHelper.java:1522)
	at org.apache.tools.ant.IntrospectionHelper.setAttribute(IntrospectionHelper.java:412)
	at org.apache.tools.ant.RuntimeConfigurable.maybeConfigure(RuntimeConfigurable.java:531)
	at org.apache.tools.ant.RuntimeConfigurable.maybeConfigure(RuntimeConfigurable.java:467)
	at org.apache.tools.ant.Task.maybeConfigure(Task.java:203)
	at org.apache.tools.ant.UnknownElement.configure(UnknownElement.java:201)
	at org.apache.tools.ant.UnknownElement.maybeConfigure(UnknownElement.java:165)
	at org.apache.tools.ant.Task.perform(Task.java:349)
	at org.eclipse.epsilon.workflow.tasks.EUnitTask$TaskCollection.run(EUnitTask.java:65)
	at org.eclipse.epsilon.workflow.tasks.EUnitTask.beforeCase(EUnitTask.java:215)
	at org.eclipse.epsilon.eunit.EUnitModule.fireBeforeCase(EUnitModule.java:542)
	at org.eclipse.epsilon.eunit.EUnitModule.runSuiteInternal(EUnitModule.java:324)
	at org.eclipse.epsilon.eunit.EUnitModule.runSuite(EUnitModule.java:167)
	at org.eclipse.epsilon.eunit.EUnitModule.runInnerTestCase(EUnitModule.java:370)
	at org.eclipse.epsilon.eunit.EUnitModule.runSuiteInternal(EUnitModule.java:345)
	at org.eclipse.epsilon.eunit.EUnitModule.runSuite(EUnitModule.java:167)
	at org.eclipse.epsilon.eunit.EUnitModule.executeImpl(EUnitModule.java:128)
	at org.eclipse.epsilon.eol.execute.ExecutorFactory.execute(ExecutorFactory.java:102)
	at org.eclipse.epsilon.eol.EolModule.execute(EolModule.java:413)
	at org.eclipse.epsilon.workflow.tasks.ExecutableModuleTask.executeImpl(ExecutableModuleTask.java:216)
	at org.eclipse.epsilon.workflow.tasks.EpsilonTask.execute(EpsilonTask.java:39)
	at org.apache.tools.ant.UnknownElement.execute(UnknownElement.java:292)
	at sun.reflect.GeneratedMethodAccessor124.invoke(Unknown Source)
	at sun.reflect.DelegatingMethodAccessorImpl.invoke(DelegatingMethodAccessorImpl.java:43)
	at java.lang.reflect.Method.invoke(Method.java:498)
	at org.apache.tools.ant.dispatch.DispatchUtils.execute(DispatchUtils.java:106)
	at org.apache.tools.ant.Task.perform(Task.java:350)
	at org.apache.tools.ant.Target.execute(Target.java:448)
	at org.apache.tools.ant.Target.performTasks(Target.java:469)
	at org.apache.tools.ant.Project.executeSortedTargets(Project.java:1399)
	at org.apache.tools.ant.Project.executeTarget(Project.java:1370)
	at org.apache.tools.ant.helper.DefaultExecutor.executeTargets(DefaultExecutor.java:41)
	at org.eclipse.ant.internal.core.ant.EclipseDefaultExecutor.executeTargets(EclipseDefaultExecutor.java:36)
	at org.apache.tools.ant.Project.executeTargets(Project.java:1260)
	at org.eclipse.ant.internal.core.ant.InternalAntRunner.run(InternalAntRunner.java:712)
	at org.eclipse.ant.internal.core.ant.InternalAntRunner.run(InternalAntRunner.java:532)
	at sun.reflect.NativeMethodAccessorImpl.invoke0(Native Method)
	at sun.reflect.NativeMethodAccessorImpl.invoke(NativeMethodAccessorImpl.java:62)
	at sun.reflect.DelegatingMethodAccessorImpl.invoke(DelegatingMethodAccessorImpl.java:43)
	at java.lang.reflect.Method.invoke(Method.java:498)
	at org.eclipse.ant.core.AntRunner.run(AntRunner.java:371)
	at org.eclipse.ant.core.AntRunner.run(AntRunner.java:473)
	at org.eclipse.epsilon.workflow.tasks.eunit.EUnitModelComparisonTests.runTarget(EUnitModelComparisonTests.java:45)
	at org.eclipse.epsilon.workflow.tasks.eunit.EUnitModelComparisonTests.compareEMFWithEMFCopy(EUnitModelComparisonTests.java:68)

compareEMFWithEMFWithModelReferences(org.eclipse.epsilon.workflow.tasks.eunit.EUnitModelComparisonTests)  Time elapsed: 3.71 sec
compareEMFWithEMFUsingGeneratedModels(org.eclipse.epsilon.workflow.tasks.eunit.EUnitModelComparisonTests)  Time elapsed: 0.67 sec
compareEMFWithEMF(org.eclipse.epsilon.workflow.tasks.eunit.EUnitModelComparisonTests)  Time elapsed: 1.138 sec
leftModelIsEmpty(org.eclipse.epsilon.workflow.tasks.eunit.EUnitModelComparisonTests)  Time elapsed: 0.565 sec
bothModelsAreEmpty(org.eclipse.epsilon.workflow.tasks.eunit.EUnitModelComparisonTests)  Time elapsed: 0.435 sec

Results :

Tests in error: 
  EUnitModelComparisonTests.compareEMFWithEMFCopy:68->runTarget:47 Build org.ecl...

Tests run: 34, Failures: 0, Errors: 1, Skipped: 0

[INFO] ------------------------------------------------------------------------
[INFO] Reactor Summary:
[INFO] 
[INFO] parent ............................................. SUCCESS [  0.967 s]
[INFO] features ........................................... SUCCESS [  0.008 s]
[INFO] plugins ............................................ SUCCESS [  0.007 s]
[INFO] org.h2_1.1.117 ..................................... SUCCESS [  2.618 s]
[INFO] org.eclipse.epsilon.concordance.dependencies.feature SUCCESS [  0.065 s]
[INFO] org.antlr.runtime_3.1.b1 ........................... SUCCESS [  0.051 s]
[INFO] org.eclipse.epsilon.dependencies ................... SUCCESS [  0.034 s]
[INFO] org.eclipse.epsilon.common ......................... SUCCESS [  1.802 s]
[INFO] org.eclipse.epsilon.antlr.postprocessor.model ...... SUCCESS [  0.282 s]
[INFO] org.eclipse.epsilon.antlr.postprocessor ............ SUCCESS [  0.139 s]
[INFO] org.eclipse.epsilon.eol.engine ..................... SUCCESS [  1.937 s]
[INFO] org.eclipse.epsilon.erl.engine ..................... SUCCESS [  0.249 s]
[INFO] org.eclipse.epsilon.common.dt ...................... SUCCESS [  0.713 s]
[INFO] org.eclipse.epsilon.egl.engine ..................... SUCCESS [  0.820 s]
[INFO] org.eclipse.epsilon.emc.emf ........................ SUCCESS [  0.501 s]
[INFO] org.eclipse.epsilon.etl.engine ..................... SUCCESS [  0.443 s]
[INFO] org.eclipse.epsilon.evl.engine ..................... SUCCESS [  0.784 s]
[INFO] org.eclipse.epsilon.hutn.model ..................... SUCCESS [  0.216 s]
[INFO] org.eclipse.epsilon.hutn.model.antlrAst ............ SUCCESS [  0.340 s]
[INFO] org.eclipse.epsilon.hutn.model.config .............. SUCCESS [  0.133 s]
[INFO] org.eclipse.epsilon.hutn.engine .................... SUCCESS [  0.301 s]
[INFO] org.eclipse.epsilon.hutn.unparser .................. SUCCESS [  0.105 s]
[INFO] org.eclipse.epsilon.hutn.xmi ....................... SUCCESS [  0.189 s]
[INFO] org.eclipse.epsilon.concordance.core.hashing ....... SUCCESS [  0.137 s]
[INFO] org.eclipse.epsilon.concordance.core ............... SUCCESS [  0.352 s]
[INFO] org.eclipse.epsilon.ecl.engine ..................... SUCCESS [  0.354 s]
[INFO] org.eclipse.epsilon.emc.composite .................. SUCCESS [  0.088 s]
[INFO] org.eclipse.epsilon.emf.dt ......................... SUCCESS [  0.254 s]
[INFO] org.eclipse.epsilon.hutn.dt ........................ SUCCESS [  0.345 s]
[INFO] org.eclipse.epsilon.hutn.xmi.dt .................... SUCCESS [  0.189 s]
[INFO] org.eclipse.epsilon.concordance.clients ............ SUCCESS [  0.219 s]
[INFO] org.eclipse.epsilon.eol.dt ......................... SUCCESS [  0.352 s]
[INFO] org.eclipse.epsilon.flock.engine ................... SUCCESS [  0.421 s]
[INFO] org.eclipse.epsilon.flock.dt.emf ................... SUCCESS [  0.187 s]
[INFO] org.eclipse.epsilon.flock.dt.concordance ........... SUCCESS [  0.209 s]
[INFO] org.eclipse.epsilon.concordance.feature ............ SUCCESS [  0.066 s]
[INFO] org.apache.commons.csv_1.5 ......................... SUCCESS [  0.046 s]
[INFO] org.eclipse.epsilon.core.dependencies.feature ...... SUCCESS [  0.031 s]
[INFO] org.eclipse.epsilon.common.dt.examples ............. SUCCESS [  0.204 s]
[INFO] org.eclipse.epsilon.eml.engine ..................... SUCCESS [  0.394 s]
[INFO] org.eclipse.epsilon.ewl.engine ..................... SUCCESS [  0.306 s]
[INFO] org.eclipse.epsilon.profiling ...................... SUCCESS [  0.084 s]
[INFO] org.eclipse.epsilon.emc.plainxml ................... SUCCESS [  0.115 s]
[INFO] org.eclipse.epsilon.emc.bibtex ..................... SUCCESS [  0.084 s]
[INFO] org.eclipse.epsilon.emc.csv ........................ SUCCESS [  0.100 s]
[INFO] org.eclipse.epsilon.epl.engine ..................... SUCCESS [  0.435 s]
[INFO] org.eclipse.epsilon.eunit.engine ................... SUCCESS [  0.281 s]
[INFO] org.eclipse.epsilon.erl.dt ......................... SUCCESS [  0.172 s]
[INFO] org.eclipse.epsilon.ecl.dt ......................... SUCCESS [  0.199 s]
[INFO] org.eclipse.epsilon.egl.traceability.fine .......... SUCCESS [  0.095 s]
[INFO] org.eclipse.epsilon.egl.dt ......................... SUCCESS [  0.632 s]
[INFO] org.eclipse.epsilon.etl.dt ......................... SUCCESS [  0.191 s]
[INFO] org.eclipse.epsilon.eml.dt ......................... SUCCESS [  0.230 s]
[INFO] org.eclipse.epsilon.eol.tools ...................... SUCCESS [  0.084 s]
[INFO] org.eclipse.epsilon.eol.dt.tools ................... SUCCESS [  0.026 s]
[INFO] org.eclipse.epsilon.evl.dt ......................... SUCCESS [  0.216 s]
[INFO] org.eclipse.epsilon.ecl.dt.tools ................... SUCCESS [  0.027 s]
[INFO] org.eclipse.epsilon.ewl.dt ......................... SUCCESS [  0.175 s]
[INFO] org.eclipse.epsilon.profiling.dt ................... SUCCESS [  0.207 s]
[INFO] org.eclipse.epsilon.help ........................... SUCCESS [  0.020 s]
[INFO] org.eclipse.epsilon.emc.plainxml.dt ................ SUCCESS [  0.158 s]
[INFO] org.eclipse.epsilon.flock.dt ....................... SUCCESS [  0.203 s]
[INFO] org.eclipse.epsilon.emc.bibtex.dt .................. SUCCESS [  0.310 s]
[INFO] org.eclipse.epsilon.emc.csv.dt ..................... SUCCESS [  0.188 s]
[INFO] org.eclipse.epsilon.epl.dt ......................... SUCCESS [  0.195 s]
[INFO] org.eclipse.epsilon.perspective .................... SUCCESS [  0.166 s]
[INFO] org.eclipse.epsilon.emc.hutn ....................... SUCCESS [  0.094 s]
[INFO] org.eclipse.epsilon.workflow ....................... SUCCESS [  2.546 s]
[INFO] org.eclipse.epsilon.eunit.dt ....................... SUCCESS [  0.264 s]
[INFO] org.eclipse.epsilon.eunit.dt.diff.files ............ SUCCESS [  0.212 s]
[INFO] org.eclipse.epsilon.eunit.junit .................... SUCCESS [  0.084 s]
[INFO] org.eclipse.epsilon.eunit.junit.dt ................. SUCCESS [  0.158 s]
[INFO] org.eclipse.epsilon.core.dt.feature ................ SUCCESS [  0.131 s]
[INFO] org.eclipse.epsilon.core.feature ................... SUCCESS [  0.060 s]
[INFO] org.jdom_1.0 ....................................... SUCCESS [  0.088 s]
[INFO] org.eclipse.epsilon.emc.muddle ..................... SUCCESS [  0.185 s]
[INFO] org.eclipse.epsilon.emc.graphml .................... SUCCESS [  0.332 s]
[INFO] org.eclipse.epsilon.emc.graphml.dt ................. SUCCESS [  0.150 s]
[INFO] org.eclipse.epsilon.emc.graphml.feature ............ SUCCESS [  0.034 s]
[INFO] org.eclipse.epsilon.emc.spreadsheets.dependencies .. SUCCESS [  0.016 s]
[INFO] org.eclipse.epsilon.emc.spreadsheets.dependencies.feature SUCCESS [  0.023 s]
[INFO] org.apache.xmlbeans_2.6.0 .......................... SUCCESS [  1.741 s]
[INFO] org.apache.poi.ooxml.schemas_3.10.1 ................ SUCCESS [  3.991 s]
[INFO] org.apache.poi_3.10.1 .............................. SUCCESS [  1.144 s]
[INFO] org.apache.poi.ooxml_3.10.1 ........................ SUCCESS [  0.536 s]
[INFO] org.eclipse.epsilon.emc.spreadsheets.excel.dependencies SUCCESS [  0.022 s]
[INFO] org.eclipse.epsilon.emc.spreadsheets.excel.dependencies.feature SUCCESS [  0.045 s]
[INFO] org.eclipse.epsilon.emc.spreadsheets ............... SUCCESS [  0.170 s]
[INFO] org.eclipse.epsilon.emc.spreadsheets.excel ......... SUCCESS [  0.103 s]
[INFO] org.eclipse.epsilon.emc.spreadsheets.excel.dt ...... SUCCESS [  0.167 s]
[INFO] org.eclipse.epsilon.emc.spreadsheets.excel.dt.feature SUCCESS [  0.031 s]
[INFO] org.eclipse.epsilon.emc.spreadsheets.excel.feature . SUCCESS [  0.025 s]
[INFO] org.eclipse.epsilon.emc.spreadsheets.feature ....... SUCCESS [  0.025 s]
[INFO] com.google.gdata_1.47.1 ............................ SUCCESS [  0.685 s]
[INFO] org.eclipse.epsilon.emc.spreadsheets.google.dependencies SUCCESS [  0.019 s]
[INFO] org.eclipse.epsilon.emc.spreadsheets.google.dependencies.feature SUCCESS [  0.024 s]
[INFO] org.eclipse.epsilon.emc.spreadsheets.google ........ SUCCESS [  0.172 s]
[INFO] org.eclipse.epsilon.emc.spreadsheets.google.dt ..... SUCCESS [  0.168 s]
[INFO] org.eclipse.epsilon.emc.spreadsheets.google.dt.feature SUCCESS [  0.042 s]
[INFO] org.eclipse.epsilon.emc.spreadsheets.google.feature  SUCCESS [  0.032 s]
[INFO] org.eclipse.epsilon.emf.dt.dependencies.feature .... SUCCESS [  0.021 s]
[INFO] org.eclipse.epsilon.dt.epackageregistryexplorer .... SUCCESS [  0.220 s]
[INFO] org.eclipse.epsilon.dt.exeed ....................... SUCCESS [  0.367 s]
[INFO] org.eclipse.epsilon.egl.dt.traceability.fine.emf ... SUCCESS [  0.218 s]
[INFO] org.eclipse.epsilon.egl.dt.traceability.editor ..... SUCCESS [  0.226 s]
[INFO] org.eclipse.epsilon.emc.emf.decorator .............. SUCCESS [  0.084 s]
[INFO] org.eclipse.epsilon.emc.emf.virtual ................ SUCCESS [  0.154 s]
[INFO] org.eclipse.epsilon.emc.emf.dt ..................... SUCCESS [  0.193 s]
[INFO] org.eclipse.epsilon.emc.emf.decorator.dt ........... SUCCESS [  0.155 s]
[INFO] org.eclipse.epsilon.workflow.emf ................... SUCCESS [  0.293 s]
[INFO] org.eclipse.epsilon.flexmi ......................... SUCCESS [  0.189 s]
[INFO] org.eclipse.epsilon.flexmi.dt ...................... SUCCESS [  0.279 s]
[INFO] org.eclipse.epsilon.emf.dt.feature ................. SUCCESS [  0.290 s]
[INFO] org.eclipse.epsilon.emf.feature .................... SUCCESS [  0.026 s]
[INFO] org.eclipse.epsilon.eugenia ........................ SUCCESS [  0.352 s]
[INFO] org.eclipse.epsilon.workflow.eugenia ............... SUCCESS [  0.317 s]
[INFO] org.eclipse.epsilon.eugenia.feature ................ SUCCESS [  0.050 s]
[INFO] org.eclipse.epsilon.eunit.dt.cmp.emf ............... SUCCESS [  0.164 s]
[INFO] org.eclipse.epsilon.eunit.dt.diff.emf .............. SUCCESS [  0.156 s]
[INFO] org.eclipse.epsilon.eunit.dt.emf.feature ........... SUCCESS [  0.035 s]
[INFO] org.eclipse.epsilon.evl.emf.validation ............. SUCCESS [  0.361 s]
[INFO] org.eclipse.epsilon.evl.emf.validation.feature ..... SUCCESS [  0.041 s]
[INFO] org.eclipse.epsilon.ewl.emf ........................ SUCCESS [  0.376 s]
[INFO] org.eclipse.epsilon.ewl.emf.feature ................ SUCCESS [  0.028 s]
[INFO] org.eclipse.epsilon.ewl.gmf ........................ SUCCESS [  0.190 s]
[INFO] org.eclipse.epsilon.ewl.gmf.feature ................ SUCCESS [  0.031 s]
[INFO] org.eclipse.epsilon.hutn.dependencies.feature ...... SUCCESS [  0.015 s]
[INFO] org.eclipse.epsilon.emc.hutn.dt .................... SUCCESS [  0.151 s]
[INFO] org.eclipse.epsilon.hutn.dt.feature ................ SUCCESS [  0.039 s]
[INFO] org.eclipse.epsilon.hutn.feature ................... SUCCESS [  0.032 s]
[INFO] org.eclipse.epsilon.emc.uml ........................ SUCCESS [  0.114 s]
[INFO] org.eclipse.epsilon.emc.uml.dt ..................... SUCCESS [  0.165 s]
[INFO] org.eclipse.epsilon.uml.dt.feature ................. SUCCESS [  0.056 s]
[INFO] org.eclipse.epsilon.uml.feature .................... SUCCESS [  0.020 s]
[INFO] org.eclipse.epsilon.emc.simulink ................... SUCCESS [  0.178 s]
[INFO] org.eclipse.epsilon.emc.simulink.dt ................ SUCCESS [  0.174 s]
[INFO] org.eclipse.epsilon.simulink.dt.feature ............ SUCCESS [  0.026 s]
[INFO] org.eclipse.epsilon.simulink.feature ............... SUCCESS [  0.018 s]
[INFO] org.eclipse.epsilon.targetplatform ................. SUCCESS [  0.003 s]
[INFO] org.eclipse.epsilon.workflow.csv ................... SUCCESS [  0.243 s]
[INFO] tests .............................................. SUCCESS [  0.003 s]
[INFO] net.sf.cglib.nodep_2.1.3 ........................... SUCCESS [  0.212 s]
[INFO] org.easymock_2.4 ................................... SUCCESS [  0.043 s]
[INFO] org.objenesis_1.0 .................................. SUCCESS [  0.038 s]
[INFO] org.easymock_3.1 ................................... SUCCESS [  0.077 s]
[INFO] org.mockito_1.8.4 .................................. SUCCESS [  0.749 s]
[INFO] org.eclipse.epsilon.test.dependencies .............. SUCCESS [  0.151 s]
[INFO] org.eclipse.epsilon.common.dt.test ................. SUCCESS [  0.197 s]
[INFO] org.eclipse.epsilon.common.test .................... SUCCESS [  0.154 s]
[INFO] org.eclipse.epsilon.concordance.clients.test ....... SUCCESS [  0.264 s]
[INFO] org.eclipse.epsilon.concordance.core.hashing.test .. SUCCESS [  0.126 s]
[INFO] org.eclipse.epsilon.concordance.core.test .......... SUCCESS [  0.470 s]
[INFO] org.eclipse.epsilon.concordance.test ............... SUCCESS [  0.164 s]
[INFO] org.eclipse.epsilon.concordance.test.performance ... SUCCESS [  0.200 s]
[INFO] org.eclipse.epsilon.ecl.engine.test.acceptance ..... SUCCESS [  0.099 s]
[INFO] org.eclipse.epsilon.egl.dt.test .................... SUCCESS [  0.157 s]
[INFO] org.eclipse.epsilon.egl.dt.traceability.editor.tests SUCCESS [  0.190 s]
[INFO] org.eclipse.epsilon.egl.engine.test.dependencies ... SUCCESS [  0.094 s]
[INFO] org.eclipse.epsilon.egl.engine.test.unit ........... SUCCESS [  0.200 s]
[INFO] org.eclipse.epsilon.egl.engine.test.acceptance ..... SUCCESS [  0.190 s]
[INFO] org.eclipse.epsilon.egl.traceability.fine.test.acceptance SUCCESS [  0.115 s]
[INFO] org.eclipse.epsilon.egl.traceability.fine.test.unit  SUCCESS [  0.103 s]
[INFO] org.eclipse.epsilon.egl.engine.test ................ SUCCESS [  0.093 s]
[INFO] org.eclipse.epsilon.test.fixtures.hutn ............. SUCCESS [  0.086 s]
[INFO] org.eclipse.epsilon.hutn.test.dependencies.model ... SUCCESS [  0.192 s]
[INFO] org.eclipse.epsilon.egx.engine.test.acceptance ..... SUCCESS [  0.115 s]
[INFO] org.eclipse.epsilon.emc.bibtex.test ................ SUCCESS [  0.104 s]
[INFO] org.eclipse.epsilon.emc.csv.test ................... SUCCESS [  0.107 s]
[INFO] org.eclipse.epsilon.emc.emf.test ................... SUCCESS [  0.264 s]
[INFO] org.eclipse.epsilon.emc.graphml.tests .............. SUCCESS [  0.112 s]
[INFO] org.eclipse.epsilon.hutn.test.dependencies ......... SUCCESS [  0.091 s]
[INFO] org.eclipse.epsilon.emc.hutn.test .................. SUCCESS [  0.101 s]
[INFO] org.eclipse.epsilon.emc.plainxml.test .............. SUCCESS [  0.127 s]
[INFO] org.eclipse.epsilon.emc.spreadsheets.test .......... SUCCESS [  0.360 s]
[INFO] org.eclipse.epsilon.eml.engine.test.acceptance ..... SUCCESS [  0.104 s]
[INFO] org.eclipse.epsilon.eol.engine.test.acceptance ..... SUCCESS [  0.164 s]
[INFO] org.eclipse.epsilon.eol.engine.test.unit ........... SUCCESS [  0.146 s]
[INFO] org.eclipse.epsilon.epl.engine.test.acceptance ..... SUCCESS [  0.103 s]
[INFO] org.eclipse.epsilon.etl.engine.test.acceptance ..... SUCCESS [  0.135 s]
[INFO] org.eclipse.epsilon.evl.engine.test.acceptance ..... SUCCESS [  0.101 s]
[INFO] org.eclipse.epsilon.ewl.engine.test.acceptance ..... SUCCESS [  0.098 s]
[INFO] org.eclipse.epsilon.flock.engine.test.dependencies . SUCCESS [  0.022 s]
[INFO] org.eclipse.epsilon.flock.engine.test.unit ......... SUCCESS [  0.174 s]
[INFO] org.eclipse.epsilon.flock.engine.test.acceptance ... SUCCESS [  0.207 s]
[INFO] org.eclipse.epsilon.flock.engine.test .............. SUCCESS [  0.090 s]
[INFO] org.eclipse.epsilon.hutn.dt.test ................... SUCCESS [  0.169 s]
[INFO] org.eclipse.epsilon.hutn.test.acceptance ........... SUCCESS [  0.167 s]
[INFO] org.eclipse.epsilon.hutn.test.unit ................. SUCCESS [  0.502 s]
[INFO] org.eclipse.epsilon.hutn.test ...................... SUCCESS [  0.191 s]
[INFO] org.eclipse.epsilon.flexmi.test .................... SUCCESS [  0.122 s]
[INFO] org.eclipse.epsilon.hutn.unparser.test.unit ........ SUCCESS [  0.143 s]
[INFO] org.eclipse.epsilon.hutn.xmi.test.dependencies ..... SUCCESS [  1.064 s]
[INFO] org.eclipse.epsilon.hutn.xmi.test.unit ............. SUCCESS [  0.900 s]
[INFO] org.eclipse.epsilon.hutn.xmi.test.integration ...... SUCCESS [  0.203 s]
[INFO] org.eclipse.epsilon.hutn.xmi.test .................. SUCCESS [  0.112 s]
[INFO] org.eclipse.epsilon.workflow.test .................. SUCCESS [  0.399 s]
[INFO] org.eclipse.epsilon.test ........................... FAILURE [ 41.518 s]
[INFO] releng ............................................. SKIPPED
[INFO] org.eclipse.epsilon.updatesite.interim ............. SKIPPED
[INFO] org.eclipse.epsilon.ide ............................ SKIPPED
[INFO] org.eclipse.epsilon.rcp.application.interim ........ SKIPPED
[INFO] Epsilon Utility Mojos .............................. SKIPPED
[INFO] org.eclipse.epsilon.standalone ..................... SKIPPED
[INFO] ------------------------------------------------------------------------
[INFO] BUILD FAILURE
[INFO] ------------------------------------------------------------------------
[INFO] Total time: 07:05 min
[INFO] Finished at: 2018-07-18T12:36:20-04:00
[INFO] Final Memory: 386M/2003M
[INFO] ------------------------------------------------------------------------
[ERROR] Failed to execute goal org.eclipse.tycho:tycho-surefire-plugin:1.0.0:test (default-test) on project org.eclipse.epsilon.test: There are test failures.
[ERROR] 
[ERROR] Please refer to /jobs/genie.epsilon/RC for 1.5.0/workspace/tests/org.eclipse.epsilon.test/target/surefire-reports for the individual test results.
[ERROR] -> [Help 1]
[ERROR] 
[ERROR] To see the full stack trace of the errors, re-run Maven with the -e switch.
[ERROR] Re-run Maven using the -X switch to enable full debug logging.
[ERROR] 
[ERROR] For more information about the errors and possible solutions, please read the following articles:
[ERROR] [Help 1] http://cwiki.apache.org/confluence/display/MAVEN/MojoFailureException
[ERROR] 
[ERROR] After correcting the problems, you can resume the build with the command
[ERROR]   mvn <goals> -rf :org.eclipse.epsilon.test
Build step 'Invoke top-level Maven targets' marked build as failure
Terminating xvnc.
Sending e-mails to: a.garcia-dominguez@aston.ac.uk dimitris.kolovos@york.ac.uk arcanefoam@gmail.com Sm1748@york.ac.uk
Started calculate disk usage of build
Finished Calculation of disk usage of build in 0 seconds
Started calculate disk usage of workspace
Finished Calculation of disk usage of workspace in  1 second
Finished: FAILURE