FailedConsole Output

Skipping 1,815 KB.. Full Log
d in /jobs/genie.epsilon/RC for 1.5.0/workspace/tests/org.eclipse.epsilon.etl.engine.test.acceptance/META-INF/MANIFEST.MF, fallback to 'unknown' for source bundle
[INFO] Building jar: /jobs/genie.epsilon/RC for 1.5.0/workspace/tests/org.eclipse.epsilon.etl.engine.test.acceptance/target/org.eclipse.epsilon.etl.engine.test.acceptance-1.0.0-SNAPSHOT-sources.jar
[INFO] 
[INFO] --- target-platform-configuration:1.0.0:target-platform (default-target-platform) @ org.eclipse.epsilon.etl.engine.test.acceptance ---
[INFO] 
[INFO] --- tycho-packaging-plugin:1.0.0:package-plugin (default-package-plugin) @ org.eclipse.epsilon.etl.engine.test.acceptance ---
[INFO] Building jar: /jobs/genie.epsilon/RC for 1.5.0/workspace/tests/org.eclipse.epsilon.etl.engine.test.acceptance/target/org.eclipse.epsilon.etl.engine.test.acceptance-1.0.0-SNAPSHOT.jar
[INFO] 
[INFO] --- tycho-p2-plugin:1.0.0:p2-metadata-default (default-p2-metadata-default) @ org.eclipse.epsilon.etl.engine.test.acceptance ---
[INFO] 
[INFO] --- maven-install-plugin:2.3.1:install (default-install) @ org.eclipse.epsilon.etl.engine.test.acceptance ---
[INFO] Installing /jobs/genie.epsilon/RC for 1.5.0/workspace/tests/org.eclipse.epsilon.etl.engine.test.acceptance/target/org.eclipse.epsilon.etl.engine.test.acceptance-1.0.0-SNAPSHOT.jar to /home/hudson/genie.epsilon/.jenkins/jobs/RC for 1.5.0/workspace/.repository/org/eclipse/epsilon/org.eclipse.epsilon.etl.engine.test.acceptance/1.0.0-SNAPSHOT/org.eclipse.epsilon.etl.engine.test.acceptance-1.0.0-SNAPSHOT.jar
[INFO] Installing /jobs/genie.epsilon/RC for 1.5.0/workspace/tests/org.eclipse.epsilon.etl.engine.test.acceptance/pom.xml to /home/hudson/genie.epsilon/.jenkins/jobs/RC for 1.5.0/workspace/.repository/org/eclipse/epsilon/org.eclipse.epsilon.etl.engine.test.acceptance/1.0.0-SNAPSHOT/org.eclipse.epsilon.etl.engine.test.acceptance-1.0.0-SNAPSHOT.pom
[INFO] Installing /jobs/genie.epsilon/RC for 1.5.0/workspace/tests/org.eclipse.epsilon.etl.engine.test.acceptance/target/org.eclipse.epsilon.etl.engine.test.acceptance-1.0.0-SNAPSHOT-sources.jar to /home/hudson/genie.epsilon/.jenkins/jobs/RC for 1.5.0/workspace/.repository/org/eclipse/epsilon/org.eclipse.epsilon.etl.engine.test.acceptance/1.0.0-SNAPSHOT/org.eclipse.epsilon.etl.engine.test.acceptance-1.0.0-SNAPSHOT-sources.jar
[INFO] Installing /jobs/genie.epsilon/RC for 1.5.0/workspace/tests/org.eclipse.epsilon.etl.engine.test.acceptance/target/p2content.xml to /home/hudson/genie.epsilon/.jenkins/jobs/RC for 1.5.0/workspace/.repository/org/eclipse/epsilon/org.eclipse.epsilon.etl.engine.test.acceptance/1.0.0-SNAPSHOT/org.eclipse.epsilon.etl.engine.test.acceptance-1.0.0-SNAPSHOT-p2metadata.xml
[INFO] Installing /jobs/genie.epsilon/RC for 1.5.0/workspace/tests/org.eclipse.epsilon.etl.engine.test.acceptance/target/p2artifacts.xml to /home/hudson/genie.epsilon/.jenkins/jobs/RC for 1.5.0/workspace/.repository/org/eclipse/epsilon/org.eclipse.epsilon.etl.engine.test.acceptance/1.0.0-SNAPSHOT/org.eclipse.epsilon.etl.engine.test.acceptance-1.0.0-SNAPSHOT-p2artifacts.xml
[INFO] 
[INFO] --- tycho-p2-plugin:1.0.0:update-local-index (default-update-local-index) @ org.eclipse.epsilon.etl.engine.test.acceptance ---
[INFO]                                                                         
[INFO] ------------------------------------------------------------------------
[INFO] Building org.eclipse.epsilon.evl.engine.test.acceptance 0.9.0-SNAPSHOT
[INFO] ------------------------------------------------------------------------
[INFO] 
[INFO] --- maven-clean-plugin:2.5:clean (default-clean) @ org.eclipse.epsilon.evl.engine.test.acceptance ---
[INFO] 
[INFO] --- tycho-packaging-plugin:1.0.0:build-qualifier (default-build-qualifier) @ org.eclipse.epsilon.evl.engine.test.acceptance ---
[INFO] The project's OSGi version is 0.9.0.201807181609
[INFO] 
[INFO] --- tycho-packaging-plugin:1.0.0:validate-id (default-validate-id) @ org.eclipse.epsilon.evl.engine.test.acceptance ---
[INFO] 
[INFO] --- tycho-packaging-plugin:1.0.0:validate-version (default-validate-version) @ org.eclipse.epsilon.evl.engine.test.acceptance ---
[INFO] 
[INFO] --- maven-resources-plugin:2.4.3:resources (default-resources) @ org.eclipse.epsilon.evl.engine.test.acceptance ---
[INFO] Using 'UTF-8' encoding to copy filtered resources.
[INFO] skip non existing resourceDirectory /jobs/genie.epsilon/RC for 1.5.0/workspace/tests/org.eclipse.epsilon.evl.engine.test.acceptance/src/main/resources
[INFO] 
[INFO] --- tycho-compiler-plugin:1.0.0:compile (default-compile) @ org.eclipse.epsilon.evl.engine.test.acceptance ---
[WARNING] Parameter 'useProjectSettings' is set to true, but preferences file '/jobs/genie.epsilon/RC for 1.5.0/workspace/tests/org.eclipse.epsilon.evl.engine.test.acceptance/.settings/org.eclipse.jdt.core.prefs' could not be found!
[INFO] Compiling 3 source files to /jobs/genie.epsilon/RC for 1.5.0/workspace/tests/org.eclipse.epsilon.evl.engine.test.acceptance/target/classes
[INFO] 
[INFO] --- maven-resources-plugin:2.4.3:testResources (default-testResources) @ org.eclipse.epsilon.evl.engine.test.acceptance ---
[INFO] Using 'UTF-8' encoding to copy filtered resources.
[INFO] skip non existing resourceDirectory /jobs/genie.epsilon/RC for 1.5.0/workspace/tests/org.eclipse.epsilon.evl.engine.test.acceptance/src/test/resources
[INFO] 
[INFO] --- tycho-source-plugin:1.0.0:plugin-source (plugin-source) @ org.eclipse.epsilon.evl.engine.test.acceptance ---
[WARNING] bundle localization file /jobs/genie.epsilon/RC for 1.5.0/workspace/tests/org.eclipse.epsilon.evl.engine.test.acceptance/plugin.properties not found
[INFO] Building jar: /jobs/genie.epsilon/RC for 1.5.0/workspace/tests/org.eclipse.epsilon.evl.engine.test.acceptance/target/org.eclipse.epsilon.evl.engine.test.acceptance-0.9.0-SNAPSHOT-sources.jar
[INFO] 
[INFO] --- target-platform-configuration:1.0.0:target-platform (default-target-platform) @ org.eclipse.epsilon.evl.engine.test.acceptance ---
[INFO] 
[INFO] --- tycho-packaging-plugin:1.0.0:package-plugin (default-package-plugin) @ org.eclipse.epsilon.evl.engine.test.acceptance ---
[INFO] Building jar: /jobs/genie.epsilon/RC for 1.5.0/workspace/tests/org.eclipse.epsilon.evl.engine.test.acceptance/target/org.eclipse.epsilon.evl.engine.test.acceptance-0.9.0-SNAPSHOT.jar
[INFO] 
[INFO] --- tycho-p2-plugin:1.0.0:p2-metadata-default (default-p2-metadata-default) @ org.eclipse.epsilon.evl.engine.test.acceptance ---
[INFO] 
[INFO] --- maven-install-plugin:2.3.1:install (default-install) @ org.eclipse.epsilon.evl.engine.test.acceptance ---
[INFO] Installing /jobs/genie.epsilon/RC for 1.5.0/workspace/tests/org.eclipse.epsilon.evl.engine.test.acceptance/target/org.eclipse.epsilon.evl.engine.test.acceptance-0.9.0-SNAPSHOT.jar to /home/hudson/genie.epsilon/.jenkins/jobs/RC for 1.5.0/workspace/.repository/org/eclipse/epsilon/org.eclipse.epsilon.evl.engine.test.acceptance/0.9.0-SNAPSHOT/org.eclipse.epsilon.evl.engine.test.acceptance-0.9.0-SNAPSHOT.jar
[INFO] Installing /jobs/genie.epsilon/RC for 1.5.0/workspace/tests/org.eclipse.epsilon.evl.engine.test.acceptance/pom.xml to /home/hudson/genie.epsilon/.jenkins/jobs/RC for 1.5.0/workspace/.repository/org/eclipse/epsilon/org.eclipse.epsilon.evl.engine.test.acceptance/0.9.0-SNAPSHOT/org.eclipse.epsilon.evl.engine.test.acceptance-0.9.0-SNAPSHOT.pom
[INFO] Installing /jobs/genie.epsilon/RC for 1.5.0/workspace/tests/org.eclipse.epsilon.evl.engine.test.acceptance/target/org.eclipse.epsilon.evl.engine.test.acceptance-0.9.0-SNAPSHOT-sources.jar to /home/hudson/genie.epsilon/.jenkins/jobs/RC for 1.5.0/workspace/.repository/org/eclipse/epsilon/org.eclipse.epsilon.evl.engine.test.acceptance/0.9.0-SNAPSHOT/org.eclipse.epsilon.evl.engine.test.acceptance-0.9.0-SNAPSHOT-sources.jar
[INFO] Installing /jobs/genie.epsilon/RC for 1.5.0/workspace/tests/org.eclipse.epsilon.evl.engine.test.acceptance/target/p2content.xml to /home/hudson/genie.epsilon/.jenkins/jobs/RC for 1.5.0/workspace/.repository/org/eclipse/epsilon/org.eclipse.epsilon.evl.engine.test.acceptance/0.9.0-SNAPSHOT/org.eclipse.epsilon.evl.engine.test.acceptance-0.9.0-SNAPSHOT-p2metadata.xml
[INFO] Installing /jobs/genie.epsilon/RC for 1.5.0/workspace/tests/org.eclipse.epsilon.evl.engine.test.acceptance/target/p2artifacts.xml to /home/hudson/genie.epsilon/.jenkins/jobs/RC for 1.5.0/workspace/.repository/org/eclipse/epsilon/org.eclipse.epsilon.evl.engine.test.acceptance/0.9.0-SNAPSHOT/org.eclipse.epsilon.evl.engine.test.acceptance-0.9.0-SNAPSHOT-p2artifacts.xml
[INFO] 
[INFO] --- tycho-p2-plugin:1.0.0:update-local-index (default-update-local-index) @ org.eclipse.epsilon.evl.engine.test.acceptance ---
[INFO]                                                                         
[INFO] ------------------------------------------------------------------------
[INFO] Building org.eclipse.epsilon.ewl.engine.test.acceptance 0.9.0-SNAPSHOT
[INFO] ------------------------------------------------------------------------
[INFO] 
[INFO] --- maven-clean-plugin:2.5:clean (default-clean) @ org.eclipse.epsilon.ewl.engine.test.acceptance ---
[INFO] 
[INFO] --- tycho-packaging-plugin:1.0.0:build-qualifier (default-build-qualifier) @ org.eclipse.epsilon.ewl.engine.test.acceptance ---
[INFO] The project's OSGi version is 0.9.0.201807181609
[INFO] 
[INFO] --- tycho-packaging-plugin:1.0.0:validate-id (default-validate-id) @ org.eclipse.epsilon.ewl.engine.test.acceptance ---
[INFO] 
[INFO] --- tycho-packaging-plugin:1.0.0:validate-version (default-validate-version) @ org.eclipse.epsilon.ewl.engine.test.acceptance ---
[INFO] 
[INFO] --- maven-resources-plugin:2.4.3:resources (default-resources) @ org.eclipse.epsilon.ewl.engine.test.acceptance ---
[INFO] Using 'UTF-8' encoding to copy filtered resources.
[INFO] skip non existing resourceDirectory /jobs/genie.epsilon/RC for 1.5.0/workspace/tests/org.eclipse.epsilon.ewl.engine.test.acceptance/src/main/resources
[INFO] 
[INFO] --- tycho-compiler-plugin:1.0.0:compile (default-compile) @ org.eclipse.epsilon.ewl.engine.test.acceptance ---
[WARNING] Parameter 'useProjectSettings' is set to true, but preferences file '/jobs/genie.epsilon/RC for 1.5.0/workspace/tests/org.eclipse.epsilon.ewl.engine.test.acceptance/.settings/org.eclipse.jdt.core.prefs' could not be found!
[INFO] Compiling 3 source files to /jobs/genie.epsilon/RC for 1.5.0/workspace/tests/org.eclipse.epsilon.ewl.engine.test.acceptance/target/classes
[INFO] 
[INFO] --- maven-resources-plugin:2.4.3:testResources (default-testResources) @ org.eclipse.epsilon.ewl.engine.test.acceptance ---
[INFO] Using 'UTF-8' encoding to copy filtered resources.
[INFO] skip non existing resourceDirectory /jobs/genie.epsilon/RC for 1.5.0/workspace/tests/org.eclipse.epsilon.ewl.engine.test.acceptance/src/test/resources
[INFO] 
[INFO] --- tycho-source-plugin:1.0.0:plugin-source (plugin-source) @ org.eclipse.epsilon.ewl.engine.test.acceptance ---
[WARNING] bundle localization file /jobs/genie.epsilon/RC for 1.5.0/workspace/tests/org.eclipse.epsilon.ewl.engine.test.acceptance/plugin.properties not found
[INFO] Building jar: /jobs/genie.epsilon/RC for 1.5.0/workspace/tests/org.eclipse.epsilon.ewl.engine.test.acceptance/target/org.eclipse.epsilon.ewl.engine.test.acceptance-0.9.0-SNAPSHOT-sources.jar
[INFO] 
[INFO] --- target-platform-configuration:1.0.0:target-platform (default-target-platform) @ org.eclipse.epsilon.ewl.engine.test.acceptance ---
[INFO] 
[INFO] --- tycho-packaging-plugin:1.0.0:package-plugin (default-package-plugin) @ org.eclipse.epsilon.ewl.engine.test.acceptance ---
[INFO] Building jar: /jobs/genie.epsilon/RC for 1.5.0/workspace/tests/org.eclipse.epsilon.ewl.engine.test.acceptance/target/org.eclipse.epsilon.ewl.engine.test.acceptance-0.9.0-SNAPSHOT.jar
[INFO] 
[INFO] --- tycho-p2-plugin:1.0.0:p2-metadata-default (default-p2-metadata-default) @ org.eclipse.epsilon.ewl.engine.test.acceptance ---
[INFO] 
[INFO] --- maven-install-plugin:2.3.1:install (default-install) @ org.eclipse.epsilon.ewl.engine.test.acceptance ---
[INFO] Installing /jobs/genie.epsilon/RC for 1.5.0/workspace/tests/org.eclipse.epsilon.ewl.engine.test.acceptance/target/org.eclipse.epsilon.ewl.engine.test.acceptance-0.9.0-SNAPSHOT.jar to /home/hudson/genie.epsilon/.jenkins/jobs/RC for 1.5.0/workspace/.repository/org/eclipse/epsilon/org.eclipse.epsilon.ewl.engine.test.acceptance/0.9.0-SNAPSHOT/org.eclipse.epsilon.ewl.engine.test.acceptance-0.9.0-SNAPSHOT.jar
[INFO] Installing /jobs/genie.epsilon/RC for 1.5.0/workspace/tests/org.eclipse.epsilon.ewl.engine.test.acceptance/pom.xml to /home/hudson/genie.epsilon/.jenkins/jobs/RC for 1.5.0/workspace/.repository/org/eclipse/epsilon/org.eclipse.epsilon.ewl.engine.test.acceptance/0.9.0-SNAPSHOT/org.eclipse.epsilon.ewl.engine.test.acceptance-0.9.0-SNAPSHOT.pom
[INFO] Installing /jobs/genie.epsilon/RC for 1.5.0/workspace/tests/org.eclipse.epsilon.ewl.engine.test.acceptance/target/org.eclipse.epsilon.ewl.engine.test.acceptance-0.9.0-SNAPSHOT-sources.jar to /home/hudson/genie.epsilon/.jenkins/jobs/RC for 1.5.0/workspace/.repository/org/eclipse/epsilon/org.eclipse.epsilon.ewl.engine.test.acceptance/0.9.0-SNAPSHOT/org.eclipse.epsilon.ewl.engine.test.acceptance-0.9.0-SNAPSHOT-sources.jar
[INFO] Installing /jobs/genie.epsilon/RC for 1.5.0/workspace/tests/org.eclipse.epsilon.ewl.engine.test.acceptance/target/p2content.xml to /home/hudson/genie.epsilon/.jenkins/jobs/RC for 1.5.0/workspace/.repository/org/eclipse/epsilon/org.eclipse.epsilon.ewl.engine.test.acceptance/0.9.0-SNAPSHOT/org.eclipse.epsilon.ewl.engine.test.acceptance-0.9.0-SNAPSHOT-p2metadata.xml
[INFO] Installing /jobs/genie.epsilon/RC for 1.5.0/workspace/tests/org.eclipse.epsilon.ewl.engine.test.acceptance/target/p2artifacts.xml to /home/hudson/genie.epsilon/.jenkins/jobs/RC for 1.5.0/workspace/.repository/org/eclipse/epsilon/org.eclipse.epsilon.ewl.engine.test.acceptance/0.9.0-SNAPSHOT/org.eclipse.epsilon.ewl.engine.test.acceptance-0.9.0-SNAPSHOT-p2artifacts.xml
[INFO] 
[INFO] --- tycho-p2-plugin:1.0.0:update-local-index (default-update-local-index) @ org.eclipse.epsilon.ewl.engine.test.acceptance ---
[INFO]                                                                         
[INFO] ------------------------------------------------------------------------
[INFO] Building org.eclipse.epsilon.flock.engine.test.dependencies 0.0.1-SNAPSHOT
[INFO] ------------------------------------------------------------------------
[INFO] 
[INFO] --- maven-clean-plugin:2.5:clean (default-clean) @ org.eclipse.epsilon.flock.engine.test.dependencies ---
[INFO] 
[INFO] --- tycho-packaging-plugin:1.0.0:build-qualifier (default-build-qualifier) @ org.eclipse.epsilon.flock.engine.test.dependencies ---
[INFO] The project's OSGi version is 0.0.1.201807181609
[INFO] 
[INFO] --- tycho-packaging-plugin:1.0.0:validate-id (default-validate-id) @ org.eclipse.epsilon.flock.engine.test.dependencies ---
[INFO] 
[INFO] --- tycho-packaging-plugin:1.0.0:validate-version (default-validate-version) @ org.eclipse.epsilon.flock.engine.test.dependencies ---
[INFO] 
[INFO] --- maven-resources-plugin:2.4.3:resources (default-resources) @ org.eclipse.epsilon.flock.engine.test.dependencies ---
[INFO] Using 'UTF-8' encoding to copy filtered resources.
[INFO] skip non existing resourceDirectory /jobs/genie.epsilon/RC for 1.5.0/workspace/tests/org.eclipse.epsilon.flock.engine.test.dependencies/src/main/resources
[INFO] 
[INFO] --- tycho-compiler-plugin:1.0.0:compile (default-compile) @ org.eclipse.epsilon.flock.engine.test.dependencies ---
[INFO] 
[INFO] --- maven-resources-plugin:2.4.3:testResources (default-testResources) @ org.eclipse.epsilon.flock.engine.test.dependencies ---
[INFO] Using 'UTF-8' encoding to copy filtered resources.
[INFO] skip non existing resourceDirectory /jobs/genie.epsilon/RC for 1.5.0/workspace/tests/org.eclipse.epsilon.flock.engine.test.dependencies/src/test/resources
[INFO] 
[INFO] --- tycho-source-plugin:1.0.0:plugin-source (plugin-source) @ org.eclipse.epsilon.flock.engine.test.dependencies ---
[INFO] 
[INFO] --- target-platform-configuration:1.0.0:target-platform (default-target-platform) @ org.eclipse.epsilon.flock.engine.test.dependencies ---
[INFO] 
[INFO] --- tycho-packaging-plugin:1.0.0:package-plugin (default-package-plugin) @ org.eclipse.epsilon.flock.engine.test.dependencies ---
[INFO] Building jar: /jobs/genie.epsilon/RC for 1.5.0/workspace/tests/org.eclipse.epsilon.flock.engine.test.dependencies/target/org.eclipse.epsilon.flock.engine.test.dependencies-0.0.1-SNAPSHOT.jar
[INFO] 
[INFO] --- tycho-p2-plugin:1.0.0:p2-metadata-default (default-p2-metadata-default) @ org.eclipse.epsilon.flock.engine.test.dependencies ---
[INFO] 
[INFO] --- maven-install-plugin:2.3.1:install (default-install) @ org.eclipse.epsilon.flock.engine.test.dependencies ---
[INFO] Installing /jobs/genie.epsilon/RC for 1.5.0/workspace/tests/org.eclipse.epsilon.flock.engine.test.dependencies/target/org.eclipse.epsilon.flock.engine.test.dependencies-0.0.1-SNAPSHOT.jar to /home/hudson/genie.epsilon/.jenkins/jobs/RC for 1.5.0/workspace/.repository/org/eclipse/epsilon/org.eclipse.epsilon.flock.engine.test.dependencies/0.0.1-SNAPSHOT/org.eclipse.epsilon.flock.engine.test.dependencies-0.0.1-SNAPSHOT.jar
[INFO] Installing /jobs/genie.epsilon/RC for 1.5.0/workspace/tests/org.eclipse.epsilon.flock.engine.test.dependencies/pom.xml to /home/hudson/genie.epsilon/.jenkins/jobs/RC for 1.5.0/workspace/.repository/org/eclipse/epsilon/org.eclipse.epsilon.flock.engine.test.dependencies/0.0.1-SNAPSHOT/org.eclipse.epsilon.flock.engine.test.dependencies-0.0.1-SNAPSHOT.pom
[INFO] Installing /jobs/genie.epsilon/RC for 1.5.0/workspace/tests/org.eclipse.epsilon.flock.engine.test.dependencies/target/p2content.xml to /home/hudson/genie.epsilon/.jenkins/jobs/RC for 1.5.0/workspace/.repository/org/eclipse/epsilon/org.eclipse.epsilon.flock.engine.test.dependencies/0.0.1-SNAPSHOT/org.eclipse.epsilon.flock.engine.test.dependencies-0.0.1-SNAPSHOT-p2metadata.xml
[INFO] Installing /jobs/genie.epsilon/RC for 1.5.0/workspace/tests/org.eclipse.epsilon.flock.engine.test.dependencies/target/p2artifacts.xml to /home/hudson/genie.epsilon/.jenkins/jobs/RC for 1.5.0/workspace/.repository/org/eclipse/epsilon/org.eclipse.epsilon.flock.engine.test.dependencies/0.0.1-SNAPSHOT/org.eclipse.epsilon.flock.engine.test.dependencies-0.0.1-SNAPSHOT-p2artifacts.xml
[INFO] 
[INFO] --- tycho-p2-plugin:1.0.0:update-local-index (default-update-local-index) @ org.eclipse.epsilon.flock.engine.test.dependencies ---
[INFO]                                                                         
[INFO] ------------------------------------------------------------------------
[INFO] Building org.eclipse.epsilon.flock.engine.test.unit 0.0.1-SNAPSHOT
[INFO] ------------------------------------------------------------------------
[INFO] 
[INFO] --- maven-clean-plugin:2.5:clean (default-clean) @ org.eclipse.epsilon.flock.engine.test.unit ---
[INFO] 
[INFO] --- tycho-packaging-plugin:1.0.0:build-qualifier (default-build-qualifier) @ org.eclipse.epsilon.flock.engine.test.unit ---
[INFO] The project's OSGi version is 0.0.1.201807181609
[INFO] 
[INFO] --- tycho-packaging-plugin:1.0.0:validate-id (default-validate-id) @ org.eclipse.epsilon.flock.engine.test.unit ---
[INFO] 
[INFO] --- tycho-packaging-plugin:1.0.0:validate-version (default-validate-version) @ org.eclipse.epsilon.flock.engine.test.unit ---
[INFO] 
[INFO] --- maven-resources-plugin:2.4.3:resources (default-resources) @ org.eclipse.epsilon.flock.engine.test.unit ---
[INFO] Using 'UTF-8' encoding to copy filtered resources.
[INFO] skip non existing resourceDirectory /jobs/genie.epsilon/RC for 1.5.0/workspace/tests/org.eclipse.epsilon.flock.engine.test.unit/src/main/resources
[INFO] 
[INFO] --- tycho-compiler-plugin:1.0.0:compile (default-compile) @ org.eclipse.epsilon.flock.engine.test.unit ---
[WARNING] Parameter 'useProjectSettings' is set to true, but preferences file '/jobs/genie.epsilon/RC for 1.5.0/workspace/tests/org.eclipse.epsilon.flock.engine.test.unit/.settings/org.eclipse.jdt.core.prefs' could not be found!
[INFO] Compiling 24 source files to /jobs/genie.epsilon/RC for 1.5.0/workspace/tests/org.eclipse.epsilon.flock.engine.test.unit/target/classes
[INFO] 
[INFO] --- maven-resources-plugin:2.4.3:testResources (default-testResources) @ org.eclipse.epsilon.flock.engine.test.unit ---
[INFO] Using 'UTF-8' encoding to copy filtered resources.
[INFO] skip non existing resourceDirectory /jobs/genie.epsilon/RC for 1.5.0/workspace/tests/org.eclipse.epsilon.flock.engine.test.unit/src/test/resources
[INFO] 
[INFO] --- tycho-source-plugin:1.0.0:plugin-source (plugin-source) @ org.eclipse.epsilon.flock.engine.test.unit ---
[WARNING] bundle localization file /jobs/genie.epsilon/RC for 1.5.0/workspace/tests/org.eclipse.epsilon.flock.engine.test.unit/plugin.properties not found
[INFO] Building jar: /jobs/genie.epsilon/RC for 1.5.0/workspace/tests/org.eclipse.epsilon.flock.engine.test.unit/target/org.eclipse.epsilon.flock.engine.test.unit-0.0.1-SNAPSHOT-sources.jar
[INFO] 
[INFO] --- target-platform-configuration:1.0.0:target-platform (default-target-platform) @ org.eclipse.epsilon.flock.engine.test.unit ---
[INFO] 
[INFO] --- tycho-packaging-plugin:1.0.0:package-plugin (default-package-plugin) @ org.eclipse.epsilon.flock.engine.test.unit ---
[INFO] Building jar: /jobs/genie.epsilon/RC for 1.5.0/workspace/tests/org.eclipse.epsilon.flock.engine.test.unit/target/org.eclipse.epsilon.flock.engine.test.unit-0.0.1-SNAPSHOT.jar
[INFO] 
[INFO] --- tycho-p2-plugin:1.0.0:p2-metadata-default (default-p2-metadata-default) @ org.eclipse.epsilon.flock.engine.test.unit ---
[INFO] 
[INFO] --- maven-install-plugin:2.3.1:install (default-install) @ org.eclipse.epsilon.flock.engine.test.unit ---
[INFO] Installing /jobs/genie.epsilon/RC for 1.5.0/workspace/tests/org.eclipse.epsilon.flock.engine.test.unit/target/org.eclipse.epsilon.flock.engine.test.unit-0.0.1-SNAPSHOT.jar to /home/hudson/genie.epsilon/.jenkins/jobs/RC for 1.5.0/workspace/.repository/org/eclipse/epsilon/org.eclipse.epsilon.flock.engine.test.unit/0.0.1-SNAPSHOT/org.eclipse.epsilon.flock.engine.test.unit-0.0.1-SNAPSHOT.jar
[INFO] Installing /jobs/genie.epsilon/RC for 1.5.0/workspace/tests/org.eclipse.epsilon.flock.engine.test.unit/pom.xml to /home/hudson/genie.epsilon/.jenkins/jobs/RC for 1.5.0/workspace/.repository/org/eclipse/epsilon/org.eclipse.epsilon.flock.engine.test.unit/0.0.1-SNAPSHOT/org.eclipse.epsilon.flock.engine.test.unit-0.0.1-SNAPSHOT.pom
[INFO] Installing /jobs/genie.epsilon/RC for 1.5.0/workspace/tests/org.eclipse.epsilon.flock.engine.test.unit/target/org.eclipse.epsilon.flock.engine.test.unit-0.0.1-SNAPSHOT-sources.jar to /home/hudson/genie.epsilon/.jenkins/jobs/RC for 1.5.0/workspace/.repository/org/eclipse/epsilon/org.eclipse.epsilon.flock.engine.test.unit/0.0.1-SNAPSHOT/org.eclipse.epsilon.flock.engine.test.unit-0.0.1-SNAPSHOT-sources.jar
[INFO] Installing /jobs/genie.epsilon/RC for 1.5.0/workspace/tests/org.eclipse.epsilon.flock.engine.test.unit/target/p2content.xml to /home/hudson/genie.epsilon/.jenkins/jobs/RC for 1.5.0/workspace/.repository/org/eclipse/epsilon/org.eclipse.epsilon.flock.engine.test.unit/0.0.1-SNAPSHOT/org.eclipse.epsilon.flock.engine.test.unit-0.0.1-SNAPSHOT-p2metadata.xml
[INFO] Installing /jobs/genie.epsilon/RC for 1.5.0/workspace/tests/org.eclipse.epsilon.flock.engine.test.unit/target/p2artifacts.xml to /home/hudson/genie.epsilon/.jenkins/jobs/RC for 1.5.0/workspace/.repository/org/eclipse/epsilon/org.eclipse.epsilon.flock.engine.test.unit/0.0.1-SNAPSHOT/org.eclipse.epsilon.flock.engine.test.unit-0.0.1-SNAPSHOT-p2artifacts.xml
[INFO] 
[INFO] --- tycho-p2-plugin:1.0.0:update-local-index (default-update-local-index) @ org.eclipse.epsilon.flock.engine.test.unit ---
[INFO]                                                                         
[INFO] ------------------------------------------------------------------------
[INFO] Building org.eclipse.epsilon.flock.engine.test.acceptance 0.0.1-SNAPSHOT
[INFO] ------------------------------------------------------------------------
[INFO] 
[INFO] --- maven-clean-plugin:2.5:clean (default-clean) @ org.eclipse.epsilon.flock.engine.test.acceptance ---
[INFO] 
[INFO] --- tycho-packaging-plugin:1.0.0:build-qualifier (default-build-qualifier) @ org.eclipse.epsilon.flock.engine.test.acceptance ---
[INFO] The project's OSGi version is 0.0.1.201807181609
[INFO] 
[INFO] --- tycho-packaging-plugin:1.0.0:validate-id (default-validate-id) @ org.eclipse.epsilon.flock.engine.test.acceptance ---
[INFO] 
[INFO] --- tycho-packaging-plugin:1.0.0:validate-version (default-validate-version) @ org.eclipse.epsilon.flock.engine.test.acceptance ---
[INFO] 
[INFO] --- maven-resources-plugin:2.4.3:resources (default-resources) @ org.eclipse.epsilon.flock.engine.test.acceptance ---
[INFO] Using 'UTF-8' encoding to copy filtered resources.
[INFO] skip non existing resourceDirectory /jobs/genie.epsilon/RC for 1.5.0/workspace/tests/org.eclipse.epsilon.flock.engine.test.acceptance/src/main/resources
[INFO] 
[INFO] --- tycho-compiler-plugin:1.0.0:compile (default-compile) @ org.eclipse.epsilon.flock.engine.test.acceptance ---
[WARNING] Parameter 'useProjectSettings' is set to true, but preferences file '/jobs/genie.epsilon/RC for 1.5.0/workspace/tests/org.eclipse.epsilon.flock.engine.test.acceptance/.settings/org.eclipse.jdt.core.prefs' could not be found!
[INFO] Compiling 84 source files to /jobs/genie.epsilon/RC for 1.5.0/workspace/tests/org.eclipse.epsilon.flock.engine.test.acceptance/target/classes
[INFO] 
[INFO] --- maven-resources-plugin:2.4.3:testResources (default-testResources) @ org.eclipse.epsilon.flock.engine.test.acceptance ---
[INFO] Using 'UTF-8' encoding to copy filtered resources.
[INFO] skip non existing resourceDirectory /jobs/genie.epsilon/RC for 1.5.0/workspace/tests/org.eclipse.epsilon.flock.engine.test.acceptance/src/test/resources
[INFO] 
[INFO] --- tycho-source-plugin:1.0.0:plugin-source (plugin-source) @ org.eclipse.epsilon.flock.engine.test.acceptance ---
[WARNING] bundle localization file /jobs/genie.epsilon/RC for 1.5.0/workspace/tests/org.eclipse.epsilon.flock.engine.test.acceptance/plugin.properties not found
[INFO] Building jar: /jobs/genie.epsilon/RC for 1.5.0/workspace/tests/org.eclipse.epsilon.flock.engine.test.acceptance/target/org.eclipse.epsilon.flock.engine.test.acceptance-0.0.1-SNAPSHOT-sources.jar
[INFO] 
[INFO] --- target-platform-configuration:1.0.0:target-platform (default-target-platform) @ org.eclipse.epsilon.flock.engine.test.acceptance ---
[INFO] 
[INFO] --- tycho-packaging-plugin:1.0.0:package-plugin (default-package-plugin) @ org.eclipse.epsilon.flock.engine.test.acceptance ---
[INFO] Building jar: /jobs/genie.epsilon/RC for 1.5.0/workspace/tests/org.eclipse.epsilon.flock.engine.test.acceptance/target/org.eclipse.epsilon.flock.engine.test.acceptance-0.0.1-SNAPSHOT.jar
[INFO] 
[INFO] --- tycho-p2-plugin:1.0.0:p2-metadata-default (default-p2-metadata-default) @ org.eclipse.epsilon.flock.engine.test.acceptance ---
[INFO] 
[INFO] --- maven-install-plugin:2.3.1:install (default-install) @ org.eclipse.epsilon.flock.engine.test.acceptance ---
[INFO] Installing /jobs/genie.epsilon/RC for 1.5.0/workspace/tests/org.eclipse.epsilon.flock.engine.test.acceptance/target/org.eclipse.epsilon.flock.engine.test.acceptance-0.0.1-SNAPSHOT.jar to /home/hudson/genie.epsilon/.jenkins/jobs/RC for 1.5.0/workspace/.repository/org/eclipse/epsilon/org.eclipse.epsilon.flock.engine.test.acceptance/0.0.1-SNAPSHOT/org.eclipse.epsilon.flock.engine.test.acceptance-0.0.1-SNAPSHOT.jar
[INFO] Installing /jobs/genie.epsilon/RC for 1.5.0/workspace/tests/org.eclipse.epsilon.flock.engine.test.acceptance/pom.xml to /home/hudson/genie.epsilon/.jenkins/jobs/RC for 1.5.0/workspace/.repository/org/eclipse/epsilon/org.eclipse.epsilon.flock.engine.test.acceptance/0.0.1-SNAPSHOT/org.eclipse.epsilon.flock.engine.test.acceptance-0.0.1-SNAPSHOT.pom
[INFO] Installing /jobs/genie.epsilon/RC for 1.5.0/workspace/tests/org.eclipse.epsilon.flock.engine.test.acceptance/target/org.eclipse.epsilon.flock.engine.test.acceptance-0.0.1-SNAPSHOT-sources.jar to /home/hudson/genie.epsilon/.jenkins/jobs/RC for 1.5.0/workspace/.repository/org/eclipse/epsilon/org.eclipse.epsilon.flock.engine.test.acceptance/0.0.1-SNAPSHOT/org.eclipse.epsilon.flock.engine.test.acceptance-0.0.1-SNAPSHOT-sources.jar
[INFO] Installing /jobs/genie.epsilon/RC for 1.5.0/workspace/tests/org.eclipse.epsilon.flock.engine.test.acceptance/target/p2content.xml to /home/hudson/genie.epsilon/.jenkins/jobs/RC for 1.5.0/workspace/.repository/org/eclipse/epsilon/org.eclipse.epsilon.flock.engine.test.acceptance/0.0.1-SNAPSHOT/org.eclipse.epsilon.flock.engine.test.acceptance-0.0.1-SNAPSHOT-p2metadata.xml
[INFO] Installing /jobs/genie.epsilon/RC for 1.5.0/workspace/tests/org.eclipse.epsilon.flock.engine.test.acceptance/target/p2artifacts.xml to /home/hudson/genie.epsilon/.jenkins/jobs/RC for 1.5.0/workspace/.repository/org/eclipse/epsilon/org.eclipse.epsilon.flock.engine.test.acceptance/0.0.1-SNAPSHOT/org.eclipse.epsilon.flock.engine.test.acceptance-0.0.1-SNAPSHOT-p2artifacts.xml
[INFO] 
[INFO] --- tycho-p2-plugin:1.0.0:update-local-index (default-update-local-index) @ org.eclipse.epsilon.flock.engine.test.acceptance ---
[INFO]                                                                         
[INFO] ------------------------------------------------------------------------
[INFO] Building org.eclipse.epsilon.flock.engine.test 0.0.1-SNAPSHOT
[INFO] ------------------------------------------------------------------------
[INFO] 
[INFO] --- maven-clean-plugin:2.5:clean (default-clean) @ org.eclipse.epsilon.flock.engine.test ---
[INFO] 
[INFO] --- tycho-packaging-plugin:1.0.0:build-qualifier (default-build-qualifier) @ org.eclipse.epsilon.flock.engine.test ---
[INFO] The project's OSGi version is 0.0.1.201807181609
[INFO] 
[INFO] --- tycho-packaging-plugin:1.0.0:validate-id (default-validate-id) @ org.eclipse.epsilon.flock.engine.test ---
[INFO] 
[INFO] --- tycho-packaging-plugin:1.0.0:validate-version (default-validate-version) @ org.eclipse.epsilon.flock.engine.test ---
[INFO] 
[INFO] --- maven-resources-plugin:2.4.3:resources (default-resources) @ org.eclipse.epsilon.flock.engine.test ---
[INFO] Using 'UTF-8' encoding to copy filtered resources.
[INFO] skip non existing resourceDirectory /jobs/genie.epsilon/RC for 1.5.0/workspace/tests/org.eclipse.epsilon.flock.engine.test/src/main/resources
[INFO] 
[INFO] --- tycho-compiler-plugin:1.0.0:compile (default-compile) @ org.eclipse.epsilon.flock.engine.test ---
[WARNING] Parameter 'useProjectSettings' is set to true, but preferences file '/jobs/genie.epsilon/RC for 1.5.0/workspace/tests/org.eclipse.epsilon.flock.engine.test/.settings/org.eclipse.jdt.core.prefs' could not be found!
[INFO] Compiling 1 source file to /jobs/genie.epsilon/RC for 1.5.0/workspace/tests/org.eclipse.epsilon.flock.engine.test/target/classes
[INFO] 
[INFO] --- maven-resources-plugin:2.4.3:testResources (default-testResources) @ org.eclipse.epsilon.flock.engine.test ---
[INFO] Using 'UTF-8' encoding to copy filtered resources.
[INFO] skip non existing resourceDirectory /jobs/genie.epsilon/RC for 1.5.0/workspace/tests/org.eclipse.epsilon.flock.engine.test/src/test/resources
[INFO] 
[INFO] --- tycho-source-plugin:1.0.0:plugin-source (plugin-source) @ org.eclipse.epsilon.flock.engine.test ---
[WARNING] bundle localization file /jobs/genie.epsilon/RC for 1.5.0/workspace/tests/org.eclipse.epsilon.flock.engine.test/plugin.properties not found
[INFO] Building jar: /jobs/genie.epsilon/RC for 1.5.0/workspace/tests/org.eclipse.epsilon.flock.engine.test/target/org.eclipse.epsilon.flock.engine.test-0.0.1-SNAPSHOT-sources.jar
[INFO] 
[INFO] --- target-platform-configuration:1.0.0:target-platform (default-target-platform) @ org.eclipse.epsilon.flock.engine.test ---
[INFO] 
[INFO] --- tycho-packaging-plugin:1.0.0:package-plugin (default-package-plugin) @ org.eclipse.epsilon.flock.engine.test ---
[INFO] Building jar: /jobs/genie.epsilon/RC for 1.5.0/workspace/tests/org.eclipse.epsilon.flock.engine.test/target/org.eclipse.epsilon.flock.engine.test-0.0.1-SNAPSHOT.jar
[INFO] 
[INFO] --- tycho-p2-plugin:1.0.0:p2-metadata-default (default-p2-metadata-default) @ org.eclipse.epsilon.flock.engine.test ---
[INFO] 
[INFO] --- maven-install-plugin:2.3.1:install (default-install) @ org.eclipse.epsilon.flock.engine.test ---
[INFO] Installing /jobs/genie.epsilon/RC for 1.5.0/workspace/tests/org.eclipse.epsilon.flock.engine.test/target/org.eclipse.epsilon.flock.engine.test-0.0.1-SNAPSHOT.jar to /home/hudson/genie.epsilon/.jenkins/jobs/RC for 1.5.0/workspace/.repository/org/eclipse/epsilon/org.eclipse.epsilon.flock.engine.test/0.0.1-SNAPSHOT/org.eclipse.epsilon.flock.engine.test-0.0.1-SNAPSHOT.jar
[INFO] Installing /jobs/genie.epsilon/RC for 1.5.0/workspace/tests/org.eclipse.epsilon.flock.engine.test/pom.xml to /home/hudson/genie.epsilon/.jenkins/jobs/RC for 1.5.0/workspace/.repository/org/eclipse/epsilon/org.eclipse.epsilon.flock.engine.test/0.0.1-SNAPSHOT/org.eclipse.epsilon.flock.engine.test-0.0.1-SNAPSHOT.pom
[INFO] Installing /jobs/genie.epsilon/RC for 1.5.0/workspace/tests/org.eclipse.epsilon.flock.engine.test/target/org.eclipse.epsilon.flock.engine.test-0.0.1-SNAPSHOT-sources.jar to /home/hudson/genie.epsilon/.jenkins/jobs/RC for 1.5.0/workspace/.repository/org/eclipse/epsilon/org.eclipse.epsilon.flock.engine.test/0.0.1-SNAPSHOT/org.eclipse.epsilon.flock.engine.test-0.0.1-SNAPSHOT-sources.jar
[INFO] Installing /jobs/genie.epsilon/RC for 1.5.0/workspace/tests/org.eclipse.epsilon.flock.engine.test/target/p2content.xml to /home/hudson/genie.epsilon/.jenkins/jobs/RC for 1.5.0/workspace/.repository/org/eclipse/epsilon/org.eclipse.epsilon.flock.engine.test/0.0.1-SNAPSHOT/org.eclipse.epsilon.flock.engine.test-0.0.1-SNAPSHOT-p2metadata.xml
[INFO] Installing /jobs/genie.epsilon/RC for 1.5.0/workspace/tests/org.eclipse.epsilon.flock.engine.test/target/p2artifacts.xml to /home/hudson/genie.epsilon/.jenkins/jobs/RC for 1.5.0/workspace/.repository/org/eclipse/epsilon/org.eclipse.epsilon.flock.engine.test/0.0.1-SNAPSHOT/org.eclipse.epsilon.flock.engine.test-0.0.1-SNAPSHOT-p2artifacts.xml
[INFO] 
[INFO] --- tycho-p2-plugin:1.0.0:update-local-index (default-update-local-index) @ org.eclipse.epsilon.flock.engine.test ---
[INFO]                                                                         
[INFO] ------------------------------------------------------------------------
[INFO] Building org.eclipse.epsilon.hutn.dt.test 0.7.7-SNAPSHOT
[INFO] ------------------------------------------------------------------------
[INFO] 
[INFO] --- maven-clean-plugin:2.5:clean (default-clean) @ org.eclipse.epsilon.hutn.dt.test ---
[INFO] 
[INFO] --- tycho-packaging-plugin:1.0.0:build-qualifier (default-build-qualifier) @ org.eclipse.epsilon.hutn.dt.test ---
[INFO] The project's OSGi version is 0.7.7.201807181609
[INFO] 
[INFO] --- tycho-packaging-plugin:1.0.0:validate-id (default-validate-id) @ org.eclipse.epsilon.hutn.dt.test ---
[INFO] 
[INFO] --- tycho-packaging-plugin:1.0.0:validate-version (default-validate-version) @ org.eclipse.epsilon.hutn.dt.test ---
[INFO] 
[INFO] --- maven-resources-plugin:2.4.3:resources (default-resources) @ org.eclipse.epsilon.hutn.dt.test ---
[INFO] Using 'UTF-8' encoding to copy filtered resources.
[INFO] skip non existing resourceDirectory /jobs/genie.epsilon/RC for 1.5.0/workspace/tests/org.eclipse.epsilon.hutn.dt.test/src/main/resources
[INFO] 
[INFO] --- tycho-compiler-plugin:1.0.0:compile (default-compile) @ org.eclipse.epsilon.hutn.dt.test ---
[WARNING] Parameter 'useProjectSettings' is set to true, but preferences file '/jobs/genie.epsilon/RC for 1.5.0/workspace/tests/org.eclipse.epsilon.hutn.dt.test/.settings/org.eclipse.jdt.core.prefs' could not be found!
[INFO] Compiling 6 source files to /jobs/genie.epsilon/RC for 1.5.0/workspace/tests/org.eclipse.epsilon.hutn.dt.test/target/classes
[INFO] 
[INFO] --- maven-resources-plugin:2.4.3:testResources (default-testResources) @ org.eclipse.epsilon.hutn.dt.test ---
[INFO] Using 'UTF-8' encoding to copy filtered resources.
[INFO] skip non existing resourceDirectory /jobs/genie.epsilon/RC for 1.5.0/workspace/tests/org.eclipse.epsilon.hutn.dt.test/src/test/resources
[INFO] 
[INFO] --- tycho-source-plugin:1.0.0:plugin-source (plugin-source) @ org.eclipse.epsilon.hutn.dt.test ---
[WARNING] bundle localization file /jobs/genie.epsilon/RC for 1.5.0/workspace/tests/org.eclipse.epsilon.hutn.dt.test/plugin.properties not found
[INFO] Building jar: /jobs/genie.epsilon/RC for 1.5.0/workspace/tests/org.eclipse.epsilon.hutn.dt.test/target/org.eclipse.epsilon.hutn.dt.test-0.7.7-SNAPSHOT-sources.jar
[INFO] 
[INFO] --- target-platform-configuration:1.0.0:target-platform (default-target-platform) @ org.eclipse.epsilon.hutn.dt.test ---
[INFO] 
[INFO] --- tycho-packaging-plugin:1.0.0:package-plugin (default-package-plugin) @ org.eclipse.epsilon.hutn.dt.test ---
[INFO] Building jar: /jobs/genie.epsilon/RC for 1.5.0/workspace/tests/org.eclipse.epsilon.hutn.dt.test/target/org.eclipse.epsilon.hutn.dt.test-0.7.7-SNAPSHOT.jar
[INFO] 
[INFO] --- tycho-p2-plugin:1.0.0:p2-metadata-default (default-p2-metadata-default) @ org.eclipse.epsilon.hutn.dt.test ---
[INFO] 
[INFO] --- maven-install-plugin:2.3.1:install (default-install) @ org.eclipse.epsilon.hutn.dt.test ---
[INFO] Installing /jobs/genie.epsilon/RC for 1.5.0/workspace/tests/org.eclipse.epsilon.hutn.dt.test/target/org.eclipse.epsilon.hutn.dt.test-0.7.7-SNAPSHOT.jar to /home/hudson/genie.epsilon/.jenkins/jobs/RC for 1.5.0/workspace/.repository/org/eclipse/epsilon/org.eclipse.epsilon.hutn.dt.test/0.7.7-SNAPSHOT/org.eclipse.epsilon.hutn.dt.test-0.7.7-SNAPSHOT.jar
[INFO] Installing /jobs/genie.epsilon/RC for 1.5.0/workspace/tests/org.eclipse.epsilon.hutn.dt.test/pom.xml to /home/hudson/genie.epsilon/.jenkins/jobs/RC for 1.5.0/workspace/.repository/org/eclipse/epsilon/org.eclipse.epsilon.hutn.dt.test/0.7.7-SNAPSHOT/org.eclipse.epsilon.hutn.dt.test-0.7.7-SNAPSHOT.pom
[INFO] Installing /jobs/genie.epsilon/RC for 1.5.0/workspace/tests/org.eclipse.epsilon.hutn.dt.test/target/org.eclipse.epsilon.hutn.dt.test-0.7.7-SNAPSHOT-sources.jar to /home/hudson/genie.epsilon/.jenkins/jobs/RC for 1.5.0/workspace/.repository/org/eclipse/epsilon/org.eclipse.epsilon.hutn.dt.test/0.7.7-SNAPSHOT/org.eclipse.epsilon.hutn.dt.test-0.7.7-SNAPSHOT-sources.jar
[INFO] Installing /jobs/genie.epsilon/RC for 1.5.0/workspace/tests/org.eclipse.epsilon.hutn.dt.test/target/p2content.xml to /home/hudson/genie.epsilon/.jenkins/jobs/RC for 1.5.0/workspace/.repository/org/eclipse/epsilon/org.eclipse.epsilon.hutn.dt.test/0.7.7-SNAPSHOT/org.eclipse.epsilon.hutn.dt.test-0.7.7-SNAPSHOT-p2metadata.xml
[INFO] Installing /jobs/genie.epsilon/RC for 1.5.0/workspace/tests/org.eclipse.epsilon.hutn.dt.test/target/p2artifacts.xml to /home/hudson/genie.epsilon/.jenkins/jobs/RC for 1.5.0/workspace/.repository/org/eclipse/epsilon/org.eclipse.epsilon.hutn.dt.test/0.7.7-SNAPSHOT/org.eclipse.epsilon.hutn.dt.test-0.7.7-SNAPSHOT-p2artifacts.xml
[INFO] 
[INFO] --- tycho-p2-plugin:1.0.0:update-local-index (default-update-local-index) @ org.eclipse.epsilon.hutn.dt.test ---
[INFO]                                                                         
[INFO] ------------------------------------------------------------------------
[INFO] Building org.eclipse.epsilon.hutn.test.acceptance 0.7.4-SNAPSHOT
[INFO] ------------------------------------------------------------------------
[INFO] 
[INFO] --- maven-clean-plugin:2.5:clean (default-clean) @ org.eclipse.epsilon.hutn.test.acceptance ---
[INFO] 
[INFO] --- tycho-packaging-plugin:1.0.0:build-qualifier (default-build-qualifier) @ org.eclipse.epsilon.hutn.test.acceptance ---
[INFO] The project's OSGi version is 0.7.4.201807181609
[INFO] 
[INFO] --- tycho-packaging-plugin:1.0.0:validate-id (default-validate-id) @ org.eclipse.epsilon.hutn.test.acceptance ---
[INFO] 
[INFO] --- tycho-packaging-plugin:1.0.0:validate-version (default-validate-version) @ org.eclipse.epsilon.hutn.test.acceptance ---
[INFO] 
[INFO] --- maven-resources-plugin:2.4.3:resources (default-resources) @ org.eclipse.epsilon.hutn.test.acceptance ---
[INFO] Using 'UTF-8' encoding to copy filtered resources.
[INFO] skip non existing resourceDirectory /jobs/genie.epsilon/RC for 1.5.0/workspace/tests/org.eclipse.epsilon.hutn.test.acceptance/src/main/resources
[INFO] 
[INFO] --- tycho-compiler-plugin:1.0.0:compile (default-compile) @ org.eclipse.epsilon.hutn.test.acceptance ---
[WARNING] Parameter 'useProjectSettings' is set to true, but preferences file '/jobs/genie.epsilon/RC for 1.5.0/workspace/tests/org.eclipse.epsilon.hutn.test.acceptance/.settings/org.eclipse.jdt.core.prefs' could not be found!
[INFO] Compiling 41 source files to /jobs/genie.epsilon/RC for 1.5.0/workspace/tests/org.eclipse.epsilon.hutn.test.acceptance/target/classes
[INFO] 
[INFO] --- maven-resources-plugin:2.4.3:testResources (default-testResources) @ org.eclipse.epsilon.hutn.test.acceptance ---
[INFO] Using 'UTF-8' encoding to copy filtered resources.
[INFO] skip non existing resourceDirectory /jobs/genie.epsilon/RC for 1.5.0/workspace/tests/org.eclipse.epsilon.hutn.test.acceptance/src/test/resources
[INFO] 
[INFO] --- tycho-source-plugin:1.0.0:plugin-source (plugin-source) @ org.eclipse.epsilon.hutn.test.acceptance ---
[WARNING] bundle localization file /jobs/genie.epsilon/RC for 1.5.0/workspace/tests/org.eclipse.epsilon.hutn.test.acceptance/plugin.properties not found
[INFO] Building jar: /jobs/genie.epsilon/RC for 1.5.0/workspace/tests/org.eclipse.epsilon.hutn.test.acceptance/target/org.eclipse.epsilon.hutn.test.acceptance-0.7.4-SNAPSHOT-sources.jar
[INFO] 
[INFO] --- target-platform-configuration:1.0.0:target-platform (default-target-platform) @ org.eclipse.epsilon.hutn.test.acceptance ---
[INFO] 
[INFO] --- tycho-packaging-plugin:1.0.0:package-plugin (default-package-plugin) @ org.eclipse.epsilon.hutn.test.acceptance ---
[INFO] Building jar: /jobs/genie.epsilon/RC for 1.5.0/workspace/tests/org.eclipse.epsilon.hutn.test.acceptance/target/org.eclipse.epsilon.hutn.test.acceptance-0.7.4-SNAPSHOT.jar
[INFO] 
[INFO] --- tycho-p2-plugin:1.0.0:p2-metadata-default (default-p2-metadata-default) @ org.eclipse.epsilon.hutn.test.acceptance ---
[INFO] 
[INFO] --- maven-install-plugin:2.3.1:install (default-install) @ org.eclipse.epsilon.hutn.test.acceptance ---
[INFO] Installing /jobs/genie.epsilon/RC for 1.5.0/workspace/tests/org.eclipse.epsilon.hutn.test.acceptance/target/org.eclipse.epsilon.hutn.test.acceptance-0.7.4-SNAPSHOT.jar to /home/hudson/genie.epsilon/.jenkins/jobs/RC for 1.5.0/workspace/.repository/org/eclipse/epsilon/org.eclipse.epsilon.hutn.test.acceptance/0.7.4-SNAPSHOT/org.eclipse.epsilon.hutn.test.acceptance-0.7.4-SNAPSHOT.jar
[INFO] Installing /jobs/genie.epsilon/RC for 1.5.0/workspace/tests/org.eclipse.epsilon.hutn.test.acceptance/pom.xml to /home/hudson/genie.epsilon/.jenkins/jobs/RC for 1.5.0/workspace/.repository/org/eclipse/epsilon/org.eclipse.epsilon.hutn.test.acceptance/0.7.4-SNAPSHOT/org.eclipse.epsilon.hutn.test.acceptance-0.7.4-SNAPSHOT.pom
[INFO] Installing /jobs/genie.epsilon/RC for 1.5.0/workspace/tests/org.eclipse.epsilon.hutn.test.acceptance/target/org.eclipse.epsilon.hutn.test.acceptance-0.7.4-SNAPSHOT-sources.jar to /home/hudson/genie.epsilon/.jenkins/jobs/RC for 1.5.0/workspace/.repository/org/eclipse/epsilon/org.eclipse.epsilon.hutn.test.acceptance/0.7.4-SNAPSHOT/org.eclipse.epsilon.hutn.test.acceptance-0.7.4-SNAPSHOT-sources.jar
[INFO] Installing /jobs/genie.epsilon/RC for 1.5.0/workspace/tests/org.eclipse.epsilon.hutn.test.acceptance/target/p2content.xml to /home/hudson/genie.epsilon/.jenkins/jobs/RC for 1.5.0/workspace/.repository/org/eclipse/epsilon/org.eclipse.epsilon.hutn.test.acceptance/0.7.4-SNAPSHOT/org.eclipse.epsilon.hutn.test.acceptance-0.7.4-SNAPSHOT-p2metadata.xml
[INFO] Installing /jobs/genie.epsilon/RC for 1.5.0/workspace/tests/org.eclipse.epsilon.hutn.test.acceptance/target/p2artifacts.xml to /home/hudson/genie.epsilon/.jenkins/jobs/RC for 1.5.0/workspace/.repository/org/eclipse/epsilon/org.eclipse.epsilon.hutn.test.acceptance/0.7.4-SNAPSHOT/org.eclipse.epsilon.hutn.test.acceptance-0.7.4-SNAPSHOT-p2artifacts.xml
[INFO] 
[INFO] --- tycho-p2-plugin:1.0.0:update-local-index (default-update-local-index) @ org.eclipse.epsilon.hutn.test.acceptance ---
[INFO]                                                                         
[INFO] ------------------------------------------------------------------------
[INFO] Building org.eclipse.epsilon.hutn.test.unit 0.7.4-SNAPSHOT
[INFO] ------------------------------------------------------------------------
[INFO] 
[INFO] --- maven-clean-plugin:2.5:clean (default-clean) @ org.eclipse.epsilon.hutn.test.unit ---
[INFO] 
[INFO] --- tycho-packaging-plugin:1.0.0:build-qualifier (default-build-qualifier) @ org.eclipse.epsilon.hutn.test.unit ---
[INFO] The project's OSGi version is 0.7.4.201807181609
[INFO] 
[INFO] --- tycho-packaging-plugin:1.0.0:validate-id (default-validate-id) @ org.eclipse.epsilon.hutn.test.unit ---
[INFO] 
[INFO] --- tycho-packaging-plugin:1.0.0:validate-version (default-validate-version) @ org.eclipse.epsilon.hutn.test.unit ---
[INFO] 
[INFO] --- maven-resources-plugin:2.4.3:resources (default-resources) @ org.eclipse.epsilon.hutn.test.unit ---
[INFO] Using 'UTF-8' encoding to copy filtered resources.
[INFO] skip non existing resourceDirectory /jobs/genie.epsilon/RC for 1.5.0/workspace/tests/org.eclipse.epsilon.hutn.test.unit/src/main/resources
[INFO] 
[INFO] --- tycho-compiler-plugin:1.0.0:compile (default-compile) @ org.eclipse.epsilon.hutn.test.unit ---
[WARNING] Parameter 'useProjectSettings' is set to true, but preferences file '/jobs/genie.epsilon/RC for 1.5.0/workspace/tests/org.eclipse.epsilon.hutn.test.unit/.settings/org.eclipse.jdt.core.prefs' could not be found!
[INFO] Compiling 96 source files to /jobs/genie.epsilon/RC for 1.5.0/workspace/tests/org.eclipse.epsilon.hutn.test.unit/target/classes
[INFO] 
[INFO] --- maven-resources-plugin:2.4.3:testResources (default-testResources) @ org.eclipse.epsilon.hutn.test.unit ---
[INFO] Using 'UTF-8' encoding to copy filtered resources.
[INFO] skip non existing resourceDirectory /jobs/genie.epsilon/RC for 1.5.0/workspace/tests/org.eclipse.epsilon.hutn.test.unit/src/test/resources
[INFO] 
[INFO] --- tycho-source-plugin:1.0.0:plugin-source (plugin-source) @ org.eclipse.epsilon.hutn.test.unit ---
[WARNING] bundle localization file /jobs/genie.epsilon/RC for 1.5.0/workspace/tests/org.eclipse.epsilon.hutn.test.unit/plugin.properties not found
[INFO] Building jar: /jobs/genie.epsilon/RC for 1.5.0/workspace/tests/org.eclipse.epsilon.hutn.test.unit/target/org.eclipse.epsilon.hutn.test.unit-0.7.4-SNAPSHOT-sources.jar
[INFO] 
[INFO] --- target-platform-configuration:1.0.0:target-platform (default-target-platform) @ org.eclipse.epsilon.hutn.test.unit ---
[INFO] 
[INFO] --- tycho-packaging-plugin:1.0.0:package-plugin (default-package-plugin) @ org.eclipse.epsilon.hutn.test.unit ---
[INFO] Building jar: /jobs/genie.epsilon/RC for 1.5.0/workspace/tests/org.eclipse.epsilon.hutn.test.unit/target/org.eclipse.epsilon.hutn.test.unit-0.7.4-SNAPSHOT.jar
[INFO] 
[INFO] --- tycho-p2-plugin:1.0.0:p2-metadata-default (default-p2-metadata-default) @ org.eclipse.epsilon.hutn.test.unit ---
[INFO] 
[INFO] --- maven-install-plugin:2.3.1:install (default-install) @ org.eclipse.epsilon.hutn.test.unit ---
[INFO] Installing /jobs/genie.epsilon/RC for 1.5.0/workspace/tests/org.eclipse.epsilon.hutn.test.unit/target/org.eclipse.epsilon.hutn.test.unit-0.7.4-SNAPSHOT.jar to /home/hudson/genie.epsilon/.jenkins/jobs/RC for 1.5.0/workspace/.repository/org/eclipse/epsilon/org.eclipse.epsilon.hutn.test.unit/0.7.4-SNAPSHOT/org.eclipse.epsilon.hutn.test.unit-0.7.4-SNAPSHOT.jar
[INFO] Installing /jobs/genie.epsilon/RC for 1.5.0/workspace/tests/org.eclipse.epsilon.hutn.test.unit/pom.xml to /home/hudson/genie.epsilon/.jenkins/jobs/RC for 1.5.0/workspace/.repository/org/eclipse/epsilon/org.eclipse.epsilon.hutn.test.unit/0.7.4-SNAPSHOT/org.eclipse.epsilon.hutn.test.unit-0.7.4-SNAPSHOT.pom
[INFO] Installing /jobs/genie.epsilon/RC for 1.5.0/workspace/tests/org.eclipse.epsilon.hutn.test.unit/target/org.eclipse.epsilon.hutn.test.unit-0.7.4-SNAPSHOT-sources.jar to /home/hudson/genie.epsilon/.jenkins/jobs/RC for 1.5.0/workspace/.repository/org/eclipse/epsilon/org.eclipse.epsilon.hutn.test.unit/0.7.4-SNAPSHOT/org.eclipse.epsilon.hutn.test.unit-0.7.4-SNAPSHOT-sources.jar
[INFO] Installing /jobs/genie.epsilon/RC for 1.5.0/workspace/tests/org.eclipse.epsilon.hutn.test.unit/target/p2content.xml to /home/hudson/genie.epsilon/.jenkins/jobs/RC for 1.5.0/workspace/.repository/org/eclipse/epsilon/org.eclipse.epsilon.hutn.test.unit/0.7.4-SNAPSHOT/org.eclipse.epsilon.hutn.test.unit-0.7.4-SNAPSHOT-p2metadata.xml
[INFO] Installing /jobs/genie.epsilon/RC for 1.5.0/workspace/tests/org.eclipse.epsilon.hutn.test.unit/target/p2artifacts.xml to /home/hudson/genie.epsilon/.jenkins/jobs/RC for 1.5.0/workspace/.repository/org/eclipse/epsilon/org.eclipse.epsilon.hutn.test.unit/0.7.4-SNAPSHOT/org.eclipse.epsilon.hutn.test.unit-0.7.4-SNAPSHOT-p2artifacts.xml
[INFO] 
[INFO] --- tycho-p2-plugin:1.0.0:update-local-index (default-update-local-index) @ org.eclipse.epsilon.hutn.test.unit ---
[INFO]                                                                         
[INFO] ------------------------------------------------------------------------
[INFO] Building org.eclipse.epsilon.hutn.test 0.7.4-SNAPSHOT
[INFO] ------------------------------------------------------------------------
[INFO] 
[INFO] --- maven-clean-plugin:2.5:clean (default-clean) @ org.eclipse.epsilon.hutn.test ---
[INFO] 
[INFO] --- tycho-packaging-plugin:1.0.0:build-qualifier (default-build-qualifier) @ org.eclipse.epsilon.hutn.test ---
[INFO] The project's OSGi version is 0.7.4.201807181609
[INFO] 
[INFO] --- tycho-packaging-plugin:1.0.0:validate-id (default-validate-id) @ org.eclipse.epsilon.hutn.test ---
[INFO] 
[INFO] --- tycho-packaging-plugin:1.0.0:validate-version (default-validate-version) @ org.eclipse.epsilon.hutn.test ---
[INFO] 
[INFO] --- maven-resources-plugin:2.4.3:resources (default-resources) @ org.eclipse.epsilon.hutn.test ---
[INFO] Using 'UTF-8' encoding to copy filtered resources.
[INFO] skip non existing resourceDirectory /jobs/genie.epsilon/RC for 1.5.0/workspace/tests/org.eclipse.epsilon.hutn.test/src/main/resources
[INFO] 
[INFO] --- tycho-compiler-plugin:1.0.0:compile (default-compile) @ org.eclipse.epsilon.hutn.test ---
[WARNING] Parameter 'useProjectSettings' is set to true, but preferences file '/jobs/genie.epsilon/RC for 1.5.0/workspace/tests/org.eclipse.epsilon.hutn.test/.settings/org.eclipse.jdt.core.prefs' could not be found!
[INFO] Compiling 1 source file to /jobs/genie.epsilon/RC for 1.5.0/workspace/tests/org.eclipse.epsilon.hutn.test/target/classes
[INFO] 
[INFO] --- maven-resources-plugin:2.4.3:testResources (default-testResources) @ org.eclipse.epsilon.hutn.test ---
[INFO] Using 'UTF-8' encoding to copy filtered resources.
[INFO] skip non existing resourceDirectory /jobs/genie.epsilon/RC for 1.5.0/workspace/tests/org.eclipse.epsilon.hutn.test/src/test/resources
[INFO] 
[INFO] --- tycho-source-plugin:1.0.0:plugin-source (plugin-source) @ org.eclipse.epsilon.hutn.test ---
[WARNING] bundle localization file /jobs/genie.epsilon/RC for 1.5.0/workspace/tests/org.eclipse.epsilon.hutn.test/plugin.properties not found
[INFO] Building jar: /jobs/genie.epsilon/RC for 1.5.0/workspace/tests/org.eclipse.epsilon.hutn.test/target/org.eclipse.epsilon.hutn.test-0.7.4-SNAPSHOT-sources.jar
[INFO] 
[INFO] --- target-platform-configuration:1.0.0:target-platform (default-target-platform) @ org.eclipse.epsilon.hutn.test ---
[INFO] 
[INFO] --- tycho-packaging-plugin:1.0.0:package-plugin (default-package-plugin) @ org.eclipse.epsilon.hutn.test ---
[INFO] Building jar: /jobs/genie.epsilon/RC for 1.5.0/workspace/tests/org.eclipse.epsilon.hutn.test/target/org.eclipse.epsilon.hutn.test-0.7.4-SNAPSHOT.jar
[INFO] 
[INFO] --- tycho-p2-plugin:1.0.0:p2-metadata-default (default-p2-metadata-default) @ org.eclipse.epsilon.hutn.test ---
[INFO] 
[INFO] --- maven-install-plugin:2.3.1:install (default-install) @ org.eclipse.epsilon.hutn.test ---
[INFO] Installing /jobs/genie.epsilon/RC for 1.5.0/workspace/tests/org.eclipse.epsilon.hutn.test/target/org.eclipse.epsilon.hutn.test-0.7.4-SNAPSHOT.jar to /home/hudson/genie.epsilon/.jenkins/jobs/RC for 1.5.0/workspace/.repository/org/eclipse/epsilon/org.eclipse.epsilon.hutn.test/0.7.4-SNAPSHOT/org.eclipse.epsilon.hutn.test-0.7.4-SNAPSHOT.jar
[INFO] Installing /jobs/genie.epsilon/RC for 1.5.0/workspace/tests/org.eclipse.epsilon.hutn.test/pom.xml to /home/hudson/genie.epsilon/.jenkins/jobs/RC for 1.5.0/workspace/.repository/org/eclipse/epsilon/org.eclipse.epsilon.hutn.test/0.7.4-SNAPSHOT/org.eclipse.epsilon.hutn.test-0.7.4-SNAPSHOT.pom
[INFO] Installing /jobs/genie.epsilon/RC for 1.5.0/workspace/tests/org.eclipse.epsilon.hutn.test/target/org.eclipse.epsilon.hutn.test-0.7.4-SNAPSHOT-sources.jar to /home/hudson/genie.epsilon/.jenkins/jobs/RC for 1.5.0/workspace/.repository/org/eclipse/epsilon/org.eclipse.epsilon.hutn.test/0.7.4-SNAPSHOT/org.eclipse.epsilon.hutn.test-0.7.4-SNAPSHOT-sources.jar
[INFO] Installing /jobs/genie.epsilon/RC for 1.5.0/workspace/tests/org.eclipse.epsilon.hutn.test/target/p2content.xml to /home/hudson/genie.epsilon/.jenkins/jobs/RC for 1.5.0/workspace/.repository/org/eclipse/epsilon/org.eclipse.epsilon.hutn.test/0.7.4-SNAPSHOT/org.eclipse.epsilon.hutn.test-0.7.4-SNAPSHOT-p2metadata.xml
[INFO] Installing /jobs/genie.epsilon/RC for 1.5.0/workspace/tests/org.eclipse.epsilon.hutn.test/target/p2artifacts.xml to /home/hudson/genie.epsilon/.jenkins/jobs/RC for 1.5.0/workspace/.repository/org/eclipse/epsilon/org.eclipse.epsilon.hutn.test/0.7.4-SNAPSHOT/org.eclipse.epsilon.hutn.test-0.7.4-SNAPSHOT-p2artifacts.xml
[INFO] 
[INFO] --- tycho-p2-plugin:1.0.0:update-local-index (default-update-local-index) @ org.eclipse.epsilon.hutn.test ---
[INFO]                                                                         
[INFO] ------------------------------------------------------------------------
[INFO] Building org.eclipse.epsilon.flexmi.test 0.9.0-SNAPSHOT
[INFO] ------------------------------------------------------------------------
[INFO] 
[INFO] --- maven-clean-plugin:2.5:clean (default-clean) @ org.eclipse.epsilon.flexmi.test ---
[INFO] 
[INFO] --- tycho-packaging-plugin:1.0.0:build-qualifier (default-build-qualifier) @ org.eclipse.epsilon.flexmi.test ---
[INFO] The project's OSGi version is 0.9.0.201807181609
[INFO] 
[INFO] --- tycho-packaging-plugin:1.0.0:validate-id (default-validate-id) @ org.eclipse.epsilon.flexmi.test ---
[INFO] 
[INFO] --- tycho-packaging-plugin:1.0.0:validate-version (default-validate-version) @ org.eclipse.epsilon.flexmi.test ---
[INFO] 
[INFO] --- maven-resources-plugin:2.4.3:resources (default-resources) @ org.eclipse.epsilon.flexmi.test ---
[INFO] Using 'UTF-8' encoding to copy filtered resources.
[INFO] skip non existing resourceDirectory /jobs/genie.epsilon/RC for 1.5.0/workspace/tests/org.eclipse.epsilon.flexmi.test/src/main/resources
[INFO] 
[INFO] --- tycho-compiler-plugin:1.0.0:compile (default-compile) @ org.eclipse.epsilon.flexmi.test ---
[INFO] Compiling 12 source files to /jobs/genie.epsilon/RC for 1.5.0/workspace/tests/org.eclipse.epsilon.flexmi.test/target/classes
[INFO] 
[INFO] --- maven-resources-plugin:2.4.3:testResources (default-testResources) @ org.eclipse.epsilon.flexmi.test ---
[INFO] Using 'UTF-8' encoding to copy filtered resources.
[INFO] skip non existing resourceDirectory /jobs/genie.epsilon/RC for 1.5.0/workspace/tests/org.eclipse.epsilon.flexmi.test/src/test/resources
[INFO] 
[INFO] --- tycho-source-plugin:1.0.0:plugin-source (plugin-source) @ org.eclipse.epsilon.flexmi.test ---
[WARNING] bundle localization file /jobs/genie.epsilon/RC for 1.5.0/workspace/tests/org.eclipse.epsilon.flexmi.test/plugin.properties not found
[WARNING] Bundle-Vendor header not found in /jobs/genie.epsilon/RC for 1.5.0/workspace/tests/org.eclipse.epsilon.flexmi.test/META-INF/MANIFEST.MF, fallback to 'unknown' for source bundle
[INFO] Building jar: /jobs/genie.epsilon/RC for 1.5.0/workspace/tests/org.eclipse.epsilon.flexmi.test/target/org.eclipse.epsilon.flexmi.test-0.9.0-SNAPSHOT-sources.jar
[INFO] 
[INFO] --- target-platform-configuration:1.0.0:target-platform (default-target-platform) @ org.eclipse.epsilon.flexmi.test ---
[INFO] 
[INFO] --- tycho-packaging-plugin:1.0.0:package-plugin (default-package-plugin) @ org.eclipse.epsilon.flexmi.test ---
[INFO] Building jar: /jobs/genie.epsilon/RC for 1.5.0/workspace/tests/org.eclipse.epsilon.flexmi.test/target/org.eclipse.epsilon.flexmi.test-0.9.0-SNAPSHOT.jar
[INFO] 
[INFO] --- tycho-p2-plugin:1.0.0:p2-metadata-default (default-p2-metadata-default) @ org.eclipse.epsilon.flexmi.test ---
[INFO] 
[INFO] --- maven-install-plugin:2.3.1:install (default-install) @ org.eclipse.epsilon.flexmi.test ---
[INFO] Installing /jobs/genie.epsilon/RC for 1.5.0/workspace/tests/org.eclipse.epsilon.flexmi.test/target/org.eclipse.epsilon.flexmi.test-0.9.0-SNAPSHOT.jar to /home/hudson/genie.epsilon/.jenkins/jobs/RC for 1.5.0/workspace/.repository/org/eclipse/epsilon/org.eclipse.epsilon.flexmi.test/0.9.0-SNAPSHOT/org.eclipse.epsilon.flexmi.test-0.9.0-SNAPSHOT.jar
[INFO] Installing /jobs/genie.epsilon/RC for 1.5.0/workspace/tests/org.eclipse.epsilon.flexmi.test/pom.xml to /home/hudson/genie.epsilon/.jenkins/jobs/RC for 1.5.0/workspace/.repository/org/eclipse/epsilon/org.eclipse.epsilon.flexmi.test/0.9.0-SNAPSHOT/org.eclipse.epsilon.flexmi.test-0.9.0-SNAPSHOT.pom
[INFO] Installing /jobs/genie.epsilon/RC for 1.5.0/workspace/tests/org.eclipse.epsilon.flexmi.test/target/org.eclipse.epsilon.flexmi.test-0.9.0-SNAPSHOT-sources.jar to /home/hudson/genie.epsilon/.jenkins/jobs/RC for 1.5.0/workspace/.repository/org/eclipse/epsilon/org.eclipse.epsilon.flexmi.test/0.9.0-SNAPSHOT/org.eclipse.epsilon.flexmi.test-0.9.0-SNAPSHOT-sources.jar
[INFO] Installing /jobs/genie.epsilon/RC for 1.5.0/workspace/tests/org.eclipse.epsilon.flexmi.test/target/p2content.xml to /home/hudson/genie.epsilon/.jenkins/jobs/RC for 1.5.0/workspace/.repository/org/eclipse/epsilon/org.eclipse.epsilon.flexmi.test/0.9.0-SNAPSHOT/org.eclipse.epsilon.flexmi.test-0.9.0-SNAPSHOT-p2metadata.xml
[INFO] Installing /jobs/genie.epsilon/RC for 1.5.0/workspace/tests/org.eclipse.epsilon.flexmi.test/target/p2artifacts.xml to /home/hudson/genie.epsilon/.jenkins/jobs/RC for 1.5.0/workspace/.repository/org/eclipse/epsilon/org.eclipse.epsilon.flexmi.test/0.9.0-SNAPSHOT/org.eclipse.epsilon.flexmi.test-0.9.0-SNAPSHOT-p2artifacts.xml
[INFO] 
[INFO] --- tycho-p2-plugin:1.0.0:update-local-index (default-update-local-index) @ org.eclipse.epsilon.flexmi.test ---
[INFO]                                                                         
[INFO] ------------------------------------------------------------------------
[INFO] Building org.eclipse.epsilon.hutn.unparser.test.unit 0.7.4-SNAPSHOT
[INFO] ------------------------------------------------------------------------
[INFO] 
[INFO] --- maven-clean-plugin:2.5:clean (default-clean) @ org.eclipse.epsilon.hutn.unparser.test.unit ---
[INFO] 
[INFO] --- tycho-packaging-plugin:1.0.0:build-qualifier (default-build-qualifier) @ org.eclipse.epsilon.hutn.unparser.test.unit ---
[INFO] The project's OSGi version is 0.7.4.201807181609
[INFO] 
[INFO] --- tycho-packaging-plugin:1.0.0:validate-id (default-validate-id) @ org.eclipse.epsilon.hutn.unparser.test.unit ---
[INFO] 
[INFO] --- tycho-packaging-plugin:1.0.0:validate-version (default-validate-version) @ org.eclipse.epsilon.hutn.unparser.test.unit ---
[INFO] 
[INFO] --- maven-resources-plugin:2.4.3:resources (default-resources) @ org.eclipse.epsilon.hutn.unparser.test.unit ---
[INFO] Using 'UTF-8' encoding to copy filtered resources.
[INFO] skip non existing resourceDirectory /jobs/genie.epsilon/RC for 1.5.0/workspace/tests/org.eclipse.epsilon.hutn.unparser.test.unit/src/main/resources
[INFO] 
[INFO] --- tycho-compiler-plugin:1.0.0:compile (default-compile) @ org.eclipse.epsilon.hutn.unparser.test.unit ---
[WARNING] Parameter 'useProjectSettings' is set to true, but preferences file '/jobs/genie.epsilon/RC for 1.5.0/workspace/tests/org.eclipse.epsilon.hutn.unparser.test.unit/.settings/org.eclipse.jdt.core.prefs' could not be found!
[INFO] Compiling 34 source files to /jobs/genie.epsilon/RC for 1.5.0/workspace/tests/org.eclipse.epsilon.hutn.unparser.test.unit/target/classes
[INFO] 
[INFO] --- maven-resources-plugin:2.4.3:testResources (default-testResources) @ org.eclipse.epsilon.hutn.unparser.test.unit ---
[INFO] Using 'UTF-8' encoding to copy filtered resources.
[INFO] skip non existing resourceDirectory /jobs/genie.epsilon/RC for 1.5.0/workspace/tests/org.eclipse.epsilon.hutn.unparser.test.unit/src/test/resources
[INFO] 
[INFO] --- tycho-source-plugin:1.0.0:plugin-source (plugin-source) @ org.eclipse.epsilon.hutn.unparser.test.unit ---
[WARNING] bundle localization file /jobs/genie.epsilon/RC for 1.5.0/workspace/tests/org.eclipse.epsilon.hutn.unparser.test.unit/plugin.properties not found
[INFO] Building jar: /jobs/genie.epsilon/RC for 1.5.0/workspace/tests/org.eclipse.epsilon.hutn.unparser.test.unit/target/org.eclipse.epsilon.hutn.unparser.test.unit-0.7.4-SNAPSHOT-sources.jar
[INFO] 
[INFO] --- target-platform-configuration:1.0.0:target-platform (default-target-platform) @ org.eclipse.epsilon.hutn.unparser.test.unit ---
[INFO] 
[INFO] --- tycho-packaging-plugin:1.0.0:package-plugin (default-package-plugin) @ org.eclipse.epsilon.hutn.unparser.test.unit ---
[INFO] Building jar: /jobs/genie.epsilon/RC for 1.5.0/workspace/tests/org.eclipse.epsilon.hutn.unparser.test.unit/target/org.eclipse.epsilon.hutn.unparser.test.unit-0.7.4-SNAPSHOT.jar
[INFO] 
[INFO] --- tycho-p2-plugin:1.0.0:p2-metadata-default (default-p2-metadata-default) @ org.eclipse.epsilon.hutn.unparser.test.unit ---
[INFO] 
[INFO] --- maven-install-plugin:2.3.1:install (default-install) @ org.eclipse.epsilon.hutn.unparser.test.unit ---
[INFO] Installing /jobs/genie.epsilon/RC for 1.5.0/workspace/tests/org.eclipse.epsilon.hutn.unparser.test.unit/target/org.eclipse.epsilon.hutn.unparser.test.unit-0.7.4-SNAPSHOT.jar to /home/hudson/genie.epsilon/.jenkins/jobs/RC for 1.5.0/workspace/.repository/org/eclipse/epsilon/org.eclipse.epsilon.hutn.unparser.test.unit/0.7.4-SNAPSHOT/org.eclipse.epsilon.hutn.unparser.test.unit-0.7.4-SNAPSHOT.jar
[INFO] Installing /jobs/genie.epsilon/RC for 1.5.0/workspace/tests/org.eclipse.epsilon.hutn.unparser.test.unit/pom.xml to /home/hudson/genie.epsilon/.jenkins/jobs/RC for 1.5.0/workspace/.repository/org/eclipse/epsilon/org.eclipse.epsilon.hutn.unparser.test.unit/0.7.4-SNAPSHOT/org.eclipse.epsilon.hutn.unparser.test.unit-0.7.4-SNAPSHOT.pom
[INFO] Installing /jobs/genie.epsilon/RC for 1.5.0/workspace/tests/org.eclipse.epsilon.hutn.unparser.test.unit/target/org.eclipse.epsilon.hutn.unparser.test.unit-0.7.4-SNAPSHOT-sources.jar to /home/hudson/genie.epsilon/.jenkins/jobs/RC for 1.5.0/workspace/.repository/org/eclipse/epsilon/org.eclipse.epsilon.hutn.unparser.test.unit/0.7.4-SNAPSHOT/org.eclipse.epsilon.hutn.unparser.test.unit-0.7.4-SNAPSHOT-sources.jar
[INFO] Installing /jobs/genie.epsilon/RC for 1.5.0/workspace/tests/org.eclipse.epsilon.hutn.unparser.test.unit/target/p2content.xml to /home/hudson/genie.epsilon/.jenkins/jobs/RC for 1.5.0/workspace/.repository/org/eclipse/epsilon/org.eclipse.epsilon.hutn.unparser.test.unit/0.7.4-SNAPSHOT/org.eclipse.epsilon.hutn.unparser.test.unit-0.7.4-SNAPSHOT-p2metadata.xml
[INFO] Installing /jobs/genie.epsilon/RC for 1.5.0/workspace/tests/org.eclipse.epsilon.hutn.unparser.test.unit/target/p2artifacts.xml to /home/hudson/genie.epsilon/.jenkins/jobs/RC for 1.5.0/workspace/.repository/org/eclipse/epsilon/org.eclipse.epsilon.hutn.unparser.test.unit/0.7.4-SNAPSHOT/org.eclipse.epsilon.hutn.unparser.test.unit-0.7.4-SNAPSHOT-p2artifacts.xml
[INFO] 
[INFO] --- tycho-p2-plugin:1.0.0:update-local-index (default-update-local-index) @ org.eclipse.epsilon.hutn.unparser.test.unit ---
[INFO]                                                                         
[INFO] ------------------------------------------------------------------------
[INFO] Building org.eclipse.epsilon.hutn.xmi.test.dependencies 0.7.4-SNAPSHOT
[INFO] ------------------------------------------------------------------------
[INFO] 
[INFO] --- maven-clean-plugin:2.5:clean (default-clean) @ org.eclipse.epsilon.hutn.xmi.test.dependencies ---
[INFO] 
[INFO] --- tycho-packaging-plugin:1.0.0:build-qualifier (default-build-qualifier) @ org.eclipse.epsilon.hutn.xmi.test.dependencies ---
[INFO] The project's OSGi version is 0.7.4.201807181609
[INFO] 
[INFO] --- tycho-packaging-plugin:1.0.0:validate-id (default-validate-id) @ org.eclipse.epsilon.hutn.xmi.test.dependencies ---
[INFO] 
[INFO] --- tycho-packaging-plugin:1.0.0:validate-version (default-validate-version) @ org.eclipse.epsilon.hutn.xmi.test.dependencies ---
[INFO] 
[INFO] --- maven-resources-plugin:2.4.3:resources (default-resources) @ org.eclipse.epsilon.hutn.xmi.test.dependencies ---
[INFO] Using 'UTF-8' encoding to copy filtered resources.
[INFO] skip non existing resourceDirectory /jobs/genie.epsilon/RC for 1.5.0/workspace/tests/org.eclipse.epsilon.hutn.xmi.test.dependencies/src/main/resources
[INFO] 
[INFO] --- tycho-compiler-plugin:1.0.0:compile (default-compile) @ org.eclipse.epsilon.hutn.xmi.test.dependencies ---
[INFO] No sources to compile
[WARNING] Source directory /jobs/genie.epsilon/RC for 1.5.0/workspace/tests/org.eclipse.epsilon.hutn.xmi.test.dependencies/src does not exist
[INFO] 
[INFO] --- maven-resources-plugin:2.4.3:testResources (default-testResources) @ org.eclipse.epsilon.hutn.xmi.test.dependencies ---
[INFO] Using 'UTF-8' encoding to copy filtered resources.
[INFO] skip non existing resourceDirectory /jobs/genie.epsilon/RC for 1.5.0/workspace/tests/org.eclipse.epsilon.hutn.xmi.test.dependencies/src/test/resources
[INFO] 
[INFO] --- tycho-source-plugin:1.0.0:plugin-source (plugin-source) @ org.eclipse.epsilon.hutn.xmi.test.dependencies ---
[WARNING] bundle localization file /jobs/genie.epsilon/RC for 1.5.0/workspace/tests/org.eclipse.epsilon.hutn.xmi.test.dependencies/plugin.properties not found
[INFO] Building jar: /jobs/genie.epsilon/RC for 1.5.0/workspace/tests/org.eclipse.epsilon.hutn.xmi.test.dependencies/target/org.eclipse.epsilon.hutn.xmi.test.dependencies-0.7.4-SNAPSHOT-sources.jar
[INFO] 
[INFO] --- target-platform-configuration:1.0.0:target-platform (default-target-platform) @ org.eclipse.epsilon.hutn.xmi.test.dependencies ---
[INFO] 
[INFO] --- tycho-packaging-plugin:1.0.0:package-plugin (default-package-plugin) @ org.eclipse.epsilon.hutn.xmi.test.dependencies ---
[INFO] Building jar: /jobs/genie.epsilon/RC for 1.5.0/workspace/tests/org.eclipse.epsilon.hutn.xmi.test.dependencies/target/org.eclipse.epsilon.hutn.xmi.test.dependencies-0.7.4-SNAPSHOT.jar
[INFO] 
[INFO] --- tycho-p2-plugin:1.0.0:p2-metadata-default (default-p2-metadata-default) @ org.eclipse.epsilon.hutn.xmi.test.dependencies ---
[INFO] 
[INFO] --- maven-install-plugin:2.3.1:install (default-install) @ org.eclipse.epsilon.hutn.xmi.test.dependencies ---
[INFO] Installing /jobs/genie.epsilon/RC for 1.5.0/workspace/tests/org.eclipse.epsilon.hutn.xmi.test.dependencies/target/org.eclipse.epsilon.hutn.xmi.test.dependencies-0.7.4-SNAPSHOT.jar to /home/hudson/genie.epsilon/.jenkins/jobs/RC for 1.5.0/workspace/.repository/org/eclipse/epsilon/org.eclipse.epsilon.hutn.xmi.test.dependencies/0.7.4-SNAPSHOT/org.eclipse.epsilon.hutn.xmi.test.dependencies-0.7.4-SNAPSHOT.jar
[INFO] Installing /jobs/genie.epsilon/RC for 1.5.0/workspace/tests/org.eclipse.epsilon.hutn.xmi.test.dependencies/pom.xml to /home/hudson/genie.epsilon/.jenkins/jobs/RC for 1.5.0/workspace/.repository/org/eclipse/epsilon/org.eclipse.epsilon.hutn.xmi.test.dependencies/0.7.4-SNAPSHOT/org.eclipse.epsilon.hutn.xmi.test.dependencies-0.7.4-SNAPSHOT.pom
[INFO] Installing /jobs/genie.epsilon/RC for 1.5.0/workspace/tests/org.eclipse.epsilon.hutn.xmi.test.dependencies/target/org.eclipse.epsilon.hutn.xmi.test.dependencies-0.7.4-SNAPSHOT-sources.jar to /home/hudson/genie.epsilon/.jenkins/jobs/RC for 1.5.0/workspace/.repository/org/eclipse/epsilon/org.eclipse.epsilon.hutn.xmi.test.dependencies/0.7.4-SNAPSHOT/org.eclipse.epsilon.hutn.xmi.test.dependencies-0.7.4-SNAPSHOT-sources.jar
[INFO] Installing /jobs/genie.epsilon/RC for 1.5.0/workspace/tests/org.eclipse.epsilon.hutn.xmi.test.dependencies/target/p2content.xml to /home/hudson/genie.epsilon/.jenkins/jobs/RC for 1.5.0/workspace/.repository/org/eclipse/epsilon/org.eclipse.epsilon.hutn.xmi.test.dependencies/0.7.4-SNAPSHOT/org.eclipse.epsilon.hutn.xmi.test.dependencies-0.7.4-SNAPSHOT-p2metadata.xml
[INFO] Installing /jobs/genie.epsilon/RC for 1.5.0/workspace/tests/org.eclipse.epsilon.hutn.xmi.test.dependencies/target/p2artifacts.xml to /home/hudson/genie.epsilon/.jenkins/jobs/RC for 1.5.0/workspace/.repository/org/eclipse/epsilon/org.eclipse.epsilon.hutn.xmi.test.dependencies/0.7.4-SNAPSHOT/org.eclipse.epsilon.hutn.xmi.test.dependencies-0.7.4-SNAPSHOT-p2artifacts.xml
[INFO] 
[INFO] --- tycho-p2-plugin:1.0.0:update-local-index (default-update-local-index) @ org.eclipse.epsilon.hutn.xmi.test.dependencies ---
[INFO]                                                                         
[INFO] ------------------------------------------------------------------------
[INFO] Building org.eclipse.epsilon.hutn.xmi.test.unit 0.7.4-SNAPSHOT
[INFO] ------------------------------------------------------------------------
[INFO] 
[INFO] --- maven-clean-plugin:2.5:clean (default-clean) @ org.eclipse.epsilon.hutn.xmi.test.unit ---
[INFO] 
[INFO] --- tycho-packaging-plugin:1.0.0:build-qualifier (default-build-qualifier) @ org.eclipse.epsilon.hutn.xmi.test.unit ---
[INFO] The project's OSGi version is 0.7.4.201807181609
[INFO] 
[INFO] --- tycho-packaging-plugin:1.0.0:validate-id (default-validate-id) @ org.eclipse.epsilon.hutn.xmi.test.unit ---
[INFO] 
[INFO] --- tycho-packaging-plugin:1.0.0:validate-version (default-validate-version) @ org.eclipse.epsilon.hutn.xmi.test.unit ---
[INFO] 
[INFO] --- maven-resources-plugin:2.4.3:resources (default-resources) @ org.eclipse.epsilon.hutn.xmi.test.unit ---
[INFO] Using 'UTF-8' encoding to copy filtered resources.
[INFO] skip non existing resourceDirectory /jobs/genie.epsilon/RC for 1.5.0/workspace/tests/org.eclipse.epsilon.hutn.xmi.test.unit/src/main/resources
[INFO] 
[INFO] --- tycho-compiler-plugin:1.0.0:compile (default-compile) @ org.eclipse.epsilon.hutn.xmi.test.unit ---
[WARNING] Parameter 'useProjectSettings' is set to true, but preferences file '/jobs/genie.epsilon/RC for 1.5.0/workspace/tests/org.eclipse.epsilon.hutn.xmi.test.unit/.settings/org.eclipse.jdt.core.prefs' could not be found!
[INFO] Compiling 25 source files to /jobs/genie.epsilon/RC for 1.5.0/workspace/tests/org.eclipse.epsilon.hutn.xmi.test.unit/target/classes
[INFO] 
[INFO] --- maven-resources-plugin:2.4.3:testResources (default-testResources) @ org.eclipse.epsilon.hutn.xmi.test.unit ---
[INFO] Using 'UTF-8' encoding to copy filtered resources.
[INFO] skip non existing resourceDirectory /jobs/genie.epsilon/RC for 1.5.0/workspace/tests/org.eclipse.epsilon.hutn.xmi.test.unit/src/test/resources
[INFO] 
[INFO] --- tycho-source-plugin:1.0.0:plugin-source (plugin-source) @ org.eclipse.epsilon.hutn.xmi.test.unit ---
[WARNING] bundle localization file /jobs/genie.epsilon/RC for 1.5.0/workspace/tests/org.eclipse.epsilon.hutn.xmi.test.unit/plugin.properties not found
[INFO] Building jar: /jobs/genie.epsilon/RC for 1.5.0/workspace/tests/org.eclipse.epsilon.hutn.xmi.test.unit/target/org.eclipse.epsilon.hutn.xmi.test.unit-0.7.4-SNAPSHOT-sources.jar
[INFO] 
[INFO] --- target-platform-configuration:1.0.0:target-platform (default-target-platform) @ org.eclipse.epsilon.hutn.xmi.test.unit ---
[INFO] 
[INFO] --- tycho-packaging-plugin:1.0.0:package-plugin (default-package-plugin) @ org.eclipse.epsilon.hutn.xmi.test.unit ---
[INFO] Building jar: /jobs/genie.epsilon/RC for 1.5.0/workspace/tests/org.eclipse.epsilon.hutn.xmi.test.unit/target/org.eclipse.epsilon.hutn.xmi.test.unit-0.7.4-SNAPSHOT.jar
[INFO] 
[INFO] --- tycho-p2-plugin:1.0.0:p2-metadata-default (default-p2-metadata-default) @ org.eclipse.epsilon.hutn.xmi.test.unit ---
[INFO] 
[INFO] --- maven-install-plugin:2.3.1:install (default-install) @ org.eclipse.epsilon.hutn.xmi.test.unit ---
[INFO] Installing /jobs/genie.epsilon/RC for 1.5.0/workspace/tests/org.eclipse.epsilon.hutn.xmi.test.unit/target/org.eclipse.epsilon.hutn.xmi.test.unit-0.7.4-SNAPSHOT.jar to /home/hudson/genie.epsilon/.jenkins/jobs/RC for 1.5.0/workspace/.repository/org/eclipse/epsilon/org.eclipse.epsilon.hutn.xmi.test.unit/0.7.4-SNAPSHOT/org.eclipse.epsilon.hutn.xmi.test.unit-0.7.4-SNAPSHOT.jar
[INFO] Installing /jobs/genie.epsilon/RC for 1.5.0/workspace/tests/org.eclipse.epsilon.hutn.xmi.test.unit/pom.xml to /home/hudson/genie.epsilon/.jenkins/jobs/RC for 1.5.0/workspace/.repository/org/eclipse/epsilon/org.eclipse.epsilon.hutn.xmi.test.unit/0.7.4-SNAPSHOT/org.eclipse.epsilon.hutn.xmi.test.unit-0.7.4-SNAPSHOT.pom
[INFO] Installing /jobs/genie.epsilon/RC for 1.5.0/workspace/tests/org.eclipse.epsilon.hutn.xmi.test.unit/target/org.eclipse.epsilon.hutn.xmi.test.unit-0.7.4-SNAPSHOT-sources.jar to /home/hudson/genie.epsilon/.jenkins/jobs/RC for 1.5.0/workspace/.repository/org/eclipse/epsilon/org.eclipse.epsilon.hutn.xmi.test.unit/0.7.4-SNAPSHOT/org.eclipse.epsilon.hutn.xmi.test.unit-0.7.4-SNAPSHOT-sources.jar
[INFO] Installing /jobs/genie.epsilon/RC for 1.5.0/workspace/tests/org.eclipse.epsilon.hutn.xmi.test.unit/target/p2content.xml to /home/hudson/genie.epsilon/.jenkins/jobs/RC for 1.5.0/workspace/.repository/org/eclipse/epsilon/org.eclipse.epsilon.hutn.xmi.test.unit/0.7.4-SNAPSHOT/org.eclipse.epsilon.hutn.xmi.test.unit-0.7.4-SNAPSHOT-p2metadata.xml
[INFO] Installing /jobs/genie.epsilon/RC for 1.5.0/workspace/tests/org.eclipse.epsilon.hutn.xmi.test.unit/target/p2artifacts.xml to /home/hudson/genie.epsilon/.jenkins/jobs/RC for 1.5.0/workspace/.repository/org/eclipse/epsilon/org.eclipse.epsilon.hutn.xmi.test.unit/0.7.4-SNAPSHOT/org.eclipse.epsilon.hutn.xmi.test.unit-0.7.4-SNAPSHOT-p2artifacts.xml
[INFO] 
[INFO] --- tycho-p2-plugin:1.0.0:update-local-index (default-update-local-index) @ org.eclipse.epsilon.hutn.xmi.test.unit ---
[INFO]                                                                         
[INFO] ------------------------------------------------------------------------
[INFO] Building org.eclipse.epsilon.hutn.xmi.test.integration 0.7.4-SNAPSHOT
[INFO] ------------------------------------------------------------------------
[INFO] 
[INFO] --- maven-clean-plugin:2.5:clean (default-clean) @ org.eclipse.epsilon.hutn.xmi.test.integration ---
[INFO] 
[INFO] --- tycho-packaging-plugin:1.0.0:build-qualifier (default-build-qualifier) @ org.eclipse.epsilon.hutn.xmi.test.integration ---
[INFO] The project's OSGi version is 0.7.4.201807181609
[INFO] 
[INFO] --- tycho-packaging-plugin:1.0.0:validate-id (default-validate-id) @ org.eclipse.epsilon.hutn.xmi.test.integration ---
[INFO] 
[INFO] --- tycho-packaging-plugin:1.0.0:validate-version (default-validate-version) @ org.eclipse.epsilon.hutn.xmi.test.integration ---
[INFO] 
[INFO] --- maven-resources-plugin:2.4.3:resources (default-resources) @ org.eclipse.epsilon.hutn.xmi.test.integration ---
[INFO] Using 'UTF-8' encoding to copy filtered resources.
[INFO] skip non existing resourceDirectory /jobs/genie.epsilon/RC for 1.5.0/workspace/tests/org.eclipse.epsilon.hutn.xmi.test.integration/src/main/resources
[INFO] 
[INFO] --- tycho-compiler-plugin:1.0.0:compile (default-compile) @ org.eclipse.epsilon.hutn.xmi.test.integration ---
[WARNING] Parameter 'useProjectSettings' is set to true, but preferences file '/jobs/genie.epsilon/RC for 1.5.0/workspace/tests/org.eclipse.epsilon.hutn.xmi.test.integration/.settings/org.eclipse.jdt.core.prefs' could not be found!
[INFO] Compiling 66 source files to /jobs/genie.epsilon/RC for 1.5.0/workspace/tests/org.eclipse.epsilon.hutn.xmi.test.integration/target/classes
[INFO] 
[INFO] --- maven-resources-plugin:2.4.3:testResources (default-testResources) @ org.eclipse.epsilon.hutn.xmi.test.integration ---
[INFO] Using 'UTF-8' encoding to copy filtered resources.
[INFO] skip non existing resourceDirectory /jobs/genie.epsilon/RC for 1.5.0/workspace/tests/org.eclipse.epsilon.hutn.xmi.test.integration/src/test/resources
[INFO] 
[INFO] --- tycho-source-plugin:1.0.0:plugin-source (plugin-source) @ org.eclipse.epsilon.hutn.xmi.test.integration ---
[WARNING] bundle localization file /jobs/genie.epsilon/RC for 1.5.0/workspace/tests/org.eclipse.epsilon.hutn.xmi.test.integration/plugin.properties not found
[INFO] Building jar: /jobs/genie.epsilon/RC for 1.5.0/workspace/tests/org.eclipse.epsilon.hutn.xmi.test.integration/target/org.eclipse.epsilon.hutn.xmi.test.integration-0.7.4-SNAPSHOT-sources.jar
[INFO] 
[INFO] --- target-platform-configuration:1.0.0:target-platform (default-target-platform) @ org.eclipse.epsilon.hutn.xmi.test.integration ---
[INFO] 
[INFO] --- tycho-packaging-plugin:1.0.0:package-plugin (default-package-plugin) @ org.eclipse.epsilon.hutn.xmi.test.integration ---
[INFO] Building jar: /jobs/genie.epsilon/RC for 1.5.0/workspace/tests/org.eclipse.epsilon.hutn.xmi.test.integration/target/org.eclipse.epsilon.hutn.xmi.test.integration-0.7.4-SNAPSHOT.jar
[INFO] 
[INFO] --- tycho-p2-plugin:1.0.0:p2-metadata-default (default-p2-metadata-default) @ org.eclipse.epsilon.hutn.xmi.test.integration ---
[INFO] 
[INFO] --- maven-install-plugin:2.3.1:install (default-install) @ org.eclipse.epsilon.hutn.xmi.test.integration ---
[INFO] Installing /jobs/genie.epsilon/RC for 1.5.0/workspace/tests/org.eclipse.epsilon.hutn.xmi.test.integration/target/org.eclipse.epsilon.hutn.xmi.test.integration-0.7.4-SNAPSHOT.jar to /home/hudson/genie.epsilon/.jenkins/jobs/RC for 1.5.0/workspace/.repository/org/eclipse/epsilon/org.eclipse.epsilon.hutn.xmi.test.integration/0.7.4-SNAPSHOT/org.eclipse.epsilon.hutn.xmi.test.integration-0.7.4-SNAPSHOT.jar
[INFO] Installing /jobs/genie.epsilon/RC for 1.5.0/workspace/tests/org.eclipse.epsilon.hutn.xmi.test.integration/pom.xml to /home/hudson/genie.epsilon/.jenkins/jobs/RC for 1.5.0/workspace/.repository/org/eclipse/epsilon/org.eclipse.epsilon.hutn.xmi.test.integration/0.7.4-SNAPSHOT/org.eclipse.epsilon.hutn.xmi.test.integration-0.7.4-SNAPSHOT.pom
[INFO] Installing /jobs/genie.epsilon/RC for 1.5.0/workspace/tests/org.eclipse.epsilon.hutn.xmi.test.integration/target/org.eclipse.epsilon.hutn.xmi.test.integration-0.7.4-SNAPSHOT-sources.jar to /home/hudson/genie.epsilon/.jenkins/jobs/RC for 1.5.0/workspace/.repository/org/eclipse/epsilon/org.eclipse.epsilon.hutn.xmi.test.integration/0.7.4-SNAPSHOT/org.eclipse.epsilon.hutn.xmi.test.integration-0.7.4-SNAPSHOT-sources.jar
[INFO] Installing /jobs/genie.epsilon/RC for 1.5.0/workspace/tests/org.eclipse.epsilon.hutn.xmi.test.integration/target/p2content.xml to /home/hudson/genie.epsilon/.jenkins/jobs/RC for 1.5.0/workspace/.repository/org/eclipse/epsilon/org.eclipse.epsilon.hutn.xmi.test.integration/0.7.4-SNAPSHOT/org.eclipse.epsilon.hutn.xmi.test.integration-0.7.4-SNAPSHOT-p2metadata.xml
[INFO] Installing /jobs/genie.epsilon/RC for 1.5.0/workspace/tests/org.eclipse.epsilon.hutn.xmi.test.integration/target/p2artifacts.xml to /home/hudson/genie.epsilon/.jenkins/jobs/RC for 1.5.0/workspace/.repository/org/eclipse/epsilon/org.eclipse.epsilon.hutn.xmi.test.integration/0.7.4-SNAPSHOT/org.eclipse.epsilon.hutn.xmi.test.integration-0.7.4-SNAPSHOT-p2artifacts.xml
[INFO] 
[INFO] --- tycho-p2-plugin:1.0.0:update-local-index (default-update-local-index) @ org.eclipse.epsilon.hutn.xmi.test.integration ---
[INFO]                                                                         
[INFO] ------------------------------------------------------------------------
[INFO] Building org.eclipse.epsilon.hutn.xmi.test 0.7.4-SNAPSHOT
[INFO] ------------------------------------------------------------------------
[INFO] 
[INFO] --- maven-clean-plugin:2.5:clean (default-clean) @ org.eclipse.epsilon.hutn.xmi.test ---
[INFO] 
[INFO] --- tycho-packaging-plugin:1.0.0:build-qualifier (default-build-qualifier) @ org.eclipse.epsilon.hutn.xmi.test ---
[INFO] The project's OSGi version is 0.7.4.201807181609
[INFO] 
[INFO] --- tycho-packaging-plugin:1.0.0:validate-id (default-validate-id) @ org.eclipse.epsilon.hutn.xmi.test ---
[INFO] 
[INFO] --- tycho-packaging-plugin:1.0.0:validate-version (default-validate-version) @ org.eclipse.epsilon.hutn.xmi.test ---
[INFO] 
[INFO] --- maven-resources-plugin:2.4.3:resources (default-resources) @ org.eclipse.epsilon.hutn.xmi.test ---
[INFO] Using 'UTF-8' encoding to copy filtered resources.
[INFO] skip non existing resourceDirectory /jobs/genie.epsilon/RC for 1.5.0/workspace/tests/org.eclipse.epsilon.hutn.xmi.test/src/main/resources
[INFO] 
[INFO] --- tycho-compiler-plugin:1.0.0:compile (default-compile) @ org.eclipse.epsilon.hutn.xmi.test ---
[WARNING] Parameter 'useProjectSettings' is set to true, but preferences file '/jobs/genie.epsilon/RC for 1.5.0/workspace/tests/org.eclipse.epsilon.hutn.xmi.test/.settings/org.eclipse.jdt.core.prefs' could not be found!
[INFO] Compiling 1 source file to /jobs/genie.epsilon/RC for 1.5.0/workspace/tests/org.eclipse.epsilon.hutn.xmi.test/target/classes
[INFO] 
[INFO] --- maven-resources-plugin:2.4.3:testResources (default-testResources) @ org.eclipse.epsilon.hutn.xmi.test ---
[INFO] Using 'UTF-8' encoding to copy filtered resources.
[INFO] skip non existing resourceDirectory /jobs/genie.epsilon/RC for 1.5.0/workspace/tests/org.eclipse.epsilon.hutn.xmi.test/src/test/resources
[INFO] 
[INFO] --- tycho-source-plugin:1.0.0:plugin-source (plugin-source) @ org.eclipse.epsilon.hutn.xmi.test ---
[WARNING] bundle localization file /jobs/genie.epsilon/RC for 1.5.0/workspace/tests/org.eclipse.epsilon.hutn.xmi.test/plugin.properties not found
[INFO] Building jar: /jobs/genie.epsilon/RC for 1.5.0/workspace/tests/org.eclipse.epsilon.hutn.xmi.test/target/org.eclipse.epsilon.hutn.xmi.test-0.7.4-SNAPSHOT-sources.jar
[INFO] 
[INFO] --- target-platform-configuration:1.0.0:target-platform (default-target-platform) @ org.eclipse.epsilon.hutn.xmi.test ---
[INFO] 
[INFO] --- tycho-packaging-plugin:1.0.0:package-plugin (default-package-plugin) @ org.eclipse.epsilon.hutn.xmi.test ---
[INFO] Building jar: /jobs/genie.epsilon/RC for 1.5.0/workspace/tests/org.eclipse.epsilon.hutn.xmi.test/target/org.eclipse.epsilon.hutn.xmi.test-0.7.4-SNAPSHOT.jar
[INFO] 
[INFO] --- tycho-p2-plugin:1.0.0:p2-metadata-default (default-p2-metadata-default) @ org.eclipse.epsilon.hutn.xmi.test ---
[INFO] 
[INFO] --- maven-install-plugin:2.3.1:install (default-install) @ org.eclipse.epsilon.hutn.xmi.test ---
[INFO] Installing /jobs/genie.epsilon/RC for 1.5.0/workspace/tests/org.eclipse.epsilon.hutn.xmi.test/target/org.eclipse.epsilon.hutn.xmi.test-0.7.4-SNAPSHOT.jar to /home/hudson/genie.epsilon/.jenkins/jobs/RC for 1.5.0/workspace/.repository/org/eclipse/epsilon/org.eclipse.epsilon.hutn.xmi.test/0.7.4-SNAPSHOT/org.eclipse.epsilon.hutn.xmi.test-0.7.4-SNAPSHOT.jar
[INFO] Installing /jobs/genie.epsilon/RC for 1.5.0/workspace/tests/org.eclipse.epsilon.hutn.xmi.test/pom.xml to /home/hudson/genie.epsilon/.jenkins/jobs/RC for 1.5.0/workspace/.repository/org/eclipse/epsilon/org.eclipse.epsilon.hutn.xmi.test/0.7.4-SNAPSHOT/org.eclipse.epsilon.hutn.xmi.test-0.7.4-SNAPSHOT.pom
[INFO] Installing /jobs/genie.epsilon/RC for 1.5.0/workspace/tests/org.eclipse.epsilon.hutn.xmi.test/target/org.eclipse.epsilon.hutn.xmi.test-0.7.4-SNAPSHOT-sources.jar to /home/hudson/genie.epsilon/.jenkins/jobs/RC for 1.5.0/workspace/.repository/org/eclipse/epsilon/org.eclipse.epsilon.hutn.xmi.test/0.7.4-SNAPSHOT/org.eclipse.epsilon.hutn.xmi.test-0.7.4-SNAPSHOT-sources.jar
[INFO] Installing /jobs/genie.epsilon/RC for 1.5.0/workspace/tests/org.eclipse.epsilon.hutn.xmi.test/target/p2content.xml to /home/hudson/genie.epsilon/.jenkins/jobs/RC for 1.5.0/workspace/.repository/org/eclipse/epsilon/org.eclipse.epsilon.hutn.xmi.test/0.7.4-SNAPSHOT/org.eclipse.epsilon.hutn.xmi.test-0.7.4-SNAPSHOT-p2metadata.xml
[INFO] Installing /jobs/genie.epsilon/RC for 1.5.0/workspace/tests/org.eclipse.epsilon.hutn.xmi.test/target/p2artifacts.xml to /home/hudson/genie.epsilon/.jenkins/jobs/RC for 1.5.0/workspace/.repository/org/eclipse/epsilon/org.eclipse.epsilon.hutn.xmi.test/0.7.4-SNAPSHOT/org.eclipse.epsilon.hutn.xmi.test-0.7.4-SNAPSHOT-p2artifacts.xml
[INFO] 
[INFO] --- tycho-p2-plugin:1.0.0:update-local-index (default-update-local-index) @ org.eclipse.epsilon.hutn.xmi.test ---
[INFO]                                                                         
[INFO] ------------------------------------------------------------------------
[INFO] Building org.eclipse.epsilon.workflow.test 1.5.0-SNAPSHOT
[INFO] ------------------------------------------------------------------------
[INFO] 
[INFO] --- maven-clean-plugin:2.5:clean (default-clean) @ org.eclipse.epsilon.workflow.test ---
[INFO] 
[INFO] --- tycho-packaging-plugin:1.0.0:build-qualifier (default-build-qualifier) @ org.eclipse.epsilon.workflow.test ---
[INFO] The project's OSGi version is 1.5.0.201807181609
[INFO] 
[INFO] --- tycho-packaging-plugin:1.0.0:validate-id (default-validate-id) @ org.eclipse.epsilon.workflow.test ---
[INFO] 
[INFO] --- tycho-packaging-plugin:1.0.0:validate-version (default-validate-version) @ org.eclipse.epsilon.workflow.test ---
[INFO] 
[INFO] --- maven-resources-plugin:2.4.3:resources (default-resources) @ org.eclipse.epsilon.workflow.test ---
[INFO] Using 'UTF-8' encoding to copy filtered resources.
[INFO] skip non existing resourceDirectory /jobs/genie.epsilon/RC for 1.5.0/workspace/tests/org.eclipse.epsilon.workflow.test/src/main/resources
[INFO] 
[INFO] --- tycho-compiler-plugin:1.0.0:compile (default-compile) @ org.eclipse.epsilon.workflow.test ---
[WARNING] Parameter 'useProjectSettings' is set to true, but preferences file '/jobs/genie.epsilon/RC for 1.5.0/workspace/tests/org.eclipse.epsilon.workflow.test/.settings/org.eclipse.jdt.core.prefs' could not be found!
[INFO] Compiling 21 source files to /jobs/genie.epsilon/RC for 1.5.0/workspace/tests/org.eclipse.epsilon.workflow.test/target/classes
[INFO] 
[INFO] --- maven-resources-plugin:2.4.3:testResources (default-testResources) @ org.eclipse.epsilon.workflow.test ---
[INFO] Using 'UTF-8' encoding to copy filtered resources.
[INFO] skip non existing resourceDirectory /jobs/genie.epsilon/RC for 1.5.0/workspace/tests/org.eclipse.epsilon.workflow.test/src/test/resources
[INFO] 
[INFO] --- tycho-source-plugin:1.0.0:plugin-source (plugin-source) @ org.eclipse.epsilon.workflow.test ---
[WARNING] bundle localization file /jobs/genie.epsilon/RC for 1.5.0/workspace/tests/org.eclipse.epsilon.workflow.test/plugin.properties not found
[INFO] Building jar: /jobs/genie.epsilon/RC for 1.5.0/workspace/tests/org.eclipse.epsilon.workflow.test/target/org.eclipse.epsilon.workflow.test-1.5.0-SNAPSHOT-sources.jar
[INFO] 
[INFO] --- target-platform-configuration:1.0.0:target-platform (default-target-platform) @ org.eclipse.epsilon.workflow.test ---
[INFO] 
[INFO] --- tycho-packaging-plugin:1.0.0:package-plugin (default-package-plugin) @ org.eclipse.epsilon.workflow.test ---
[INFO] ------------------------------------------------------------------------
[INFO] Reactor Summary:
[INFO] 
[INFO] parent ............................................. SUCCESS [  1.102 s]
[INFO] features ........................................... SUCCESS [  0.005 s]
[INFO] plugins ............................................ SUCCESS [  0.007 s]
[INFO] org.h2_1.1.117 ..................................... SUCCESS [  2.624 s]
[INFO] org.eclipse.epsilon.concordance.dependencies.feature SUCCESS [  0.074 s]
[INFO] org.antlr.runtime_3.1.b1 ........................... SUCCESS [  0.055 s]
[INFO] org.eclipse.epsilon.dependencies ................... SUCCESS [  0.037 s]
[INFO] org.eclipse.epsilon.common ......................... SUCCESS [  1.195 s]
[INFO] org.eclipse.epsilon.antlr.postprocessor.model ...... SUCCESS [  0.309 s]
[INFO] org.eclipse.epsilon.antlr.postprocessor ............ SUCCESS [  0.144 s]
[INFO] org.eclipse.epsilon.eol.engine ..................... SUCCESS [  2.864 s]
[INFO] org.eclipse.epsilon.erl.engine ..................... SUCCESS [  0.348 s]
[INFO] org.eclipse.epsilon.common.dt ...................... SUCCESS [  0.918 s]
[INFO] org.eclipse.epsilon.egl.engine ..................... SUCCESS [  1.128 s]
[INFO] org.eclipse.epsilon.emc.emf ........................ SUCCESS [  0.814 s]
[INFO] org.eclipse.epsilon.etl.engine ..................... SUCCESS [  0.473 s]
[INFO] org.eclipse.epsilon.evl.engine ..................... SUCCESS [  0.776 s]
[INFO] org.eclipse.epsilon.hutn.model ..................... SUCCESS [  0.211 s]
[INFO] org.eclipse.epsilon.hutn.model.antlrAst ............ SUCCESS [  0.155 s]
[INFO] org.eclipse.epsilon.hutn.model.config .............. SUCCESS [  0.139 s]
[INFO] org.eclipse.epsilon.hutn.engine .................... SUCCESS [  0.346 s]
[INFO] org.eclipse.epsilon.hutn.unparser .................. SUCCESS [  0.130 s]
[INFO] org.eclipse.epsilon.hutn.xmi ....................... SUCCESS [  0.183 s]
[INFO] org.eclipse.epsilon.concordance.core.hashing ....... SUCCESS [  0.147 s]
[INFO] org.eclipse.epsilon.concordance.core ............... SUCCESS [  0.337 s]
[INFO] org.eclipse.epsilon.ecl.engine ..................... SUCCESS [  0.350 s]
[INFO] org.eclipse.epsilon.emc.composite .................. SUCCESS [  0.086 s]
[INFO] org.eclipse.epsilon.emf.dt ......................... SUCCESS [  0.261 s]
[INFO] org.eclipse.epsilon.hutn.dt ........................ SUCCESS [  0.347 s]
[INFO] org.eclipse.epsilon.hutn.xmi.dt .................... SUCCESS [  0.200 s]
[INFO] org.eclipse.epsilon.concordance.clients ............ SUCCESS [  0.262 s]
[INFO] org.eclipse.epsilon.eol.dt ......................... SUCCESS [  0.410 s]
[INFO] org.eclipse.epsilon.flock.engine ................... SUCCESS [  0.558 s]
[INFO] org.eclipse.epsilon.flock.dt.emf ................... SUCCESS [  0.301 s]
[INFO] org.eclipse.epsilon.flock.dt.concordance ........... SUCCESS [  0.333 s]
[INFO] org.eclipse.epsilon.concordance.feature ............ SUCCESS [  0.098 s]
[INFO] org.apache.commons.csv_1.5 ......................... SUCCESS [  0.057 s]
[INFO] org.eclipse.epsilon.core.dependencies.feature ...... SUCCESS [  0.045 s]
[INFO] org.eclipse.epsilon.common.dt.examples ............. SUCCESS [  0.266 s]
[INFO] org.eclipse.epsilon.eml.engine ..................... SUCCESS [  0.403 s]
[INFO] org.eclipse.epsilon.ewl.engine ..................... SUCCESS [  0.552 s]
[INFO] org.eclipse.epsilon.profiling ...................... SUCCESS [  0.112 s]
[INFO] org.eclipse.epsilon.emc.plainxml ................... SUCCESS [  0.187 s]
[INFO] org.eclipse.epsilon.emc.bibtex ..................... SUCCESS [  0.109 s]
[INFO] org.eclipse.epsilon.emc.csv ........................ SUCCESS [  0.147 s]
[INFO] org.eclipse.epsilon.epl.engine ..................... SUCCESS [  0.614 s]
[INFO] org.eclipse.epsilon.eunit.engine ................... SUCCESS [  0.378 s]
[INFO] org.eclipse.epsilon.erl.dt ......................... SUCCESS [  0.782 s]
[INFO] org.eclipse.epsilon.ecl.dt ......................... SUCCESS [  0.203 s]
[INFO] org.eclipse.epsilon.egl.traceability.fine .......... SUCCESS [  0.094 s]
[INFO] org.eclipse.epsilon.egl.dt ......................... SUCCESS [  0.771 s]
[INFO] org.eclipse.epsilon.etl.dt ......................... SUCCESS [  0.243 s]
[INFO] org.eclipse.epsilon.eml.dt ......................... SUCCESS [  0.203 s]
[INFO] org.eclipse.epsilon.eol.tools ...................... SUCCESS [  0.094 s]
[INFO] org.eclipse.epsilon.eol.dt.tools ................... SUCCESS [  0.037 s]
[INFO] org.eclipse.epsilon.evl.dt ......................... SUCCESS [  0.236 s]
[INFO] org.eclipse.epsilon.ecl.dt.tools ................... SUCCESS [  0.040 s]
[INFO] org.eclipse.epsilon.ewl.dt ......................... SUCCESS [  0.253 s]
[INFO] org.eclipse.epsilon.profiling.dt ................... SUCCESS [  0.278 s]
[INFO] org.eclipse.epsilon.help ........................... SUCCESS [  0.023 s]
[INFO] org.eclipse.epsilon.emc.plainxml.dt ................ SUCCESS [  0.177 s]
[INFO] org.eclipse.epsilon.flock.dt ....................... SUCCESS [  0.257 s]
[INFO] org.eclipse.epsilon.emc.bibtex.dt .................. SUCCESS [  0.173 s]
[INFO] org.eclipse.epsilon.emc.csv.dt ..................... SUCCESS [  0.176 s]
[INFO] org.eclipse.epsilon.epl.dt ......................... SUCCESS [  0.225 s]
[INFO] org.eclipse.epsilon.perspective .................... SUCCESS [  0.175 s]
[INFO] org.eclipse.epsilon.emc.hutn ....................... SUCCESS [  0.101 s]
[INFO] org.eclipse.epsilon.workflow ....................... SUCCESS [  2.532 s]
[INFO] org.eclipse.epsilon.eunit.dt ....................... SUCCESS [  0.317 s]
[INFO] org.eclipse.epsilon.eunit.dt.diff.files ............ SUCCESS [  0.186 s]
[INFO] org.eclipse.epsilon.eunit.junit .................... SUCCESS [  0.088 s]
[INFO] org.eclipse.epsilon.eunit.junit.dt ................. SUCCESS [  0.168 s]
[INFO] org.eclipse.epsilon.core.dt.feature ................ SUCCESS [  0.137 s]
[INFO] org.eclipse.epsilon.core.feature ................... SUCCESS [  0.067 s]
[INFO] org.jdom_1.0 ....................................... SUCCESS [  0.099 s]
[INFO] org.eclipse.epsilon.emc.muddle ..................... SUCCESS [  0.219 s]
[INFO] org.eclipse.epsilon.emc.graphml .................... SUCCESS [  0.199 s]
[INFO] org.eclipse.epsilon.emc.graphml.dt ................. SUCCESS [  0.218 s]
[INFO] org.eclipse.epsilon.emc.graphml.feature ............ SUCCESS [  0.041 s]
[INFO] org.eclipse.epsilon.emc.spreadsheets.dependencies .. SUCCESS [  0.020 s]
[INFO] org.eclipse.epsilon.emc.spreadsheets.dependencies.feature SUCCESS [  0.027 s]
[INFO] org.apache.xmlbeans_2.6.0 .......................... SUCCESS [  1.930 s]
[INFO] org.apache.poi.ooxml.schemas_3.10.1 ................ SUCCESS [  4.322 s]
[INFO] org.apache.poi_3.10.1 .............................. SUCCESS [  1.115 s]
[INFO] org.apache.poi.ooxml_3.10.1 ........................ SUCCESS [  0.558 s]
[INFO] org.eclipse.epsilon.emc.spreadsheets.excel.dependencies SUCCESS [  0.019 s]
[INFO] org.eclipse.epsilon.emc.spreadsheets.excel.dependencies.feature SUCCESS [  0.039 s]
[INFO] org.eclipse.epsilon.emc.spreadsheets ............... SUCCESS [  0.127 s]
[INFO] org.eclipse.epsilon.emc.spreadsheets.excel ......... SUCCESS [  0.114 s]
[INFO] org.eclipse.epsilon.emc.spreadsheets.excel.dt ...... SUCCESS [  0.209 s]
[INFO] org.eclipse.epsilon.emc.spreadsheets.excel.dt.feature SUCCESS [  0.033 s]
[INFO] org.eclipse.epsilon.emc.spreadsheets.excel.feature . SUCCESS [  0.032 s]
[INFO] org.eclipse.epsilon.emc.spreadsheets.feature ....... SUCCESS [  0.027 s]
[INFO] com.google.gdata_1.47.1 ............................ SUCCESS [  0.820 s]
[INFO] org.eclipse.epsilon.emc.spreadsheets.google.dependencies SUCCESS [  0.028 s]
[INFO] org.eclipse.epsilon.emc.spreadsheets.google.dependencies.feature SUCCESS [  0.034 s]
[INFO] org.eclipse.epsilon.emc.spreadsheets.google ........ SUCCESS [  0.134 s]
[INFO] org.eclipse.epsilon.emc.spreadsheets.google.dt ..... SUCCESS [  0.201 s]
[INFO] org.eclipse.epsilon.emc.spreadsheets.google.dt.feature SUCCESS [  0.053 s]
[INFO] org.eclipse.epsilon.emc.spreadsheets.google.feature  SUCCESS [  0.031 s]
[INFO] org.eclipse.epsilon.emf.dt.dependencies.feature .... SUCCESS [  0.025 s]
[INFO] org.eclipse.epsilon.dt.epackageregistryexplorer .... SUCCESS [  0.292 s]
[INFO] org.eclipse.epsilon.dt.exeed ....................... SUCCESS [  0.441 s]
[INFO] org.eclipse.epsilon.egl.dt.traceability.fine.emf ... SUCCESS [  0.316 s]
[INFO] org.eclipse.epsilon.egl.dt.traceability.editor ..... SUCCESS [  0.345 s]
[INFO] org.eclipse.epsilon.emc.emf.decorator .............. SUCCESS [  0.096 s]
[INFO] org.eclipse.epsilon.emc.emf.virtual ................ SUCCESS [  0.200 s]
[INFO] org.eclipse.epsilon.emc.emf.dt ..................... SUCCESS [  0.229 s]
[INFO] org.eclipse.epsilon.emc.emf.decorator.dt ........... SUCCESS [  0.177 s]
[INFO] org.eclipse.epsilon.workflow.emf ................... SUCCESS [  0.327 s]
[INFO] org.eclipse.epsilon.flexmi ......................... SUCCESS [  0.204 s]
[INFO] org.eclipse.epsilon.flexmi.dt ...................... SUCCESS [  0.466 s]
[INFO] org.eclipse.epsilon.emf.dt.feature ................. SUCCESS [  0.106 s]
[INFO] org.eclipse.epsilon.emf.feature .................... SUCCESS [  0.025 s]
[INFO] org.eclipse.epsilon.eugenia ........................ SUCCESS [  0.402 s]
[INFO] org.eclipse.epsilon.workflow.eugenia ............... SUCCESS [  0.359 s]
[INFO] org.eclipse.epsilon.eugenia.feature ................ SUCCESS [  0.060 s]
[INFO] org.eclipse.epsilon.eunit.dt.cmp.emf ............... SUCCESS [  0.214 s]
[INFO] org.eclipse.epsilon.eunit.dt.diff.emf .............. SUCCESS [  0.184 s]
[INFO] org.eclipse.epsilon.eunit.dt.emf.feature ........... SUCCESS [  0.042 s]
[INFO] org.eclipse.epsilon.evl.emf.validation ............. SUCCESS [  0.514 s]
[INFO] org.eclipse.epsilon.evl.emf.validation.feature ..... SUCCESS [  0.037 s]
[INFO] org.eclipse.epsilon.ewl.emf ........................ SUCCESS [  0.407 s]
[INFO] org.eclipse.epsilon.ewl.emf.feature ................ SUCCESS [  0.030 s]
[INFO] org.eclipse.epsilon.ewl.gmf ........................ SUCCESS [  0.198 s]
[INFO] org.eclipse.epsilon.ewl.gmf.feature ................ SUCCESS [  0.031 s]
[INFO] org.eclipse.epsilon.hutn.dependencies.feature ...... SUCCESS [  0.018 s]
[INFO] org.eclipse.epsilon.emc.hutn.dt .................... SUCCESS [ 11.847 s]
[INFO] org.eclipse.epsilon.hutn.dt.feature ................ SUCCESS [  0.049 s]
[INFO] org.eclipse.epsilon.hutn.feature ................... SUCCESS [  5.856 s]
[INFO] org.eclipse.epsilon.emc.uml ........................ SUCCESS [  0.135 s]
[INFO] org.eclipse.epsilon.emc.uml.dt ..................... SUCCESS [  0.230 s]
[INFO] org.eclipse.epsilon.uml.dt.feature ................. SUCCESS [  0.031 s]
[INFO] org.eclipse.epsilon.uml.feature .................... SUCCESS [  0.022 s]
[INFO] org.eclipse.epsilon.emc.simulink ................... SUCCESS [  0.196 s]
[INFO] org.eclipse.epsilon.emc.simulink.dt ................ SUCCESS [  0.183 s]
[INFO] org.eclipse.epsilon.simulink.dt.feature ............ SUCCESS [  0.031 s]
[INFO] org.eclipse.epsilon.simulink.feature ............... SUCCESS [  0.020 s]
[INFO] org.eclipse.epsilon.targetplatform ................. SUCCESS [  0.005 s]
[INFO] org.eclipse.epsilon.workflow.csv ................... SUCCESS [  0.296 s]
[INFO] tests .............................................. SUCCESS [  0.003 s]
[INFO] net.sf.cglib.nodep_2.1.3 ........................... SUCCESS [  0.227 s]
[INFO] org.easymock_2.4 ................................... SUCCESS [  0.047 s]
[INFO] org.objenesis_1.0 .................................. SUCCESS [  0.046 s]
[INFO] org.easymock_3.1 ................................... SUCCESS [  0.094 s]
[INFO] org.mockito_1.8.4 .................................. SUCCESS [  0.849 s]
[INFO] org.eclipse.epsilon.test.dependencies .............. SUCCESS [  0.178 s]
[INFO] org.eclipse.epsilon.common.dt.test ................. SUCCESS [  0.233 s]
[INFO] org.eclipse.epsilon.common.test .................... SUCCESS [  0.144 s]
[INFO] org.eclipse.epsilon.concordance.clients.test ....... SUCCESS [  0.270 s]
[INFO] org.eclipse.epsilon.concordance.core.hashing.test .. SUCCESS [  0.124 s]
[INFO] org.eclipse.epsilon.concordance.core.test .......... SUCCESS [  0.240 s]
[INFO] org.eclipse.epsilon.concordance.test ............... SUCCESS [  0.166 s]
[INFO] org.eclipse.epsilon.concordance.test.performance ... SUCCESS [  0.210 s]
[INFO] org.eclipse.epsilon.ecl.engine.test.acceptance ..... SUCCESS [  0.103 s]
[INFO] org.eclipse.epsilon.egl.dt.test .................... SUCCESS [  0.180 s]
[INFO] org.eclipse.epsilon.egl.dt.traceability.editor.tests SUCCESS [  0.185 s]
[INFO] org.eclipse.epsilon.egl.engine.test.dependencies ... SUCCESS [  0.117 s]
[INFO] org.eclipse.epsilon.egl.engine.test.unit ........... SUCCESS [  0.259 s]
[INFO] org.eclipse.epsilon.egl.engine.test.acceptance ..... SUCCESS [  0.237 s]
[INFO] org.eclipse.epsilon.egl.traceability.fine.test.acceptance SUCCESS [  0.140 s]
[INFO] org.eclipse.epsilon.egl.traceability.fine.test.unit  SUCCESS [  0.120 s]
[INFO] org.eclipse.epsilon.egl.engine.test ................ SUCCESS [  0.112 s]
[INFO] org.eclipse.epsilon.test.fixtures.hutn ............. SUCCESS [  0.094 s]
[INFO] org.eclipse.epsilon.hutn.test.dependencies.model ... SUCCESS [  0.238 s]
[INFO] org.eclipse.epsilon.egx.engine.test.acceptance ..... SUCCESS [  0.135 s]
[INFO] org.eclipse.epsilon.emc.bibtex.test ................ SUCCESS [  0.145 s]
[INFO] org.eclipse.epsilon.emc.csv.test ................... SUCCESS [  0.107 s]
[INFO] org.eclipse.epsilon.emc.emf.test ................... SUCCESS [  0.255 s]
[INFO] org.eclipse.epsilon.emc.graphml.tests .............. SUCCESS [  0.124 s]
[INFO] org.eclipse.epsilon.hutn.test.dependencies ......... SUCCESS [  0.102 s]
[INFO] org.eclipse.epsilon.emc.hutn.test .................. SUCCESS [  0.101 s]
[INFO] org.eclipse.epsilon.emc.plainxml.test .............. SUCCESS [  0.131 s]
[INFO] org.eclipse.epsilon.emc.spreadsheets.test .......... SUCCESS [  0.362 s]
[INFO] org.eclipse.epsilon.eml.engine.test.acceptance ..... SUCCESS [  0.118 s]
[INFO] org.eclipse.epsilon.eol.engine.test.acceptance ..... SUCCESS [  0.178 s]
[INFO] org.eclipse.epsilon.eol.engine.test.unit ........... SUCCESS [  0.184 s]
[INFO] org.eclipse.epsilon.epl.engine.test.acceptance ..... SUCCESS [  0.102 s]
[INFO] org.eclipse.epsilon.etl.engine.test.acceptance ..... SUCCESS [  0.117 s]
[INFO] org.eclipse.epsilon.evl.engine.test.acceptance ..... SUCCESS [  0.109 s]
[INFO] org.eclipse.epsilon.ewl.engine.test.acceptance ..... SUCCESS [  0.104 s]
[INFO] org.eclipse.epsilon.flock.engine.test.dependencies . SUCCESS [  0.025 s]
[INFO] org.eclipse.epsilon.flock.engine.test.unit ......... SUCCESS [  0.177 s]
[INFO] org.eclipse.epsilon.flock.engine.test.acceptance ... SUCCESS [  0.219 s]
[INFO] org.eclipse.epsilon.flock.engine.test .............. SUCCESS [  0.092 s]
[INFO] org.eclipse.epsilon.hutn.dt.test ................... SUCCESS [  0.178 s]
[INFO] org.eclipse.epsilon.hutn.test.acceptance ........... SUCCESS [  0.174 s]
[INFO] org.eclipse.epsilon.hutn.test.unit ................. SUCCESS [  0.290 s]
[INFO] org.eclipse.epsilon.hutn.test ...................... SUCCESS [  0.186 s]
[INFO] org.eclipse.epsilon.flexmi.test .................... SUCCESS [  0.139 s]
[INFO] org.eclipse.epsilon.hutn.unparser.test.unit ........ SUCCESS [  0.175 s]
[INFO] org.eclipse.epsilon.hutn.xmi.test.dependencies ..... SUCCESS [  0.031 s]
[INFO] org.eclipse.epsilon.hutn.xmi.test.unit ............. SUCCESS [  0.191 s]
[INFO] org.eclipse.epsilon.hutn.xmi.test.integration ...... SUCCESS [  0.203 s]
[INFO] org.eclipse.epsilon.hutn.xmi.test .................. SUCCESS [  0.120 s]
[INFO] org.eclipse.epsilon.workflow.test .................. FAILURE [  0.951 s]
[INFO] org.eclipse.epsilon.test ........................... SKIPPED
[INFO] Epsilon Utility Mojos .............................. SKIPPED
[INFO] org.eclipse.epsilon.standalone ..................... SKIPPED
[INFO] ------------------------------------------------------------------------
[INFO] BUILD FAILURE
[INFO] ------------------------------------------------------------------------
[INFO] Total time: 04:36 min
[INFO] Finished at: 2018-07-18T12:13:40-04:00
[INFO] Final Memory: 274M/1995M
[INFO] ------------------------------------------------------------------------
[ERROR] Failed to execute goal org.eclipse.tycho:tycho-packaging-plugin:1.0.0:package-plugin (default-package-plugin) on project org.eclipse.epsilon.workflow.test: /jobs/genie.epsilon/RC for 1.5.0/workspace/tests/org.eclipse.epsilon.workflow.test/build.properties: bin.includes value(s) [EPL-2.0.html] do not match any files. -> [Help 1]
[ERROR] 
[ERROR] To see the full stack trace of the errors, re-run Maven with the -e switch.
[ERROR] Re-run Maven using the -X switch to enable full debug logging.
[ERROR] 
[ERROR] For more information about the errors and possible solutions, please read the following articles:
[ERROR] [Help 1] http://cwiki.apache.org/confluence/display/MAVEN/MojoExecutionException
[ERROR] 
[ERROR] After correcting the problems, you can resume the build with the command
[ERROR]   mvn <goals> -rf :org.eclipse.epsilon.workflow.test
Build step 'Invoke top-level Maven targets' marked build as failure
Terminating xvnc.
Sending e-mails to: a.garcia-dominguez@aston.ac.uk dimitris.kolovos@york.ac.uk arcanefoam@gmail.com Sm1748@york.ac.uk
Started calculate disk usage of build
Finished Calculation of disk usage of build in 0 seconds
Started calculate disk usage of workspace
Finished Calculation of disk usage of workspace in  1 second
Finished: FAILURE