AbortedConsole Output

Skipping 823 KB.. Full Log
Exception on execution: No branch info available.
Exception on execution: No branch info available.
Total time for commit: 0
Total time for commit: 0
Total time for commit: 0
Total time for commit: 0
Exception on execution: No branch info available.
Exception on execution: No branch info available.
Exception on execution: No branch info available.
Exception on execution: No branch info available.
Exception on execution: No branch info available.
Exception on execution: No branch info available.
Exception on execution: No branch info available.
Exception on execution: No branch info available.
Total time for commit: 1
Total time for commit: 1
Total time for commit: 1
Total time for commit: 1
Total time for commit: 1
Total time for commit: 1
Total time for commit: 1
Total time for commit: 1
Total time for commit: 1
Total time for commit: 1
Total time for commit: 1
Total time for commit: 1
Exception on execution: No branch info available.
Exception on execution: No branch info available.
Exception on execution: No branch info available.
Exception on execution: No branch info available.
Exception on execution: No branch info available.
Exception on execution: No branch info available.
Exception on execution: No branch info available.
Exception on execution: No branch info available.
Total time for commit: 1
Total time for commit: 1
Total time for commit: 1
Total time for commit: 1
Total time for commit: 1
Total time for commit: 1
Total time for commit: 1
Total time for commit: 1
Exception on execution: org.eclipse.emf.emfstore.internal.server.exceptions.InvalidVersionSpecException: Walked too far, invalid path.
	at org.eclipse.emf.emfstore.internal.server.core.subinterfaces.VersionSubInterfaceImpl.getVersions(VersionSubInterfaceImpl.java:892)
	at org.eclipse.emf.emfstore.internal.server.core.subinterfaces.HistorySubInterfaceImpl.handlePathQuery(HistorySubInterfaceImpl.java:240)
	at org.eclipse.emf.emfstore.internal.server.core.subinterfaces.HistorySubInterfaceImpl.getHistoryInfo(HistorySubInterfaceImpl.java:204)
	at sun.reflect.GeneratedMethodAccessor22.invoke(Unknown Source)
	at sun.reflect.DelegatingMethodAccessorImpl.invoke(DelegatingMethodAccessorImpl.java:43)
	at java.lang.reflect.Method.invoke(Method.java:498)
	at org.eclipse.emf.emfstore.internal.server.core.AbstractSubEmfstoreInterface.execute(AbstractSubEmfstoreInterface.java:142)
	at org.eclipse.emf.emfstore.internal.server.core.EMFStoreImpl.invoke(EMFStoreImpl.java:181)
	at com.sun.proxy.$Proxy22.getHistoryInfo(Unknown Source)
	at org.eclipse.emf.emfstore.client.test.common.mocks.ConnectionMock.getHistoryInfo(ConnectionMock.java:165)
	at org.eclipse.emf.emfstore.internal.client.model.impl.api.ESRemoteProjectImpl$8$1.run(ESRemoteProjectImpl.java:255)
	at org.eclipse.emf.emfstore.internal.client.model.impl.api.ESRemoteProjectImpl$8$1.run(ESRemoteProjectImpl.java:1)
	at org.eclipse.emf.emfstore.internal.client.model.connectionmanager.ServerCall.run(ServerCall.java:250)
	at org.eclipse.emf.emfstore.internal.client.model.connectionmanager.SessionManager.executeCall(SessionManager.java:151)
	at org.eclipse.emf.emfstore.internal.client.model.connectionmanager.SessionManager.execute(SessionManager.java:70)
	at org.eclipse.emf.emfstore.internal.client.model.connectionmanager.ServerCall.execute(ServerCall.java:270)
	at org.eclipse.emf.emfstore.internal.client.model.impl.api.ESRemoteProjectImpl$8.call(ESRemoteProjectImpl.java:260)
	at org.eclipse.emf.emfstore.internal.client.model.impl.api.ESRemoteProjectImpl$8.call(ESRemoteProjectImpl.java:1)
	at org.eclipse.emf.emfstore.client.util.RunESCommand$WithException$1.doRun(RunESCommand.java:61)
	at org.eclipse.emf.emfstore.internal.client.model.util.EMFStoreCommandWithResult.commandBody(EMFStoreCommandWithResult.java:31)
	at org.eclipse.emf.emfstore.internal.client.model.util.AbstractEMFStoreCommand.execute(AbstractEMFStoreCommand.java:64)
	at org.eclipse.emf.emfstore.internal.client.transaction.EMFStoreTransactionalCommandStack$1.doExecute(EMFStoreTransactionalCommandStack.java:61)
	at org.eclipse.emf.transaction.RecordingCommand.execute(RecordingCommand.java:135)
	at org.eclipse.emf.common.command.BasicCommandStack.execute(BasicCommandStack.java:78)
	at org.eclipse.emf.transaction.impl.AbstractTransactionalCommandStack.basicExecute(AbstractTransactionalCommandStack.java:241)
	at org.eclipse.emf.emfstore.internal.client.transaction.EMFStoreTransactionalCommandStack.basicExecute(EMFStoreTransactionalCommandStack.java:160)
	at org.eclipse.emf.transaction.impl.TransactionalCommandStackImpl.doExecute(TransactionalCommandStackImpl.java:63)
	at org.eclipse.emf.transaction.impl.AbstractTransactionalCommandStack.execute(AbstractTransactionalCommandStack.java:165)
	at org.eclipse.emf.transaction.impl.AbstractTransactionalCommandStack.execute(AbstractTransactionalCommandStack.java:219)
	at org.eclipse.emf.emfstore.internal.client.transaction.EMFStoreTransactionalCommandStack.runEMFStoreCommand(EMFStoreTransactionalCommandStack.java:64)
	at org.eclipse.emf.emfstore.internal.client.transaction.EMFStoreTransactionalCommandStack.execute(EMFStoreTransactionalCommandStack.java:49)
	at org.eclipse.emf.emfstore.internal.client.model.util.AbstractEMFStoreCommand.aRun(AbstractEMFStoreCommand.java:108)
	at org.eclipse.emf.emfstore.internal.client.model.util.EMFStoreCommandWithResult.run(EMFStoreCommandWithResult.java:59)
	at org.eclipse.emf.emfstore.client.util.RunESCommand$WithException.runWithResult(RunESCommand.java:78)
	at org.eclipse.emf.emfstore.internal.client.model.impl.api.ESRemoteProjectImpl.getHistoryInfos(ESRemoteProjectImpl.java:246)
	at org.eclipse.emf.emfstore.internal.client.model.impl.api.ESLocalProjectImpl$31.call(ESLocalProjectImpl.java:837)
	at org.eclipse.emf.emfstore.internal.client.model.impl.api.ESLocalProjectImpl$31.call(ESLocalProjectImpl.java:1)
	at org.eclipse.emf.emfstore.client.util.RunESCommand$WithException$1.doRun(RunESCommand.java:61)
	at org.eclipse.emf.emfstore.internal.client.model.util.EMFStoreCommandWithResult.commandBody(EMFStoreCommandWithResult.java:31)
	at org.eclipse.emf.emfstore.internal.client.model.util.AbstractEMFStoreCommand.execute(AbstractEMFStoreCommand.java:64)
	at org.eclipse.emf.emfstore.internal.client.transaction.EMFStoreTransactionalCommandStack$1.doExecute(EMFStoreTransactionalCommandStack.java:61)
	at org.eclipse.emf.transaction.RecordingCommand.execute(RecordingCommand.java:135)
	at org.eclipse.emf.common.command.BasicCommandStack.execute(BasicCommandStack.java:78)
	at org.eclipse.emf.transaction.impl.AbstractTransactionalCommandStack.basicExecute(AbstractTransactionalCommandStack.java:241)
	at org.eclipse.emf.emfstore.internal.client.transaction.EMFStoreTransactionalCommandStack.basicExecute(EMFStoreTransactionalCommandStack.java:160)
	at org.eclipse.emf.transaction.impl.TransactionalCommandStackImpl.doExecute(TransactionalCommandStackImpl.java:63)
	at org.eclipse.emf.transaction.impl.AbstractTransactionalCommandStack.execute(AbstractTransactionalCommandStack.java:165)
	at org.eclipse.emf.transaction.impl.AbstractTransactionalCommandStack.execute(AbstractTransactionalCommandStack.java:219)
	at org.eclipse.emf.emfstore.internal.client.transaction.EMFStoreTransactionalCommandStack.runEMFStoreCommand(EMFStoreTransactionalCommandStack.java:64)
	at org.eclipse.emf.emfstore.internal.client.transaction.EMFStoreTransactionalCommandStack.execute(EMFStoreTransactionalCommandStack.java:49)
	at org.eclipse.emf.emfstore.internal.client.model.util.AbstractEMFStoreCommand.aRun(AbstractEMFStoreCommand.java:108)
	at org.eclipse.emf.emfstore.internal.client.model.util.EMFStoreCommandWithResult.run(EMFStoreCommandWithResult.java:59)
	at org.eclipse.emf.emfstore.client.util.RunESCommand$WithException.runWithResult(RunESCommand.java:78)
	at org.eclipse.emf.emfstore.internal.client.model.impl.api.ESLocalProjectImpl.getHistoryInfos(ESLocalProjectImpl.java:835)
	at org.eclipse.emf.emfstore.server.test.HistoryAPITests.invalidPathQuery(HistoryAPITests.java:361)
	at sun.reflect.NativeMethodAccessorImpl.invoke0(Native Method)
	at sun.reflect.NativeMethodAccessorImpl.invoke(NativeMethodAccessorImpl.java:62)
	at sun.reflect.DelegatingMethodAccessorImpl.invoke(DelegatingMethodAccessorImpl.java:43)
	at java.lang.reflect.Method.invoke(Method.java:498)
	at org.junit.runners.model.FrameworkMethod$1.runReflectiveCall(FrameworkMethod.java:47)
	at org.junit.internal.runners.model.ReflectiveCallable.run(ReflectiveCallable.java:12)
	at org.junit.runners.model.FrameworkMethod.invokeExplosively(FrameworkMethod.java:44)
	at org.junit.internal.runners.statements.InvokeMethod.evaluate(InvokeMethod.java:17)
	at org.junit.internal.runners.statements.ExpectException.evaluate(ExpectException.java:19)
	at org.junit.runners.ParentRunner.runLeaf(ParentRunner.java:271)
	at org.junit.runners.BlockJUnit4ClassRunner.runChild(BlockJUnit4ClassRunner.java:70)
	at org.junit.runners.BlockJUnit4ClassRunner.runChild(BlockJUnit4ClassRunner.java:50)
	at org.junit.runners.ParentRunner$3.run(ParentRunner.java:238)
	at org.junit.runners.ParentRunner$1.schedule(ParentRunner.java:63)
	at org.junit.runners.ParentRunner.runChildren(ParentRunner.java:236)
	at org.junit.runners.ParentRunner.access$000(ParentRunner.java:53)
	at org.junit.runners.ParentRunner$2.evaluate(ParentRunner.java:229)
	at org.junit.internal.runners.statements.RunBefores.evaluate(RunBefores.java:26)
	at org.junit.internal.runners.statements.RunAfters.evaluate(RunAfters.java:27)
	at org.junit.runners.ParentRunner.run(ParentRunner.java:309)
	at org.junit.runners.Suite.runChild(Suite.java:127)
	at org.junit.runners.Suite.runChild(Suite.java:26)
	at org.junit.runners.ParentRunner$3.run(ParentRunner.java:238)
	at org.junit.runners.ParentRunner$1.schedule(ParentRunner.java:63)
	at org.junit.runners.ParentRunner.runChildren(ParentRunner.java:236)
	at org.junit.runners.ParentRunner.access$000(ParentRunner.java:53)
	at org.junit.runners.ParentRunner$2.evaluate(ParentRunner.java:229)
	at org.junit.runners.ParentRunner.run(ParentRunner.java:309)
	at org.junit.runners.Suite.runChild(Suite.java:127)
	at org.junit.runners.Suite.runChild(Suite.java:26)
	at org.junit.runners.ParentRunner$3.run(ParentRunner.java:238)
	at org.junit.runners.ParentRunner$1.schedule(ParentRunner.java:63)
	at org.junit.runners.ParentRunner.runChildren(ParentRunner.java:236)
	at org.junit.runners.ParentRunner.access$000(ParentRunner.java:53)
	at org.junit.runners.ParentRunner$2.evaluate(ParentRunner.java:229)
	at org.junit.runners.ParentRunner.run(ParentRunner.java:309)
	at org.apache.maven.surefire.junit4.JUnit4TestSet.execute(JUnit4TestSet.java:53)
	at org.apache.maven.surefire.junit4.JUnit4Provider.executeTestSet(JUnit4Provider.java:123)
	at org.apache.maven.surefire.junit4.JUnit4Provider.invoke(JUnit4Provider.java:104)
	at sun.reflect.NativeMethodAccessorImpl.invoke0(Native Method)
	at sun.reflect.NativeMethodAccessorImpl.invoke(NativeMethodAccessorImpl.java:62)
	at sun.reflect.DelegatingMethodAccessorImpl.invoke(DelegatingMethodAccessorImpl.java:43)
	at java.lang.reflect.Method.invoke(Method.java:498)
	at org.apache.maven.surefire.util.ReflectionUtils.invokeMethodWithArray(ReflectionUtils.java:164)
	at org.apache.maven.surefire.booter.ProviderFactory$ProviderProxy.invoke(ProviderFactory.java:110)
	at org.apache.maven.surefire.booter.SurefireStarter.invokeProvider(SurefireStarter.java:175)
	at org.apache.maven.surefire.booter.SurefireStarter.runSuitesInProcess(SurefireStarter.java:123)
	at org.eclipse.tycho.surefire.osgibooter.OsgiSurefireBooter.run(OsgiSurefireBooter.java:86)
	at org.eclipse.tycho.surefire.osgibooter.AbstractUITestApplication.runTests(AbstractUITestApplication.java:44)
	at org.eclipse.ui.internal.testing.WorkbenchTestable$1.run(WorkbenchTestable.java:71)
	at java.lang.Thread.run(Thread.java:748)

Exception on execution: org.eclipse.emf.emfstore.internal.server.exceptions.InvalidVersionSpecException: Walked too far, invalid path.
	at org.eclipse.emf.emfstore.internal.server.core.subinterfaces.VersionSubInterfaceImpl.getVersions(VersionSubInterfaceImpl.java:892)
	at org.eclipse.emf.emfstore.internal.server.core.subinterfaces.HistorySubInterfaceImpl.handlePathQuery(HistorySubInterfaceImpl.java:240)
	at org.eclipse.emf.emfstore.internal.server.core.subinterfaces.HistorySubInterfaceImpl.getHistoryInfo(HistorySubInterfaceImpl.java:204)
	at sun.reflect.GeneratedMethodAccessor22.invoke(Unknown Source)
	at sun.reflect.DelegatingMethodAccessorImpl.invoke(DelegatingMethodAccessorImpl.java:43)
	at java.lang.reflect.Method.invoke(Method.java:498)
	at org.eclipse.emf.emfstore.internal.server.core.AbstractSubEmfstoreInterface.execute(AbstractSubEmfstoreInterface.java:142)
	at org.eclipse.emf.emfstore.internal.server.core.EMFStoreImpl.invoke(EMFStoreImpl.java:181)
	at com.sun.proxy.$Proxy22.getHistoryInfo(Unknown Source)
	at org.eclipse.emf.emfstore.client.test.common.mocks.ConnectionMock.getHistoryInfo(ConnectionMock.java:165)
	at org.eclipse.emf.emfstore.internal.client.model.impl.api.ESRemoteProjectImpl$8$1.run(ESRemoteProjectImpl.java:255)
	at org.eclipse.emf.emfstore.internal.client.model.impl.api.ESRemoteProjectImpl$8$1.run(ESRemoteProjectImpl.java:1)
	at org.eclipse.emf.emfstore.internal.client.model.connectionmanager.ServerCall.run(ServerCall.java:250)
	at org.eclipse.emf.emfstore.internal.client.model.connectionmanager.SessionManager.executeCall(SessionManager.java:151)
	at org.eclipse.emf.emfstore.internal.client.model.connectionmanager.SessionManager.execute(SessionManager.java:70)
	at org.eclipse.emf.emfstore.internal.client.model.connectionmanager.ServerCall.execute(ServerCall.java:270)
	at org.eclipse.emf.emfstore.internal.client.model.impl.api.ESRemoteProjectImpl$8.call(ESRemoteProjectImpl.java:260)
	at org.eclipse.emf.emfstore.internal.client.model.impl.api.ESRemoteProjectImpl$8.call(ESRemoteProjectImpl.java:1)
	at org.eclipse.emf.emfstore.client.util.RunESCommand$WithException$1.doRun(RunESCommand.java:61)
	at org.eclipse.emf.emfstore.internal.client.model.util.EMFStoreCommandWithResult.commandBody(EMFStoreCommandWithResult.java:31)
	at org.eclipse.emf.emfstore.internal.client.model.util.AbstractEMFStoreCommand.execute(AbstractEMFStoreCommand.java:64)
	at org.eclipse.emf.emfstore.internal.client.transaction.EMFStoreTransactionalCommandStack$1.doExecute(EMFStoreTransactionalCommandStack.java:61)
	at org.eclipse.emf.transaction.RecordingCommand.execute(RecordingCommand.java:135)
	at org.eclipse.emf.common.command.BasicCommandStack.execute(BasicCommandStack.java:78)
	at org.eclipse.emf.transaction.impl.AbstractTransactionalCommandStack.basicExecute(AbstractTransactionalCommandStack.java:241)
	at org.eclipse.emf.emfstore.internal.client.transaction.EMFStoreTransactionalCommandStack.basicExecute(EMFStoreTransactionalCommandStack.java:160)
	at org.eclipse.emf.transaction.impl.TransactionalCommandStackImpl.doExecute(TransactionalCommandStackImpl.java:63)
	at org.eclipse.emf.transaction.impl.AbstractTransactionalCommandStack.execute(AbstractTransactionalCommandStack.java:165)
	at org.eclipse.emf.transaction.impl.AbstractTransactionalCommandStack.execute(AbstractTransactionalCommandStack.java:219)
	at org.eclipse.emf.emfstore.internal.client.transaction.EMFStoreTransactionalCommandStack.runEMFStoreCommand(EMFStoreTransactionalCommandStack.java:64)
	at org.eclipse.emf.emfstore.internal.client.transaction.EMFStoreTransactionalCommandStack.execute(EMFStoreTransactionalCommandStack.java:49)
	at org.eclipse.emf.emfstore.internal.client.model.util.AbstractEMFStoreCommand.aRun(AbstractEMFStoreCommand.java:108)
	at org.eclipse.emf.emfstore.internal.client.model.util.EMFStoreCommandWithResult.run(EMFStoreCommandWithResult.java:59)
	at org.eclipse.emf.emfstore.client.util.RunESCommand$WithException.runWithResult(RunESCommand.java:78)
	at org.eclipse.emf.emfstore.internal.client.model.impl.api.ESRemoteProjectImpl.getHistoryInfos(ESRemoteProjectImpl.java:246)
	at org.eclipse.emf.emfstore.internal.client.model.impl.api.ESLocalProjectImpl$31.call(ESLocalProjectImpl.java:837)
	at org.eclipse.emf.emfstore.internal.client.model.impl.api.ESLocalProjectImpl$31.call(ESLocalProjectImpl.java:1)
	at org.eclipse.emf.emfstore.client.util.RunESCommand$WithException$1.doRun(RunESCommand.java:61)
	at org.eclipse.emf.emfstore.internal.client.model.util.EMFStoreCommandWithResult.commandBody(EMFStoreCommandWithResult.java:31)
	at org.eclipse.emf.emfstore.internal.client.model.util.AbstractEMFStoreCommand.execute(AbstractEMFStoreCommand.java:64)
	at org.eclipse.emf.emfstore.internal.client.transaction.EMFStoreTransactionalCommandStack$1.doExecute(EMFStoreTransactionalCommandStack.java:61)
	at org.eclipse.emf.transaction.RecordingCommand.execute(RecordingCommand.java:135)
	at org.eclipse.emf.common.command.BasicCommandStack.execute(BasicCommandStack.java:78)
	at org.eclipse.emf.transaction.impl.AbstractTransactionalCommandStack.basicExecute(AbstractTransactionalCommandStack.java:241)
	at org.eclipse.emf.emfstore.internal.client.transaction.EMFStoreTransactionalCommandStack.basicExecute(EMFStoreTransactionalCommandStack.java:160)
	at org.eclipse.emf.transaction.impl.TransactionalCommandStackImpl.doExecute(TransactionalCommandStackImpl.java:63)
	at org.eclipse.emf.transaction.impl.AbstractTransactionalCommandStack.execute(AbstractTransactionalCommandStack.java:165)
	at org.eclipse.emf.transaction.impl.AbstractTransactionalCommandStack.execute(AbstractTransactionalCommandStack.java:219)
	at org.eclipse.emf.emfstore.internal.client.transaction.EMFStoreTransactionalCommandStack.runEMFStoreCommand(EMFStoreTransactionalCommandStack.java:64)
	at org.eclipse.emf.emfstore.internal.client.transaction.EMFStoreTransactionalCommandStack.execute(EMFStoreTransactionalCommandStack.java:49)
	at org.eclipse.emf.emfstore.internal.client.model.util.AbstractEMFStoreCommand.aRun(AbstractEMFStoreCommand.java:108)
	at org.eclipse.emf.emfstore.internal.client.model.util.EMFStoreCommandWithResult.run(EMFStoreCommandWithResult.java:59)
	at org.eclipse.emf.emfstore.client.util.RunESCommand$WithException.runWithResult(RunESCommand.java:78)
	at org.eclipse.emf.emfstore.internal.client.model.impl.api.ESLocalProjectImpl.getHistoryInfos(ESLocalProjectImpl.java:835)
	at org.eclipse.emf.emfstore.server.test.HistoryAPITests.invalidPathQuery(HistoryAPITests.java:361)
	at sun.reflect.NativeMethodAccessorImpl.invoke0(Native Method)
	at sun.reflect.NativeMethodAccessorImpl.invoke(NativeMethodAccessorImpl.java:62)
	at sun.reflect.DelegatingMethodAccessorImpl.invoke(DelegatingMethodAccessorImpl.java:43)
	at java.lang.reflect.Method.invoke(Method.java:498)
	at org.junit.runners.model.FrameworkMethod$1.runReflectiveCall(FrameworkMethod.java:47)
	at org.junit.internal.runners.model.ReflectiveCallable.run(ReflectiveCallable.java:12)
	at org.junit.runners.model.FrameworkMethod.invokeExplosively(FrameworkMethod.java:44)
	at org.junit.internal.runners.statements.InvokeMethod.evaluate(InvokeMethod.java:17)
	at org.junit.internal.runners.statements.ExpectException.evaluate(ExpectException.java:19)
	at org.junit.runners.ParentRunner.runLeaf(ParentRunner.java:271)
	at org.junit.runners.BlockJUnit4ClassRunner.runChild(BlockJUnit4ClassRunner.java:70)
	at org.junit.runners.BlockJUnit4ClassRunner.runChild(BlockJUnit4ClassRunner.java:50)
	at org.junit.runners.ParentRunner$3.run(ParentRunner.java:238)
	at org.junit.runners.ParentRunner$1.schedule(ParentRunner.java:63)
	at org.junit.runners.ParentRunner.runChildren(ParentRunner.java:236)
	at org.junit.runners.ParentRunner.access$000(ParentRunner.java:53)
	at org.junit.runners.ParentRunner$2.evaluate(ParentRunner.java:229)
	at org.junit.internal.runners.statements.RunBefores.evaluate(RunBefores.java:26)
	at org.junit.internal.runners.statements.RunAfters.evaluate(RunAfters.java:27)
	at org.junit.runners.ParentRunner.run(ParentRunner.java:309)
	at org.junit.runners.Suite.runChild(Suite.java:127)
	at org.junit.runners.Suite.runChild(Suite.java:26)
	at org.junit.runners.ParentRunner$3.run(ParentRunner.java:238)
	at org.junit.runners.ParentRunner$1.schedule(ParentRunner.java:63)
	at org.junit.runners.ParentRunner.runChildren(ParentRunner.java:236)
	at org.junit.runners.ParentRunner.access$000(ParentRunner.java:53)
	at org.junit.runners.ParentRunner$2.evaluate(ParentRunner.java:229)
	at org.junit.runners.ParentRunner.run(ParentRunner.java:309)
	at org.junit.runners.Suite.runChild(Suite.java:127)
	at org.junit.runners.Suite.runChild(Suite.java:26)
	at org.junit.runners.ParentRunner$3.run(ParentRunner.java:238)
	at org.junit.runners.ParentRunner$1.schedule(ParentRunner.java:63)
	at org.junit.runners.ParentRunner.runChildren(ParentRunner.java:236)
	at org.junit.runners.ParentRunner.access$000(ParentRunner.java:53)
	at org.junit.runners.ParentRunner$2.evaluate(ParentRunner.java:229)
	at org.junit.runners.ParentRunner.run(ParentRunner.java:309)
	at org.apache.maven.surefire.junit4.JUnit4TestSet.execute(JUnit4TestSet.java:53)
	at org.apache.maven.surefire.junit4.JUnit4Provider.executeTestSet(JUnit4Provider.java:123)
	at org.apache.maven.surefire.junit4.JUnit4Provider.invoke(JUnit4Provider.java:104)
	at sun.reflect.NativeMethodAccessorImpl.invoke0(Native Method)
	at sun.reflect.NativeMethodAccessorImpl.invoke(NativeMethodAccessorImpl.java:62)
	at sun.reflect.DelegatingMethodAccessorImpl.invoke(DelegatingMethodAccessorImpl.java:43)
	at java.lang.reflect.Method.invoke(Method.java:498)
	at org.apache.maven.surefire.util.ReflectionUtils.invokeMethodWithArray(ReflectionUtils.java:164)
	at org.apache.maven.surefire.booter.ProviderFactory$ProviderProxy.invoke(ProviderFactory.java:110)
	at org.apache.maven.surefire.booter.SurefireStarter.invokeProvider(SurefireStarter.java:175)
	at org.apache.maven.surefire.booter.SurefireStarter.runSuitesInProcess(SurefireStarter.java:123)
	at org.eclipse.tycho.surefire.osgibooter.OsgiSurefireBooter.run(OsgiSurefireBooter.java:86)
	at org.eclipse.tycho.surefire.osgibooter.AbstractUITestApplication.runTests(AbstractUITestApplication.java:44)
	at org.eclipse.ui.internal.testing.WorkbenchTestable$1.run(WorkbenchTestable.java:71)
	at java.lang.Thread.run(Thread.java:748)

Exception on execution: org.eclipse.emf.emfstore.internal.server.exceptions.InvalidVersionSpecException: Walked too far, invalid path.
	at org.eclipse.emf.emfstore.internal.server.core.subinterfaces.VersionSubInterfaceImpl.getVersions(VersionSubInterfaceImpl.java:892)
	at org.eclipse.emf.emfstore.internal.server.core.subinterfaces.HistorySubInterfaceImpl.handlePathQuery(HistorySubInterfaceImpl.java:240)
	at org.eclipse.emf.emfstore.internal.server.core.subinterfaces.HistorySubInterfaceImpl.getHistoryInfo(HistorySubInterfaceImpl.java:204)
	at sun.reflect.GeneratedMethodAccessor22.invoke(Unknown Source)
	at sun.reflect.DelegatingMethodAccessorImpl.invoke(DelegatingMethodAccessorImpl.java:43)
	at java.lang.reflect.Method.invoke(Method.java:498)
	at org.eclipse.emf.emfstore.internal.server.core.AbstractSubEmfstoreInterface.execute(AbstractSubEmfstoreInterface.java:142)
	at org.eclipse.emf.emfstore.internal.server.core.EMFStoreImpl.invoke(EMFStoreImpl.java:181)
	at com.sun.proxy.$Proxy22.getHistoryInfo(Unknown Source)
	at org.eclipse.emf.emfstore.client.test.common.mocks.ConnectionMock.getHistoryInfo(ConnectionMock.java:165)
	at org.eclipse.emf.emfstore.internal.client.model.impl.api.ESRemoteProjectImpl$8$1.run(ESRemoteProjectImpl.java:255)
	at org.eclipse.emf.emfstore.internal.client.model.impl.api.ESRemoteProjectImpl$8$1.run(ESRemoteProjectImpl.java:1)
	at org.eclipse.emf.emfstore.internal.client.model.connectionmanager.ServerCall.run(ServerCall.java:250)
	at org.eclipse.emf.emfstore.internal.client.model.connectionmanager.SessionManager.executeCall(SessionManager.java:151)
	at org.eclipse.emf.emfstore.internal.client.model.connectionmanager.SessionManager.execute(SessionManager.java:70)
	at org.eclipse.emf.emfstore.internal.client.model.connectionmanager.ServerCall.execute(ServerCall.java:270)
	at org.eclipse.emf.emfstore.internal.client.model.impl.api.ESRemoteProjectImpl$8.call(ESRemoteProjectImpl.java:260)
	at org.eclipse.emf.emfstore.internal.client.model.impl.api.ESRemoteProjectImpl$8.call(ESRemoteProjectImpl.java:1)
	at org.eclipse.emf.emfstore.client.util.RunESCommand$WithException$1.doRun(RunESCommand.java:61)
	at org.eclipse.emf.emfstore.internal.client.model.util.EMFStoreCommandWithResult.commandBody(EMFStoreCommandWithResult.java:31)
	at org.eclipse.emf.emfstore.internal.client.model.util.AbstractEMFStoreCommand.execute(AbstractEMFStoreCommand.java:64)
	at org.eclipse.emf.emfstore.internal.client.transaction.EMFStoreTransactionalCommandStack$1.doExecute(EMFStoreTransactionalCommandStack.java:61)
	at org.eclipse.emf.transaction.RecordingCommand.execute(RecordingCommand.java:135)
	at org.eclipse.emf.common.command.BasicCommandStack.execute(BasicCommandStack.java:78)
	at org.eclipse.emf.transaction.impl.AbstractTransactionalCommandStack.basicExecute(AbstractTransactionalCommandStack.java:241)
	at org.eclipse.emf.emfstore.internal.client.transaction.EMFStoreTransactionalCommandStack.basicExecute(EMFStoreTransactionalCommandStack.java:160)
	at org.eclipse.emf.transaction.impl.TransactionalCommandStackImpl.doExecute(TransactionalCommandStackImpl.java:63)
	at org.eclipse.emf.transaction.impl.AbstractTransactionalCommandStack.execute(AbstractTransactionalCommandStack.java:165)
	at org.eclipse.emf.transaction.impl.AbstractTransactionalCommandStack.execute(AbstractTransactionalCommandStack.java:219)
	at org.eclipse.emf.emfstore.internal.client.transaction.EMFStoreTransactionalCommandStack.runEMFStoreCommand(EMFStoreTransactionalCommandStack.java:64)
	at org.eclipse.emf.emfstore.internal.client.transaction.EMFStoreTransactionalCommandStack.execute(EMFStoreTransactionalCommandStack.java:49)
	at org.eclipse.emf.emfstore.internal.client.model.util.AbstractEMFStoreCommand.aRun(AbstractEMFStoreCommand.java:108)
	at org.eclipse.emf.emfstore.internal.client.model.util.EMFStoreCommandWithResult.run(EMFStoreCommandWithResult.java:59)
	at org.eclipse.emf.emfstore.client.util.RunESCommand$WithException.runWithResult(RunESCommand.java:78)
	at org.eclipse.emf.emfstore.internal.client.model.impl.api.ESRemoteProjectImpl.getHistoryInfos(ESRemoteProjectImpl.java:246)
	at org.eclipse.emf.emfstore.internal.client.model.impl.api.ESLocalProjectImpl$31.call(ESLocalProjectImpl.java:837)
	at org.eclipse.emf.emfstore.internal.client.model.impl.api.ESLocalProjectImpl$31.call(ESLocalProjectImpl.java:1)
	at org.eclipse.emf.emfstore.client.util.RunESCommand$WithException$1.doRun(RunESCommand.java:61)
	at org.eclipse.emf.emfstore.internal.client.model.util.EMFStoreCommandWithResult.commandBody(EMFStoreCommandWithResult.java:31)
	at org.eclipse.emf.emfstore.internal.client.model.util.AbstractEMFStoreCommand.execute(AbstractEMFStoreCommand.java:64)
	at org.eclipse.emf.emfstore.internal.client.transaction.EMFStoreTransactionalCommandStack$1.doExecute(EMFStoreTransactionalCommandStack.java:61)
	at org.eclipse.emf.transaction.RecordingCommand.execute(RecordingCommand.java:135)
	at org.eclipse.emf.common.command.BasicCommandStack.execute(BasicCommandStack.java:78)
	at org.eclipse.emf.transaction.impl.AbstractTransactionalCommandStack.basicExecute(AbstractTransactionalCommandStack.java:241)
	at org.eclipse.emf.emfstore.internal.client.transaction.EMFStoreTransactionalCommandStack.basicExecute(EMFStoreTransactionalCommandStack.java:160)
	at org.eclipse.emf.transaction.impl.TransactionalCommandStackImpl.doExecute(TransactionalCommandStackImpl.java:63)
	at org.eclipse.emf.transaction.impl.AbstractTransactionalCommandStack.execute(AbstractTransactionalCommandStack.java:165)
	at org.eclipse.emf.transaction.impl.AbstractTransactionalCommandStack.execute(AbstractTransactionalCommandStack.java:219)
	at org.eclipse.emf.emfstore.internal.client.transaction.EMFStoreTransactionalCommandStack.runEMFStoreCommand(EMFStoreTransactionalCommandStack.java:64)
	at org.eclipse.emf.emfstore.internal.client.transaction.EMFStoreTransactionalCommandStack.execute(EMFStoreTransactionalCommandStack.java:49)
	at org.eclipse.emf.emfstore.internal.client.model.util.AbstractEMFStoreCommand.aRun(AbstractEMFStoreCommand.java:108)
	at org.eclipse.emf.emfstore.internal.client.model.util.EMFStoreCommandWithResult.run(EMFStoreCommandWithResult.java:59)
	at org.eclipse.emf.emfstore.client.util.RunESCommand$WithException.runWithResult(RunESCommand.java:78)
	at org.eclipse.emf.emfstore.internal.client.model.impl.api.ESLocalProjectImpl.getHistoryInfos(ESLocalProjectImpl.java:835)
	at org.eclipse.emf.emfstore.server.test.HistoryAPITests.invalidPathQuery(HistoryAPITests.java:361)
	at sun.reflect.NativeMethodAccessorImpl.invoke0(Native Method)
	at sun.reflect.NativeMethodAccessorImpl.invoke(NativeMethodAccessorImpl.java:62)
	at sun.reflect.DelegatingMethodAccessorImpl.invoke(DelegatingMethodAccessorImpl.java:43)
	at java.lang.reflect.Method.invoke(Method.java:498)
	at org.junit.runners.model.FrameworkMethod$1.runReflectiveCall(FrameworkMethod.java:47)
	at org.junit.internal.runners.model.ReflectiveCallable.run(ReflectiveCallable.java:12)
	at org.junit.runners.model.FrameworkMethod.invokeExplosively(FrameworkMethod.java:44)
	at org.junit.internal.runners.statements.InvokeMethod.evaluate(InvokeMethod.java:17)
	at org.junit.internal.runners.statements.ExpectException.evaluate(ExpectException.java:19)
	at org.junit.runners.ParentRunner.runLeaf(ParentRunner.java:271)
	at org.junit.runners.BlockJUnit4ClassRunner.runChild(BlockJUnit4ClassRunner.java:70)
	at org.junit.runners.BlockJUnit4ClassRunner.runChild(BlockJUnit4ClassRunner.java:50)
	at org.junit.runners.ParentRunner$3.run(ParentRunner.java:238)
	at org.junit.runners.ParentRunner$1.schedule(ParentRunner.java:63)
	at org.junit.runners.ParentRunner.runChildren(ParentRunner.java:236)
	at org.junit.runners.ParentRunner.access$000(ParentRunner.java:53)
	at org.junit.runners.ParentRunner$2.evaluate(ParentRunner.java:229)
	at org.junit.internal.runners.statements.RunBefores.evaluate(RunBefores.java:26)
	at org.junit.internal.runners.statements.RunAfters.evaluate(RunAfters.java:27)
	at org.junit.runners.ParentRunner.run(ParentRunner.java:309)
	at org.junit.runners.Suite.runChild(Suite.java:127)
	at org.junit.runners.Suite.runChild(Suite.java:26)
	at org.junit.runners.ParentRunner$3.run(ParentRunner.java:238)
	at org.junit.runners.ParentRunner$1.schedule(ParentRunner.java:63)
	at org.junit.runners.ParentRunner.runChildren(ParentRunner.java:236)
	at org.junit.runners.ParentRunner.access$000(ParentRunner.java:53)
	at org.junit.runners.ParentRunner$2.evaluate(ParentRunner.java:229)
	at org.junit.runners.ParentRunner.run(ParentRunner.java:309)
	at org.junit.runners.Suite.runChild(Suite.java:127)
	at org.junit.runners.Suite.runChild(Suite.java:26)
	at org.junit.runners.ParentRunner$3.run(ParentRunner.java:238)
	at org.junit.runners.ParentRunner$1.schedule(ParentRunner.java:63)
	at org.junit.runners.ParentRunner.runChildren(ParentRunner.java:236)
	at org.junit.runners.ParentRunner.access$000(ParentRunner.java:53)
	at org.junit.runners.ParentRunner$2.evaluate(ParentRunner.java:229)
	at org.junit.runners.ParentRunner.run(ParentRunner.java:309)
	at org.apache.maven.surefire.junit4.JUnit4TestSet.execute(JUnit4TestSet.java:53)
	at org.apache.maven.surefire.junit4.JUnit4Provider.executeTestSet(JUnit4Provider.java:123)
	at org.apache.maven.surefire.junit4.JUnit4Provider.invoke(JUnit4Provider.java:104)
	at sun.reflect.NativeMethodAccessorImpl.invoke0(Native Method)
	at sun.reflect.NativeMethodAccessorImpl.invoke(NativeMethodAccessorImpl.java:62)
	at sun.reflect.DelegatingMethodAccessorImpl.invoke(DelegatingMethodAccessorImpl.java:43)
	at java.lang.reflect.Method.invoke(Method.java:498)
	at org.apache.maven.surefire.util.ReflectionUtils.invokeMethodWithArray(ReflectionUtils.java:164)
	at org.apache.maven.surefire.booter.ProviderFactory$ProviderProxy.invoke(ProviderFactory.java:110)
	at org.apache.maven.surefire.booter.SurefireStarter.invokeProvider(SurefireStarter.java:175)
	at org.apache.maven.surefire.booter.SurefireStarter.runSuitesInProcess(SurefireStarter.java:123)
	at org.eclipse.tycho.surefire.osgibooter.OsgiSurefireBooter.run(OsgiSurefireBooter.java:86)
	at org.eclipse.tycho.surefire.osgibooter.AbstractUITestApplication.runTests(AbstractUITestApplication.java:44)
	at org.eclipse.ui.internal.testing.WorkbenchTestable$1.run(WorkbenchTestable.java:71)
	at java.lang.Thread.run(Thread.java:748)

Exception on execution: org.eclipse.emf.emfstore.internal.server.exceptions.InvalidVersionSpecException: Walked too far, invalid path.
	at org.eclipse.emf.emfstore.internal.server.core.subinterfaces.VersionSubInterfaceImpl.getVersions(VersionSubInterfaceImpl.java:892)
	at org.eclipse.emf.emfstore.internal.server.core.subinterfaces.HistorySubInterfaceImpl.handlePathQuery(HistorySubInterfaceImpl.java:240)
	at org.eclipse.emf.emfstore.internal.server.core.subinterfaces.HistorySubInterfaceImpl.getHistoryInfo(HistorySubInterfaceImpl.java:204)
	at sun.reflect.GeneratedMethodAccessor22.invoke(Unknown Source)
	at sun.reflect.DelegatingMethodAccessorImpl.invoke(DelegatingMethodAccessorImpl.java:43)
	at java.lang.reflect.Method.invoke(Method.java:498)
	at org.eclipse.emf.emfstore.internal.server.core.AbstractSubEmfstoreInterface.execute(AbstractSubEmfstoreInterface.java:142)
	at org.eclipse.emf.emfstore.internal.server.core.EMFStoreImpl.invoke(EMFStoreImpl.java:181)
	at com.sun.proxy.$Proxy22.getHistoryInfo(Unknown Source)
	at org.eclipse.emf.emfstore.client.test.common.mocks.ConnectionMock.getHistoryInfo(ConnectionMock.java:165)
	at org.eclipse.emf.emfstore.internal.client.model.impl.api.ESRemoteProjectImpl$8$1.run(ESRemoteProjectImpl.java:255)
	at org.eclipse.emf.emfstore.internal.client.model.impl.api.ESRemoteProjectImpl$8$1.run(ESRemoteProjectImpl.java:1)
	at org.eclipse.emf.emfstore.internal.client.model.connectionmanager.ServerCall.run(ServerCall.java:250)
	at org.eclipse.emf.emfstore.internal.client.model.connectionmanager.SessionManager.executeCall(SessionManager.java:151)
	at org.eclipse.emf.emfstore.internal.client.model.connectionmanager.SessionManager.execute(SessionManager.java:70)
	at org.eclipse.emf.emfstore.internal.client.model.connectionmanager.ServerCall.execute(ServerCall.java:270)
	at org.eclipse.emf.emfstore.internal.client.model.impl.api.ESRemoteProjectImpl$8.call(ESRemoteProjectImpl.java:260)
	at org.eclipse.emf.emfstore.internal.client.model.impl.api.ESRemoteProjectImpl$8.call(ESRemoteProjectImpl.java:1)
	at org.eclipse.emf.emfstore.client.util.RunESCommand$WithException$1.doRun(RunESCommand.java:61)
	at org.eclipse.emf.emfstore.internal.client.model.util.EMFStoreCommandWithResult.commandBody(EMFStoreCommandWithResult.java:31)
	at org.eclipse.emf.emfstore.internal.client.model.util.AbstractEMFStoreCommand.execute(AbstractEMFStoreCommand.java:64)
	at org.eclipse.emf.emfstore.internal.client.transaction.EMFStoreTransactionalCommandStack$1.doExecute(EMFStoreTransactionalCommandStack.java:61)
	at org.eclipse.emf.transaction.RecordingCommand.execute(RecordingCommand.java:135)
	at org.eclipse.emf.common.command.BasicCommandStack.execute(BasicCommandStack.java:78)
	at org.eclipse.emf.transaction.impl.AbstractTransactionalCommandStack.basicExecute(AbstractTransactionalCommandStack.java:241)
	at org.eclipse.emf.emfstore.internal.client.transaction.EMFStoreTransactionalCommandStack.basicExecute(EMFStoreTransactionalCommandStack.java:160)
	at org.eclipse.emf.transaction.impl.TransactionalCommandStackImpl.doExecute(TransactionalCommandStackImpl.java:63)
	at org.eclipse.emf.transaction.impl.AbstractTransactionalCommandStack.execute(AbstractTransactionalCommandStack.java:165)
	at org.eclipse.emf.transaction.impl.AbstractTransactionalCommandStack.execute(AbstractTransactionalCommandStack.java:219)
	at org.eclipse.emf.emfstore.internal.client.transaction.EMFStoreTransactionalCommandStack.runEMFStoreCommand(EMFStoreTransactionalCommandStack.java:64)
	at org.eclipse.emf.emfstore.internal.client.transaction.EMFStoreTransactionalCommandStack.execute(EMFStoreTransactionalCommandStack.java:49)
	at org.eclipse.emf.emfstore.internal.client.model.util.AbstractEMFStoreCommand.aRun(AbstractEMFStoreCommand.java:108)
	at org.eclipse.emf.emfstore.internal.client.model.util.EMFStoreCommandWithResult.run(EMFStoreCommandWithResult.java:59)
	at org.eclipse.emf.emfstore.client.util.RunESCommand$WithException.runWithResult(RunESCommand.java:78)
	at org.eclipse.emf.emfstore.internal.client.model.impl.api.ESRemoteProjectImpl.getHistoryInfos(ESRemoteProjectImpl.java:246)
	at org.eclipse.emf.emfstore.internal.client.model.impl.api.ESLocalProjectImpl$31.call(ESLocalProjectImpl.java:837)
	at org.eclipse.emf.emfstore.internal.client.model.impl.api.ESLocalProjectImpl$31.call(ESLocalProjectImpl.java:1)
	at org.eclipse.emf.emfstore.client.util.RunESCommand$WithException$1.doRun(RunESCommand.java:61)
	at org.eclipse.emf.emfstore.internal.client.model.util.EMFStoreCommandWithResult.commandBody(EMFStoreCommandWithResult.java:31)
	at org.eclipse.emf.emfstore.internal.client.model.util.AbstractEMFStoreCommand.execute(AbstractEMFStoreCommand.java:64)
	at org.eclipse.emf.emfstore.internal.client.transaction.EMFStoreTransactionalCommandStack$1.doExecute(EMFStoreTransactionalCommandStack.java:61)
	at org.eclipse.emf.transaction.RecordingCommand.execute(RecordingCommand.java:135)
	at org.eclipse.emf.common.command.BasicCommandStack.execute(BasicCommandStack.java:78)
	at org.eclipse.emf.transaction.impl.AbstractTransactionalCommandStack.basicExecute(AbstractTransactionalCommandStack.java:241)
	at org.eclipse.emf.emfstore.internal.client.transaction.EMFStoreTransactionalCommandStack.basicExecute(EMFStoreTransactionalCommandStack.java:160)
	at org.eclipse.emf.transaction.impl.TransactionalCommandStackImpl.doExecute(TransactionalCommandStackImpl.java:63)
	at org.eclipse.emf.transaction.impl.AbstractTransactionalCommandStack.execute(AbstractTransactionalCommandStack.java:165)
	at org.eclipse.emf.transaction.impl.AbstractTransactionalCommandStack.execute(AbstractTransactionalCommandStack.java:219)
	at org.eclipse.emf.emfstore.internal.client.transaction.EMFStoreTransactionalCommandStack.runEMFStoreCommand(EMFStoreTransactionalCommandStack.java:64)
	at org.eclipse.emf.emfstore.internal.client.transaction.EMFStoreTransactionalCommandStack.execute(EMFStoreTransactionalCommandStack.java:49)
	at org.eclipse.emf.emfstore.internal.client.model.util.AbstractEMFStoreCommand.aRun(AbstractEMFStoreCommand.java:108)
	at org.eclipse.emf.emfstore.internal.client.model.util.EMFStoreCommandWithResult.run(EMFStoreCommandWithResult.java:59)
	at org.eclipse.emf.emfstore.client.util.RunESCommand$WithException.runWithResult(RunESCommand.java:78)
	at org.eclipse.emf.emfstore.internal.client.model.impl.api.ESLocalProjectImpl.getHistoryInfos(ESLocalProjectImpl.java:835)
	at org.eclipse.emf.emfstore.server.test.HistoryAPITests.invalidPathQuery(HistoryAPITests.java:361)
	at sun.reflect.NativeMethodAccessorImpl.invoke0(Native Method)
	at sun.reflect.NativeMethodAccessorImpl.invoke(NativeMethodAccessorImpl.java:62)
	at sun.reflect.DelegatingMethodAccessorImpl.invoke(DelegatingMethodAccessorImpl.java:43)
	at java.lang.reflect.Method.invoke(Method.java:498)
	at org.junit.runners.model.FrameworkMethod$1.runReflectiveCall(FrameworkMethod.java:47)
	at org.junit.internal.runners.model.ReflectiveCallable.run(ReflectiveCallable.java:12)
	at org.junit.runners.model.FrameworkMethod.invokeExplosively(FrameworkMethod.java:44)
	at org.junit.internal.runners.statements.InvokeMethod.evaluate(InvokeMethod.java:17)
	at org.junit.internal.runners.statements.ExpectException.evaluate(ExpectException.java:19)
	at org.junit.runners.ParentRunner.runLeaf(ParentRunner.java:271)
	at org.junit.runners.BlockJUnit4ClassRunner.runChild(BlockJUnit4ClassRunner.java:70)
	at org.junit.runners.BlockJUnit4ClassRunner.runChild(BlockJUnit4ClassRunner.java:50)
	at org.junit.runners.ParentRunner$3.run(ParentRunner.java:238)
	at org.junit.runners.ParentRunner$1.schedule(ParentRunner.java:63)
	at org.junit.runners.ParentRunner.runChildren(ParentRunner.java:236)
	at org.junit.runners.ParentRunner.access$000(ParentRunner.java:53)
	at org.junit.runners.ParentRunner$2.evaluate(ParentRunner.java:229)
	at org.junit.internal.runners.statements.RunBefores.evaluate(RunBefores.java:26)
	at org.junit.internal.runners.statements.RunAfters.evaluate(RunAfters.java:27)
	at org.junit.runners.ParentRunner.run(ParentRunner.java:309)
	at org.junit.runners.Suite.runChild(Suite.java:127)
	at org.junit.runners.Suite.runChild(Suite.java:26)
	at org.junit.runners.ParentRunner$3.run(ParentRunner.java:238)
	at org.junit.runners.ParentRunner$1.schedule(ParentRunner.java:63)
	at org.junit.runners.ParentRunner.runChildren(ParentRunner.java:236)
	at org.junit.runners.ParentRunner.access$000(ParentRunner.java:53)
	at org.junit.runners.ParentRunner$2.evaluate(ParentRunner.java:229)
	at org.junit.runners.ParentRunner.run(ParentRunner.java:309)
	at org.junit.runners.Suite.runChild(Suite.java:127)
	at org.junit.runners.Suite.runChild(Suite.java:26)
	at org.junit.runners.ParentRunner$3.run(ParentRunner.java:238)
	at org.junit.runners.ParentRunner$1.schedule(ParentRunner.java:63)
	at org.junit.runners.ParentRunner.runChildren(ParentRunner.java:236)
	at org.junit.runners.ParentRunner.access$000(ParentRunner.java:53)
	at org.junit.runners.ParentRunner$2.evaluate(ParentRunner.java:229)
	at org.junit.runners.ParentRunner.run(ParentRunner.java:309)
	at org.apache.maven.surefire.junit4.JUnit4TestSet.execute(JUnit4TestSet.java:53)
	at org.apache.maven.surefire.junit4.JUnit4Provider.executeTestSet(JUnit4Provider.java:123)
	at org.apache.maven.surefire.junit4.JUnit4Provider.invoke(JUnit4Provider.java:104)
	at sun.reflect.NativeMethodAccessorImpl.invoke0(Native Method)
	at sun.reflect.NativeMethodAccessorImpl.invoke(NativeMethodAccessorImpl.java:62)
	at sun.reflect.DelegatingMethodAccessorImpl.invoke(DelegatingMethodAccessorImpl.java:43)
	at java.lang.reflect.Method.invoke(Method.java:498)
	at org.apache.maven.surefire.util.ReflectionUtils.invokeMethodWithArray(ReflectionUtils.java:164)
	at org.apache.maven.surefire.booter.ProviderFactory$ProviderProxy.invoke(ProviderFactory.java:110)
	at org.apache.maven.surefire.booter.SurefireStarter.invokeProvider(SurefireStarter.java:175)
	at org.apache.maven.surefire.booter.SurefireStarter.runSuitesInProcess(SurefireStarter.java:123)
	at org.eclipse.tycho.surefire.osgibooter.OsgiSurefireBooter.run(OsgiSurefireBooter.java:86)
	at org.eclipse.tycho.surefire.osgibooter.AbstractUITestApplication.runTests(AbstractUITestApplication.java:44)
	at org.eclipse.ui.internal.testing.WorkbenchTestable$1.run(WorkbenchTestable.java:71)
	at java.lang.Thread.run(Thread.java:748)

Total time for commit: 1
Total time for commit: 1
Total time for commit: 1
Total time for commit: 1
Total time for commit: 1
Total time for commit: 1
Total time for commit: 1
Total time for commit: 1
Total time for commit: 1
Total time for commit: 1
Total time for commit: 1
Total time for commit: 1
Total time for commit: 0
Total time for commit: 0
Total time for commit: 0
Total time for commit: 0
Total time for commit: 1
Total time for commit: 1
Total time for commit: 1
Total time for commit: 1
Total time for commit: 1
Total time for commit: 1
Total time for commit: 1
Total time for commit: 1
Total time for commit: 1
Total time for commit: 1
Total time for commit: 1
Total time for commit: 1
Total time for commit: 1
Total time for commit: 1
Total time for commit: 1
Total time for commit: 1
Total time for commit: 1
Total time for commit: 1
Total time for commit: 1
Total time for commit: 1
Total time for commit: 1
Total time for commit: 1
Total time for commit: 1
Total time for commit: 1
Total time for commit: 0
Total time for commit: 0
Total time for commit: 0
Total time for commit: 0
Total time for commit: 1
Total time for commit: 1
Total time for commit: 1
Total time for commit: 1
Total time for commit: 1
Total time for commit: 1
Total time for commit: 1
Total time for commit: 1
Total time for commit: 1
Total time for commit: 1
Total time for commit: 1
Total time for commit: 1
Server was stopped.
Server was stopped.
Server was stopped.
Server was stopped.
Property file read. (/home/jenkins/agent/workspace/gerrit/tests/org.eclipse.emf.emfstore.server.test/target/work/data/profiles/default_test/./conf/es.properties)
Property file read. (/home/jenkins/agent/workspace/gerrit/tests/org.eclipse.emf.emfstore.server.test/target/work/data/profiles/default_test/./conf/es.properties)
Property file read. (/home/jenkins/agent/workspace/gerrit/tests/org.eclipse.emf.emfstore.server.test/target/work/data/profiles/default_test/./conf/es.properties)
Property file read. (/home/jenkins/agent/workspace/gerrit/tests/org.eclipse.emf.emfstore.server.test/target/work/data/profiles/default_test/./conf/es.properties)
added superuser super
added superuser super
added superuser super
added superuser super
Total time for commit: 0
Total time for commit: 0
Total time for commit: 0
Total time for commit: 0
Exception on execution: No branch info available.
Exception on execution: No branch info available.
Exception on execution: No branch info available.
Exception on execution: No branch info available.
Exception on execution: No branch info available.
Exception on execution: No branch info available.
Exception on execution: No branch info available.
Exception on execution: No branch info available.
Total time for commit: 0
Total time for commit: 0
Total time for commit: 0
Total time for commit: 0
Exception on execution: No branch info available.
Exception on execution: No branch info available.
Exception on execution: No branch info available.
Exception on execution: No branch info available.
Exception on execution: No branch info available.
Exception on execution: No branch info available.
Exception on execution: No branch info available.
Exception on execution: No branch info available.
Total time for commit: 1
Total time for commit: 1
Total time for commit: 1
Total time for commit: 1
Total time for commit: 1
Total time for commit: 1
Total time for commit: 1
Total time for commit: 1
Total time for commit: 1
Total time for commit: 1
Total time for commit: 1
Total time for commit: 1
Exception on execution: No branch info available.
Exception on execution: No branch info available.
Exception on execution: No branch info available.
Exception on execution: No branch info available.
Exception on execution: No branch info available.
Exception on execution: No branch info available.
Exception on execution: No branch info available.
Exception on execution: No branch info available.
Total time for commit: 1
Total time for commit: 1
Total time for commit: 1
Total time for commit: 1
Total time for commit: 1
Total time for commit: 1
Total time for commit: 1
Total time for commit: 1
Total time for commit: 0
Total time for commit: 0
Total time for commit: 0
Total time for commit: 0
Exception on execution: No branch info available.
Exception on execution: No branch info available.
Exception on execution: No branch info available.
Exception on execution: No branch info available.
Exception on execution: No branch info available.
Exception on execution: No branch info available.
Exception on execution: No branch info available.
Exception on execution: No branch info available.
Total time for commit: 0
Total time for commit: 0
Total time for commit: 0
Total time for commit: 0
Exception on execution: No branch info available.
Exception on execution: No branch info available.
Exception on execution: No branch info available.
Exception on execution: No branch info available.
Exception on execution: No branch info available.
Exception on execution: No branch info available.
Exception on execution: No branch info available.
Exception on execution: No branch info available.
Total time for commit: 1
Total time for commit: 1
Total time for commit: 1
Total time for commit: 1
Total time for commit: 1
Total time for commit: 1
Total time for commit: 1
Total time for commit: 1
Total time for commit: 1
Total time for commit: 1
Total time for commit: 1
Total time for commit: 1
Exception on execution: No branch info available.
Exception on execution: No branch info available.
Exception on execution: No branch info available.
Exception on execution: No branch info available.
Exception on execution: No branch info available.
Exception on execution: No branch info available.
Exception on execution: No branch info available.
Exception on execution: No branch info available.
Total time for commit: 1
Total time for commit: 1
Total time for commit: 1
Total time for commit: 1
Total time for commit: 1
Total time for commit: 1
Total time for commit: 1
Total time for commit: 1
Total time for commit: 1
Total time for commit: 1
Total time for commit: 1
Total time for commit: 1
Exception on execution: No branch info available.
Exception on execution: No branch info available.
Exception on execution: No branch info available.
Exception on execution: No branch info available.
Exception on execution: No branch info available.
Exception on execution: No branch info available.
Exception on execution: No branch info available.
Exception on execution: No branch info available.
Total time for commit: 0
Total time for commit: 0
Total time for commit: 0
Total time for commit: 0
Exception on execution: No branch info available.
Exception on execution: No branch info available.
Exception on execution: No branch info available.
Exception on execution: No branch info available.
Exception on execution: No branch info available.
Exception on execution: No branch info available.
Exception on execution: No branch info available.
Exception on execution: No branch info available.
Total time for commit: 0
Total time for commit: 0
Total time for commit: 0
Total time for commit: 0
Total time for commit: 1
Total time for commit: 1
Total time for commit: 1
Total time for commit: 1
Total time for commit: 0
Total time for commit: 0
Total time for commit: 0
Total time for commit: 0
Exception on execution: No branch info available.
Exception on execution: No branch info available.
Exception on execution: No branch info available.
Exception on execution: No branch info available.
Exception on execution: No branch info available.
Exception on execution: No branch info available.
Exception on execution: No branch info available.
Exception on execution: No branch info available.
Total time for commit: 0
Total time for commit: 0
Total time for commit: 0
Total time for commit: 0
Total time for commit: 25
Total time for commit: 25
Total time for commit: 25
Total time for commit: 25
Total time for commit: 1
Total time for commit: 1
Total time for commit: 1
Total time for commit: 1
Total time for commit: 1
Total time for commit: 1
Total time for commit: 1
Total time for commit: 1
Exception on execution: No branch info available.
Exception on execution: No branch info available.
Exception on execution: No branch info available.
Exception on execution: No branch info available.
Exception on execution: No branch info available.
Exception on execution: No branch info available.
Exception on execution: No branch info available.
Exception on execution: No branch info available.
Total time for commit: 1
Total time for commit: 1
Total time for commit: 1
Total time for commit: 1
Exception on execution: No branch info available.
Exception on execution: No branch info available.
Exception on execution: No branch info available.
Exception on execution: No branch info available.
Exception on execution: No branch info available.
Exception on execution: No branch info available.
Exception on execution: No branch info available.
Exception on execution: No branch info available.
Total time for commit: 1
Total time for commit: 1
Total time for commit: 1
Total time for commit: 1
Total time for commit: 2
Total time for commit: 2
Total time for commit: 2
Total time for commit: 2
Total time for commit: 2
Total time for commit: 2
Total time for commit: 2
Total time for commit: 2
Exception on execution: No branch info available.
Exception on execution: No branch info available.
Exception on execution: No branch info available.
Exception on execution: No branch info available.
Exception on execution: No branch info available.
Exception on execution: No branch info available.
Exception on execution: No branch info available.
Exception on execution: No branch info available.
Total time for commit: 1
Total time for commit: 1
Total time for commit: 1
Total time for commit: 1
Total time for commit: 1
Total time for commit: 1
Total time for commit: 1
Total time for commit: 1
Exception on execution: org.eclipse.emf.emfstore.internal.server.exceptions.InvalidVersionSpecException: Head version could not be resolved.
	at org.eclipse.emf.emfstore.internal.server.core.subinterfaces.VersionSubInterfaceImpl.resolveHeadVersionSpec(VersionSubInterfaceImpl.java:213)
	at org.eclipse.emf.emfstore.internal.server.core.subinterfaces.VersionSubInterfaceImpl.resolveVersionSpec(VersionSubInterfaceImpl.java:118)
	at sun.reflect.GeneratedMethodAccessor19.invoke(Unknown Source)
	at sun.reflect.DelegatingMethodAccessorImpl.invoke(DelegatingMethodAccessorImpl.java:43)
	at java.lang.reflect.Method.invoke(Method.java:498)
	at org.eclipse.emf.emfstore.internal.server.core.AbstractSubEmfstoreInterface.execute(AbstractSubEmfstoreInterface.java:142)
	at org.eclipse.emf.emfstore.internal.server.core.EMFStoreImpl.invoke(EMFStoreImpl.java:181)
	at com.sun.proxy.$Proxy22.resolveVersionSpec(Unknown Source)
	at org.eclipse.emf.emfstore.client.test.common.mocks.ConnectionMock.resolveVersionSpec(ConnectionMock.java:138)
	at org.eclipse.emf.emfstore.internal.client.model.impl.ProjectSpaceBase$6.run(ProjectSpaceBase.java:1233)
	at org.eclipse.emf.emfstore.internal.client.model.impl.ProjectSpaceBase$6.run(ProjectSpaceBase.java:1)
	at org.eclipse.emf.emfstore.internal.client.model.connectionmanager.ServerCall.run(ServerCall.java:250)
	at org.eclipse.emf.emfstore.internal.client.model.connectionmanager.SessionManager.executeCall(SessionManager.java:151)
	at org.eclipse.emf.emfstore.internal.client.model.connectionmanager.SessionManager.execute(SessionManager.java:70)
	at org.eclipse.emf.emfstore.internal.client.model.connectionmanager.ServerCall.execute(ServerCall.java:270)
	at org.eclipse.emf.emfstore.internal.client.model.impl.ProjectSpaceBase.resolveVersionSpec(ProjectSpaceBase.java:1238)
	at org.eclipse.emf.emfstore.server.test.VersionSpecTests.resolveIllegalHead(VersionSpecTests.java:215)
	at sun.reflect.NativeMethodAccessorImpl.invoke0(Native Method)
	at sun.reflect.NativeMethodAccessorImpl.invoke(NativeMethodAccessorImpl.java:62)
	at sun.reflect.DelegatingMethodAccessorImpl.invoke(DelegatingMethodAccessorImpl.java:43)
	at java.lang.reflect.Method.invoke(Method.java:498)
	at org.junit.runners.model.FrameworkMethod$1.runReflectiveCall(FrameworkMethod.java:47)
	at org.junit.internal.runners.model.ReflectiveCallable.run(ReflectiveCallable.java:12)
	at org.junit.runners.model.FrameworkMethod.invokeExplosively(FrameworkMethod.java:44)
	at org.junit.internal.runners.statements.InvokeMethod.evaluate(InvokeMethod.java:17)
	at org.junit.internal.runners.statements.ExpectException.evaluate(ExpectException.java:19)
	at org.junit.internal.runners.statements.RunBefores.evaluate(RunBefores.java:26)
	at org.junit.internal.runners.statements.RunAfters.evaluate(RunAfters.java:27)
	at org.junit.runners.ParentRunner.runLeaf(ParentRunner.java:271)
	at org.junit.runners.BlockJUnit4ClassRunner.runChild(BlockJUnit4ClassRunner.java:70)
	at org.junit.runners.BlockJUnit4ClassRunner.runChild(BlockJUnit4ClassRunner.java:50)
	at org.junit.runners.ParentRunner$3.run(ParentRunner.java:238)
	at org.junit.runners.ParentRunner$1.schedule(ParentRunner.java:63)
	at org.junit.runners.ParentRunner.runChildren(ParentRunner.java:236)
	at org.junit.runners.ParentRunner.access$000(ParentRunner.java:53)
	at org.junit.runners.ParentRunner$2.evaluate(ParentRunner.java:229)
	at org.junit.internal.runners.statements.RunBefores.evaluate(RunBefores.java:26)
	at org.junit.internal.runners.statements.RunAfters.evaluate(RunAfters.java:27)
	at org.junit.runners.ParentRunner.run(ParentRunner.java:309)
	at org.junit.runners.Suite.runChild(Suite.java:127)
	at org.junit.runners.Suite.runChild(Suite.java:26)
	at org.junit.runners.ParentRunner$3.run(ParentRunner.java:238)
	at org.junit.runners.ParentRunner$1.schedule(ParentRunner.java:63)
	at org.junit.runners.ParentRunner.runChildren(ParentRunner.java:236)
	at org.junit.runners.ParentRunner.access$000(ParentRunner.java:53)
	at org.junit.runners.ParentRunner$2.evaluate(ParentRunner.java:229)
	at org.junit.runners.ParentRunner.run(ParentRunner.java:309)
	at org.apache.maven.surefire.junit4.JUnit4TestSet.execute(JUnit4TestSet.java:53)
	at org.apache.maven.surefire.junit4.JUnit4Provider.executeTestSet(JUnit4Provider.java:123)
	at org.apache.maven.surefire.junit4.JUnit4Provider.invoke(JUnit4Provider.java:104)
	at sun.reflect.NativeMethodAccessorImpl.invoke0(Native Method)
	at sun.reflect.NativeMethodAccessorImpl.invoke(NativeMethodAccessorImpl.java:62)
	at sun.reflect.DelegatingMethodAccessorImpl.invoke(DelegatingMethodAccessorImpl.java:43)
	at java.lang.reflect.Method.invoke(Method.java:498)
	at org.apache.maven.surefire.util.ReflectionUtils.invokeMethodWithArray(ReflectionUtils.java:164)
	at org.apache.maven.surefire.booter.ProviderFactory$ProviderProxy.invoke(ProviderFactory.java:110)
	at org.apache.maven.surefire.booter.SurefireStarter.invokeProvider(SurefireStarter.java:175)
	at org.apache.maven.surefire.booter.SurefireStarter.runSuitesInProcess(SurefireStarter.java:123)
	at org.eclipse.tycho.surefire.osgibooter.OsgiSurefireBooter.run(OsgiSurefireBooter.java:86)
	at org.eclipse.tycho.surefire.osgibooter.AbstractUITestApplication.runTests(AbstractUITestApplication.java:44)
	at org.eclipse.ui.internal.testing.WorkbenchTestable$1.run(WorkbenchTestable.java:71)
	at java.lang.Thread.run(Thread.java:748)

Exception on execution: org.eclipse.emf.emfstore.internal.server.exceptions.InvalidVersionSpecException: Head version could not be resolved.
	at org.eclipse.emf.emfstore.internal.server.core.subinterfaces.VersionSubInterfaceImpl.resolveHeadVersionSpec(VersionSubInterfaceImpl.java:213)
	at org.eclipse.emf.emfstore.internal.server.core.subinterfaces.VersionSubInterfaceImpl.resolveVersionSpec(VersionSubInterfaceImpl.java:118)
	at sun.reflect.GeneratedMethodAccessor19.invoke(Unknown Source)
	at sun.reflect.DelegatingMethodAccessorImpl.invoke(DelegatingMethodAccessorImpl.java:43)
	at java.lang.reflect.Method.invoke(Method.java:498)
	at org.eclipse.emf.emfstore.internal.server.core.AbstractSubEmfstoreInterface.execute(AbstractSubEmfstoreInterface.java:142)
	at org.eclipse.emf.emfstore.internal.server.core.EMFStoreImpl.invoke(EMFStoreImpl.java:181)
	at com.sun.proxy.$Proxy22.resolveVersionSpec(Unknown Source)
	at org.eclipse.emf.emfstore.client.test.common.mocks.ConnectionMock.resolveVersionSpec(ConnectionMock.java:138)
	at org.eclipse.emf.emfstore.internal.client.model.impl.ProjectSpaceBase$6.run(ProjectSpaceBase.java:1233)
	at org.eclipse.emf.emfstore.internal.client.model.impl.ProjectSpaceBase$6.run(ProjectSpaceBase.java:1)
	at org.eclipse.emf.emfstore.internal.client.model.connectionmanager.ServerCall.run(ServerCall.java:250)
	at org.eclipse.emf.emfstore.internal.client.model.connectionmanager.SessionManager.executeCall(SessionManager.java:151)
	at org.eclipse.emf.emfstore.internal.client.model.connectionmanager.SessionManager.execute(SessionManager.java:70)
	at org.eclipse.emf.emfstore.internal.client.model.connectionmanager.ServerCall.execute(ServerCall.java:270)
	at org.eclipse.emf.emfstore.internal.client.model.impl.ProjectSpaceBase.resolveVersionSpec(ProjectSpaceBase.java:1238)
	at org.eclipse.emf.emfstore.server.test.VersionSpecTests.resolveIllegalHead(VersionSpecTests.java:215)
	at sun.reflect.NativeMethodAccessorImpl.invoke0(Native Method)
	at sun.reflect.NativeMethodAccessorImpl.invoke(NativeMethodAccessorImpl.java:62)
	at sun.reflect.DelegatingMethodAccessorImpl.invoke(DelegatingMethodAccessorImpl.java:43)
	at java.lang.reflect.Method.invoke(Method.java:498)
	at org.junit.runners.model.FrameworkMethod$1.runReflectiveCall(FrameworkMethod.java:47)
	at org.junit.internal.runners.model.ReflectiveCallable.run(ReflectiveCallable.java:12)
	at org.junit.runners.model.FrameworkMethod.invokeExplosively(FrameworkMethod.java:44)
	at org.junit.internal.runners.statements.InvokeMethod.evaluate(InvokeMethod.java:17)
	at org.junit.internal.runners.statements.ExpectException.evaluate(ExpectException.java:19)
	at org.junit.internal.runners.statements.RunBefores.evaluate(RunBefores.java:26)
	at org.junit.internal.runners.statements.RunAfters.evaluate(RunAfters.java:27)
	at org.junit.runners.ParentRunner.runLeaf(ParentRunner.java:271)
	at org.junit.runners.BlockJUnit4ClassRunner.runChild(BlockJUnit4ClassRunner.java:70)
	at org.junit.runners.BlockJUnit4ClassRunner.runChild(BlockJUnit4ClassRunner.java:50)
	at org.junit.runners.ParentRunner$3.run(ParentRunner.java:238)
	at org.junit.runners.ParentRunner$1.schedule(ParentRunner.java:63)
	at org.junit.runners.ParentRunner.runChildren(ParentRunner.java:236)
	at org.junit.runners.ParentRunner.access$000(ParentRunner.java:53)
	at org.junit.runners.ParentRunner$2.evaluate(ParentRunner.java:229)
	at org.junit.internal.runners.statements.RunBefores.evaluate(RunBefores.java:26)
	at org.junit.internal.runners.statements.RunAfters.evaluate(RunAfters.java:27)
	at org.junit.runners.ParentRunner.run(ParentRunner.java:309)
	at org.junit.runners.Suite.runChild(Suite.java:127)
	at org.junit.runners.Suite.runChild(Suite.java:26)
	at org.junit.runners.ParentRunner$3.run(ParentRunner.java:238)
	at org.junit.runners.ParentRunner$1.schedule(ParentRunner.java:63)
	at org.junit.runners.ParentRunner.runChildren(ParentRunner.java:236)
	at org.junit.runners.ParentRunner.access$000(ParentRunner.java:53)
	at org.junit.runners.ParentRunner$2.evaluate(ParentRunner.java:229)
	at org.junit.runners.ParentRunner.run(ParentRunner.java:309)
	at org.apache.maven.surefire.junit4.JUnit4TestSet.execute(JUnit4TestSet.java:53)
	at org.apache.maven.surefire.junit4.JUnit4Provider.executeTestSet(JUnit4Provider.java:123)
	at org.apache.maven.surefire.junit4.JUnit4Provider.invoke(JUnit4Provider.java:104)
	at sun.reflect.NativeMethodAccessorImpl.invoke0(Native Method)
	at sun.reflect.NativeMethodAccessorImpl.invoke(NativeMethodAccessorImpl.java:62)
	at sun.reflect.DelegatingMethodAccessorImpl.invoke(DelegatingMethodAccessorImpl.java:43)
	at java.lang.reflect.Method.invoke(Method.java:498)
	at org.apache.maven.surefire.util.ReflectionUtils.invokeMethodWithArray(ReflectionUtils.java:164)
	at org.apache.maven.surefire.booter.ProviderFactory$ProviderProxy.invoke(ProviderFactory.java:110)
	at org.apache.maven.surefire.booter.SurefireStarter.invokeProvider(SurefireStarter.java:175)
	at org.apache.maven.surefire.booter.SurefireStarter.runSuitesInProcess(SurefireStarter.java:123)
	at org.eclipse.tycho.surefire.osgibooter.OsgiSurefireBooter.run(OsgiSurefireBooter.java:86)
	at org.eclipse.tycho.surefire.osgibooter.AbstractUITestApplication.runTests(AbstractUITestApplication.java:44)
	at org.eclipse.ui.internal.testing.WorkbenchTestable$1.run(WorkbenchTestable.java:71)
	at java.lang.Thread.run(Thread.java:748)

Exception on execution: org.eclipse.emf.emfstore.internal.server.exceptions.InvalidVersionSpecException: Head version could not be resolved.
	at org.eclipse.emf.emfstore.internal.server.core.subinterfaces.VersionSubInterfaceImpl.resolveHeadVersionSpec(VersionSubInterfaceImpl.java:213)
	at org.eclipse.emf.emfstore.internal.server.core.subinterfaces.VersionSubInterfaceImpl.resolveVersionSpec(VersionSubInterfaceImpl.java:118)
	at sun.reflect.GeneratedMethodAccessor19.invoke(Unknown Source)
	at sun.reflect.DelegatingMethodAccessorImpl.invoke(DelegatingMethodAccessorImpl.java:43)
	at java.lang.reflect.Method.invoke(Method.java:498)
	at org.eclipse.emf.emfstore.internal.server.core.AbstractSubEmfstoreInterface.execute(AbstractSubEmfstoreInterface.java:142)
	at org.eclipse.emf.emfstore.internal.server.core.EMFStoreImpl.invoke(EMFStoreImpl.java:181)
	at com.sun.proxy.$Proxy22.resolveVersionSpec(Unknown Source)
	at org.eclipse.emf.emfstore.client.test.common.mocks.ConnectionMock.resolveVersionSpec(ConnectionMock.java:138)
	at org.eclipse.emf.emfstore.internal.client.model.impl.ProjectSpaceBase$6.run(ProjectSpaceBase.java:1233)
	at org.eclipse.emf.emfstore.internal.client.model.impl.ProjectSpaceBase$6.run(ProjectSpaceBase.java:1)
	at org.eclipse.emf.emfstore.internal.client.model.connectionmanager.ServerCall.run(ServerCall.java:250)
	at org.eclipse.emf.emfstore.internal.client.model.connectionmanager.SessionManager.executeCall(SessionManager.java:151)
	at org.eclipse.emf.emfstore.internal.client.model.connectionmanager.SessionManager.execute(SessionManager.java:70)
	at org.eclipse.emf.emfstore.internal.client.model.connectionmanager.ServerCall.execute(ServerCall.java:270)
	at org.eclipse.emf.emfstore.internal.client.model.impl.ProjectSpaceBase.resolveVersionSpec(ProjectSpaceBase.java:1238)
	at org.eclipse.emf.emfstore.server.test.VersionSpecTests.resolveIllegalHead(VersionSpecTests.java:215)
	at sun.reflect.NativeMethodAccessorImpl.invoke0(Native Method)
	at sun.reflect.NativeMethodAccessorImpl.invoke(NativeMethodAccessorImpl.java:62)
	at sun.reflect.DelegatingMethodAccessorImpl.invoke(DelegatingMethodAccessorImpl.java:43)
	at java.lang.reflect.Method.invoke(Method.java:498)
	at org.junit.runners.model.FrameworkMethod$1.runReflectiveCall(FrameworkMethod.java:47)
	at org.junit.internal.runners.model.ReflectiveCallable.run(ReflectiveCallable.java:12)
	at org.junit.runners.model.FrameworkMethod.invokeExplosively(FrameworkMethod.java:44)
	at org.junit.internal.runners.statements.InvokeMethod.evaluate(InvokeMethod.java:17)
	at org.junit.internal.runners.statements.ExpectException.evaluate(ExpectException.java:19)
	at org.junit.internal.runners.statements.RunBefores.evaluate(RunBefores.java:26)
	at org.junit.internal.runners.statements.RunAfters.evaluate(RunAfters.java:27)
	at org.junit.runners.ParentRunner.runLeaf(ParentRunner.java:271)
	at org.junit.runners.BlockJUnit4ClassRunner.runChild(BlockJUnit4ClassRunner.java:70)
	at org.junit.runners.BlockJUnit4ClassRunner.runChild(BlockJUnit4ClassRunner.java:50)
	at org.junit.runners.ParentRunner$3.run(ParentRunner.java:238)
	at org.junit.runners.ParentRunner$1.schedule(ParentRunner.java:63)
	at org.junit.runners.ParentRunner.runChildren(ParentRunner.java:236)
	at org.junit.runners.ParentRunner.access$000(ParentRunner.java:53)
	at org.junit.runners.ParentRunner$2.evaluate(ParentRunner.java:229)
	at org.junit.internal.runners.statements.RunBefores.evaluate(RunBefores.java:26)
	at org.junit.internal.runners.statements.RunAfters.evaluate(RunAfters.java:27)
	at org.junit.runners.ParentRunner.run(ParentRunner.java:309)
	at org.junit.runners.Suite.runChild(Suite.java:127)
	at org.junit.runners.Suite.runChild(Suite.java:26)
	at org.junit.runners.ParentRunner$3.run(ParentRunner.java:238)
	at org.junit.runners.ParentRunner$1.schedule(ParentRunner.java:63)
	at org.junit.runners.ParentRunner.runChildren(ParentRunner.java:236)
	at org.junit.runners.ParentRunner.access$000(ParentRunner.java:53)
	at org.junit.runners.ParentRunner$2.evaluate(ParentRunner.java:229)
	at org.junit.runners.ParentRunner.run(ParentRunner.java:309)
	at org.apache.maven.surefire.junit4.JUnit4TestSet.execute(JUnit4TestSet.java:53)
	at org.apache.maven.surefire.junit4.JUnit4Provider.executeTestSet(JUnit4Provider.java:123)
	at org.apache.maven.surefire.junit4.JUnit4Provider.invoke(JUnit4Provider.java:104)
	at sun.reflect.NativeMethodAccessorImpl.invoke0(Native Method)
	at sun.reflect.NativeMethodAccessorImpl.invoke(NativeMethodAccessorImpl.java:62)
	at sun.reflect.DelegatingMethodAccessorImpl.invoke(DelegatingMethodAccessorImpl.java:43)
	at java.lang.reflect.Method.invoke(Method.java:498)
	at org.apache.maven.surefire.util.ReflectionUtils.invokeMethodWithArray(ReflectionUtils.java:164)
	at org.apache.maven.surefire.booter.ProviderFactory$ProviderProxy.invoke(ProviderFactory.java:110)
	at org.apache.maven.surefire.booter.SurefireStarter.invokeProvider(SurefireStarter.java:175)
	at org.apache.maven.surefire.booter.SurefireStarter.runSuitesInProcess(SurefireStarter.java:123)
	at org.eclipse.tycho.surefire.osgibooter.OsgiSurefireBooter.run(OsgiSurefireBooter.java:86)
	at org.eclipse.tycho.surefire.osgibooter.AbstractUITestApplication.runTests(AbstractUITestApplication.java:44)
	at org.eclipse.ui.internal.testing.WorkbenchTestable$1.run(WorkbenchTestable.java:71)
	at java.lang.Thread.run(Thread.java:748)

Exception on execution: org.eclipse.emf.emfstore.internal.server.exceptions.InvalidVersionSpecException: Head version could not be resolved.
	at org.eclipse.emf.emfstore.internal.server.core.subinterfaces.VersionSubInterfaceImpl.resolveHeadVersionSpec(VersionSubInterfaceImpl.java:213)
	at org.eclipse.emf.emfstore.internal.server.core.subinterfaces.VersionSubInterfaceImpl.resolveVersionSpec(VersionSubInterfaceImpl.java:118)
	at sun.reflect.GeneratedMethodAccessor19.invoke(Unknown Source)
	at sun.reflect.DelegatingMethodAccessorImpl.invoke(DelegatingMethodAccessorImpl.java:43)
	at java.lang.reflect.Method.invoke(Method.java:498)
	at org.eclipse.emf.emfstore.internal.server.core.AbstractSubEmfstoreInterface.execute(AbstractSubEmfstoreInterface.java:142)
	at org.eclipse.emf.emfstore.internal.server.core.EMFStoreImpl.invoke(EMFStoreImpl.java:181)
	at com.sun.proxy.$Proxy22.resolveVersionSpec(Unknown Source)
	at org.eclipse.emf.emfstore.client.test.common.mocks.ConnectionMock.resolveVersionSpec(ConnectionMock.java:138)
	at org.eclipse.emf.emfstore.internal.client.model.impl.ProjectSpaceBase$6.run(ProjectSpaceBase.java:1233)
	at org.eclipse.emf.emfstore.internal.client.model.impl.ProjectSpaceBase$6.run(ProjectSpaceBase.java:1)
	at org.eclipse.emf.emfstore.internal.client.model.connectionmanager.ServerCall.run(ServerCall.java:250)
	at org.eclipse.emf.emfstore.internal.client.model.connectionmanager.SessionManager.executeCall(SessionManager.java:151)
	at org.eclipse.emf.emfstore.internal.client.model.connectionmanager.SessionManager.execute(SessionManager.java:70)
	at org.eclipse.emf.emfstore.internal.client.model.connectionmanager.ServerCall.execute(ServerCall.java:270)
	at org.eclipse.emf.emfstore.internal.client.model.impl.ProjectSpaceBase.resolveVersionSpec(ProjectSpaceBase.java:1238)
	at org.eclipse.emf.emfstore.server.test.VersionSpecTests.resolveIllegalHead(VersionSpecTests.java:215)
	at sun.reflect.NativeMethodAccessorImpl.invoke0(Native Method)
	at sun.reflect.NativeMethodAccessorImpl.invoke(NativeMethodAccessorImpl.java:62)
	at sun.reflect.DelegatingMethodAccessorImpl.invoke(DelegatingMethodAccessorImpl.java:43)
	at java.lang.reflect.Method.invoke(Method.java:498)
	at org.junit.runners.model.FrameworkMethod$1.runReflectiveCall(FrameworkMethod.java:47)
	at org.junit.internal.runners.model.ReflectiveCallable.run(ReflectiveCallable.java:12)
	at org.junit.runners.model.FrameworkMethod.invokeExplosively(FrameworkMethod.java:44)
	at org.junit.internal.runners.statements.InvokeMethod.evaluate(InvokeMethod.java:17)
	at org.junit.internal.runners.statements.ExpectException.evaluate(ExpectException.java:19)
	at org.junit.internal.runners.statements.RunBefores.evaluate(RunBefores.java:26)
	at org.junit.internal.runners.statements.RunAfters.evaluate(RunAfters.java:27)
	at org.junit.runners.ParentRunner.runLeaf(ParentRunner.java:271)
	at org.junit.runners.BlockJUnit4ClassRunner.runChild(BlockJUnit4ClassRunner.java:70)
	at org.junit.runners.BlockJUnit4ClassRunner.runChild(BlockJUnit4ClassRunner.java:50)
	at org.junit.runners.ParentRunner$3.run(ParentRunner.java:238)
	at org.junit.runners.ParentRunner$1.schedule(ParentRunner.java:63)
	at org.junit.runners.ParentRunner.runChildren(ParentRunner.java:236)
	at org.junit.runners.ParentRunner.access$000(ParentRunner.java:53)
	at org.junit.runners.ParentRunner$2.evaluate(ParentRunner.java:229)
	at org.junit.internal.runners.statements.RunBefores.evaluate(RunBefores.java:26)
	at org.junit.internal.runners.statements.RunAfters.evaluate(RunAfters.java:27)
	at org.junit.runners.ParentRunner.run(ParentRunner.java:309)
	at org.junit.runners.Suite.runChild(Suite.java:127)
	at org.junit.runners.Suite.runChild(Suite.java:26)
	at org.junit.runners.ParentRunner$3.run(ParentRunner.java:238)
	at org.junit.runners.ParentRunner$1.schedule(ParentRunner.java:63)
	at org.junit.runners.ParentRunner.runChildren(ParentRunner.java:236)
	at org.junit.runners.ParentRunner.access$000(ParentRunner.java:53)
	at org.junit.runners.ParentRunner$2.evaluate(ParentRunner.java:229)
	at org.junit.runners.ParentRunner.run(ParentRunner.java:309)
	at org.apache.maven.surefire.junit4.JUnit4TestSet.execute(JUnit4TestSet.java:53)
	at org.apache.maven.surefire.junit4.JUnit4Provider.executeTestSet(JUnit4Provider.java:123)
	at org.apache.maven.surefire.junit4.JUnit4Provider.invoke(JUnit4Provider.java:104)
	at sun.reflect.NativeMethodAccessorImpl.invoke0(Native Method)
	at sun.reflect.NativeMethodAccessorImpl.invoke(NativeMethodAccessorImpl.java:62)
	at sun.reflect.DelegatingMethodAccessorImpl.invoke(DelegatingMethodAccessorImpl.java:43)
	at java.lang.reflect.Method.invoke(Method.java:498)
	at org.apache.maven.surefire.util.ReflectionUtils.invokeMethodWithArray(ReflectionUtils.java:164)
	at org.apache.maven.surefire.booter.ProviderFactory$ProviderProxy.invoke(ProviderFactory.java:110)
	at org.apache.maven.surefire.booter.SurefireStarter.invokeProvider(SurefireStarter.java:175)
	at org.apache.maven.surefire.booter.SurefireStarter.runSuitesInProcess(SurefireStarter.java:123)
	at org.eclipse.tycho.surefire.osgibooter.OsgiSurefireBooter.run(OsgiSurefireBooter.java:86)
	at org.eclipse.tycho.surefire.osgibooter.AbstractUITestApplication.runTests(AbstractUITestApplication.java:44)
	at org.eclipse.ui.internal.testing.WorkbenchTestable$1.run(WorkbenchTestable.java:71)
	at java.lang.Thread.run(Thread.java:748)

Total time for commit: 0
Total time for commit: 0
Total time for commit: 0
Total time for commit: 0
Exception on execution: No branch info available.
Exception on execution: No branch info available.
Exception on execution: No branch info available.
Exception on execution: No branch info available.
Exception on execution: No branch info available.
Exception on execution: No branch info available.
Exception on execution: No branch info available.
Exception on execution: No branch info available.
Total time for commit: 1
Total time for commit: 1
Total time for commit: 1
Total time for commit: 1
Exception on execution: No branch info available.
Exception on execution: No branch info available.
Exception on execution: No branch info available.
Exception on execution: No branch info available.
Exception on execution: No branch info available.
Exception on execution: No branch info available.
Exception on execution: No branch info available.
Exception on execution: No branch info available.
Total time for commit: 0
Total time for commit: 0
Total time for commit: 0
Total time for commit: 0
Total time for commit: 1
Total time for commit: 1
Total time for commit: 1
Total time for commit: 1
Total time for commit: 1
Total time for commit: 1
Total time for commit: 1
Total time for commit: 1
Exception on execution: No branch info available.
Exception on execution: No branch info available.
Exception on execution: No branch info available.
Exception on execution: No branch info available.
Exception on execution: No branch info available.
Exception on execution: No branch info available.
Exception on execution: No branch info available.
Exception on execution: No branch info available.
Total time for commit: 0
Total time for commit: 0
Total time for commit: 0
Total time for commit: 0
Total time for commit: 0
Total time for commit: 0
Total time for commit: 0
Total time for commit: 0
Exception on execution: org.eclipse.emf.emfstore.internal.server.exceptions.InvalidVersionSpecException: Primary version could not be resolved
	at org.eclipse.emf.emfstore.internal.server.core.subinterfaces.VersionSubInterfaceImpl.resolvePrimaryVersionSpec(VersionSubInterfaceImpl.java:201)
	at org.eclipse.emf.emfstore.internal.server.core.subinterfaces.VersionSubInterfaceImpl.resolveVersionSpec(VersionSubInterfaceImpl.java:116)
	at sun.reflect.GeneratedMethodAccessor19.invoke(Unknown Source)
	at sun.reflect.DelegatingMethodAccessorImpl.invoke(DelegatingMethodAccessorImpl.java:43)
	at java.lang.reflect.Method.invoke(Method.java:498)
	at org.eclipse.emf.emfstore.internal.server.core.AbstractSubEmfstoreInterface.execute(AbstractSubEmfstoreInterface.java:142)
	at org.eclipse.emf.emfstore.internal.server.core.EMFStoreImpl.invoke(EMFStoreImpl.java:181)
	at com.sun.proxy.$Proxy22.resolveVersionSpec(Unknown Source)
	at org.eclipse.emf.emfstore.client.test.common.mocks.ConnectionMock.resolveVersionSpec(ConnectionMock.java:138)
	at org.eclipse.emf.emfstore.internal.client.model.impl.ProjectSpaceBase$6.run(ProjectSpaceBase.java:1233)
	at org.eclipse.emf.emfstore.internal.client.model.impl.ProjectSpaceBase$6.run(ProjectSpaceBase.java:1)
	at org.eclipse.emf.emfstore.internal.client.model.connectionmanager.ServerCall.run(ServerCall.java:250)
	at org.eclipse.emf.emfstore.internal.client.model.connectionmanager.SessionManager.executeCall(SessionManager.java:151)
	at org.eclipse.emf.emfstore.internal.client.model.connectionmanager.SessionManager.execute(SessionManager.java:70)
	at org.eclipse.emf.emfstore.internal.client.model.connectionmanager.ServerCall.execute(ServerCall.java:270)
	at org.eclipse.emf.emfstore.internal.client.model.impl.ProjectSpaceBase.resolveVersionSpec(ProjectSpaceBase.java:1238)
	at org.eclipse.emf.emfstore.server.test.VersionSpecTests.resolvePrimaryInvalid(VersionSpecTests.java:204)
	at sun.reflect.NativeMethodAccessorImpl.invoke0(Native Method)
	at sun.reflect.NativeMethodAccessorImpl.invoke(NativeMethodAccessorImpl.java:62)
	at sun.reflect.DelegatingMethodAccessorImpl.invoke(DelegatingMethodAccessorImpl.java:43)
	at java.lang.reflect.Method.invoke(Method.java:498)
	at org.junit.runners.model.FrameworkMethod$1.runReflectiveCall(FrameworkMethod.java:47)
	at org.junit.internal.runners.model.ReflectiveCallable.run(ReflectiveCallable.java:12)
	at org.junit.runners.model.FrameworkMethod.invokeExplosively(FrameworkMethod.java:44)
	at org.junit.internal.runners.statements.InvokeMethod.evaluate(InvokeMethod.java:17)
	at org.junit.internal.runners.statements.ExpectException.evaluate(ExpectException.java:19)
	at org.junit.internal.runners.statements.RunBefores.evaluate(RunBefores.java:26)
	at org.junit.internal.runners.statements.RunAfters.evaluate(RunAfters.java:27)
	at org.junit.runners.ParentRunner.runLeaf(ParentRunner.java:271)
	at org.junit.runners.BlockJUnit4ClassRunner.runChild(BlockJUnit4ClassRunner.java:70)
	at org.junit.runners.BlockJUnit4ClassRunner.runChild(BlockJUnit4ClassRunner.java:50)
	at org.junit.runners.ParentRunner$3.run(ParentRunner.java:238)
	at org.junit.runners.ParentRunner$1.schedule(ParentRunner.java:63)
	at org.junit.runners.ParentRunner.runChildren(ParentRunner.java:236)
	at org.junit.runners.ParentRunner.access$000(ParentRunner.java:53)
	at org.junit.runners.ParentRunner$2.evaluate(ParentRunner.java:229)
	at org.junit.internal.runners.statements.RunBefores.evaluate(RunBefores.java:26)
	at org.junit.internal.runners.statements.RunAfters.evaluate(RunAfters.java:27)
	at org.junit.runners.ParentRunner.run(ParentRunner.java:309)
	at org.junit.runners.Suite.runChild(Suite.java:127)
	at org.junit.runners.Suite.runChild(Suite.java:26)
	at org.junit.runners.ParentRunner$3.run(ParentRunner.java:238)
	at org.junit.runners.ParentRunner$1.schedule(ParentRunner.java:63)
	at org.junit.runners.ParentRunner.runChildren(ParentRunner.java:236)
	at org.junit.runners.ParentRunner.access$000(ParentRunner.java:53)
	at org.junit.runners.ParentRunner$2.evaluate(ParentRunner.java:229)
	at org.junit.runners.ParentRunner.run(ParentRunner.java:309)
	at org.apache.maven.surefire.junit4.JUnit4TestSet.execute(JUnit4TestSet.java:53)
	at org.apache.maven.surefire.junit4.JUnit4Provider.executeTestSet(JUnit4Provider.java:123)
	at org.apache.maven.surefire.junit4.JUnit4Provider.invoke(JUnit4Provider.java:104)
	at sun.reflect.NativeMethodAccessorImpl.invoke0(Native Method)
	at sun.reflect.NativeMethodAccessorImpl.invoke(NativeMethodAccessorImpl.java:62)
	at sun.reflect.DelegatingMethodAccessorImpl.invoke(DelegatingMethodAccessorImpl.java:43)
	at java.lang.reflect.Method.invoke(Method.java:498)
	at org.apache.maven.surefire.util.ReflectionUtils.invokeMethodWithArray(ReflectionUtils.java:164)
	at org.apache.maven.surefire.booter.ProviderFactory$ProviderProxy.invoke(ProviderFactory.java:110)
	at org.apache.maven.surefire.booter.SurefireStarter.invokeProvider(SurefireStarter.java:175)
	at org.apache.maven.surefire.booter.SurefireStarter.runSuitesInProcess(SurefireStarter.java:123)
	at org.eclipse.tycho.surefire.osgibooter.OsgiSurefireBooter.run(OsgiSurefireBooter.java:86)
	at org.eclipse.tycho.surefire.osgibooter.AbstractUITestApplication.runTests(AbstractUITestApplication.java:44)
	at org.eclipse.ui.internal.testing.WorkbenchTestable$1.run(WorkbenchTestable.java:71)
	at java.lang.Thread.run(Thread.java:748)

Exception on execution: org.eclipse.emf.emfstore.internal.server.exceptions.InvalidVersionSpecException: Primary version could not be resolved
	at org.eclipse.emf.emfstore.internal.server.core.subinterfaces.VersionSubInterfaceImpl.resolvePrimaryVersionSpec(VersionSubInterfaceImpl.java:201)
	at org.eclipse.emf.emfstore.internal.server.core.subinterfaces.VersionSubInterfaceImpl.resolveVersionSpec(VersionSubInterfaceImpl.java:116)
	at sun.reflect.GeneratedMethodAccessor19.invoke(Unknown Source)
	at sun.reflect.DelegatingMethodAccessorImpl.invoke(DelegatingMethodAccessorImpl.java:43)
	at java.lang.reflect.Method.invoke(Method.java:498)
	at org.eclipse.emf.emfstore.internal.server.core.AbstractSubEmfstoreInterface.execute(AbstractSubEmfstoreInterface.java:142)
	at org.eclipse.emf.emfstore.internal.server.core.EMFStoreImpl.invoke(EMFStoreImpl.java:181)
	at com.sun.proxy.$Proxy22.resolveVersionSpec(Unknown Source)
	at org.eclipse.emf.emfstore.client.test.common.mocks.ConnectionMock.resolveVersionSpec(ConnectionMock.java:138)
	at org.eclipse.emf.emfstore.internal.client.model.impl.ProjectSpaceBase$6.run(ProjectSpaceBase.java:1233)
	at org.eclipse.emf.emfstore.internal.client.model.impl.ProjectSpaceBase$6.run(ProjectSpaceBase.java:1)
	at org.eclipse.emf.emfstore.internal.client.model.connectionmanager.ServerCall.run(ServerCall.java:250)
	at org.eclipse.emf.emfstore.internal.client.model.connectionmanager.SessionManager.executeCall(SessionManager.java:151)
	at org.eclipse.emf.emfstore.internal.client.model.connectionmanager.SessionManager.execute(SessionManager.java:70)
	at org.eclipse.emf.emfstore.internal.client.model.connectionmanager.ServerCall.execute(ServerCall.java:270)
	at org.eclipse.emf.emfstore.internal.client.model.impl.ProjectSpaceBase.resolveVersionSpec(ProjectSpaceBase.java:1238)
	at org.eclipse.emf.emfstore.server.test.VersionSpecTests.resolvePrimaryInvalid(VersionSpecTests.java:204)
	at sun.reflect.NativeMethodAccessorImpl.invoke0(Native Method)
	at sun.reflect.NativeMethodAccessorImpl.invoke(NativeMethodAccessorImpl.java:62)
	at sun.reflect.DelegatingMethodAccessorImpl.invoke(DelegatingMethodAccessorImpl.java:43)
	at java.lang.reflect.Method.invoke(Method.java:498)
	at org.junit.runners.model.FrameworkMethod$1.runReflectiveCall(FrameworkMethod.java:47)
	at org.junit.internal.runners.model.ReflectiveCallable.run(ReflectiveCallable.java:12)
	at org.junit.runners.model.FrameworkMethod.invokeExplosively(FrameworkMethod.java:44)
	at org.junit.internal.runners.statements.InvokeMethod.evaluate(InvokeMethod.java:17)
	at org.junit.internal.runners.statements.ExpectException.evaluate(ExpectException.java:19)
	at org.junit.internal.runners.statements.RunBefores.evaluate(RunBefores.java:26)
	at org.junit.internal.runners.statements.RunAfters.evaluate(RunAfters.java:27)
	at org.junit.runners.ParentRunner.runLeaf(ParentRunner.java:271)
	at org.junit.runners.BlockJUnit4ClassRunner.runChild(BlockJUnit4ClassRunner.java:70)
	at org.junit.runners.BlockJUnit4ClassRunner.runChild(BlockJUnit4ClassRunner.java:50)
	at org.junit.runners.ParentRunner$3.run(ParentRunner.java:238)
	at org.junit.runners.ParentRunner$1.schedule(ParentRunner.java:63)
	at org.junit.runners.ParentRunner.runChildren(ParentRunner.java:236)
	at org.junit.runners.ParentRunner.access$000(ParentRunner.java:53)
	at org.junit.runners.ParentRunner$2.evaluate(ParentRunner.java:229)
	at org.junit.internal.runners.statements.RunBefores.evaluate(RunBefores.java:26)
	at org.junit.internal.runners.statements.RunAfters.evaluate(RunAfters.java:27)
	at org.junit.runners.ParentRunner.run(ParentRunner.java:309)
	at org.junit.runners.Suite.runChild(Suite.java:127)
	at org.junit.runners.Suite.runChild(Suite.java:26)
	at org.junit.runners.ParentRunner$3.run(ParentRunner.java:238)
	at org.junit.runners.ParentRunner$1.schedule(ParentRunner.java:63)
	at org.junit.runners.ParentRunner.runChildren(ParentRunner.java:236)
	at org.junit.runners.ParentRunner.access$000(ParentRunner.java:53)
	at org.junit.runners.ParentRunner$2.evaluate(ParentRunner.java:229)
	at org.junit.runners.ParentRunner.run(ParentRunner.java:309)
	at org.apache.maven.surefire.junit4.JUnit4TestSet.execute(JUnit4TestSet.java:53)
	at org.apache.maven.surefire.junit4.JUnit4Provider.executeTestSet(JUnit4Provider.java:123)
	at org.apache.maven.surefire.junit4.JUnit4Provider.invoke(JUnit4Provider.java:104)
	at sun.reflect.NativeMethodAccessorImpl.invoke0(Native Method)
	at sun.reflect.NativeMethodAccessorImpl.invoke(NativeMethodAccessorImpl.java:62)
	at sun.reflect.DelegatingMethodAccessorImpl.invoke(DelegatingMethodAccessorImpl.java:43)
	at java.lang.reflect.Method.invoke(Method.java:498)
	at org.apache.maven.surefire.util.ReflectionUtils.invokeMethodWithArray(ReflectionUtils.java:164)
	at org.apache.maven.surefire.booter.ProviderFactory$ProviderProxy.invoke(ProviderFactory.java:110)
	at org.apache.maven.surefire.booter.SurefireStarter.invokeProvider(SurefireStarter.java:175)
	at org.apache.maven.surefire.booter.SurefireStarter.runSuitesInProcess(SurefireStarter.java:123)
	at org.eclipse.tycho.surefire.osgibooter.OsgiSurefireBooter.run(OsgiSurefireBooter.java:86)
	at org.eclipse.tycho.surefire.osgibooter.AbstractUITestApplication.runTests(AbstractUITestApplication.java:44)
	at org.eclipse.ui.internal.testing.WorkbenchTestable$1.run(WorkbenchTestable.java:71)
	at java.lang.Thread.run(Thread.java:748)

Exception on execution: org.eclipse.emf.emfstore.internal.server.exceptions.InvalidVersionSpecException: Primary version could not be resolved
	at org.eclipse.emf.emfstore.internal.server.core.subinterfaces.VersionSubInterfaceImpl.resolvePrimaryVersionSpec(VersionSubInterfaceImpl.java:201)
	at org.eclipse.emf.emfstore.internal.server.core.subinterfaces.VersionSubInterfaceImpl.resolveVersionSpec(VersionSubInterfaceImpl.java:116)
	at sun.reflect.GeneratedMethodAccessor19.invoke(Unknown Source)
	at sun.reflect.DelegatingMethodAccessorImpl.invoke(DelegatingMethodAccessorImpl.java:43)
	at java.lang.reflect.Method.invoke(Method.java:498)
	at org.eclipse.emf.emfstore.internal.server.core.AbstractSubEmfstoreInterface.execute(AbstractSubEmfstoreInterface.java:142)
	at org.eclipse.emf.emfstore.internal.server.core.EMFStoreImpl.invoke(EMFStoreImpl.java:181)
	at com.sun.proxy.$Proxy22.resolveVersionSpec(Unknown Source)
	at org.eclipse.emf.emfstore.client.test.common.mocks.ConnectionMock.resolveVersionSpec(ConnectionMock.java:138)
	at org.eclipse.emf.emfstore.internal.client.model.impl.ProjectSpaceBase$6.run(ProjectSpaceBase.java:1233)
	at org.eclipse.emf.emfstore.internal.client.model.impl.ProjectSpaceBase$6.run(ProjectSpaceBase.java:1)
	at org.eclipse.emf.emfstore.internal.client.model.connectionmanager.ServerCall.run(ServerCall.java:250)
	at org.eclipse.emf.emfstore.internal.client.model.connectionmanager.SessionManager.executeCall(SessionManager.java:151)
	at org.eclipse.emf.emfstore.internal.client.model.connectionmanager.SessionManager.execute(SessionManager.java:70)
	at org.eclipse.emf.emfstore.internal.client.model.connectionmanager.ServerCall.execute(ServerCall.java:270)
	at org.eclipse.emf.emfstore.internal.client.model.impl.ProjectSpaceBase.resolveVersionSpec(ProjectSpaceBase.java:1238)
	at org.eclipse.emf.emfstore.server.test.VersionSpecTests.resolvePrimaryInvalid(VersionSpecTests.java:204)
	at sun.reflect.NativeMethodAccessorImpl.invoke0(Native Method)
	at sun.reflect.NativeMethodAccessorImpl.invoke(NativeMethodAccessorImpl.java:62)
	at sun.reflect.DelegatingMethodAccessorImpl.invoke(DelegatingMethodAccessorImpl.java:43)
	at java.lang.reflect.Method.invoke(Method.java:498)
	at org.junit.runners.model.FrameworkMethod$1.runReflectiveCall(FrameworkMethod.java:47)
	at org.junit.internal.runners.model.ReflectiveCallable.run(ReflectiveCallable.java:12)
	at org.junit.runners.model.FrameworkMethod.invokeExplosively(FrameworkMethod.java:44)
	at org.junit.internal.runners.statements.InvokeMethod.evaluate(InvokeMethod.java:17)
	at org.junit.internal.runners.statements.ExpectException.evaluate(ExpectException.java:19)
	at org.junit.internal.runners.statements.RunBefores.evaluate(RunBefores.java:26)
	at org.junit.internal.runners.statements.RunAfters.evaluate(RunAfters.java:27)
	at org.junit.runners.ParentRunner.runLeaf(ParentRunner.java:271)
	at org.junit.runners.BlockJUnit4ClassRunner.runChild(BlockJUnit4ClassRunner.java:70)
	at org.junit.runners.BlockJUnit4ClassRunner.runChild(BlockJUnit4ClassRunner.java:50)
	at org.junit.runners.ParentRunner$3.run(ParentRunner.java:238)
	at org.junit.runners.ParentRunner$1.schedule(ParentRunner.java:63)
	at org.junit.runners.ParentRunner.runChildren(ParentRunner.java:236)
	at org.junit.runners.ParentRunner.access$000(ParentRunner.java:53)
	at org.junit.runners.ParentRunner$2.evaluate(ParentRunner.java:229)
	at org.junit.internal.runners.statements.RunBefores.evaluate(RunBefores.java:26)
	at org.junit.internal.runners.statements.RunAfters.evaluate(RunAfters.java:27)
	at org.junit.runners.ParentRunner.run(ParentRunner.java:309)
	at org.junit.runners.Suite.runChild(Suite.java:127)
	at org.junit.runners.Suite.runChild(Suite.java:26)
	at org.junit.runners.ParentRunner$3.run(ParentRunner.java:238)
	at org.junit.runners.ParentRunner$1.schedule(ParentRunner.java:63)
	at org.junit.runners.ParentRunner.runChildren(ParentRunner.java:236)
	at org.junit.runners.ParentRunner.access$000(ParentRunner.java:53)
	at org.junit.runners.ParentRunner$2.evaluate(ParentRunner.java:229)
	at org.junit.runners.ParentRunner.run(ParentRunner.java:309)
	at org.apache.maven.surefire.junit4.JUnit4TestSet.execute(JUnit4TestSet.java:53)
	at org.apache.maven.surefire.junit4.JUnit4Provider.executeTestSet(JUnit4Provider.java:123)
	at org.apache.maven.surefire.junit4.JUnit4Provider.invoke(JUnit4Provider.java:104)
	at sun.reflect.NativeMethodAccessorImpl.invoke0(Native Method)
	at sun.reflect.NativeMethodAccessorImpl.invoke(NativeMethodAccessorImpl.java:62)
	at sun.reflect.DelegatingMethodAccessorImpl.invoke(DelegatingMethodAccessorImpl.java:43)
	at java.lang.reflect.Method.invoke(Method.java:498)
	at org.apache.maven.surefire.util.ReflectionUtils.invokeMethodWithArray(ReflectionUtils.java:164)
	at org.apache.maven.surefire.booter.ProviderFactory$ProviderProxy.invoke(ProviderFactory.java:110)
	at org.apache.maven.surefire.booter.SurefireStarter.invokeProvider(SurefireStarter.java:175)
	at org.apache.maven.surefire.booter.SurefireStarter.runSuitesInProcess(SurefireStarter.java:123)
	at org.eclipse.tycho.surefire.osgibooter.OsgiSurefireBooter.run(OsgiSurefireBooter.java:86)
	at org.eclipse.tycho.surefire.osgibooter.AbstractUITestApplication.runTests(AbstractUITestApplication.java:44)
	at org.eclipse.ui.internal.testing.WorkbenchTestable$1.run(WorkbenchTestable.java:71)
	at java.lang.Thread.run(Thread.java:748)

Exception on execution: org.eclipse.emf.emfstore.internal.server.exceptions.InvalidVersionSpecException: Primary version could not be resolved
	at org.eclipse.emf.emfstore.internal.server.core.subinterfaces.VersionSubInterfaceImpl.resolvePrimaryVersionSpec(VersionSubInterfaceImpl.java:201)
	at org.eclipse.emf.emfstore.internal.server.core.subinterfaces.VersionSubInterfaceImpl.resolveVersionSpec(VersionSubInterfaceImpl.java:116)
	at sun.reflect.GeneratedMethodAccessor19.invoke(Unknown Source)
	at sun.reflect.DelegatingMethodAccessorImpl.invoke(DelegatingMethodAccessorImpl.java:43)
	at java.lang.reflect.Method.invoke(Method.java:498)
	at org.eclipse.emf.emfstore.internal.server.core.AbstractSubEmfstoreInterface.execute(AbstractSubEmfstoreInterface.java:142)
	at org.eclipse.emf.emfstore.internal.server.core.EMFStoreImpl.invoke(EMFStoreImpl.java:181)
	at com.sun.proxy.$Proxy22.resolveVersionSpec(Unknown Source)
	at org.eclipse.emf.emfstore.client.test.common.mocks.ConnectionMock.resolveVersionSpec(ConnectionMock.java:138)
	at org.eclipse.emf.emfstore.internal.client.model.impl.ProjectSpaceBase$6.run(ProjectSpaceBase.java:1233)
	at org.eclipse.emf.emfstore.internal.client.model.impl.ProjectSpaceBase$6.run(ProjectSpaceBase.java:1)
	at org.eclipse.emf.emfstore.internal.client.model.connectionmanager.ServerCall.run(ServerCall.java:250)
	at org.eclipse.emf.emfstore.internal.client.model.connectionmanager.SessionManager.executeCall(SessionManager.java:151)
	at org.eclipse.emf.emfstore.internal.client.model.connectionmanager.SessionManager.execute(SessionManager.java:70)
	at org.eclipse.emf.emfstore.internal.client.model.connectionmanager.ServerCall.execute(ServerCall.java:270)
	at org.eclipse.emf.emfstore.internal.client.model.impl.ProjectSpaceBase.resolveVersionSpec(ProjectSpaceBase.java:1238)
	at org.eclipse.emf.emfstore.server.test.VersionSpecTests.resolvePrimaryInvalid(VersionSpecTests.java:204)
	at sun.reflect.NativeMethodAccessorImpl.invoke0(Native Method)
	at sun.reflect.NativeMethodAccessorImpl.invoke(NativeMethodAccessorImpl.java:62)
	at sun.reflect.DelegatingMethodAccessorImpl.invoke(DelegatingMethodAccessorImpl.java:43)
	at java.lang.reflect.Method.invoke(Method.java:498)
	at org.junit.runners.model.FrameworkMethod$1.runReflectiveCall(FrameworkMethod.java:47)
	at org.junit.internal.runners.model.ReflectiveCallable.run(ReflectiveCallable.java:12)
	at org.junit.runners.model.FrameworkMethod.invokeExplosively(FrameworkMethod.java:44)
	at org.junit.internal.runners.statements.InvokeMethod.evaluate(InvokeMethod.java:17)
	at org.junit.internal.runners.statements.ExpectException.evaluate(ExpectException.java:19)
	at org.junit.internal.runners.statements.RunBefores.evaluate(RunBefores.java:26)
	at org.junit.internal.runners.statements.RunAfters.evaluate(RunAfters.java:27)
	at org.junit.runners.ParentRunner.runLeaf(ParentRunner.java:271)
	at org.junit.runners.BlockJUnit4ClassRunner.runChild(BlockJUnit4ClassRunner.java:70)
	at org.junit.runners.BlockJUnit4ClassRunner.runChild(BlockJUnit4ClassRunner.java:50)
	at org.junit.runners.ParentRunner$3.run(ParentRunner.java:238)
	at org.junit.runners.ParentRunner$1.schedule(ParentRunner.java:63)
	at org.junit.runners.ParentRunner.runChildren(ParentRunner.java:236)
	at org.junit.runners.ParentRunner.access$000(ParentRunner.java:53)
	at org.junit.runners.ParentRunner$2.evaluate(ParentRunner.java:229)
	at org.junit.internal.runners.statements.RunBefores.evaluate(RunBefores.java:26)
	at org.junit.internal.runners.statements.RunAfters.evaluate(RunAfters.java:27)
	at org.junit.runners.ParentRunner.run(ParentRunner.java:309)
	at org.junit.runners.Suite.runChild(Suite.java:127)
	at org.junit.runners.Suite.runChild(Suite.java:26)
	at org.junit.runners.ParentRunner$3.run(ParentRunner.java:238)
	at org.junit.runners.ParentRunner$1.schedule(ParentRunner.java:63)
	at org.junit.runners.ParentRunner.runChildren(ParentRunner.java:236)
	at org.junit.runners.ParentRunner.access$000(ParentRunner.java:53)
	at org.junit.runners.ParentRunner$2.evaluate(ParentRunner.java:229)
	at org.junit.runners.ParentRunner.run(ParentRunner.java:309)
	at org.apache.maven.surefire.junit4.JUnit4TestSet.execute(JUnit4TestSet.java:53)
	at org.apache.maven.surefire.junit4.JUnit4Provider.executeTestSet(JUnit4Provider.java:123)
	at org.apache.maven.surefire.junit4.JUnit4Provider.invoke(JUnit4Provider.java:104)
	at sun.reflect.NativeMethodAccessorImpl.invoke0(Native Method)
	at sun.reflect.NativeMethodAccessorImpl.invoke(NativeMethodAccessorImpl.java:62)
	at sun.reflect.DelegatingMethodAccessorImpl.invoke(DelegatingMethodAccessorImpl.java:43)
	at java.lang.reflect.Method.invoke(Method.java:498)
	at org.apache.maven.surefire.util.ReflectionUtils.invokeMethodWithArray(ReflectionUtils.java:164)
	at org.apache.maven.surefire.booter.ProviderFactory$ProviderProxy.invoke(ProviderFactory.java:110)
	at org.apache.maven.surefire.booter.SurefireStarter.invokeProvider(SurefireStarter.java:175)
	at org.apache.maven.surefire.booter.SurefireStarter.runSuitesInProcess(SurefireStarter.java:123)
	at org.eclipse.tycho.surefire.osgibooter.OsgiSurefireBooter.run(OsgiSurefireBooter.java:86)
	at org.eclipse.tycho.surefire.osgibooter.AbstractUITestApplication.runTests(AbstractUITestApplication.java:44)
	at org.eclipse.ui.internal.testing.WorkbenchTestable$1.run(WorkbenchTestable.java:71)
	at java.lang.Thread.run(Thread.java:748)

Total time for commit: 1
Total time for commit: 1
Total time for commit: 1
Total time for commit: 1
Exception on execution: No branch info available.
Exception on execution: No branch info available.
Exception on execution: No branch info available.
Exception on execution: No branch info available.
Exception on execution: No branch info available.
Exception on execution: No branch info available.
Exception on execution: No branch info available.
Exception on execution: No branch info available.
Total time for commit: 0
Total time for commit: 0
Total time for commit: 0
Total time for commit: 0
Exception on execution: No branch info available.
Exception on execution: No branch info available.
Exception on execution: No branch info available.
Exception on execution: No branch info available.
Exception on execution: No branch info available.
Exception on execution: No branch info available.
Exception on execution: No branch info available.
Exception on execution: No branch info available.
Total time for commit: 1
Total time for commit: 1
Total time for commit: 1
Total time for commit: 1
Total time for commit: 1
Total time for commit: 1
Total time for commit: 1
Total time for commit: 1
Total time for commit: 0
Total time for commit: 0
Total time for commit: 0
Total time for commit: 0
Exception on execution: No branch info available.
Exception on execution: No branch info available.
Exception on execution: No branch info available.
Exception on execution: No branch info available.
Exception on execution: No branch info available.
Exception on execution: No branch info available.
Exception on execution: No branch info available.
Exception on execution: No branch info available.
Total time for commit: 0
Total time for commit: 0
Total time for commit: 0
Total time for commit: 0
Total time for commit: 0
Total time for commit: 0
Total time for commit: 0
Total time for commit: 0
Total time for commit: 0
Total time for commit: 0
Total time for commit: 0
Total time for commit: 0
Exception on execution: No branch info available.
Exception on execution: No branch info available.
Exception on execution: No branch info available.
Exception on execution: No branch info available.
Exception on execution: No branch info available.
Exception on execution: No branch info available.
Exception on execution: No branch info available.
Exception on execution: No branch info available.
Total time for commit: 1
Total time for commit: 1
Total time for commit: 1
Total time for commit: 1
Exception on execution: No branch info available.
Exception on execution: No branch info available.
Exception on execution: No branch info available.
Exception on execution: No branch info available.
Exception on execution: No branch info available.
Exception on execution: No branch info available.
Exception on execution: No branch info available.
Exception on execution: No branch info available.
Total time for commit: 1
Total time for commit: 1
Total time for commit: 1
Total time for commit: 1
Total time for commit: 1
Total time for commit: 1
Total time for commit: 1
Total time for commit: 1
Total time for commit: 0
Total time for commit: 0
Total time for commit: 0
Total time for commit: 0
Exception on execution: No branch info available.
Exception on execution: No branch info available.
Exception on execution: No branch info available.
Exception on execution: No branch info available.
Exception on execution: No branch info available.
Exception on execution: No branch info available.
Exception on execution: No branch info available.
Exception on execution: No branch info available.
Total time for commit: 1
Total time for commit: 1
Total time for commit: 1
Total time for commit: 1
Total time for commit: 1
Total time for commit: 1
Total time for commit: 1
Total time for commit: 1
Total time for commit: 1
Total time for commit: 1
Total time for commit: 1
Total time for commit: 1
Exception on execution: No branch info available.
Exception on execution: No branch info available.
Exception on execution: No branch info available.
Exception on execution: No branch info available.
Exception on execution: No branch info available.
Exception on execution: No branch info available.
Exception on execution: No branch info available.
Exception on execution: No branch info available.
Total time for commit: 1
Total time for commit: 1
Total time for commit: 1
Total time for commit: 1
Exception on execution: No branch info available.
Exception on execution: No branch info available.
Exception on execution: No branch info available.
Exception on execution: No branch info available.
Exception on execution: No branch info available.
Exception on execution: No branch info available.
Exception on execution: No branch info available.
Exception on execution: No branch info available.
Total time for commit: 0
Total time for commit: 0
Total time for commit: 0
Total time for commit: 0
Total time for commit: 1
Total time for commit: 1
Total time for commit: 1
Total time for commit: 1
Total time for commit: 1
Total time for commit: 1
Total time for commit: 1
Total time for commit: 1
Exception on execution: No branch info available.
Exception on execution: No branch info available.
Exception on execution: No branch info available.
Exception on execution: No branch info available.
Exception on execution: No branch info available.
Exception on execution: No branch info available.
Exception on execution: No branch info available.
Exception on execution: No branch info available.
Total time for commit: 1
Total time for commit: 1
Total time for commit: 1
Total time for commit: 1
Total time for commit: 0
Total time for commit: 0
Total time for commit: 0
Total time for commit: 0
Total time for commit: 1
Total time for commit: 1
Total time for commit: 1
Total time for commit: 1
Exception on execution: No branch info available.
Exception on execution: No branch info available.
Exception on execution: No branch info available.
Exception on execution: No branch info available.
Exception on execution: No branch info available.
Exception on execution: No branch info available.
Exception on execution: No branch info available.
Exception on execution: No branch info available.
Total time for commit: 1
Total time for commit: 1
Total time for commit: 1
Total time for commit: 1
Exception on execution: No branch info available.
Exception on execution: No branch info available.
Exception on execution: No branch info available.
Exception on execution: No branch info available.
Exception on execution: No branch info available.
Exception on execution: No branch info available.
Exception on execution: No branch info available.
Exception on execution: No branch info available.
Total time for commit: 1
Total time for commit: 1
Total time for commit: 1
Total time for commit: 1
Total time for commit: 1
Total time for commit: 1
Total time for commit: 1
Total time for commit: 1
Total time for commit: 1
Total time for commit: 1
Total time for commit: 1
Total time for commit: 1
Exception on execution: No branch info available.
Exception on execution: No branch info available.
Exception on execution: No branch info available.
Exception on execution: No branch info available.
Exception on execution: No branch info available.
Exception on execution: No branch info available.
Exception on execution: No branch info available.
Exception on execution: No branch info available.
Total time for commit: 0
Total time for commit: 0
Total time for commit: 0
Total time for commit: 0
Total time for commit: 1
Total time for commit: 1
Total time for commit: 1
Total time for commit: 1
No server versions supplied
org.eclipse.emf.emfstore.internal.server.exceptions.ClientVersionOutOfDateException: No server versions supplied
	at org.eclipse.emf.emfstore.internal.server.accesscontrol.authentication.verifiers.VersionVerifier.verify(VersionVerifier.java:66)
	at org.eclipse.emf.emfstore.server.test.VersionVerifierTest.testSupplyNoVersions(VersionVerifierTest.java:51)
	at sun.reflect.NativeMethodAccessorImpl.invoke0(Native Method)
	at sun.reflect.NativeMethodAccessorImpl.invoke(NativeMethodAccessorImpl.java:62)
	at sun.reflect.DelegatingMethodAccessorImpl.invoke(DelegatingMethodAccessorImpl.java:43)
	at java.lang.reflect.Method.invoke(Method.java:498)
	at org.junit.runners.model.FrameworkMethod$1.runReflectiveCall(FrameworkMethod.java:47)
	at org.junit.internal.runners.model.ReflectiveCallable.run(ReflectiveCallable.java:12)
	at org.junit.runners.model.FrameworkMethod.invokeExplosively(FrameworkMethod.java:44)
	at org.junit.internal.runners.statements.InvokeMethod.evaluate(InvokeMethod.java:17)
	at org.junit.runners.ParentRunner.runLeaf(ParentRunner.java:271)
	at org.junit.runners.BlockJUnit4ClassRunner.runChild(BlockJUnit4ClassRunner.java:70)
	at org.junit.runners.BlockJUnit4ClassRunner.runChild(BlockJUnit4ClassRunner.java:50)
	at org.junit.runners.ParentRunner$3.run(ParentRunner.java:238)
	at org.junit.runners.ParentRunner$1.schedule(ParentRunner.java:63)
	at org.junit.runners.ParentRunner.runChildren(ParentRunner.java:236)
	at org.junit.runners.ParentRunner.access$000(ParentRunner.java:53)
	at org.junit.runners.ParentRunner$2.evaluate(ParentRunner.java:229)
	at org.junit.runners.ParentRunner.run(ParentRunner.java:309)
	at org.junit.runners.Suite.runChild(Suite.java:127)
	at org.junit.runners.Suite.runChild(Suite.java:26)
	at org.junit.runners.ParentRunner$3.run(ParentRunner.java:238)
	at org.junit.runners.ParentRunner$1.schedule(ParentRunner.java:63)
	at org.junit.runners.ParentRunner.runChildren(ParentRunner.java:236)
	at org.junit.runners.ParentRunner.access$000(ParentRunner.java:53)
	at org.junit.runners.ParentRunner$2.evaluate(ParentRunner.java:229)
	at org.junit.runners.ParentRunner.run(ParentRunner.java:309)
	at org.apache.maven.surefire.junit4.JUnit4TestSet.execute(JUnit4TestSet.java:53)
	at org.apache.maven.surefire.junit4.JUnit4Provider.executeTestSet(JUnit4Provider.java:123)
	at org.apache.maven.surefire.junit4.JUnit4Provider.invoke(JUnit4Provider.java:104)
	at sun.reflect.NativeMethodAccessorImpl.invoke0(Native Method)
	at sun.reflect.NativeMethodAccessorImpl.invoke(NativeMethodAccessorImpl.java:62)
	at sun.reflect.DelegatingMethodAccessorImpl.invoke(DelegatingMethodAccessorImpl.java:43)
	at java.lang.reflect.Method.invoke(Method.java:498)
	at org.apache.maven.surefire.util.ReflectionUtils.invokeMethodWithArray(ReflectionUtils.java:164)
	at org.apache.maven.surefire.booter.ProviderFactory$ProviderProxy.invoke(ProviderFactory.java:110)
	at org.apache.maven.surefire.booter.SurefireStarter.invokeProvider(SurefireStarter.java:175)
	at org.apache.maven.surefire.booter.SurefireStarter.runSuitesInProcess(SurefireStarter.java:123)
	at org.eclipse.tycho.surefire.osgibooter.OsgiSurefireBooter.run(OsgiSurefireBooter.java:86)
	at org.eclipse.tycho.surefire.osgibooter.AbstractUITestApplication.runTests(AbstractUITestApplication.java:44)
	at org.eclipse.ui.internal.testing.WorkbenchTestable$1.run(WorkbenchTestable.java:71)
	at java.lang.Thread.run(Thread.java:748)
No server versions supplied
org.eclipse.emf.emfstore.internal.server.exceptions.ClientVersionOutOfDateException: No server versions supplied
	at org.eclipse.emf.emfstore.internal.server.accesscontrol.authentication.verifiers.VersionVerifier.verify(VersionVerifier.java:66)
	at org.eclipse.emf.emfstore.server.test.VersionVerifierTest.testSupplyNoVersions(VersionVerifierTest.java:51)
	at sun.reflect.NativeMethodAccessorImpl.invoke0(Native Method)
	at sun.reflect.NativeMethodAccessorImpl.invoke(NativeMethodAccessorImpl.java:62)
	at sun.reflect.DelegatingMethodAccessorImpl.invoke(DelegatingMethodAccessorImpl.java:43)
	at java.lang.reflect.Method.invoke(Method.java:498)
	at org.junit.runners.model.FrameworkMethod$1.runReflectiveCall(FrameworkMethod.java:47)
	at org.junit.internal.runners.model.ReflectiveCallable.run(ReflectiveCallable.java:12)
	at org.junit.runners.model.FrameworkMethod.invokeExplosively(FrameworkMethod.java:44)
	at org.junit.internal.runners.statements.InvokeMethod.evaluate(InvokeMethod.java:17)
	at org.junit.runners.ParentRunner.runLeaf(ParentRunner.java:271)
	at org.junit.runners.BlockJUnit4ClassRunner.runChild(BlockJUnit4ClassRunner.java:70)
	at org.junit.runners.BlockJUnit4ClassRunner.runChild(BlockJUnit4ClassRunner.java:50)
	at org.junit.runners.ParentRunner$3.run(ParentRunner.java:238)
	at org.junit.runners.ParentRunner$1.schedule(ParentRunner.java:63)
	at org.junit.runners.ParentRunner.runChildren(ParentRunner.java:236)
	at org.junit.runners.ParentRunner.access$000(ParentRunner.java:53)
	at org.junit.runners.ParentRunner$2.evaluate(ParentRunner.java:229)
	at org.junit.runners.ParentRunner.run(ParentRunner.java:309)
	at org.junit.runners.Suite.runChild(Suite.java:127)
	at org.junit.runners.Suite.runChild(Suite.java:26)
	at org.junit.runners.ParentRunner$3.run(ParentRunner.java:238)
	at org.junit.runners.ParentRunner$1.schedule(ParentRunner.java:63)
	at org.junit.runners.ParentRunner.runChildren(ParentRunner.java:236)
	at org.junit.runners.ParentRunner.access$000(ParentRunner.java:53)
	at org.junit.runners.ParentRunner$2.evaluate(ParentRunner.java:229)
	at org.junit.runners.ParentRunner.run(ParentRunner.java:309)
	at org.apache.maven.surefire.junit4.JUnit4TestSet.execute(JUnit4TestSet.java:53)
	at org.apache.maven.surefire.junit4.JUnit4Provider.executeTestSet(JUnit4Provider.java:123)
	at org.apache.maven.surefire.junit4.JUnit4Provider.invoke(JUnit4Provider.java:104)
	at sun.reflect.NativeMethodAccessorImpl.invoke0(Native Method)
	at sun.reflect.NativeMethodAccessorImpl.invoke(NativeMethodAccessorImpl.java:62)
	at sun.reflect.DelegatingMethodAccessorImpl.invoke(DelegatingMethodAccessorImpl.java:43)
	at java.lang.reflect.Method.invoke(Method.java:498)
	at org.apache.maven.surefire.util.ReflectionUtils.invokeMethodWithArray(ReflectionUtils.java:164)
	at org.apache.maven.surefire.booter.ProviderFactory$ProviderProxy.invoke(ProviderFactory.java:110)
	at org.apache.maven.surefire.booter.SurefireStarter.invokeProvider(SurefireStarter.java:175)
	at org.apache.maven.surefire.booter.SurefireStarter.runSuitesInProcess(SurefireStarter.java:123)
	at org.eclipse.tycho.surefire.osgibooter.OsgiSurefireBooter.run(OsgiSurefireBooter.java:86)
	at org.eclipse.tycho.surefire.osgibooter.AbstractUITestApplication.runTests(AbstractUITestApplication.java:44)
	at org.eclipse.ui.internal.testing.WorkbenchTestable$1.run(WorkbenchTestable.java:71)
	at java.lang.Thread.run(Thread.java:748)
No server versions supplied
org.eclipse.emf.emfstore.internal.server.exceptions.ClientVersionOutOfDateException: No server versions supplied
	at org.eclipse.emf.emfstore.internal.server.accesscontrol.authentication.verifiers.VersionVerifier.verify(VersionVerifier.java:66)
	at org.eclipse.emf.emfstore.server.test.VersionVerifierTest.testSupplyNoVersions(VersionVerifierTest.java:51)
	at sun.reflect.NativeMethodAccessorImpl.invoke0(Native Method)
	at sun.reflect.NativeMethodAccessorImpl.invoke(NativeMethodAccessorImpl.java:62)
	at sun.reflect.DelegatingMethodAccessorImpl.invoke(DelegatingMethodAccessorImpl.java:43)
	at java.lang.reflect.Method.invoke(Method.java:498)
	at org.junit.runners.model.FrameworkMethod$1.runReflectiveCall(FrameworkMethod.java:47)
	at org.junit.internal.runners.model.ReflectiveCallable.run(ReflectiveCallable.java:12)
	at org.junit.runners.model.FrameworkMethod.invokeExplosively(FrameworkMethod.java:44)
	at org.junit.internal.runners.statements.InvokeMethod.evaluate(InvokeMethod.java:17)
	at org.junit.runners.ParentRunner.runLeaf(ParentRunner.java:271)
	at org.junit.runners.BlockJUnit4ClassRunner.runChild(BlockJUnit4ClassRunner.java:70)
	at org.junit.runners.BlockJUnit4ClassRunner.runChild(BlockJUnit4ClassRunner.java:50)
	at org.junit.runners.ParentRunner$3.run(ParentRunner.java:238)
	at org.junit.runners.ParentRunner$1.schedule(ParentRunner.java:63)
	at org.junit.runners.ParentRunner.runChildren(ParentRunner.java:236)
	at org.junit.runners.ParentRunner.access$000(ParentRunner.java:53)
	at org.junit.runners.ParentRunner$2.evaluate(ParentRunner.java:229)
	at org.junit.runners.ParentRunner.run(ParentRunner.java:309)
	at org.junit.runners.Suite.runChild(Suite.java:127)
	at org.junit.runners.Suite.runChild(Suite.java:26)
	at org.junit.runners.ParentRunner$3.run(ParentRunner.java:238)
	at org.junit.runners.ParentRunner$1.schedule(ParentRunner.java:63)
	at org.junit.runners.ParentRunner.runChildren(ParentRunner.java:236)
	at org.junit.runners.ParentRunner.access$000(ParentRunner.java:53)
	at org.junit.runners.ParentRunner$2.evaluate(ParentRunner.java:229)
	at org.junit.runners.ParentRunner.run(ParentRunner.java:309)
	at org.apache.maven.surefire.junit4.JUnit4TestSet.execute(JUnit4TestSet.java:53)
	at org.apache.maven.surefire.junit4.JUnit4Provider.executeTestSet(JUnit4Provider.java:123)
	at org.apache.maven.surefire.junit4.JUnit4Provider.invoke(JUnit4Provider.java:104)
	at sun.reflect.NativeMethodAccessorImpl.invoke0(Native Method)
	at sun.reflect.NativeMethodAccessorImpl.invoke(NativeMethodAccessorImpl.java:62)
	at sun.reflect.DelegatingMethodAccessorImpl.invoke(DelegatingMethodAccessorImpl.java:43)
	at java.lang.reflect.Method.invoke(Method.java:498)
	at org.apache.maven.surefire.util.ReflectionUtils.invokeMethodWithArray(ReflectionUtils.java:164)
	at org.apache.maven.surefire.booter.ProviderFactory$ProviderProxy.invoke(ProviderFactory.java:110)
	at org.apache.maven.surefire.booter.SurefireStarter.invokeProvider(SurefireStarter.java:175)
	at org.apache.maven.surefire.booter.SurefireStarter.runSuitesInProcess(SurefireStarter.java:123)
	at org.eclipse.tycho.surefire.osgibooter.OsgiSurefireBooter.run(OsgiSurefireBooter.java:86)
	at org.eclipse.tycho.surefire.osgibooter.AbstractUITestApplication.runTests(AbstractUITestApplication.java:44)
	at org.eclipse.ui.internal.testing.WorkbenchTestable$1.run(WorkbenchTestable.java:71)
	at java.lang.Thread.run(Thread.java:748)
No server versions supplied
org.eclipse.emf.emfstore.internal.server.exceptions.ClientVersionOutOfDateException: No server versions supplied
	at org.eclipse.emf.emfstore.internal.server.accesscontrol.authentication.verifiers.VersionVerifier.verify(VersionVerifier.java:66)
	at org.eclipse.emf.emfstore.server.test.VersionVerifierTest.testSupplyNoVersions(VersionVerifierTest.java:51)
	at sun.reflect.NativeMethodAccessorImpl.invoke0(Native Method)
	at sun.reflect.NativeMethodAccessorImpl.invoke(NativeMethodAccessorImpl.java:62)
	at sun.reflect.DelegatingMethodAccessorImpl.invoke(DelegatingMethodAccessorImpl.java:43)
	at java.lang.reflect.Method.invoke(Method.java:498)
	at org.junit.runners.model.FrameworkMethod$1.runReflectiveCall(FrameworkMethod.java:47)
	at org.junit.internal.runners.model.ReflectiveCallable.run(ReflectiveCallable.java:12)
	at org.junit.runners.model.FrameworkMethod.invokeExplosively(FrameworkMethod.java:44)
	at org.junit.internal.runners.statements.InvokeMethod.evaluate(InvokeMethod.java:17)
	at org.junit.runners.ParentRunner.runLeaf(ParentRunner.java:271)
	at org.junit.runners.BlockJUnit4ClassRunner.runChild(BlockJUnit4ClassRunner.java:70)
	at org.junit.runners.BlockJUnit4ClassRunner.runChild(BlockJUnit4ClassRunner.java:50)
	at org.junit.runners.ParentRunner$3.run(ParentRunner.java:238)
	at org.junit.runners.ParentRunner$1.schedule(ParentRunner.java:63)
	at org.junit.runners.ParentRunner.runChildren(ParentRunner.java:236)
	at org.junit.runners.ParentRunner.access$000(ParentRunner.java:53)
	at org.junit.runners.ParentRunner$2.evaluate(ParentRunner.java:229)
	at org.junit.runners.ParentRunner.run(ParentRunner.java:309)
	at org.junit.runners.Suite.runChild(Suite.java:127)
	at org.junit.runners.Suite.runChild(Suite.java:26)
	at org.junit.runners.ParentRunner$3.run(ParentRunner.java:238)
	at org.junit.runners.ParentRunner$1.schedule(ParentRunner.java:63)
	at org.junit.runners.ParentRunner.runChildren(ParentRunner.java:236)
	at org.junit.runners.ParentRunner.access$000(ParentRunner.java:53)
	at org.junit.runners.ParentRunner$2.evaluate(ParentRunner.java:229)
	at org.junit.runners.ParentRunner.run(ParentRunner.java:309)
	at org.apache.maven.surefire.junit4.JUnit4TestSet.execute(JUnit4TestSet.java:53)
	at org.apache.maven.surefire.junit4.JUnit4Provider.executeTestSet(JUnit4Provider.java:123)
	at org.apache.maven.surefire.junit4.JUnit4Provider.invoke(JUnit4Provider.java:104)
	at sun.reflect.NativeMethodAccessorImpl.invoke0(Native Method)
	at sun.reflect.NativeMethodAccessorImpl.invoke(NativeMethodAccessorImpl.java:62)
	at sun.reflect.DelegatingMethodAccessorImpl.invoke(DelegatingMethodAccessorImpl.java:43)
	at java.lang.reflect.Method.invoke(Method.java:498)
	at org.apache.maven.surefire.util.ReflectionUtils.invokeMethodWithArray(ReflectionUtils.java:164)
	at org.apache.maven.surefire.booter.ProviderFactory$ProviderProxy.invoke(ProviderFactory.java:110)
	at org.apache.maven.surefire.booter.SurefireStarter.invokeProvider(SurefireStarter.java:175)
	at org.apache.maven.surefire.booter.SurefireStarter.runSuitesInProcess(SurefireStarter.java:123)
	at org.eclipse.tycho.surefire.osgibooter.OsgiSurefireBooter.run(OsgiSurefireBooter.java:86)
	at org.eclipse.tycho.surefire.osgibooter.AbstractUITestApplication.runTests(AbstractUITestApplication.java:44)
	at org.eclipse.ui.internal.testing.WorkbenchTestable$1.run(WorkbenchTestable.java:71)
	at java.lang.Thread.run(Thread.java:748)
Tests run: 283, Failures: 0, Errors: 0, Skipped: 9, Time elapsed: 31.962 sec

Results :

Tests run: 283, Failures: 0, Errors: 0, Skipped: 9

[INFO] All tests passed!
[INFO] 
[INFO] --- tycho-surefire-plugin:0.20.0:test (InMemoryChangePackageTest) @ org.eclipse.emf.emfstore.server.test ---
[INFO] Not executing tests, testSuite=org.eclipse.emf.emfstore.client.api.test and project is not the testSuite
[INFO] 
[INFO] --- tycho-surefire-plugin:0.20.0:test (ServerFileBasedChangePackage) @ org.eclipse.emf.emfstore.server.test ---
[INFO] Not executing tests, testSuite=org.eclipse.emf.emfstore.client.api.test and project is not the testSuite
[INFO] 
[INFO] ---< org.eclipse.emf.emfstore:org.eclipse.emf.emfstore.test.feature >---
[INFO] Building org.eclipse.emf.emfstore.test.feature 1.10.0-SNAPSHOT   [65/69]
[INFO] --------------------------[ eclipse-feature ]---------------------------
[INFO] 
[INFO] --- maven-clean-plugin:2.5:clean (default-clean) @ org.eclipse.emf.emfstore.test.feature ---
[INFO] Deleting /home/jenkins/agent/workspace/gerrit/features/org.eclipse.emf.emfstore.test.feature/target
[INFO] 
[INFO] --- tycho-packaging-plugin:0.20.0:build-qualifier-aggregator (default-build-qualifier-aggregator) @ org.eclipse.emf.emfstore.test.feature ---
[INFO] The project's OSGi version is 1.10.0.v20200810-0829
[INFO] 
[INFO] --- tycho-packaging-plugin:0.20.0:validate-id (default-validate-id) @ org.eclipse.emf.emfstore.test.feature ---
[INFO] 
[INFO] --- tycho-packaging-plugin:0.20.0:validate-version (default-validate-version) @ org.eclipse.emf.emfstore.test.feature ---
[INFO] 
[INFO] --- jacoco-maven-plugin:0.7.4.201502262128:prepare-agent (jacoco-initialize) @ org.eclipse.emf.emfstore.test.feature ---
[INFO] argLine set to -javaagent:/home/jenkins/agent/workspace/gerrit/.repository/org/jacoco/org.jacoco.agent/0.7.4.201502262128/org.jacoco.agent-0.7.4.201502262128-runtime.jar=destfile=/home/jenkins/agent/workspace/gerrit/tests/coverage/jacoco.exec,append=true
[INFO] 
[INFO] --- maven-checkstyle-plugin:2.10:check (checkstyle) @ org.eclipse.emf.emfstore.test.feature ---
[INFO] 
[INFO] 
[INFO] --- tycho-source-plugin:0.20.0:plugin-source (plugin-source) @ org.eclipse.emf.emfstore.test.feature ---
[INFO] 
[INFO] --- tycho-packaging-plugin:0.20.0:package-feature (default-package-feature) @ org.eclipse.emf.emfstore.test.feature ---
[INFO] Building jar: /home/jenkins/agent/workspace/gerrit/features/org.eclipse.emf.emfstore.test.feature/target/org.eclipse.emf.emfstore.test.feature-1.10.0-SNAPSHOT.jar
[INFO] 
[INFO] --- tycho-p2-plugin:0.20.0:p2-metadata-default (default-p2-metadata-default) @ org.eclipse.emf.emfstore.test.feature ---
[INFO] 
[INFO] --- tycho-p2-plugin:0.20.0:feature-p2-metadata (default-feature-p2-metadata) @ org.eclipse.emf.emfstore.test.feature ---
[INFO] 
[INFO] --- tycho-source-feature-plugin:0.20.0:source-feature (source-feature) @ org.eclipse.emf.emfstore.test.feature ---
[INFO] Building jar: /home/jenkins/agent/workspace/gerrit/features/org.eclipse.emf.emfstore.test.feature/target/org.eclipse.emf.emfstore.test.feature-1.10.0-SNAPSHOT-sources-feature.jar
[INFO] 
[INFO] --- tycho-p2-plugin:0.20.0:p2-metadata (attach-p2-metadata) @ org.eclipse.emf.emfstore.test.feature ---
[INFO] 
[INFO] --- tycho-p2-plugin:0.20.0:p2-metadata (attached-p2-metadata) @ org.eclipse.emf.emfstore.test.feature ---
[INFO] 
[INFO] --< org.eclipse.emf.emfstore:org.eclipse.emf.emfstore.client.example.test >--
[INFO] Building org.eclipse.emf.emfstore.client.example.test 1.10.0-SNAPSHOT [66/69]
[INFO] ------------------------[ eclipse-test-plugin ]-------------------------
[INFO] 
[INFO] --- maven-clean-plugin:2.5:clean (default-clean) @ org.eclipse.emf.emfstore.client.example.test ---
[INFO] 
[INFO] --- tycho-packaging-plugin:0.20.0:build-qualifier (default-build-qualifier) @ org.eclipse.emf.emfstore.client.example.test ---
[INFO] The project's OSGi version is 1.10.0.v20200810-0829
[INFO] 
[INFO] --- tycho-packaging-plugin:0.20.0:validate-id (default-validate-id) @ org.eclipse.emf.emfstore.client.example.test ---
[INFO] 
[INFO] --- tycho-packaging-plugin:0.20.0:validate-version (default-validate-version) @ org.eclipse.emf.emfstore.client.example.test ---
[INFO] 
[INFO] --- jacoco-maven-plugin:0.7.4.201502262128:prepare-agent (jacoco-initialize) @ org.eclipse.emf.emfstore.client.example.test ---
[INFO] tycho.testArgLine set to -javaagent:/home/jenkins/agent/workspace/gerrit/.repository/org/jacoco/org.jacoco.agent/0.7.4.201502262128/org.jacoco.agent-0.7.4.201502262128-runtime.jar=destfile=/home/jenkins/agent/workspace/gerrit/tests/coverage/jacoco.exec,append=true
[INFO] 
[INFO] --- maven-resources-plugin:2.4.3:resources (default-resources) @ org.eclipse.emf.emfstore.client.example.test ---
[INFO] Using 'UTF-8' encoding to copy filtered resources.
[INFO] skip non existing resourceDirectory /home/jenkins/agent/workspace/gerrit/tests/org.eclipse.emf.emfstore.client.example.test/src/main/resources
[INFO] 
[INFO] --- tycho-compiler-plugin:0.20.0:compile (default-compile) @ org.eclipse.emf.emfstore.client.example.test ---
[INFO] Compiling 1 source file to /home/jenkins/agent/workspace/gerrit/tests/org.eclipse.emf.emfstore.client.example.test/bin
[INFO] 
[INFO] --- maven-checkstyle-plugin:2.10:check (checkstyle) @ org.eclipse.emf.emfstore.client.example.test ---
[INFO] 
[INFO] 
[INFO] --- maven-resources-plugin:2.4.3:testResources (default-testResources) @ org.eclipse.emf.emfstore.client.example.test ---
[INFO] Using 'UTF-8' encoding to copy filtered resources.
[INFO] skip non existing resourceDirectory /home/jenkins/agent/workspace/gerrit/tests/org.eclipse.emf.emfstore.client.example.test/src/test/resources
[INFO] 
[INFO] --- tycho-source-plugin:0.20.0:plugin-source (plugin-source) @ org.eclipse.emf.emfstore.client.example.test ---
[WARNING] bundle localization file /home/jenkins/agent/workspace/gerrit/tests/org.eclipse.emf.emfstore.client.example.test/plugin.properties not found
[WARNING] Bundle-Vendor header not found in /home/jenkins/agent/workspace/gerrit/tests/org.eclipse.emf.emfstore.client.example.test/META-INF/MANIFEST.MF, fallback to 'unknown' for source bundle
[INFO] Building jar: /home/jenkins/agent/workspace/gerrit/tests/org.eclipse.emf.emfstore.client.example.test/target/org.eclipse.emf.emfstore.client.example.test-1.10.0-SNAPSHOT-sources.jar
[INFO] 
[INFO] --- tycho-packaging-plugin:0.20.0:package-plugin (default-package-plugin) @ org.eclipse.emf.emfstore.client.example.test ---
[INFO] Building jar: /home/jenkins/agent/workspace/gerrit/tests/org.eclipse.emf.emfstore.client.example.test/target/org.eclipse.emf.emfstore.client.example.test-1.10.0-SNAPSHOT.jar
[INFO] 
[INFO] --- tycho-p2-plugin:0.20.0:p2-metadata-default (default-p2-metadata-default) @ org.eclipse.emf.emfstore.client.example.test ---
[INFO] 
[INFO] --- tycho-surefire-plugin:0.20.0:test (default-test) @ org.eclipse.emf.emfstore.client.example.test ---
[INFO] Expected eclipse log file: /home/jenkins/agent/workspace/gerrit/tests/org.eclipse.emf.emfstore.client.example.test/target/work/data/.metadata/.log
[INFO] Command line:
	[/opt/tools/java/oracle/jdk-8/1.8.0_202/jre/bin/java, -Dosgi.noShutdown=false, -Dosgi.os=linux, -Dosgi.ws=gtk, -Dosgi.arch=x86_64, -javaagent:/home/jenkins/agent/workspace/gerrit/.repository/org/jacoco/org.jacoco.agent/0.7.4.201502262128/org.jacoco.agent-0.7.4.201502262128-runtime.jar=destfile=/home/jenkins/agent/workspace/gerrit/tests/coverage/jacoco.exec,append=true, -Dosgi.requiredJavaVersion=1.5, -Xms40m, -Xmx512m, -Dosgi.clean=true, -jar, /home/jenkins/agent/workspace/gerrit/.repository/p2/osgi/bundle/org.eclipse.equinox.launcher/1.3.0.v20120522-1813/org.eclipse.equinox.launcher-1.3.0.v20120522-1813.jar, -data, /home/jenkins/agent/workspace/gerrit/tests/org.eclipse.emf.emfstore.client.example.test/target/work/data, -install, /home/jenkins/agent/workspace/gerrit/tests/org.eclipse.emf.emfstore.client.example.test/target/work, -configuration, /home/jenkins/agent/workspace/gerrit/tests/org.eclipse.emf.emfstore.client.example.test/target/work/configuration, -application, org.eclipse.tycho.surefire.osgibooter.uitest, -testproperties, /home/jenkins/agent/workspace/gerrit/tests/org.eclipse.emf.emfstore.client.example.test/target/surefire.properties, -nouithread]

-------------------------------------------------------
 T E S T S
-------------------------------------------------------
Running org.eclipse.emf.emfstore.client.example.test.APIUsedInExampleTest
Client starting...
Sharing Project:..........DONE
Fetch:.Commiting changes:......Updating Project...:.....Leagues names and player count are equal.
Commiting changes:.Updating Project...:.Leagues names and player count are still equal.
Client starting...
Commiting changes:......Commiting changes:.
Commit of demoProjectCopy failed.

Update of demoProjectCopy with conflict resolver...
Updating Project...:.....
Commit of merge result of demoProjectCopy
Commiting changes:......
Update of demoProject

League name in demoProject  is now: EU-League

League name in demoProjectCopy  is now: EU-League

Player name in demoProject is now: Johannes

Player name in demoProjectCopy is now: Johannes
Client starting...
Sharing Project:..........DONE
Fetch:.Commiting changes:......Updating Project...:.....Leagues names and player count are equal.
Commiting changes:.Updating Project...:.Leagues names and player count are still equal.
Tests run: 2, Failures: 0, Errors: 0, Skipped: 0, Time elapsed: 1.094 sec

Results :

Tests run: 2, Failures: 0, Errors: 0, Skipped: 0

[INFO] All tests passed!
[INFO] 
[INFO] --- tycho-surefire-plugin:0.20.0:test (TransactionalEditingDomainTests) @ org.eclipse.emf.emfstore.client.example.test ---
[INFO] Not executing tests, testSuite=org.eclipse.emf.emfstore.client.recording.test and project is not the testSuite
[INFO] 
[INFO] --- tycho-surefire-plugin:0.20.0:test (InMemoryChangePackageTest) @ org.eclipse.emf.emfstore.client.example.test ---
[INFO] Not executing tests, testSuite=org.eclipse.emf.emfstore.client.api.test and project is not the testSuite
[INFO] 
[INFO] --< org.eclipse.emf.emfstore:org.eclipse.emf.emfstore.client.test.ui >--
[INFO] Building org.eclipse.emf.emfstore.client.test.ui 1.10.0-SNAPSHOT [67/69]
[INFO] ------------------------[ eclipse-test-plugin ]-------------------------
[INFO] 
[INFO] --- maven-clean-plugin:2.5:clean (default-clean) @ org.eclipse.emf.emfstore.client.test.ui ---
[INFO] 
[INFO] --- tycho-packaging-plugin:0.20.0:build-qualifier (default-build-qualifier) @ org.eclipse.emf.emfstore.client.test.ui ---
[INFO] The project's OSGi version is 1.10.0.v20200810-0829
[INFO] 
[INFO] --- tycho-packaging-plugin:0.20.0:validate-id (default-validate-id) @ org.eclipse.emf.emfstore.client.test.ui ---
[INFO] 
[INFO] --- tycho-packaging-plugin:0.20.0:validate-version (default-validate-version) @ org.eclipse.emf.emfstore.client.test.ui ---
[INFO] 
[INFO] --- jacoco-maven-plugin:0.7.4.201502262128:prepare-agent (jacoco-initialize) @ org.eclipse.emf.emfstore.client.test.ui ---
[INFO] tycho.testArgLine set to -javaagent:/home/jenkins/agent/workspace/gerrit/.repository/org/jacoco/org.jacoco.agent/0.7.4.201502262128/org.jacoco.agent-0.7.4.201502262128-runtime.jar=destfile=/home/jenkins/agent/workspace/gerrit/tests/coverage/jacoco.exec,append=true
[INFO] 
[INFO] --- maven-resources-plugin:2.4.3:resources (default-resources) @ org.eclipse.emf.emfstore.client.test.ui ---
[INFO] Using 'UTF-8' encoding to copy filtered resources.
[INFO] skip non existing resourceDirectory /home/jenkins/agent/workspace/gerrit/tests/org.eclipse.emf.emfstore.client.test.ui/src/main/resources
[INFO] 
[INFO] --- tycho-compiler-plugin:0.20.0:compile (default-compile) @ org.eclipse.emf.emfstore.client.test.ui ---
[INFO] Compiling 31 source files to /home/jenkins/agent/workspace/gerrit/tests/org.eclipse.emf.emfstore.client.test.ui/bin
[INFO] 
[INFO] --- maven-checkstyle-plugin:2.10:check (checkstyle) @ org.eclipse.emf.emfstore.client.test.ui ---
[INFO] 
[INFO] 
[INFO] --- maven-resources-plugin:2.4.3:testResources (default-testResources) @ org.eclipse.emf.emfstore.client.test.ui ---
[INFO] Using 'UTF-8' encoding to copy filtered resources.
[INFO] skip non existing resourceDirectory /home/jenkins/agent/workspace/gerrit/tests/org.eclipse.emf.emfstore.client.test.ui/src/test/resources
[INFO] 
[INFO] --- tycho-source-plugin:0.20.0:plugin-source (plugin-source) @ org.eclipse.emf.emfstore.client.test.ui ---
[INFO] Building jar: /home/jenkins/agent/workspace/gerrit/tests/org.eclipse.emf.emfstore.client.test.ui/target/org.eclipse.emf.emfstore.client.test.ui-1.10.0-SNAPSHOT-sources.jar
[INFO] 
[INFO] --- tycho-packaging-plugin:0.20.0:package-plugin (default-package-plugin) @ org.eclipse.emf.emfstore.client.test.ui ---
[INFO] Building jar: /home/jenkins/agent/workspace/gerrit/tests/org.eclipse.emf.emfstore.client.test.ui/target/org.eclipse.emf.emfstore.client.test.ui-1.10.0-SNAPSHOT.jar
[INFO] 
[INFO] --- tycho-p2-plugin:0.20.0:p2-metadata-default (default-p2-metadata-default) @ org.eclipse.emf.emfstore.client.test.ui ---
[INFO] 
[INFO] --- tycho-surefire-plugin:0.20.0:test (default-test) @ org.eclipse.emf.emfstore.client.test.ui ---
[INFO] Expected eclipse log file: /home/jenkins/agent/workspace/gerrit/tests/org.eclipse.emf.emfstore.client.test.ui/target/work/data/.metadata/.log
[INFO] Command line:
	[/opt/tools/java/oracle/jdk-8/1.8.0_202/jre/bin/java, -Dosgi.noShutdown=false, -Dosgi.os=linux, -Dosgi.ws=gtk, -Dosgi.arch=x86_64, -javaagent:/home/jenkins/agent/workspace/gerrit/.repository/org/jacoco/org.jacoco.agent/0.7.4.201502262128/org.jacoco.agent-0.7.4.201502262128-runtime.jar=destfile=/home/jenkins/agent/workspace/gerrit/tests/coverage/jacoco.exec,append=true, -Dorg.eclipse.swtbot.search.timeout=30000, -Dosgi.requiredJavaVersion=1.5, -Xms40m, -Xmx512m, -Dosgi.clean=true, -jar, /home/jenkins/agent/workspace/gerrit/.repository/p2/osgi/bundle/org.eclipse.equinox.launcher/1.3.0.v20120522-1813/org.eclipse.equinox.launcher-1.3.0.v20120522-1813.jar, -data, /home/jenkins/agent/workspace/gerrit/tests/org.eclipse.emf.emfstore.client.test.ui/target/work/data, -install, /home/jenkins/agent/workspace/gerrit/tests/org.eclipse.emf.emfstore.client.test.ui/target/work, -configuration, /home/jenkins/agent/workspace/gerrit/tests/org.eclipse.emf.emfstore.client.test.ui/target/work/configuration, -application, org.eclipse.tycho.surefire.osgibooter.uitest, -testproperties, /home/jenkins/agent/workspace/gerrit/tests/org.eclipse.emf.emfstore.client.test.ui/target/surefire.properties, -nouithread]

-------------------------------------------------------
 T E S T S
-------------------------------------------------------
Running org.eclipse.emf.emfstore.client.test.ui.AllUITestsWithMock
log4j:WARN No appenders could be found for logger (org.eclipse.swtbot.swt.finder.matchers.AbstractMatcher).
log4j:WARN Please initialize the log4j system properly.
Tests run: 23, Failures: 0, Errors: 22, Skipped: 0, Time elapsed: 665.403 sec <<< FAILURE!

Results :

Tests in error: 
  testController(org.eclipse.emf.emfstore.client.test.ui.controllers.NoLocalChangesCommitControllerTest): Could not find widget matching: (of type 'Button' and with mnemonic 'OK' and with style 'SWT.PUSH')
  testController(org.eclipse.emf.emfstore.client.test.ui.controllers.LocalProjectNeedsToBeUpdatedCommitControllerTest): Could not find widget matching: (of type 'Text')
  testController(org.eclipse.emf.emfstore.client.test.ui.controllers.UIAddTagControllerTest): Could not find widget matching: (of type 'Button' and with mnemonic 'OK' and with style 'SWT.PUSH')
  testController(org.eclipse.emf.emfstore.client.test.ui.controllers.UIAskForBranchCheckoutControllerTest): Could not find widget matching: (of type 'Text')
  testController(org.eclipse.emf.emfstore.client.test.ui.controllers.UIBranchControllersTest): Could not find widget matching: (of type 'Text')
  testController(org.eclipse.emf.emfstore.client.test.ui.controllers.UICheckoutControllerTest): Could not find widget matching: (of type 'Text')
  testController(org.eclipse.emf.emfstore.client.test.ui.controllers.UICreateRemoteProjectControllerTest): Could not find widget matching: (of type 'Text')
  testController(org.eclipse.emf.emfstore.client.test.ui.controllers.UIDeleteRemoteProjectControllerTest): Could not find widget matching: (of type 'Button' and with mnemonic 'Yes' and with style 'SWT.PUSH')
  testController(org.eclipse.emf.emfstore.client.test.ui.controllers.UIMergeControllerTest): Could not find widget matching: (of type 'Text')
  testController(org.eclipse.emf.emfstore.client.test.ui.controllers.UIRevertCommitControllerTest): Could not find widget matching: (of type 'Button' and with mnemonic 'OK' and with style 'SWT.PUSH')
  testController(org.eclipse.emf.emfstore.client.test.ui.controllers.UIRemoveServerControllerTest): Could not find widget matching: (of type 'Button' and with mnemonic 'Yes' and with style 'SWT.PUSH')
  testController(org.eclipse.emf.emfstore.client.test.ui.controllers.UIRevertCommitControllerTest2): Could not find widget matching: (of type 'Text')
  testController(org.eclipse.emf.emfstore.client.test.ui.controllers.UIServerControllerTest): Could not find widget matching: (of type 'Button' and with mnemonic 'Finish' and with style 'SWT.PUSH')
  testController(org.eclipse.emf.emfstore.client.test.ui.controllers.UISessionControllerTest): Could not find widget matching: (of type 'Button' and with mnemonic 'OK' and with style 'SWT.PUSH')
  testController(org.eclipse.emf.emfstore.client.test.ui.controllers.UIShareProjectControllerTest): Could not find widget matching: (of type 'Text')
  testController(org.eclipse.emf.emfstore.client.test.ui.controllers.UIUpdateProjectControllerTest): Could not find widget matching: (of type 'Text')
  testController(org.eclipse.emf.emfstore.client.test.ui.controllers.UIUpdateProjectToVersionControllerTest): Could not find widget matching: (of type 'Text')
  testController(org.eclipse.emf.emfstore.client.test.ui.controllers.UIPagedUpdateProjectControllerTest): Could not find widget matching: (of type 'Text')
  testController(org.eclipse.emf.emfstore.client.test.ui.controllers.UIShowHistoryControllerTest): Could not find widget matching: (of type 'Button' and with mnemonic 'OK' and with style 'SWT.PUSH')
  testController(org.eclipse.emf.emfstore.client.test.ui.controllers.UIShowHistoryControllerForElementTest): Could not find widget matching: (of type 'Button' and with mnemonic 'OK' and with style 'SWT.PUSH')
  testController(org.eclipse.emf.emfstore.client.test.ui.controllers.UIHistoryViewCloseTest): Could not find widget matching: (of type 'Button' and with mnemonic 'OK' and with style 'SWT.PUSH')
  testController(org.eclipse.emf.emfstore.client.test.ui.conflictdetection.BidirectionalConflictMergeTest): Could not find widget matching: (of type 'Button' and with mnemonic 'OK' and with style 'SWT.PUSH')

Tests run: 23, Failures: 0, Errors: 22, Skipped: 0

Terminating xvnc.
[INFO] ------------------------------------------------------------------------
[INFO] Reactor Summary:
[INFO] 
[INFO] emfstore-parent 1.10.0-SNAPSHOT .................... SUCCESS [ 15.249 s]
[INFO] emfstore 1.10.0-SNAPSHOT ........................... SUCCESS [  0.266 s]
[INFO] emfstore-bundles-parent 1.10.0-SNAPSHOT ............ SUCCESS [  0.195 s]
[INFO] org.eclipse.emf.emfstore.common 1.10.0-SNAPSHOT .... SUCCESS [  3.659 s]
[INFO] org.eclipse.emf.emfstore.common.model 1.10.0-SNAPSHOT SUCCESS [  1.356 s]
[INFO] org.eclipse.emf.emfstore.migration 1.10.0-SNAPSHOT . SUCCESS [  0.282 s]
[INFO] org.eclipse.emf.emfstore.server.model 1.10.0-SNAPSHOT SUCCESS [  3.598 s]
[INFO] org.eclipse.emf.emfstore.server 1.10.0-SNAPSHOT .... SUCCESS [  2.694 s]
[INFO] org.eclipse.emf.emfstore.client 1.10.0-SNAPSHOT .... SUCCESS [  3.913 s]
[INFO] emfstore-features-parent 1.10.0-SNAPSHOT ........... SUCCESS [  0.179 s]
[INFO] org.eclipse.emf.emfstore.license.feature 1.10.0-SNAPSHOT SUCCESS [  0.312 s]
[INFO] org.eclipse.emf.emfstore.client.feature 1.10.0-SNAPSHOT SUCCESS [  0.196 s]
[INFO] org.eclipse.emf.emfstore.common.model.edit 1.10.0-SNAPSHOT SUCCESS [  0.315 s]
[INFO] org.eclipse.emf.emfstore.server.model.edit 1.10.0-SNAPSHOT SUCCESS [  1.002 s]
[INFO] org.eclipse.emf.emfstore.client.model.edit 1.10.0-SNAPSHOT SUCCESS [  0.320 s]
[INFO] org.eclipse.emf.emfstore.examplemodel 1.10.0-SNAPSHOT SUCCESS [  0.521 s]
[INFO] emfstore-tests-parent 1.10.0-SNAPSHOT .............. SUCCESS [  0.175 s]
[INFO] org.eclipse.emf.emfstore.test.model 2.0.0-SNAPSHOT . SUCCESS [  0.394 s]
[INFO] org.eclipse.emf.emfstore.test.model.edit 2.0.0-SNAPSHOT SUCCESS [  0.275 s]
[INFO] org.eclipse.emf.emfstore.test.common 2.0.0-SNAPSHOT  SUCCESS [  0.597 s]
[INFO] org.eclipse.emf.emfstore.client.test 2.0.0-SNAPSHOT  SUCCESS [  0.463 s]
[INFO] org.eclipse.emf.emfstore.client.transaction 1.10.0-SNAPSHOT SUCCESS [  0.266 s]
[INFO] org.eclipse.emf.emfstore.client.ui.transaction 1.10.0-SNAPSHOT SUCCESS [  0.226 s]
[INFO] org.eclipse.emf.emfstore.client.transaction.feature 1.10.0-SNAPSHOT SUCCESS [  0.239 s]
[INFO] org.eclipse.emf.emfstore.client.ui 1.10.0-SNAPSHOT . SUCCESS [  3.066 s]
[INFO] org.eclipse.emf.emfstore.client.ui.rcp 1.10.0-SNAPSHOT SUCCESS [  0.351 s]
[INFO] org.eclipse.emf.emfstore.client.ui.feature 1.10.0-SNAPSHOT SUCCESS [  0.323 s]
[INFO] org.eclipse.emf.emfstore.client.ui.historybrowsercomparator 1.10.0-SNAPSHOT SUCCESS [  0.285 s]
[INFO] org.eclipse.emf.emfstore.client.ui.historybrowsercomparator.feature 1.10.0-SNAPSHOT SUCCESS [  0.227 s]
[INFO] org.eclipse.emf.emfstore.client.ui.rap 1.10.0-SNAPSHOT SUCCESS [  0.327 s]
[INFO] org.eclipse.emf.emfstore.client.ui.rap.feature 1.10.0-SNAPSHOT SUCCESS [  0.199 s]
[INFO] org.eclipse.emf.emfstore.common.feature 1.10.0-SNAPSHOT SUCCESS [  0.181 s]
[INFO] org.eclipse.emf.emfstore.examplemodel.edit 1.10.0-SNAPSHOT SUCCESS [  0.284 s]
[INFO] org.eclipse.emf.emfstore.example.installer 1.10.0-SNAPSHOT SUCCESS [  0.221 s]
[INFO] org.eclipse.emf.emfstore.example.feature 1.10.0-SNAPSHOT SUCCESS [  0.190 s]
[INFO] org.eclipse.emf.emfstore.modelmutator 2.0.0-SNAPSHOT SUCCESS [  0.988 s]
[INFO] org.eclipse.emf.emfstore.fuzzy.emf 2.0.0-SNAPSHOT .. SUCCESS [  0.626 s]
[INFO] org.eclipse.emf.emfstore.fuzzy.emf.test 2.0.0-SNAPSHOT SUCCESS [  4.775 s]
[INFO] org.eclipse.emf.emfstore.fuzzy.emf.diff.test 2.0.0-SNAPSHOT SUCCESS [  2.645 s]
[INFO] org.eclipse.emf.emfstore.fuzzy.emf.edit 2.0.0-SNAPSHOT SUCCESS [  0.267 s]
[INFO] org.eclipse.emf.emfstore.fuzzy.emf.editor 2.0.0-SNAPSHOT SUCCESS [  0.341 s]
[INFO] org.eclipse.emf.emfstore.fuzzy.emf.example 2.0.0-SNAPSHOT SUCCESS [  0.246 s]
[INFO] org.eclipse.emf.emfstore.fuzzy.feature 1.10.0-SNAPSHOT SUCCESS [  0.187 s]
[INFO] org.eclipse.emf.emfstore.fuzzy.test.feature 1.10.0-SNAPSHOT SUCCESS [  0.182 s]
[INFO] org.eclipse.emf.emfstore.migration.edapt 1.10.0-SNAPSHOT SUCCESS [  0.230 s]
[INFO] org.eclipse.emf.emfstore.migration.edapt.feature 1.10.0-SNAPSHOT SUCCESS [  0.176 s]
[INFO] org.eclipse.emf.emfstore.modelmutator.feature 2.0.0-SNAPSHOT SUCCESS [  0.194 s]
[INFO] org.eclipse.emf.emfstore.mongodb 1.10.0-SNAPSHOT ... SUCCESS [  0.265 s]
[INFO] org.eclipse.emf.emfstore.mongodb.client 1.10.0-SNAPSHOT SUCCESS [  0.225 s]
[INFO] org.eclipse.emf.emfstore.mongodb.client.feature 1.10.0-SNAPSHOT SUCCESS [  0.192 s]
[INFO] org.eclipse.emf.emfstore.mongodb.server 1.10.0-SNAPSHOT SUCCESS [  0.294 s]
[INFO] org.eclipse.emf.emfstore.mongodb.server.feature 1.10.0-SNAPSHOT SUCCESS [  0.193 s]
[INFO] org.eclipse.emf.emfstore.server.feature 1.10.0-SNAPSHOT SUCCESS [  0.187 s]
[INFO] org.eclipse.emf.emfstore.sdk.feature 1.10.0-SNAPSHOT SUCCESS [  0.190 s]
[INFO] org.eclipse.emf.emfstore.p2repository 1.10.0-SNAPSHOT SUCCESS [  1.276 s]
[INFO] org.eclipse.emf.emfstore.products 1.10.0-SNAPSHOT .. SUCCESS [  5.583 s]
[INFO] org.eclipse.emf.emfstore.example.helloworld 1.10.0-SNAPSHOT SUCCESS [  0.235 s]
[INFO] org.eclipse.emf.emfstore.example.merging 1.10.0-SNAPSHOT SUCCESS [  0.250 s]
[INFO] org.eclipse.emf.emfstore.client.api.test 1.10.0-SNAPSHOT SUCCESS [ 22.408 s]
[INFO] org.eclipse.emf.emfstore.client.changetracking.test 1.10.0-SNAPSHOT SUCCESS [ 14.528 s]
[INFO] org.eclipse.emf.emfstore.client.conflictdetection.test 1.10.0-SNAPSHOT SUCCESS [ 14.517 s]
[INFO] org.eclipse.emf.emfstore.client.recording.test 1.10.0-SNAPSHOT SUCCESS [ 11.909 s]
[INFO] org.eclipse.emf.emfstore.performance.test 1.10.0-SNAPSHOT SUCCESS [  0.305 s]
[INFO] org.eclipse.emf.emfstore.server.test 1.10.0-SNAPSHOT SUCCESS [01:11 min]
[INFO] org.eclipse.emf.emfstore.test.feature 1.10.0-SNAPSHOT SUCCESS [  5.221 s]
[INFO] org.eclipse.emf.emfstore.client.example.test 1.10.0-SNAPSHOT SUCCESS [  5.083 s]
[INFO] org.eclipse.emf.emfstore.client.test.ui 1.10.0-SNAPSHOT FAILURE [  01:29 h]
[INFO] org.eclipse.emf.emfstore.client.ui.test 1.10.0-SNAPSHOT SKIPPED
[INFO] org.eclipse.emf.emfstore.migration.edapt.test 1.10.0-SNAPSHOT SKIPPED
[INFO] ------------------------------------------------------------------------
[INFO] BUILD FAILURE
[INFO] ------------------------------------------------------------------------
[INFO] Total time:  01:34 h
[INFO] Finished at: 2020-08-10T10:02:32Z
[INFO] ------------------------------------------------------------------------
Build was aborted
Aborted by Johannes Faltermeier
Recording test results
Finished: ABORTED