Console Output

Skipping 8,240 KB.. Full Log
	at org.junit.runners.ParentRunner$3.run(ParentRunner.java:238)
	at org.junit.runners.ParentRunner$1.schedule(ParentRunner.java:63)
	at org.junit.runners.ParentRunner.runChildren(ParentRunner.java:236)
	at org.junit.runners.ParentRunner.access$000(ParentRunner.java:53)
	at org.junit.runners.ParentRunner$2.evaluate(ParentRunner.java:229)
	at org.junit.runners.ParentRunner.run(ParentRunner.java:309)
	at org.apache.maven.surefire.junit4.JUnit4TestSet.execute(JUnit4TestSet.java:53)
	at org.apache.maven.surefire.junit4.JUnit4Provider.executeTestSet(JUnit4Provider.java:123)
	at org.apache.maven.surefire.junit4.JUnit4Provider.invoke(JUnit4Provider.java:104)
	at sun.reflect.NativeMethodAccessorImpl.invoke0(Native Method)
	at sun.reflect.NativeMethodAccessorImpl.invoke(NativeMethodAccessorImpl.java:39)
	at sun.reflect.DelegatingMethodAccessorImpl.invoke(DelegatingMethodAccessorImpl.java:25)
	at java.lang.reflect.Method.invoke(Method.java:597)
	at org.apache.maven.surefire.util.ReflectionUtils.invokeMethodWithArray(ReflectionUtils.java:164)
	at org.apache.maven.surefire.booter.ProviderFactory$ProviderProxy.invoke(ProviderFactory.java:110)
	at org.apache.maven.surefire.booter.SurefireStarter.invokeProvider(SurefireStarter.java:175)
	at org.apache.maven.surefire.booter.SurefireStarter.runSuitesInProcess(SurefireStarter.java:123)
	at org.eclipse.tycho.surefire.osgibooter.OsgiSurefireBooter.run(OsgiSurefireBooter.java:85)
	at org.eclipse.tycho.surefire.osgibooter.AbstractUITestApplication.runTests(AbstractUITestApplication.java:44)
	at org.eclipse.ui.internal.testing.WorkbenchTestable$1.run(WorkbenchTestable.java:71)
	at java.lang.Thread.run(Thread.java:662)
Caused by: org.eclipse.emf.emfstore.internal.server.exceptions.InvalidVersionSpecException: 
	at org.eclipse.emf.emfstore.internal.server.core.subinterfaces.VersionSubInterfaceImpl.resolveBranchVersionSpec(VersionSubInterfaceImpl.java:229)
	at org.eclipse.emf.emfstore.internal.server.core.subinterfaces.VersionSubInterfaceImpl.resolveVersionSpec(VersionSubInterfaceImpl.java:106)
	... 106 more

Exception on execution: java.lang.reflect.InvocationTargetException
	at sun.reflect.GeneratedMethodAccessor14.invoke(Unknown Source)
	at sun.reflect.DelegatingMethodAccessorImpl.invoke(DelegatingMethodAccessorImpl.java:25)
	at java.lang.reflect.Method.invoke(Method.java:597)
	at org.eclipse.emf.emfstore.internal.server.core.AbstractSubEmfstoreInterface.execute(AbstractSubEmfstoreInterface.java:140)
	at org.eclipse.emf.emfstore.internal.server.core.EMFStoreImpl.invoke(EMFStoreImpl.java:160)
	at com.sun.proxy.$Proxy20.resolveVersionSpec(Unknown Source)
	at org.eclipse.emf.emfstore.client.test.common.mocks.ConnectionMock.resolveVersionSpec(ConnectionMock.java:110)
	at org.eclipse.emf.emfstore.internal.client.model.impl.ProjectSpaceBase$4.run(ProjectSpaceBase.java:1182)
	at org.eclipse.emf.emfstore.internal.client.model.impl.ProjectSpaceBase$4.run(ProjectSpaceBase.java:1)
	at org.eclipse.emf.emfstore.internal.client.model.connectionmanager.ServerCall.run(ServerCall.java:249)
	at org.eclipse.emf.emfstore.internal.client.model.connectionmanager.SessionManager.executeCall(SessionManager.java:126)
	at org.eclipse.emf.emfstore.internal.client.model.connectionmanager.SessionManager.execute(SessionManager.java:65)
	at org.eclipse.emf.emfstore.internal.client.model.connectionmanager.ServerCall.execute(ServerCall.java:269)
	at org.eclipse.emf.emfstore.internal.client.model.impl.ProjectSpaceBase.resolveVersionSpec(ProjectSpaceBase.java:1187)
	at org.eclipse.emf.emfstore.internal.client.model.controller.CommitController.checkForCommitPreconditions(CommitController.java:274)
	at org.eclipse.emf.emfstore.internal.client.model.controller.CommitController.commit(CommitController.java:126)
	at org.eclipse.emf.emfstore.internal.client.model.controller.CommitController.run(CommitController.java:102)
	at org.eclipse.emf.emfstore.internal.client.model.controller.CommitController.run(CommitController.java:1)
	at org.eclipse.emf.emfstore.internal.client.model.connectionmanager.ServerCall.run(ServerCall.java:249)
	at org.eclipse.emf.emfstore.internal.client.model.connectionmanager.SessionManager.executeCall(SessionManager.java:126)
	at org.eclipse.emf.emfstore.internal.client.model.connectionmanager.SessionManager.execute(SessionManager.java:65)
	at org.eclipse.emf.emfstore.internal.client.model.connectionmanager.ServerCall.execute(ServerCall.java:269)
	at org.eclipse.emf.emfstore.internal.client.model.impl.ProjectSpaceBase.commitToBranch(ProjectSpaceBase.java:466)
	at org.eclipse.emf.emfstore.internal.client.model.impl.api.ESLocalProjectImpl$16.call(ESLocalProjectImpl.java:446)
	at org.eclipse.emf.emfstore.internal.client.model.impl.api.ESLocalProjectImpl$16.call(ESLocalProjectImpl.java:1)
	at org.eclipse.emf.emfstore.client.util.RunESCommand$WithException$2.doRun(RunESCommand.java:121)
	at org.eclipse.emf.emfstore.internal.client.model.util.EMFStoreCommandWithResult.commandBody(EMFStoreCommandWithResult.java:33)
	at org.eclipse.emf.emfstore.internal.client.model.util.AbstractEMFStoreCommand.execute(AbstractEMFStoreCommand.java:75)
	at org.eclipse.emf.emfstore.internal.client.transaction.EMFStoreTransactionalCommandStack$1.doExecute(EMFStoreTransactionalCommandStack.java:60)
	at org.eclipse.emf.transaction.RecordingCommand.execute(RecordingCommand.java:135)
	at org.eclipse.emf.common.command.BasicCommandStack.execute(BasicCommandStack.java:78)
	at org.eclipse.emf.transaction.impl.AbstractTransactionalCommandStack.basicExecute(AbstractTransactionalCommandStack.java:241)
	at org.eclipse.emf.emfstore.internal.client.transaction.EMFStoreTransactionalCommandStack.basicExecute(EMFStoreTransactionalCommandStack.java:162)
	at org.eclipse.emf.transaction.impl.TransactionalCommandStackImpl.doExecute(TransactionalCommandStackImpl.java:63)
	at org.eclipse.emf.transaction.impl.AbstractTransactionalCommandStack.execute(AbstractTransactionalCommandStack.java:165)
	at org.eclipse.emf.transaction.impl.AbstractTransactionalCommandStack.execute(AbstractTransactionalCommandStack.java:219)
	at org.eclipse.emf.emfstore.internal.client.transaction.EMFStoreTransactionalCommandStack.runEMFStoreCommand(EMFStoreTransactionalCommandStack.java:63)
	at org.eclipse.emf.emfstore.internal.client.transaction.EMFStoreTransactionalCommandStack.execute(EMFStoreTransactionalCommandStack.java:48)
	at org.eclipse.emf.emfstore.internal.client.model.util.AbstractEMFStoreCommand.aRun(AbstractEMFStoreCommand.java:133)
	at org.eclipse.emf.emfstore.internal.client.model.util.EMFStoreCommandWithResult.run(EMFStoreCommandWithResult.java:73)
	at org.eclipse.emf.emfstore.client.util.RunESCommand$WithException.runWithResult(RunESCommand.java:138)
	at org.eclipse.emf.emfstore.internal.client.model.impl.api.ESLocalProjectImpl.commitToBranch(ESLocalProjectImpl.java:434)
	at org.eclipse.emf.emfstore.client.test.common.util.ProjectUtil$13.call(ProjectUtil.java:300)
	at org.eclipse.emf.emfstore.client.test.common.util.ProjectUtil$13.call(ProjectUtil.java:1)
	at org.eclipse.emf.emfstore.client.util.RunESCommand$4.doRun(RunESCommand.java:342)
	at org.eclipse.emf.emfstore.internal.client.model.util.EMFStoreCommandWithResult.commandBody(EMFStoreCommandWithResult.java:33)
	at org.eclipse.emf.emfstore.internal.client.model.util.AbstractEMFStoreCommand.execute(AbstractEMFStoreCommand.java:75)
	at org.eclipse.emf.emfstore.internal.client.transaction.EMFStoreTransactionalCommandStack$1.doExecute(EMFStoreTransactionalCommandStack.java:60)
	at org.eclipse.emf.transaction.RecordingCommand.execute(RecordingCommand.java:135)
	at org.eclipse.emf.common.command.BasicCommandStack.execute(BasicCommandStack.java:78)
	at org.eclipse.emf.transaction.impl.AbstractTransactionalCommandStack.basicExecute(AbstractTransactionalCommandStack.java:241)
	at org.eclipse.emf.emfstore.internal.client.transaction.EMFStoreTransactionalCommandStack.basicExecute(EMFStoreTransactionalCommandStack.java:162)
	at org.eclipse.emf.transaction.impl.TransactionalCommandStackImpl.doExecute(TransactionalCommandStackImpl.java:63)
	at org.eclipse.emf.transaction.impl.AbstractTransactionalCommandStack.execute(AbstractTransactionalCommandStack.java:165)
	at org.eclipse.emf.transaction.impl.AbstractTransactionalCommandStack.execute(AbstractTransactionalCommandStack.java:219)
	at org.eclipse.emf.emfstore.internal.client.transaction.EMFStoreTransactionalCommandStack.runEMFStoreCommand(EMFStoreTransactionalCommandStack.java:63)
	at org.eclipse.emf.emfstore.internal.client.transaction.EMFStoreTransactionalCommandStack.execute(EMFStoreTransactionalCommandStack.java:48)
	at org.eclipse.emf.emfstore.internal.client.model.util.AbstractEMFStoreCommand.aRun(AbstractEMFStoreCommand.java:133)
	at org.eclipse.emf.emfstore.internal.client.model.util.EMFStoreCommandWithResult.run(EMFStoreCommandWithResult.java:73)
	at org.eclipse.emf.emfstore.client.util.RunESCommand.runWithResult(RunESCommand.java:350)
	at org.eclipse.emf.emfstore.internal.client.model.impl.api.ESLocalProjectImpl.runWithResult(ESLocalProjectImpl.java:864)
	at org.eclipse.emf.emfstore.client.test.common.util.ProjectUtil.branch(ProjectUtil.java:298)
	at org.eclipse.emf.emfstore.server.test.VersionSpecTests.before(VersionSpecTests.java:136)
	at sun.reflect.NativeMethodAccessorImpl.invoke0(Native Method)
	at sun.reflect.NativeMethodAccessorImpl.invoke(NativeMethodAccessorImpl.java:39)
	at sun.reflect.DelegatingMethodAccessorImpl.invoke(DelegatingMethodAccessorImpl.java:25)
	at java.lang.reflect.Method.invoke(Method.java:597)
	at org.junit.runners.model.FrameworkMethod$1.runReflectiveCall(FrameworkMethod.java:47)
	at org.junit.internal.runners.model.ReflectiveCallable.run(ReflectiveCallable.java:12)
	at org.junit.runners.model.FrameworkMethod.invokeExplosively(FrameworkMethod.java:44)
	at org.junit.internal.runners.statements.RunBefores.evaluate(RunBefores.java:24)
	at org.junit.internal.runners.statements.RunAfters.evaluate(RunAfters.java:27)
	at org.junit.runners.ParentRunner.runLeaf(ParentRunner.java:271)
	at org.junit.runners.BlockJUnit4ClassRunner.runChild(BlockJUnit4ClassRunner.java:70)
	at org.junit.runners.BlockJUnit4ClassRunner.runChild(BlockJUnit4ClassRunner.java:50)
	at org.junit.runners.ParentRunner$3.run(ParentRunner.java:238)
	at org.junit.runners.ParentRunner$1.schedule(ParentRunner.java:63)
	at org.junit.runners.ParentRunner.runChildren(ParentRunner.java:236)
	at org.junit.runners.ParentRunner.access$000(ParentRunner.java:53)
	at org.junit.runners.ParentRunner$2.evaluate(ParentRunner.java:229)
	at org.junit.internal.runners.statements.RunBefores.evaluate(RunBefores.java:26)
	at org.junit.internal.runners.statements.RunAfters.evaluate(RunAfters.java:27)
	at org.junit.runners.ParentRunner.run(ParentRunner.java:309)
	at org.junit.runners.Suite.runChild(Suite.java:127)
	at org.junit.runners.Suite.runChild(Suite.java:26)
	at org.junit.runners.ParentRunner$3.run(ParentRunner.java:238)
	at org.junit.runners.ParentRunner$1.schedule(ParentRunner.java:63)
	at org.junit.runners.ParentRunner.runChildren(ParentRunner.java:236)
	at org.junit.runners.ParentRunner.access$000(ParentRunner.java:53)
	at org.junit.runners.ParentRunner$2.evaluate(ParentRunner.java:229)
	at org.junit.runners.ParentRunner.run(ParentRunner.java:309)
	at org.apache.maven.surefire.junit4.JUnit4TestSet.execute(JUnit4TestSet.java:53)
	at org.apache.maven.surefire.junit4.JUnit4Provider.executeTestSet(JUnit4Provider.java:123)
	at org.apache.maven.surefire.junit4.JUnit4Provider.invoke(JUnit4Provider.java:104)
	at sun.reflect.NativeMethodAccessorImpl.invoke0(Native Method)
	at sun.reflect.NativeMethodAccessorImpl.invoke(NativeMethodAccessorImpl.java:39)
	at sun.reflect.DelegatingMethodAccessorImpl.invoke(DelegatingMethodAccessorImpl.java:25)
	at java.lang.reflect.Method.invoke(Method.java:597)
	at org.apache.maven.surefire.util.ReflectionUtils.invokeMethodWithArray(ReflectionUtils.java:164)
	at org.apache.maven.surefire.booter.ProviderFactory$ProviderProxy.invoke(ProviderFactory.java:110)
	at org.apache.maven.surefire.booter.SurefireStarter.invokeProvider(SurefireStarter.java:175)
	at org.apache.maven.surefire.booter.SurefireStarter.runSuitesInProcess(SurefireStarter.java:123)
	at org.eclipse.tycho.surefire.osgibooter.OsgiSurefireBooter.run(OsgiSurefireBooter.java:85)
	at org.eclipse.tycho.surefire.osgibooter.AbstractUITestApplication.runTests(AbstractUITestApplication.java:44)
	at org.eclipse.ui.internal.testing.WorkbenchTestable$1.run(WorkbenchTestable.java:71)
	at java.lang.Thread.run(Thread.java:662)
Caused by: org.eclipse.emf.emfstore.internal.server.exceptions.InvalidVersionSpecException: 
	at org.eclipse.emf.emfstore.internal.server.core.subinterfaces.VersionSubInterfaceImpl.resolveBranchVersionSpec(VersionSubInterfaceImpl.java:229)
	at org.eclipse.emf.emfstore.internal.server.core.subinterfaces.VersionSubInterfaceImpl.resolveVersionSpec(VersionSubInterfaceImpl.java:106)
	... 106 more

Exception on execution: java.lang.reflect.InvocationTargetException
	at sun.reflect.GeneratedMethodAccessor14.invoke(Unknown Source)
	at sun.reflect.DelegatingMethodAccessorImpl.invoke(DelegatingMethodAccessorImpl.java:25)
	at java.lang.reflect.Method.invoke(Method.java:597)
	at org.eclipse.emf.emfstore.internal.server.core.AbstractSubEmfstoreInterface.execute(AbstractSubEmfstoreInterface.java:140)
	at org.eclipse.emf.emfstore.internal.server.core.EMFStoreImpl.invoke(EMFStoreImpl.java:160)
	at com.sun.proxy.$Proxy20.resolveVersionSpec(Unknown Source)
	at org.eclipse.emf.emfstore.client.test.common.mocks.ConnectionMock.resolveVersionSpec(ConnectionMock.java:110)
	at org.eclipse.emf.emfstore.internal.client.model.impl.ProjectSpaceBase$4.run(ProjectSpaceBase.java:1182)
	at org.eclipse.emf.emfstore.internal.client.model.impl.ProjectSpaceBase$4.run(ProjectSpaceBase.java:1)
	at org.eclipse.emf.emfstore.internal.client.model.connectionmanager.ServerCall.run(ServerCall.java:249)
	at org.eclipse.emf.emfstore.internal.client.model.connectionmanager.SessionManager.executeCall(SessionManager.java:126)
	at org.eclipse.emf.emfstore.internal.client.model.connectionmanager.SessionManager.execute(SessionManager.java:65)
	at org.eclipse.emf.emfstore.internal.client.model.connectionmanager.ServerCall.execute(ServerCall.java:269)
	at org.eclipse.emf.emfstore.internal.client.model.impl.ProjectSpaceBase.resolveVersionSpec(ProjectSpaceBase.java:1187)
	at org.eclipse.emf.emfstore.internal.client.model.controller.CommitController.checkForCommitPreconditions(CommitController.java:274)
	at org.eclipse.emf.emfstore.internal.client.model.controller.CommitController.commit(CommitController.java:158)
	at org.eclipse.emf.emfstore.internal.client.model.controller.CommitController.run(CommitController.java:102)
	at org.eclipse.emf.emfstore.internal.client.model.controller.CommitController.run(CommitController.java:1)
	at org.eclipse.emf.emfstore.internal.client.model.connectionmanager.ServerCall.run(ServerCall.java:249)
	at org.eclipse.emf.emfstore.internal.client.model.connectionmanager.SessionManager.executeCall(SessionManager.java:126)
	at org.eclipse.emf.emfstore.internal.client.model.connectionmanager.SessionManager.execute(SessionManager.java:65)
	at org.eclipse.emf.emfstore.internal.client.model.connectionmanager.ServerCall.execute(ServerCall.java:269)
	at org.eclipse.emf.emfstore.internal.client.model.impl.ProjectSpaceBase.commitToBranch(ProjectSpaceBase.java:466)
	at org.eclipse.emf.emfstore.internal.client.model.impl.api.ESLocalProjectImpl$16.call(ESLocalProjectImpl.java:446)
	at org.eclipse.emf.emfstore.internal.client.model.impl.api.ESLocalProjectImpl$16.call(ESLocalProjectImpl.java:1)
	at org.eclipse.emf.emfstore.client.util.RunESCommand$WithException$2.doRun(RunESCommand.java:121)
	at org.eclipse.emf.emfstore.internal.client.model.util.EMFStoreCommandWithResult.commandBody(EMFStoreCommandWithResult.java:33)
	at org.eclipse.emf.emfstore.internal.client.model.util.AbstractEMFStoreCommand.execute(AbstractEMFStoreCommand.java:75)
	at org.eclipse.emf.emfstore.internal.client.transaction.EMFStoreTransactionalCommandStack$1.doExecute(EMFStoreTransactionalCommandStack.java:60)
	at org.eclipse.emf.transaction.RecordingCommand.execute(RecordingCommand.java:135)
	at org.eclipse.emf.common.command.BasicCommandStack.execute(BasicCommandStack.java:78)
	at org.eclipse.emf.transaction.impl.AbstractTransactionalCommandStack.basicExecute(AbstractTransactionalCommandStack.java:241)
	at org.eclipse.emf.emfstore.internal.client.transaction.EMFStoreTransactionalCommandStack.basicExecute(EMFStoreTransactionalCommandStack.java:162)
	at org.eclipse.emf.transaction.impl.TransactionalCommandStackImpl.doExecute(TransactionalCommandStackImpl.java:63)
	at org.eclipse.emf.transaction.impl.AbstractTransactionalCommandStack.execute(AbstractTransactionalCommandStack.java:165)
	at org.eclipse.emf.transaction.impl.AbstractTransactionalCommandStack.execute(AbstractTransactionalCommandStack.java:219)
	at org.eclipse.emf.emfstore.internal.client.transaction.EMFStoreTransactionalCommandStack.runEMFStoreCommand(EMFStoreTransactionalCommandStack.java:63)
	at org.eclipse.emf.emfstore.internal.client.transaction.EMFStoreTransactionalCommandStack.execute(EMFStoreTransactionalCommandStack.java:48)
	at org.eclipse.emf.emfstore.internal.client.model.util.AbstractEMFStoreCommand.aRun(AbstractEMFStoreCommand.java:133)
	at org.eclipse.emf.emfstore.internal.client.model.util.EMFStoreCommandWithResult.run(EMFStoreCommandWithResult.java:73)
	at org.eclipse.emf.emfstore.client.util.RunESCommand$WithException.runWithResult(RunESCommand.java:138)
	at org.eclipse.emf.emfstore.internal.client.model.impl.api.ESLocalProjectImpl.commitToBranch(ESLocalProjectImpl.java:434)
	at org.eclipse.emf.emfstore.client.test.common.util.ProjectUtil$13.call(ProjectUtil.java:300)
	at org.eclipse.emf.emfstore.client.test.common.util.ProjectUtil$13.call(ProjectUtil.java:1)
	at org.eclipse.emf.emfstore.client.util.RunESCommand$4.doRun(RunESCommand.java:342)
	at org.eclipse.emf.emfstore.internal.client.model.util.EMFStoreCommandWithResult.commandBody(EMFStoreCommandWithResult.java:33)
	at org.eclipse.emf.emfstore.internal.client.model.util.AbstractEMFStoreCommand.execute(AbstractEMFStoreCommand.java:75)
	at org.eclipse.emf.emfstore.internal.client.transaction.EMFStoreTransactionalCommandStack$1.doExecute(EMFStoreTransactionalCommandStack.java:60)
	at org.eclipse.emf.transaction.RecordingCommand.execute(RecordingCommand.java:135)
	at org.eclipse.emf.common.command.BasicCommandStack.execute(BasicCommandStack.java:78)
	at org.eclipse.emf.transaction.impl.AbstractTransactionalCommandStack.basicExecute(AbstractTransactionalCommandStack.java:241)
	at org.eclipse.emf.emfstore.internal.client.transaction.EMFStoreTransactionalCommandStack.basicExecute(EMFStoreTransactionalCommandStack.java:162)
	at org.eclipse.emf.transaction.impl.TransactionalCommandStackImpl.doExecute(TransactionalCommandStackImpl.java:63)
	at org.eclipse.emf.transaction.impl.AbstractTransactionalCommandStack.execute(AbstractTransactionalCommandStack.java:165)
	at org.eclipse.emf.transaction.impl.AbstractTransactionalCommandStack.execute(AbstractTransactionalCommandStack.java:219)
	at org.eclipse.emf.emfstore.internal.client.transaction.EMFStoreTransactionalCommandStack.runEMFStoreCommand(EMFStoreTransactionalCommandStack.java:63)
	at org.eclipse.emf.emfstore.internal.client.transaction.EMFStoreTransactionalCommandStack.execute(EMFStoreTransactionalCommandStack.java:48)
	at org.eclipse.emf.emfstore.internal.client.model.util.AbstractEMFStoreCommand.aRun(AbstractEMFStoreCommand.java:133)
	at org.eclipse.emf.emfstore.internal.client.model.util.EMFStoreCommandWithResult.run(EMFStoreCommandWithResult.java:73)
	at org.eclipse.emf.emfstore.client.util.RunESCommand.runWithResult(RunESCommand.java:350)
	at org.eclipse.emf.emfstore.internal.client.model.impl.api.ESLocalProjectImpl.runWithResult(ESLocalProjectImpl.java:864)
	at org.eclipse.emf.emfstore.client.test.common.util.ProjectUtil.branch(ProjectUtil.java:298)
	at org.eclipse.emf.emfstore.server.test.VersionSpecTests.before(VersionSpecTests.java:136)
	at sun.reflect.NativeMethodAccessorImpl.invoke0(Native Method)
	at sun.reflect.NativeMethodAccessorImpl.invoke(NativeMethodAccessorImpl.java:39)
	at sun.reflect.DelegatingMethodAccessorImpl.invoke(DelegatingMethodAccessorImpl.java:25)
	at java.lang.reflect.Method.invoke(Method.java:597)
	at org.junit.runners.model.FrameworkMethod$1.runReflectiveCall(FrameworkMethod.java:47)
	at org.junit.internal.runners.model.ReflectiveCallable.run(ReflectiveCallable.java:12)
	at org.junit.runners.model.FrameworkMethod.invokeExplosively(FrameworkMethod.java:44)
	at org.junit.internal.runners.statements.RunBefores.evaluate(RunBefores.java:24)
	at org.junit.internal.runners.statements.RunAfters.evaluate(RunAfters.java:27)
	at org.junit.runners.ParentRunner.runLeaf(ParentRunner.java:271)
	at org.junit.runners.BlockJUnit4ClassRunner.runChild(BlockJUnit4ClassRunner.java:70)
	at org.junit.runners.BlockJUnit4ClassRunner.runChild(BlockJUnit4ClassRunner.java:50)
	at org.junit.runners.ParentRunner$3.run(ParentRunner.java:238)
	at org.junit.runners.ParentRunner$1.schedule(ParentRunner.java:63)
	at org.junit.runners.ParentRunner.runChildren(ParentRunner.java:236)
	at org.junit.runners.ParentRunner.access$000(ParentRunner.java:53)
	at org.junit.runners.ParentRunner$2.evaluate(ParentRunner.java:229)
	at org.junit.internal.runners.statements.RunBefores.evaluate(RunBefores.java:26)
	at org.junit.internal.runners.statements.RunAfters.evaluate(RunAfters.java:27)
	at org.junit.runners.ParentRunner.run(ParentRunner.java:309)
	at org.junit.runners.Suite.runChild(Suite.java:127)
	at org.junit.runners.Suite.runChild(Suite.java:26)
	at org.junit.runners.ParentRunner$3.run(ParentRunner.java:238)
	at org.junit.runners.ParentRunner$1.schedule(ParentRunner.java:63)
	at org.junit.runners.ParentRunner.runChildren(ParentRunner.java:236)
	at org.junit.runners.ParentRunner.access$000(ParentRunner.java:53)
	at org.junit.runners.ParentRunner$2.evaluate(ParentRunner.java:229)
	at org.junit.runners.ParentRunner.run(ParentRunner.java:309)
	at org.apache.maven.surefire.junit4.JUnit4TestSet.execute(JUnit4TestSet.java:53)
	at org.apache.maven.surefire.junit4.JUnit4Provider.executeTestSet(JUnit4Provider.java:123)
	at org.apache.maven.surefire.junit4.JUnit4Provider.invoke(JUnit4Provider.java:104)
	at sun.reflect.NativeMethodAccessorImpl.invoke0(Native Method)
	at sun.reflect.NativeMethodAccessorImpl.invoke(NativeMethodAccessorImpl.java:39)
	at sun.reflect.DelegatingMethodAccessorImpl.invoke(DelegatingMethodAccessorImpl.java:25)
	at java.lang.reflect.Method.invoke(Method.java:597)
	at org.apache.maven.surefire.util.ReflectionUtils.invokeMethodWithArray(ReflectionUtils.java:164)
	at org.apache.maven.surefire.booter.ProviderFactory$ProviderProxy.invoke(ProviderFactory.java:110)
	at org.apache.maven.surefire.booter.SurefireStarter.invokeProvider(SurefireStarter.java:175)
	at org.apache.maven.surefire.booter.SurefireStarter.runSuitesInProcess(SurefireStarter.java:123)
	at org.eclipse.tycho.surefire.osgibooter.OsgiSurefireBooter.run(OsgiSurefireBooter.java:85)
	at org.eclipse.tycho.surefire.osgibooter.AbstractUITestApplication.runTests(AbstractUITestApplication.java:44)
	at org.eclipse.ui.internal.testing.WorkbenchTestable$1.run(WorkbenchTestable.java:71)
	at java.lang.Thread.run(Thread.java:662)
Caused by: org.eclipse.emf.emfstore.internal.server.exceptions.InvalidVersionSpecException: 
	at org.eclipse.emf.emfstore.internal.server.core.subinterfaces.VersionSubInterfaceImpl.resolveBranchVersionSpec(VersionSubInterfaceImpl.java:229)
	at org.eclipse.emf.emfstore.internal.server.core.subinterfaces.VersionSubInterfaceImpl.resolveVersionSpec(VersionSubInterfaceImpl.java:106)
	... 106 more

Exception on execution: java.lang.reflect.InvocationTargetException
	at sun.reflect.GeneratedMethodAccessor14.invoke(Unknown Source)
	at sun.reflect.DelegatingMethodAccessorImpl.invoke(DelegatingMethodAccessorImpl.java:25)
	at java.lang.reflect.Method.invoke(Method.java:597)
	at org.eclipse.emf.emfstore.internal.server.core.AbstractSubEmfstoreInterface.execute(AbstractSubEmfstoreInterface.java:140)
	at org.eclipse.emf.emfstore.internal.server.core.EMFStoreImpl.invoke(EMFStoreImpl.java:160)
	at com.sun.proxy.$Proxy20.resolveVersionSpec(Unknown Source)
	at org.eclipse.emf.emfstore.client.test.common.mocks.ConnectionMock.resolveVersionSpec(ConnectionMock.java:110)
	at org.eclipse.emf.emfstore.internal.client.model.impl.ProjectSpaceBase$4.run(ProjectSpaceBase.java:1182)
	at org.eclipse.emf.emfstore.internal.client.model.impl.ProjectSpaceBase$4.run(ProjectSpaceBase.java:1)
	at org.eclipse.emf.emfstore.internal.client.model.connectionmanager.ServerCall.run(ServerCall.java:249)
	at org.eclipse.emf.emfstore.internal.client.model.connectionmanager.SessionManager.executeCall(SessionManager.java:126)
	at org.eclipse.emf.emfstore.internal.client.model.connectionmanager.SessionManager.execute(SessionManager.java:65)
	at org.eclipse.emf.emfstore.internal.client.model.connectionmanager.ServerCall.execute(ServerCall.java:269)
	at org.eclipse.emf.emfstore.internal.client.model.impl.ProjectSpaceBase.resolveVersionSpec(ProjectSpaceBase.java:1187)
	at org.eclipse.emf.emfstore.internal.client.model.controller.CommitController.checkForCommitPreconditions(CommitController.java:274)
	at org.eclipse.emf.emfstore.internal.client.model.controller.CommitController.commit(CommitController.java:158)
	at org.eclipse.emf.emfstore.internal.client.model.controller.CommitController.run(CommitController.java:102)
	at org.eclipse.emf.emfstore.internal.client.model.controller.CommitController.run(CommitController.java:1)
	at org.eclipse.emf.emfstore.internal.client.model.connectionmanager.ServerCall.run(ServerCall.java:249)
	at org.eclipse.emf.emfstore.internal.client.model.connectionmanager.SessionManager.executeCall(SessionManager.java:126)
	at org.eclipse.emf.emfstore.internal.client.model.connectionmanager.SessionManager.execute(SessionManager.java:65)
	at org.eclipse.emf.emfstore.internal.client.model.connectionmanager.ServerCall.execute(ServerCall.java:269)
	at org.eclipse.emf.emfstore.internal.client.model.impl.ProjectSpaceBase.commitToBranch(ProjectSpaceBase.java:466)
	at org.eclipse.emf.emfstore.internal.client.model.impl.api.ESLocalProjectImpl$16.call(ESLocalProjectImpl.java:446)
	at org.eclipse.emf.emfstore.internal.client.model.impl.api.ESLocalProjectImpl$16.call(ESLocalProjectImpl.java:1)
	at org.eclipse.emf.emfstore.client.util.RunESCommand$WithException$2.doRun(RunESCommand.java:121)
	at org.eclipse.emf.emfstore.internal.client.model.util.EMFStoreCommandWithResult.commandBody(EMFStoreCommandWithResult.java:33)
	at org.eclipse.emf.emfstore.internal.client.model.util.AbstractEMFStoreCommand.execute(AbstractEMFStoreCommand.java:75)
	at org.eclipse.emf.emfstore.internal.client.transaction.EMFStoreTransactionalCommandStack$1.doExecute(EMFStoreTransactionalCommandStack.java:60)
	at org.eclipse.emf.transaction.RecordingCommand.execute(RecordingCommand.java:135)
	at org.eclipse.emf.common.command.BasicCommandStack.execute(BasicCommandStack.java:78)
	at org.eclipse.emf.transaction.impl.AbstractTransactionalCommandStack.basicExecute(AbstractTransactionalCommandStack.java:241)
	at org.eclipse.emf.emfstore.internal.client.transaction.EMFStoreTransactionalCommandStack.basicExecute(EMFStoreTransactionalCommandStack.java:162)
	at org.eclipse.emf.transaction.impl.TransactionalCommandStackImpl.doExecute(TransactionalCommandStackImpl.java:63)
	at org.eclipse.emf.transaction.impl.AbstractTransactionalCommandStack.execute(AbstractTransactionalCommandStack.java:165)
	at org.eclipse.emf.transaction.impl.AbstractTransactionalCommandStack.execute(AbstractTransactionalCommandStack.java:219)
	at org.eclipse.emf.emfstore.internal.client.transaction.EMFStoreTransactionalCommandStack.runEMFStoreCommand(EMFStoreTransactionalCommandStack.java:63)
	at org.eclipse.emf.emfstore.internal.client.transaction.EMFStoreTransactionalCommandStack.execute(EMFStoreTransactionalCommandStack.java:48)
	at org.eclipse.emf.emfstore.internal.client.model.util.AbstractEMFStoreCommand.aRun(AbstractEMFStoreCommand.java:133)
	at org.eclipse.emf.emfstore.internal.client.model.util.EMFStoreCommandWithResult.run(EMFStoreCommandWithResult.java:73)
	at org.eclipse.emf.emfstore.client.util.RunESCommand$WithException.runWithResult(RunESCommand.java:138)
	at org.eclipse.emf.emfstore.internal.client.model.impl.api.ESLocalProjectImpl.commitToBranch(ESLocalProjectImpl.java:434)
	at org.eclipse.emf.emfstore.client.test.common.util.ProjectUtil$13.call(ProjectUtil.java:300)
	at org.eclipse.emf.emfstore.client.test.common.util.ProjectUtil$13.call(ProjectUtil.java:1)
	at org.eclipse.emf.emfstore.client.util.RunESCommand$4.doRun(RunESCommand.java:342)
	at org.eclipse.emf.emfstore.internal.client.model.util.EMFStoreCommandWithResult.commandBody(EMFStoreCommandWithResult.java:33)
	at org.eclipse.emf.emfstore.internal.client.model.util.AbstractEMFStoreCommand.execute(AbstractEMFStoreCommand.java:75)
	at org.eclipse.emf.emfstore.internal.client.transaction.EMFStoreTransactionalCommandStack$1.doExecute(EMFStoreTransactionalCommandStack.java:60)
	at org.eclipse.emf.transaction.RecordingCommand.execute(RecordingCommand.java:135)
	at org.eclipse.emf.common.command.BasicCommandStack.execute(BasicCommandStack.java:78)
	at org.eclipse.emf.transaction.impl.AbstractTransactionalCommandStack.basicExecute(AbstractTransactionalCommandStack.java:241)
	at org.eclipse.emf.emfstore.internal.client.transaction.EMFStoreTransactionalCommandStack.basicExecute(EMFStoreTransactionalCommandStack.java:162)
	at org.eclipse.emf.transaction.impl.TransactionalCommandStackImpl.doExecute(TransactionalCommandStackImpl.java:63)
	at org.eclipse.emf.transaction.impl.AbstractTransactionalCommandStack.execute(AbstractTransactionalCommandStack.java:165)
	at org.eclipse.emf.transaction.impl.AbstractTransactionalCommandStack.execute(AbstractTransactionalCommandStack.java:219)
	at org.eclipse.emf.emfstore.internal.client.transaction.EMFStoreTransactionalCommandStack.runEMFStoreCommand(EMFStoreTransactionalCommandStack.java:63)
	at org.eclipse.emf.emfstore.internal.client.transaction.EMFStoreTransactionalCommandStack.execute(EMFStoreTransactionalCommandStack.java:48)
	at org.eclipse.emf.emfstore.internal.client.model.util.AbstractEMFStoreCommand.aRun(AbstractEMFStoreCommand.java:133)
	at org.eclipse.emf.emfstore.internal.client.model.util.EMFStoreCommandWithResult.run(EMFStoreCommandWithResult.java:73)
	at org.eclipse.emf.emfstore.client.util.RunESCommand.runWithResult(RunESCommand.java:350)
	at org.eclipse.emf.emfstore.internal.client.model.impl.api.ESLocalProjectImpl.runWithResult(ESLocalProjectImpl.java:864)
	at org.eclipse.emf.emfstore.client.test.common.util.ProjectUtil.branch(ProjectUtil.java:298)
	at org.eclipse.emf.emfstore.server.test.VersionSpecTests.before(VersionSpecTests.java:136)
	at sun.reflect.NativeMethodAccessorImpl.invoke0(Native Method)
	at sun.reflect.NativeMethodAccessorImpl.invoke(NativeMethodAccessorImpl.java:39)
	at sun.reflect.DelegatingMethodAccessorImpl.invoke(DelegatingMethodAccessorImpl.java:25)
	at java.lang.reflect.Method.invoke(Method.java:597)
	at org.junit.runners.model.FrameworkMethod$1.runReflectiveCall(FrameworkMethod.java:47)
	at org.junit.internal.runners.model.ReflectiveCallable.run(ReflectiveCallable.java:12)
	at org.junit.runners.model.FrameworkMethod.invokeExplosively(FrameworkMethod.java:44)
	at org.junit.internal.runners.statements.RunBefores.evaluate(RunBefores.java:24)
	at org.junit.internal.runners.statements.RunAfters.evaluate(RunAfters.java:27)
	at org.junit.runners.ParentRunner.runLeaf(ParentRunner.java:271)
	at org.junit.runners.BlockJUnit4ClassRunner.runChild(BlockJUnit4ClassRunner.java:70)
	at org.junit.runners.BlockJUnit4ClassRunner.runChild(BlockJUnit4ClassRunner.java:50)
	at org.junit.runners.ParentRunner$3.run(ParentRunner.java:238)
	at org.junit.runners.ParentRunner$1.schedule(ParentRunner.java:63)
	at org.junit.runners.ParentRunner.runChildren(ParentRunner.java:236)
	at org.junit.runners.ParentRunner.access$000(ParentRunner.java:53)
	at org.junit.runners.ParentRunner$2.evaluate(ParentRunner.java:229)
	at org.junit.internal.runners.statements.RunBefores.evaluate(RunBefores.java:26)
	at org.junit.internal.runners.statements.RunAfters.evaluate(RunAfters.java:27)
	at org.junit.runners.ParentRunner.run(ParentRunner.java:309)
	at org.junit.runners.Suite.runChild(Suite.java:127)
	at org.junit.runners.Suite.runChild(Suite.java:26)
	at org.junit.runners.ParentRunner$3.run(ParentRunner.java:238)
	at org.junit.runners.ParentRunner$1.schedule(ParentRunner.java:63)
	at org.junit.runners.ParentRunner.runChildren(ParentRunner.java:236)
	at org.junit.runners.ParentRunner.access$000(ParentRunner.java:53)
	at org.junit.runners.ParentRunner$2.evaluate(ParentRunner.java:229)
	at org.junit.runners.ParentRunner.run(ParentRunner.java:309)
	at org.apache.maven.surefire.junit4.JUnit4TestSet.execute(JUnit4TestSet.java:53)
	at org.apache.maven.surefire.junit4.JUnit4Provider.executeTestSet(JUnit4Provider.java:123)
	at org.apache.maven.surefire.junit4.JUnit4Provider.invoke(JUnit4Provider.java:104)
	at sun.reflect.NativeMethodAccessorImpl.invoke0(Native Method)
	at sun.reflect.NativeMethodAccessorImpl.invoke(NativeMethodAccessorImpl.java:39)
	at sun.reflect.DelegatingMethodAccessorImpl.invoke(DelegatingMethodAccessorImpl.java:25)
	at java.lang.reflect.Method.invoke(Method.java:597)
	at org.apache.maven.surefire.util.ReflectionUtils.invokeMethodWithArray(ReflectionUtils.java:164)
	at org.apache.maven.surefire.booter.ProviderFactory$ProviderProxy.invoke(ProviderFactory.java:110)
	at org.apache.maven.surefire.booter.SurefireStarter.invokeProvider(SurefireStarter.java:175)
	at org.apache.maven.surefire.booter.SurefireStarter.runSuitesInProcess(SurefireStarter.java:123)
	at org.eclipse.tycho.surefire.osgibooter.OsgiSurefireBooter.run(OsgiSurefireBooter.java:85)
	at org.eclipse.tycho.surefire.osgibooter.AbstractUITestApplication.runTests(AbstractUITestApplication.java:44)
	at org.eclipse.ui.internal.testing.WorkbenchTestable$1.run(WorkbenchTestable.java:71)
	at java.lang.Thread.run(Thread.java:662)
Caused by: org.eclipse.emf.emfstore.internal.server.exceptions.InvalidVersionSpecException: 
	at org.eclipse.emf.emfstore.internal.server.core.subinterfaces.VersionSubInterfaceImpl.resolveBranchVersionSpec(VersionSubInterfaceImpl.java:229)
	at org.eclipse.emf.emfstore.internal.server.core.subinterfaces.VersionSubInterfaceImpl.resolveVersionSpec(VersionSubInterfaceImpl.java:106)
	... 106 more

Total time for commit: 1
Total time for commit: 1
Exception on execution: java.lang.reflect.InvocationTargetException
	at sun.reflect.GeneratedMethodAccessor14.invoke(Unknown Source)
	at sun.reflect.DelegatingMethodAccessorImpl.invoke(DelegatingMethodAccessorImpl.java:25)
	at java.lang.reflect.Method.invoke(Method.java:597)
	at org.eclipse.emf.emfstore.internal.server.core.AbstractSubEmfstoreInterface.execute(AbstractSubEmfstoreInterface.java:140)
	at org.eclipse.emf.emfstore.internal.server.core.EMFStoreImpl.invoke(EMFStoreImpl.java:160)
	at com.sun.proxy.$Proxy20.resolveVersionSpec(Unknown Source)
	at org.eclipse.emf.emfstore.client.test.common.mocks.ConnectionMock.resolveVersionSpec(ConnectionMock.java:110)
	at org.eclipse.emf.emfstore.internal.client.model.impl.ProjectSpaceBase$4.run(ProjectSpaceBase.java:1182)
	at org.eclipse.emf.emfstore.internal.client.model.impl.ProjectSpaceBase$4.run(ProjectSpaceBase.java:1)
	at org.eclipse.emf.emfstore.internal.client.model.connectionmanager.ServerCall.run(ServerCall.java:249)
	at org.eclipse.emf.emfstore.internal.client.model.connectionmanager.SessionManager.executeCall(SessionManager.java:126)
	at org.eclipse.emf.emfstore.internal.client.model.connectionmanager.SessionManager.execute(SessionManager.java:65)
	at org.eclipse.emf.emfstore.internal.client.model.connectionmanager.ServerCall.execute(ServerCall.java:269)
	at org.eclipse.emf.emfstore.internal.client.model.impl.ProjectSpaceBase.resolveVersionSpec(ProjectSpaceBase.java:1187)
	at org.eclipse.emf.emfstore.internal.client.model.controller.CommitController.checkForCommitPreconditions(CommitController.java:274)
	at org.eclipse.emf.emfstore.internal.client.model.controller.CommitController.commit(CommitController.java:126)
	at org.eclipse.emf.emfstore.internal.client.model.controller.CommitController.run(CommitController.java:102)
	at org.eclipse.emf.emfstore.internal.client.model.controller.CommitController.run(CommitController.java:1)
	at org.eclipse.emf.emfstore.internal.client.model.connectionmanager.ServerCall.run(ServerCall.java:249)
	at org.eclipse.emf.emfstore.internal.client.model.connectionmanager.SessionManager.executeCall(SessionManager.java:126)
	at org.eclipse.emf.emfstore.internal.client.model.connectionmanager.SessionManager.execute(SessionManager.java:65)
	at org.eclipse.emf.emfstore.internal.client.model.connectionmanager.ServerCall.execute(ServerCall.java:269)
	at org.eclipse.emf.emfstore.internal.client.model.impl.ProjectSpaceBase.commitToBranch(ProjectSpaceBase.java:466)
	at org.eclipse.emf.emfstore.internal.client.model.impl.api.ESLocalProjectImpl$16.call(ESLocalProjectImpl.java:446)
	at org.eclipse.emf.emfstore.internal.client.model.impl.api.ESLocalProjectImpl$16.call(ESLocalProjectImpl.java:1)
	at org.eclipse.emf.emfstore.client.util.RunESCommand$WithException$2.doRun(RunESCommand.java:121)
	at org.eclipse.emf.emfstore.internal.client.model.util.EMFStoreCommandWithResult.commandBody(EMFStoreCommandWithResult.java:33)
	at org.eclipse.emf.emfstore.internal.client.model.util.AbstractEMFStoreCommand.execute(AbstractEMFStoreCommand.java:75)
	at org.eclipse.emf.emfstore.internal.client.transaction.EMFStoreTransactionalCommandStack$1.doExecute(EMFStoreTransactionalCommandStack.java:60)
	at org.eclipse.emf.transaction.RecordingCommand.execute(RecordingCommand.java:135)
	at org.eclipse.emf.common.command.BasicCommandStack.execute(BasicCommandStack.java:78)
	at org.eclipse.emf.transaction.impl.AbstractTransactionalCommandStack.basicExecute(AbstractTransactionalCommandStack.java:241)
	at org.eclipse.emf.emfstore.internal.client.transaction.EMFStoreTransactionalCommandStack.basicExecute(EMFStoreTransactionalCommandStack.java:162)
	at org.eclipse.emf.transaction.impl.TransactionalCommandStackImpl.doExecute(TransactionalCommandStackImpl.java:63)
	at org.eclipse.emf.transaction.impl.AbstractTransactionalCommandStack.execute(AbstractTransactionalCommandStack.java:165)
	at org.eclipse.emf.transaction.impl.AbstractTransactionalCommandStack.execute(AbstractTransactionalCommandStack.java:219)
	at org.eclipse.emf.emfstore.internal.client.transaction.EMFStoreTransactionalCommandStack.runEMFStoreCommand(EMFStoreTransactionalCommandStack.java:63)
	at org.eclipse.emf.emfstore.internal.client.transaction.EMFStoreTransactionalCommandStack.execute(EMFStoreTransactionalCommandStack.java:48)
	at org.eclipse.emf.emfstore.internal.client.model.util.AbstractEMFStoreCommand.aRun(AbstractEMFStoreCommand.java:133)
	at org.eclipse.emf.emfstore.internal.client.model.util.EMFStoreCommandWithResult.run(EMFStoreCommandWithResult.java:73)
	at org.eclipse.emf.emfstore.client.util.RunESCommand$WithException.runWithResult(RunESCommand.java:138)
	at org.eclipse.emf.emfstore.internal.client.model.impl.api.ESLocalProjectImpl.commitToBranch(ESLocalProjectImpl.java:434)
	at org.eclipse.emf.emfstore.client.test.common.util.ProjectUtil$13.call(ProjectUtil.java:300)
	at org.eclipse.emf.emfstore.client.test.common.util.ProjectUtil$13.call(ProjectUtil.java:1)
	at org.eclipse.emf.emfstore.client.util.RunESCommand$4.doRun(RunESCommand.java:342)
	at org.eclipse.emf.emfstore.internal.client.model.util.EMFStoreCommandWithResult.commandBody(EMFStoreCommandWithResult.java:33)
	at org.eclipse.emf.emfstore.internal.client.model.util.AbstractEMFStoreCommand.execute(AbstractEMFStoreCommand.java:75)
	at org.eclipse.emf.emfstore.internal.client.transaction.EMFStoreTransactionalCommandStack$1.doExecute(EMFStoreTransactionalCommandStack.java:60)
	at org.eclipse.emf.transaction.RecordingCommand.execute(RecordingCommand.java:135)
	at org.eclipse.emf.common.command.BasicCommandStack.execute(BasicCommandStack.java:78)
	at org.eclipse.emf.transaction.impl.AbstractTransactionalCommandStack.basicExecute(AbstractTransactionalCommandStack.java:241)
	at org.eclipse.emf.emfstore.internal.client.transaction.EMFStoreTransactionalCommandStack.basicExecute(EMFStoreTransactionalCommandStack.java:162)
	at org.eclipse.emf.transaction.impl.TransactionalCommandStackImpl.doExecute(TransactionalCommandStackImpl.java:63)
	at org.eclipse.emf.transaction.impl.AbstractTransactionalCommandStack.execute(AbstractTransactionalCommandStack.java:165)
	at org.eclipse.emf.transaction.impl.AbstractTransactionalCommandStack.execute(AbstractTransactionalCommandStack.java:219)
	at org.eclipse.emf.emfstore.internal.client.transaction.EMFStoreTransactionalCommandStack.runEMFStoreCommand(EMFStoreTransactionalCommandStack.java:63)
	at org.eclipse.emf.emfstore.internal.client.transaction.EMFStoreTransactionalCommandStack.execute(EMFStoreTransactionalCommandStack.java:48)
	at org.eclipse.emf.emfstore.internal.client.model.util.AbstractEMFStoreCommand.aRun(AbstractEMFStoreCommand.java:133)
	at org.eclipse.emf.emfstore.internal.client.model.util.EMFStoreCommandWithResult.run(EMFStoreCommandWithResult.java:73)
	at org.eclipse.emf.emfstore.client.util.RunESCommand.runWithResult(RunESCommand.java:350)
	at org.eclipse.emf.emfstore.internal.client.model.impl.api.ESLocalProjectImpl.runWithResult(ESLocalProjectImpl.java:864)
	at org.eclipse.emf.emfstore.client.test.common.util.ProjectUtil.branch(ProjectUtil.java:298)
	at org.eclipse.emf.emfstore.server.test.VersionSpecTests.before(VersionSpecTests.java:141)
	at sun.reflect.NativeMethodAccessorImpl.invoke0(Native Method)
	at sun.reflect.NativeMethodAccessorImpl.invoke(NativeMethodAccessorImpl.java:39)
	at sun.reflect.DelegatingMethodAccessorImpl.invoke(DelegatingMethodAccessorImpl.java:25)
	at java.lang.reflect.Method.invoke(Method.java:597)
	at org.junit.runners.model.FrameworkMethod$1.runReflectiveCall(FrameworkMethod.java:47)
	at org.junit.internal.runners.model.ReflectiveCallable.run(ReflectiveCallable.java:12)
	at org.junit.runners.model.FrameworkMethod.invokeExplosively(FrameworkMethod.java:44)
	at org.junit.internal.runners.statements.RunBefores.evaluate(RunBefores.java:24)
	at org.junit.internal.runners.statements.RunAfters.evaluate(RunAfters.java:27)
	at org.junit.runners.ParentRunner.runLeaf(ParentRunner.java:271)
	at org.junit.runners.BlockJUnit4ClassRunner.runChild(BlockJUnit4ClassRunner.java:70)
	at org.junit.runners.BlockJUnit4ClassRunner.runChild(BlockJUnit4ClassRunner.java:50)
	at org.junit.runners.ParentRunner$3.run(ParentRunner.java:238)
	at org.junit.runners.ParentRunner$1.schedule(ParentRunner.java:63)
	at org.junit.runners.ParentRunner.runChildren(ParentRunner.java:236)
	at org.junit.runners.ParentRunner.access$000(ParentRunner.java:53)
	at org.junit.runners.ParentRunner$2.evaluate(ParentRunner.java:229)
	at org.junit.internal.runners.statements.RunBefores.evaluate(RunBefores.java:26)
	at org.junit.internal.runners.statements.RunAfters.evaluate(RunAfters.java:27)
	at org.junit.runners.ParentRunner.run(ParentRunner.java:309)
	at org.junit.runners.Suite.runChild(Suite.java:127)
	at org.junit.runners.Suite.runChild(Suite.java:26)
	at org.junit.runners.ParentRunner$3.run(ParentRunner.java:238)
	at org.junit.runners.ParentRunner$1.schedule(ParentRunner.java:63)
	at org.junit.runners.ParentRunner.runChildren(ParentRunner.java:236)
	at org.junit.runners.ParentRunner.access$000(ParentRunner.java:53)
	at org.junit.runners.ParentRunner$2.evaluate(ParentRunner.java:229)
	at org.junit.runners.ParentRunner.run(ParentRunner.java:309)
	at org.apache.maven.surefire.junit4.JUnit4TestSet.execute(JUnit4TestSet.java:53)
	at org.apache.maven.surefire.junit4.JUnit4Provider.executeTestSet(JUnit4Provider.java:123)
	at org.apache.maven.surefire.junit4.JUnit4Provider.invoke(JUnit4Provider.java:104)
	at sun.reflect.NativeMethodAccessorImpl.invoke0(Native Method)
	at sun.reflect.NativeMethodAccessorImpl.invoke(NativeMethodAccessorImpl.java:39)
	at sun.reflect.DelegatingMethodAccessorImpl.invoke(DelegatingMethodAccessorImpl.java:25)
	at java.lang.reflect.Method.invoke(Method.java:597)
	at org.apache.maven.surefire.util.ReflectionUtils.invokeMethodWithArray(ReflectionUtils.java:164)
	at org.apache.maven.surefire.booter.ProviderFactory$ProviderProxy.invoke(ProviderFactory.java:110)
	at org.apache.maven.surefire.booter.SurefireStarter.invokeProvider(SurefireStarter.java:175)
	at org.apache.maven.surefire.booter.SurefireStarter.runSuitesInProcess(SurefireStarter.java:123)
	at org.eclipse.tycho.surefire.osgibooter.OsgiSurefireBooter.run(OsgiSurefireBooter.java:85)
	at org.eclipse.tycho.surefire.osgibooter.AbstractUITestApplication.runTests(AbstractUITestApplication.java:44)
	at org.eclipse.ui.internal.testing.WorkbenchTestable$1.run(WorkbenchTestable.java:71)
	at java.lang.Thread.run(Thread.java:662)
Caused by: org.eclipse.emf.emfstore.internal.server.exceptions.InvalidVersionSpecException: 
	at org.eclipse.emf.emfstore.internal.server.core.subinterfaces.VersionSubInterfaceImpl.resolveBranchVersionSpec(VersionSubInterfaceImpl.java:229)
	at org.eclipse.emf.emfstore.internal.server.core.subinterfaces.VersionSubInterfaceImpl.resolveVersionSpec(VersionSubInterfaceImpl.java:106)
	... 106 more

Exception on execution: java.lang.reflect.InvocationTargetException
	at sun.reflect.GeneratedMethodAccessor14.invoke(Unknown Source)
	at sun.reflect.DelegatingMethodAccessorImpl.invoke(DelegatingMethodAccessorImpl.java:25)
	at java.lang.reflect.Method.invoke(Method.java:597)
	at org.eclipse.emf.emfstore.internal.server.core.AbstractSubEmfstoreInterface.execute(AbstractSubEmfstoreInterface.java:140)
	at org.eclipse.emf.emfstore.internal.server.core.EMFStoreImpl.invoke(EMFStoreImpl.java:160)
	at com.sun.proxy.$Proxy20.resolveVersionSpec(Unknown Source)
	at org.eclipse.emf.emfstore.client.test.common.mocks.ConnectionMock.resolveVersionSpec(ConnectionMock.java:110)
	at org.eclipse.emf.emfstore.internal.client.model.impl.ProjectSpaceBase$4.run(ProjectSpaceBase.java:1182)
	at org.eclipse.emf.emfstore.internal.client.model.impl.ProjectSpaceBase$4.run(ProjectSpaceBase.java:1)
	at org.eclipse.emf.emfstore.internal.client.model.connectionmanager.ServerCall.run(ServerCall.java:249)
	at org.eclipse.emf.emfstore.internal.client.model.connectionmanager.SessionManager.executeCall(SessionManager.java:126)
	at org.eclipse.emf.emfstore.internal.client.model.connectionmanager.SessionManager.execute(SessionManager.java:65)
	at org.eclipse.emf.emfstore.internal.client.model.connectionmanager.ServerCall.execute(ServerCall.java:269)
	at org.eclipse.emf.emfstore.internal.client.model.impl.ProjectSpaceBase.resolveVersionSpec(ProjectSpaceBase.java:1187)
	at org.eclipse.emf.emfstore.internal.client.model.controller.CommitController.checkForCommitPreconditions(CommitController.java:274)
	at org.eclipse.emf.emfstore.internal.client.model.controller.CommitController.commit(CommitController.java:126)
	at org.eclipse.emf.emfstore.internal.client.model.controller.CommitController.run(CommitController.java:102)
	at org.eclipse.emf.emfstore.internal.client.model.controller.CommitController.run(CommitController.java:1)
	at org.eclipse.emf.emfstore.internal.client.model.connectionmanager.ServerCall.run(ServerCall.java:249)
	at org.eclipse.emf.emfstore.internal.client.model.connectionmanager.SessionManager.executeCall(SessionManager.java:126)
	at org.eclipse.emf.emfstore.internal.client.model.connectionmanager.SessionManager.execute(SessionManager.java:65)
	at org.eclipse.emf.emfstore.internal.client.model.connectionmanager.ServerCall.execute(ServerCall.java:269)
	at org.eclipse.emf.emfstore.internal.client.model.impl.ProjectSpaceBase.commitToBranch(ProjectSpaceBase.java:466)
	at org.eclipse.emf.emfstore.internal.client.model.impl.api.ESLocalProjectImpl$16.call(ESLocalProjectImpl.java:446)
	at org.eclipse.emf.emfstore.internal.client.model.impl.api.ESLocalProjectImpl$16.call(ESLocalProjectImpl.java:1)
	at org.eclipse.emf.emfstore.client.util.RunESCommand$WithException$2.doRun(RunESCommand.java:121)
	at org.eclipse.emf.emfstore.internal.client.model.util.EMFStoreCommandWithResult.commandBody(EMFStoreCommandWithResult.java:33)
	at org.eclipse.emf.emfstore.internal.client.model.util.AbstractEMFStoreCommand.execute(AbstractEMFStoreCommand.java:75)
	at org.eclipse.emf.emfstore.internal.client.transaction.EMFStoreTransactionalCommandStack$1.doExecute(EMFStoreTransactionalCommandStack.java:60)
	at org.eclipse.emf.transaction.RecordingCommand.execute(RecordingCommand.java:135)
	at org.eclipse.emf.common.command.BasicCommandStack.execute(BasicCommandStack.java:78)
	at org.eclipse.emf.transaction.impl.AbstractTransactionalCommandStack.basicExecute(AbstractTransactionalCommandStack.java:241)
	at org.eclipse.emf.emfstore.internal.client.transaction.EMFStoreTransactionalCommandStack.basicExecute(EMFStoreTransactionalCommandStack.java:162)
	at org.eclipse.emf.transaction.impl.TransactionalCommandStackImpl.doExecute(TransactionalCommandStackImpl.java:63)
	at org.eclipse.emf.transaction.impl.AbstractTransactionalCommandStack.execute(AbstractTransactionalCommandStack.java:165)
	at org.eclipse.emf.transaction.impl.AbstractTransactionalCommandStack.execute(AbstractTransactionalCommandStack.java:219)
	at org.eclipse.emf.emfstore.internal.client.transaction.EMFStoreTransactionalCommandStack.runEMFStoreCommand(EMFStoreTransactionalCommandStack.java:63)
	at org.eclipse.emf.emfstore.internal.client.transaction.EMFStoreTransactionalCommandStack.execute(EMFStoreTransactionalCommandStack.java:48)
	at org.eclipse.emf.emfstore.internal.client.model.util.AbstractEMFStoreCommand.aRun(AbstractEMFStoreCommand.java:133)
	at org.eclipse.emf.emfstore.internal.client.model.util.EMFStoreCommandWithResult.run(EMFStoreCommandWithResult.java:73)
	at org.eclipse.emf.emfstore.client.util.RunESCommand$WithException.runWithResult(RunESCommand.java:138)
	at org.eclipse.emf.emfstore.internal.client.model.impl.api.ESLocalProjectImpl.commitToBranch(ESLocalProjectImpl.java:434)
	at org.eclipse.emf.emfstore.client.test.common.util.ProjectUtil$13.call(ProjectUtil.java:300)
	at org.eclipse.emf.emfstore.client.test.common.util.ProjectUtil$13.call(ProjectUtil.java:1)
	at org.eclipse.emf.emfstore.client.util.RunESCommand$4.doRun(RunESCommand.java:342)
	at org.eclipse.emf.emfstore.internal.client.model.util.EMFStoreCommandWithResult.commandBody(EMFStoreCommandWithResult.java:33)
	at org.eclipse.emf.emfstore.internal.client.model.util.AbstractEMFStoreCommand.execute(AbstractEMFStoreCommand.java:75)
	at org.eclipse.emf.emfstore.internal.client.transaction.EMFStoreTransactionalCommandStack$1.doExecute(EMFStoreTransactionalCommandStack.java:60)
	at org.eclipse.emf.transaction.RecordingCommand.execute(RecordingCommand.java:135)
	at org.eclipse.emf.common.command.BasicCommandStack.execute(BasicCommandStack.java:78)
	at org.eclipse.emf.transaction.impl.AbstractTransactionalCommandStack.basicExecute(AbstractTransactionalCommandStack.java:241)
	at org.eclipse.emf.emfstore.internal.client.transaction.EMFStoreTransactionalCommandStack.basicExecute(EMFStoreTransactionalCommandStack.java:162)
	at org.eclipse.emf.transaction.impl.TransactionalCommandStackImpl.doExecute(TransactionalCommandStackImpl.java:63)
	at org.eclipse.emf.transaction.impl.AbstractTransactionalCommandStack.execute(AbstractTransactionalCommandStack.java:165)
	at org.eclipse.emf.transaction.impl.AbstractTransactionalCommandStack.execute(AbstractTransactionalCommandStack.java:219)
	at org.eclipse.emf.emfstore.internal.client.transaction.EMFStoreTransactionalCommandStack.runEMFStoreCommand(EMFStoreTransactionalCommandStack.java:63)
	at org.eclipse.emf.emfstore.internal.client.transaction.EMFStoreTransactionalCommandStack.execute(EMFStoreTransactionalCommandStack.java:48)
	at org.eclipse.emf.emfstore.internal.client.model.util.AbstractEMFStoreCommand.aRun(AbstractEMFStoreCommand.java:133)
	at org.eclipse.emf.emfstore.internal.client.model.util.EMFStoreCommandWithResult.run(EMFStoreCommandWithResult.java:73)
	at org.eclipse.emf.emfstore.client.util.RunESCommand.runWithResult(RunESCommand.java:350)
	at org.eclipse.emf.emfstore.internal.client.model.impl.api.ESLocalProjectImpl.runWithResult(ESLocalProjectImpl.java:864)
	at org.eclipse.emf.emfstore.client.test.common.util.ProjectUtil.branch(ProjectUtil.java:298)
	at org.eclipse.emf.emfstore.server.test.VersionSpecTests.before(VersionSpecTests.java:141)
	at sun.reflect.NativeMethodAccessorImpl.invoke0(Native Method)
	at sun.reflect.NativeMethodAccessorImpl.invoke(NativeMethodAccessorImpl.java:39)
	at sun.reflect.DelegatingMethodAccessorImpl.invoke(DelegatingMethodAccessorImpl.java:25)
	at java.lang.reflect.Method.invoke(Method.java:597)
	at org.junit.runners.model.FrameworkMethod$1.runReflectiveCall(FrameworkMethod.java:47)
	at org.junit.internal.runners.model.ReflectiveCallable.run(ReflectiveCallable.java:12)
	at org.junit.runners.model.FrameworkMethod.invokeExplosively(FrameworkMethod.java:44)
	at org.junit.internal.runners.statements.RunBefores.evaluate(RunBefores.java:24)
	at org.junit.internal.runners.statements.RunAfters.evaluate(RunAfters.java:27)
	at org.junit.runners.ParentRunner.runLeaf(ParentRunner.java:271)
	at org.junit.runners.BlockJUnit4ClassRunner.runChild(BlockJUnit4ClassRunner.java:70)
	at org.junit.runners.BlockJUnit4ClassRunner.runChild(BlockJUnit4ClassRunner.java:50)
	at org.junit.runners.ParentRunner$3.run(ParentRunner.java:238)
	at org.junit.runners.ParentRunner$1.schedule(ParentRunner.java:63)
	at org.junit.runners.ParentRunner.runChildren(ParentRunner.java:236)
	at org.junit.runners.ParentRunner.access$000(ParentRunner.java:53)
	at org.junit.runners.ParentRunner$2.evaluate(ParentRunner.java:229)
	at org.junit.internal.runners.statements.RunBefores.evaluate(RunBefores.java:26)
	at org.junit.internal.runners.statements.RunAfters.evaluate(RunAfters.java:27)
	at org.junit.runners.ParentRunner.run(ParentRunner.java:309)
	at org.junit.runners.Suite.runChild(Suite.java:127)
	at org.junit.runners.Suite.runChild(Suite.java:26)
	at org.junit.runners.ParentRunner$3.run(ParentRunner.java:238)
	at org.junit.runners.ParentRunner$1.schedule(ParentRunner.java:63)
	at org.junit.runners.ParentRunner.runChildren(ParentRunner.java:236)
	at org.junit.runners.ParentRunner.access$000(ParentRunner.java:53)
	at org.junit.runners.ParentRunner$2.evaluate(ParentRunner.java:229)
	at org.junit.runners.ParentRunner.run(ParentRunner.java:309)
	at org.apache.maven.surefire.junit4.JUnit4TestSet.execute(JUnit4TestSet.java:53)
	at org.apache.maven.surefire.junit4.JUnit4Provider.executeTestSet(JUnit4Provider.java:123)
	at org.apache.maven.surefire.junit4.JUnit4Provider.invoke(JUnit4Provider.java:104)
	at sun.reflect.NativeMethodAccessorImpl.invoke0(Native Method)
	at sun.reflect.NativeMethodAccessorImpl.invoke(NativeMethodAccessorImpl.java:39)
	at sun.reflect.DelegatingMethodAccessorImpl.invoke(DelegatingMethodAccessorImpl.java:25)
	at java.lang.reflect.Method.invoke(Method.java:597)
	at org.apache.maven.surefire.util.ReflectionUtils.invokeMethodWithArray(ReflectionUtils.java:164)
	at org.apache.maven.surefire.booter.ProviderFactory$ProviderProxy.invoke(ProviderFactory.java:110)
	at org.apache.maven.surefire.booter.SurefireStarter.invokeProvider(SurefireStarter.java:175)
	at org.apache.maven.surefire.booter.SurefireStarter.runSuitesInProcess(SurefireStarter.java:123)
	at org.eclipse.tycho.surefire.osgibooter.OsgiSurefireBooter.run(OsgiSurefireBooter.java:85)
	at org.eclipse.tycho.surefire.osgibooter.AbstractUITestApplication.runTests(AbstractUITestApplication.java:44)
	at org.eclipse.ui.internal.testing.WorkbenchTestable$1.run(WorkbenchTestable.java:71)
	at java.lang.Thread.run(Thread.java:662)
Caused by: org.eclipse.emf.emfstore.internal.server.exceptions.InvalidVersionSpecException: 
	at org.eclipse.emf.emfstore.internal.server.core.subinterfaces.VersionSubInterfaceImpl.resolveBranchVersionSpec(VersionSubInterfaceImpl.java:229)
	at org.eclipse.emf.emfstore.internal.server.core.subinterfaces.VersionSubInterfaceImpl.resolveVersionSpec(VersionSubInterfaceImpl.java:106)
	... 106 more

Exception on execution: java.lang.reflect.InvocationTargetException
	at sun.reflect.GeneratedMethodAccessor14.invoke(Unknown Source)
	at sun.reflect.DelegatingMethodAccessorImpl.invoke(DelegatingMethodAccessorImpl.java:25)
	at java.lang.reflect.Method.invoke(Method.java:597)
	at org.eclipse.emf.emfstore.internal.server.core.AbstractSubEmfstoreInterface.execute(AbstractSubEmfstoreInterface.java:140)
	at org.eclipse.emf.emfstore.internal.server.core.EMFStoreImpl.invoke(EMFStoreImpl.java:160)
	at com.sun.proxy.$Proxy20.resolveVersionSpec(Unknown Source)
	at org.eclipse.emf.emfstore.client.test.common.mocks.ConnectionMock.resolveVersionSpec(ConnectionMock.java:110)
	at org.eclipse.emf.emfstore.internal.client.model.impl.ProjectSpaceBase$4.run(ProjectSpaceBase.java:1182)
	at org.eclipse.emf.emfstore.internal.client.model.impl.ProjectSpaceBase$4.run(ProjectSpaceBase.java:1)
	at org.eclipse.emf.emfstore.internal.client.model.connectionmanager.ServerCall.run(ServerCall.java:249)
	at org.eclipse.emf.emfstore.internal.client.model.connectionmanager.SessionManager.executeCall(SessionManager.java:126)
	at org.eclipse.emf.emfstore.internal.client.model.connectionmanager.SessionManager.execute(SessionManager.java:65)
	at org.eclipse.emf.emfstore.internal.client.model.connectionmanager.ServerCall.execute(ServerCall.java:269)
	at org.eclipse.emf.emfstore.internal.client.model.impl.ProjectSpaceBase.resolveVersionSpec(ProjectSpaceBase.java:1187)
	at org.eclipse.emf.emfstore.internal.client.model.controller.CommitController.checkForCommitPreconditions(CommitController.java:274)
	at org.eclipse.emf.emfstore.internal.client.model.controller.CommitController.commit(CommitController.java:158)
	at org.eclipse.emf.emfstore.internal.client.model.controller.CommitController.run(CommitController.java:102)
	at org.eclipse.emf.emfstore.internal.client.model.controller.CommitController.run(CommitController.java:1)
	at org.eclipse.emf.emfstore.internal.client.model.connectionmanager.ServerCall.run(ServerCall.java:249)
	at org.eclipse.emf.emfstore.internal.client.model.connectionmanager.SessionManager.executeCall(SessionManager.java:126)
	at org.eclipse.emf.emfstore.internal.client.model.connectionmanager.SessionManager.execute(SessionManager.java:65)
	at org.eclipse.emf.emfstore.internal.client.model.connectionmanager.ServerCall.execute(ServerCall.java:269)
	at org.eclipse.emf.emfstore.internal.client.model.impl.ProjectSpaceBase.commitToBranch(ProjectSpaceBase.java:466)
	at org.eclipse.emf.emfstore.internal.client.model.impl.api.ESLocalProjectImpl$16.call(ESLocalProjectImpl.java:446)
	at org.eclipse.emf.emfstore.internal.client.model.impl.api.ESLocalProjectImpl$16.call(ESLocalProjectImpl.java:1)
	at org.eclipse.emf.emfstore.client.util.RunESCommand$WithException$2.doRun(RunESCommand.java:121)
	at org.eclipse.emf.emfstore.internal.client.model.util.EMFStoreCommandWithResult.commandBody(EMFStoreCommandWithResult.java:33)
	at org.eclipse.emf.emfstore.internal.client.model.util.AbstractEMFStoreCommand.execute(AbstractEMFStoreCommand.java:75)
	at org.eclipse.emf.emfstore.internal.client.transaction.EMFStoreTransactionalCommandStack$1.doExecute(EMFStoreTransactionalCommandStack.java:60)
	at org.eclipse.emf.transaction.RecordingCommand.execute(RecordingCommand.java:135)
	at org.eclipse.emf.common.command.BasicCommandStack.execute(BasicCommandStack.java:78)
	at org.eclipse.emf.transaction.impl.AbstractTransactionalCommandStack.basicExecute(AbstractTransactionalCommandStack.java:241)
	at org.eclipse.emf.emfstore.internal.client.transaction.EMFStoreTransactionalCommandStack.basicExecute(EMFStoreTransactionalCommandStack.java:162)
	at org.eclipse.emf.transaction.impl.TransactionalCommandStackImpl.doExecute(TransactionalCommandStackImpl.java:63)
	at org.eclipse.emf.transaction.impl.AbstractTransactionalCommandStack.execute(AbstractTransactionalCommandStack.java:165)
	at org.eclipse.emf.transaction.impl.AbstractTransactionalCommandStack.execute(AbstractTransactionalCommandStack.java:219)
	at org.eclipse.emf.emfstore.internal.client.transaction.EMFStoreTransactionalCommandStack.runEMFStoreCommand(EMFStoreTransactionalCommandStack.java:63)
	at org.eclipse.emf.emfstore.internal.client.transaction.EMFStoreTransactionalCommandStack.execute(EMFStoreTransactionalCommandStack.java:48)
	at org.eclipse.emf.emfstore.internal.client.model.util.AbstractEMFStoreCommand.aRun(AbstractEMFStoreCommand.java:133)
	at org.eclipse.emf.emfstore.internal.client.model.util.EMFStoreCommandWithResult.run(EMFStoreCommandWithResult.java:73)
	at org.eclipse.emf.emfstore.client.util.RunESCommand$WithException.runWithResult(RunESCommand.java:138)
	at org.eclipse.emf.emfstore.internal.client.model.impl.api.ESLocalProjectImpl.commitToBranch(ESLocalProjectImpl.java:434)
	at org.eclipse.emf.emfstore.client.test.common.util.ProjectUtil$13.call(ProjectUtil.java:300)
	at org.eclipse.emf.emfstore.client.test.common.util.ProjectUtil$13.call(ProjectUtil.java:1)
	at org.eclipse.emf.emfstore.client.util.RunESCommand$4.doRun(RunESCommand.java:342)
	at org.eclipse.emf.emfstore.internal.client.model.util.EMFStoreCommandWithResult.commandBody(EMFStoreCommandWithResult.java:33)
	at org.eclipse.emf.emfstore.internal.client.model.util.AbstractEMFStoreCommand.execute(AbstractEMFStoreCommand.java:75)
	at org.eclipse.emf.emfstore.internal.client.transaction.EMFStoreTransactionalCommandStack$1.doExecute(EMFStoreTransactionalCommandStack.java:60)
	at org.eclipse.emf.transaction.RecordingCommand.execute(RecordingCommand.java:135)
	at org.eclipse.emf.common.command.BasicCommandStack.execute(BasicCommandStack.java:78)
	at org.eclipse.emf.transaction.impl.AbstractTransactionalCommandStack.basicExecute(AbstractTransactionalCommandStack.java:241)
	at org.eclipse.emf.emfstore.internal.client.transaction.EMFStoreTransactionalCommandStack.basicExecute(EMFStoreTransactionalCommandStack.java:162)
	at org.eclipse.emf.transaction.impl.TransactionalCommandStackImpl.doExecute(TransactionalCommandStackImpl.java:63)
	at org.eclipse.emf.transaction.impl.AbstractTransactionalCommandStack.execute(AbstractTransactionalCommandStack.java:165)
	at org.eclipse.emf.transaction.impl.AbstractTransactionalCommandStack.execute(AbstractTransactionalCommandStack.java:219)
	at org.eclipse.emf.emfstore.internal.client.transaction.EMFStoreTransactionalCommandStack.runEMFStoreCommand(EMFStoreTransactionalCommandStack.java:63)
	at org.eclipse.emf.emfstore.internal.client.transaction.EMFStoreTransactionalCommandStack.execute(EMFStoreTransactionalCommandStack.java:48)
	at org.eclipse.emf.emfstore.internal.client.model.util.AbstractEMFStoreCommand.aRun(AbstractEMFStoreCommand.java:133)
	at org.eclipse.emf.emfstore.internal.client.model.util.EMFStoreCommandWithResult.run(EMFStoreCommandWithResult.java:73)
	at org.eclipse.emf.emfstore.client.util.RunESCommand.runWithResult(RunESCommand.java:350)
	at org.eclipse.emf.emfstore.internal.client.model.impl.api.ESLocalProjectImpl.runWithResult(ESLocalProjectImpl.java:864)
	at org.eclipse.emf.emfstore.client.test.common.util.ProjectUtil.branch(ProjectUtil.java:298)
	at org.eclipse.emf.emfstore.server.test.VersionSpecTests.before(VersionSpecTests.java:141)
	at sun.reflect.NativeMethodAccessorImpl.invoke0(Native Method)
	at sun.reflect.NativeMethodAccessorImpl.invoke(NativeMethodAccessorImpl.java:39)
	at sun.reflect.DelegatingMethodAccessorImpl.invoke(DelegatingMethodAccessorImpl.java:25)
	at java.lang.reflect.Method.invoke(Method.java:597)
	at org.junit.runners.model.FrameworkMethod$1.runReflectiveCall(FrameworkMethod.java:47)
	at org.junit.internal.runners.model.ReflectiveCallable.run(ReflectiveCallable.java:12)
	at org.junit.runners.model.FrameworkMethod.invokeExplosively(FrameworkMethod.java:44)
	at org.junit.internal.runners.statements.RunBefores.evaluate(RunBefores.java:24)
	at org.junit.internal.runners.statements.RunAfters.evaluate(RunAfters.java:27)
	at org.junit.runners.ParentRunner.runLeaf(ParentRunner.java:271)
	at org.junit.runners.BlockJUnit4ClassRunner.runChild(BlockJUnit4ClassRunner.java:70)
	at org.junit.runners.BlockJUnit4ClassRunner.runChild(BlockJUnit4ClassRunner.java:50)
	at org.junit.runners.ParentRunner$3.run(ParentRunner.java:238)
	at org.junit.runners.ParentRunner$1.schedule(ParentRunner.java:63)
	at org.junit.runners.ParentRunner.runChildren(ParentRunner.java:236)
	at org.junit.runners.ParentRunner.access$000(ParentRunner.java:53)
	at org.junit.runners.ParentRunner$2.evaluate(ParentRunner.java:229)
	at org.junit.internal.runners.statements.RunBefores.evaluate(RunBefores.java:26)
	at org.junit.internal.runners.statements.RunAfters.evaluate(RunAfters.java:27)
	at org.junit.runners.ParentRunner.run(ParentRunner.java:309)
	at org.junit.runners.Suite.runChild(Suite.java:127)
	at org.junit.runners.Suite.runChild(Suite.java:26)
	at org.junit.runners.ParentRunner$3.run(ParentRunner.java:238)
	at org.junit.runners.ParentRunner$1.schedule(ParentRunner.java:63)
	at org.junit.runners.ParentRunner.runChildren(ParentRunner.java:236)
	at org.junit.runners.ParentRunner.access$000(ParentRunner.java:53)
	at org.junit.runners.ParentRunner$2.evaluate(ParentRunner.java:229)
	at org.junit.runners.ParentRunner.run(ParentRunner.java:309)
	at org.apache.maven.surefire.junit4.JUnit4TestSet.execute(JUnit4TestSet.java:53)
	at org.apache.maven.surefire.junit4.JUnit4Provider.executeTestSet(JUnit4Provider.java:123)
	at org.apache.maven.surefire.junit4.JUnit4Provider.invoke(JUnit4Provider.java:104)
	at sun.reflect.NativeMethodAccessorImpl.invoke0(Native Method)
	at sun.reflect.NativeMethodAccessorImpl.invoke(NativeMethodAccessorImpl.java:39)
	at sun.reflect.DelegatingMethodAccessorImpl.invoke(DelegatingMethodAccessorImpl.java:25)
	at java.lang.reflect.Method.invoke(Method.java:597)
	at org.apache.maven.surefire.util.ReflectionUtils.invokeMethodWithArray(ReflectionUtils.java:164)
	at org.apache.maven.surefire.booter.ProviderFactory$ProviderProxy.invoke(ProviderFactory.java:110)
	at org.apache.maven.surefire.booter.SurefireStarter.invokeProvider(SurefireStarter.java:175)
	at org.apache.maven.surefire.booter.SurefireStarter.runSuitesInProcess(SurefireStarter.java:123)
	at org.eclipse.tycho.surefire.osgibooter.OsgiSurefireBooter.run(OsgiSurefireBooter.java:85)
	at org.eclipse.tycho.surefire.osgibooter.AbstractUITestApplication.runTests(AbstractUITestApplication.java:44)
	at org.eclipse.ui.internal.testing.WorkbenchTestable$1.run(WorkbenchTestable.java:71)
	at java.lang.Thread.run(Thread.java:662)
Caused by: org.eclipse.emf.emfstore.internal.server.exceptions.InvalidVersionSpecException: 
	at org.eclipse.emf.emfstore.internal.server.core.subinterfaces.VersionSubInterfaceImpl.resolveBranchVersionSpec(VersionSubInterfaceImpl.java:229)
	at org.eclipse.emf.emfstore.internal.server.core.subinterfaces.VersionSubInterfaceImpl.resolveVersionSpec(VersionSubInterfaceImpl.java:106)
	... 106 more

Exception on execution: java.lang.reflect.InvocationTargetException
	at sun.reflect.GeneratedMethodAccessor14.invoke(Unknown Source)
	at sun.reflect.DelegatingMethodAccessorImpl.invoke(DelegatingMethodAccessorImpl.java:25)
	at java.lang.reflect.Method.invoke(Method.java:597)
	at org.eclipse.emf.emfstore.internal.server.core.AbstractSubEmfstoreInterface.execute(AbstractSubEmfstoreInterface.java:140)
	at org.eclipse.emf.emfstore.internal.server.core.EMFStoreImpl.invoke(EMFStoreImpl.java:160)
	at com.sun.proxy.$Proxy20.resolveVersionSpec(Unknown Source)
	at org.eclipse.emf.emfstore.client.test.common.mocks.ConnectionMock.resolveVersionSpec(ConnectionMock.java:110)
	at org.eclipse.emf.emfstore.internal.client.model.impl.ProjectSpaceBase$4.run(ProjectSpaceBase.java:1182)
	at org.eclipse.emf.emfstore.internal.client.model.impl.ProjectSpaceBase$4.run(ProjectSpaceBase.java:1)
	at org.eclipse.emf.emfstore.internal.client.model.connectionmanager.ServerCall.run(ServerCall.java:249)
	at org.eclipse.emf.emfstore.internal.client.model.connectionmanager.SessionManager.executeCall(SessionManager.java:126)
	at org.eclipse.emf.emfstore.internal.client.model.connectionmanager.SessionManager.execute(SessionManager.java:65)
	at org.eclipse.emf.emfstore.internal.client.model.connectionmanager.ServerCall.execute(ServerCall.java:269)
	at org.eclipse.emf.emfstore.internal.client.model.impl.ProjectSpaceBase.resolveVersionSpec(ProjectSpaceBase.java:1187)
	at org.eclipse.emf.emfstore.internal.client.model.controller.CommitController.checkForCommitPreconditions(CommitController.java:274)
	at org.eclipse.emf.emfstore.internal.client.model.controller.CommitController.commit(CommitController.java:158)
	at org.eclipse.emf.emfstore.internal.client.model.controller.CommitController.run(CommitController.java:102)
	at org.eclipse.emf.emfstore.internal.client.model.controller.CommitController.run(CommitController.java:1)
	at org.eclipse.emf.emfstore.internal.client.model.connectionmanager.ServerCall.run(ServerCall.java:249)
	at org.eclipse.emf.emfstore.internal.client.model.connectionmanager.SessionManager.executeCall(SessionManager.java:126)
	at org.eclipse.emf.emfstore.internal.client.model.connectionmanager.SessionManager.execute(SessionManager.java:65)
	at org.eclipse.emf.emfstore.internal.client.model.connectionmanager.ServerCall.execute(ServerCall.java:269)
	at org.eclipse.emf.emfstore.internal.client.model.impl.ProjectSpaceBase.commitToBranch(ProjectSpaceBase.java:466)
	at org.eclipse.emf.emfstore.internal.client.model.impl.api.ESLocalProjectImpl$16.call(ESLocalProjectImpl.java:446)
	at org.eclipse.emf.emfstore.internal.client.model.impl.api.ESLocalProjectImpl$16.call(ESLocalProjectImpl.java:1)
	at org.eclipse.emf.emfstore.client.util.RunESCommand$WithException$2.doRun(RunESCommand.java:121)
	at org.eclipse.emf.emfstore.internal.client.model.util.EMFStoreCommandWithResult.commandBody(EMFStoreCommandWithResult.java:33)
	at org.eclipse.emf.emfstore.internal.client.model.util.AbstractEMFStoreCommand.execute(AbstractEMFStoreCommand.java:75)
	at org.eclipse.emf.emfstore.internal.client.transaction.EMFStoreTransactionalCommandStack$1.doExecute(EMFStoreTransactionalCommandStack.java:60)
	at org.eclipse.emf.transaction.RecordingCommand.execute(RecordingCommand.java:135)
	at org.eclipse.emf.common.command.BasicCommandStack.execute(BasicCommandStack.java:78)
	at org.eclipse.emf.transaction.impl.AbstractTransactionalCommandStack.basicExecute(AbstractTransactionalCommandStack.java:241)
	at org.eclipse.emf.emfstore.internal.client.transaction.EMFStoreTransactionalCommandStack.basicExecute(EMFStoreTransactionalCommandStack.java:162)
	at org.eclipse.emf.transaction.impl.TransactionalCommandStackImpl.doExecute(TransactionalCommandStackImpl.java:63)
	at org.eclipse.emf.transaction.impl.AbstractTransactionalCommandStack.execute(AbstractTransactionalCommandStack.java:165)
	at org.eclipse.emf.transaction.impl.AbstractTransactionalCommandStack.execute(AbstractTransactionalCommandStack.java:219)
	at org.eclipse.emf.emfstore.internal.client.transaction.EMFStoreTransactionalCommandStack.runEMFStoreCommand(EMFStoreTransactionalCommandStack.java:63)
	at org.eclipse.emf.emfstore.internal.client.transaction.EMFStoreTransactionalCommandStack.execute(EMFStoreTransactionalCommandStack.java:48)
	at org.eclipse.emf.emfstore.internal.client.model.util.AbstractEMFStoreCommand.aRun(AbstractEMFStoreCommand.java:133)
	at org.eclipse.emf.emfstore.internal.client.model.util.EMFStoreCommandWithResult.run(EMFStoreCommandWithResult.java:73)
	at org.eclipse.emf.emfstore.client.util.RunESCommand$WithException.runWithResult(RunESCommand.java:138)
	at org.eclipse.emf.emfstore.internal.client.model.impl.api.ESLocalProjectImpl.commitToBranch(ESLocalProjectImpl.java:434)
	at org.eclipse.emf.emfstore.client.test.common.util.ProjectUtil$13.call(ProjectUtil.java:300)
	at org.eclipse.emf.emfstore.client.test.common.util.ProjectUtil$13.call(ProjectUtil.java:1)
	at org.eclipse.emf.emfstore.client.util.RunESCommand$4.doRun(RunESCommand.java:342)
	at org.eclipse.emf.emfstore.internal.client.model.util.EMFStoreCommandWithResult.commandBody(EMFStoreCommandWithResult.java:33)
	at org.eclipse.emf.emfstore.internal.client.model.util.AbstractEMFStoreCommand.execute(AbstractEMFStoreCommand.java:75)
	at org.eclipse.emf.emfstore.internal.client.transaction.EMFStoreTransactionalCommandStack$1.doExecute(EMFStoreTransactionalCommandStack.java:60)
	at org.eclipse.emf.transaction.RecordingCommand.execute(RecordingCommand.java:135)
	at org.eclipse.emf.common.command.BasicCommandStack.execute(BasicCommandStack.java:78)
	at org.eclipse.emf.transaction.impl.AbstractTransactionalCommandStack.basicExecute(AbstractTransactionalCommandStack.java:241)
	at org.eclipse.emf.emfstore.internal.client.transaction.EMFStoreTransactionalCommandStack.basicExecute(EMFStoreTransactionalCommandStack.java:162)
	at org.eclipse.emf.transaction.impl.TransactionalCommandStackImpl.doExecute(TransactionalCommandStackImpl.java:63)
	at org.eclipse.emf.transaction.impl.AbstractTransactionalCommandStack.execute(AbstractTransactionalCommandStack.java:165)
	at org.eclipse.emf.transaction.impl.AbstractTransactionalCommandStack.execute(AbstractTransactionalCommandStack.java:219)
	at org.eclipse.emf.emfstore.internal.client.transaction.EMFStoreTransactionalCommandStack.runEMFStoreCommand(EMFStoreTransactionalCommandStack.java:63)
	at org.eclipse.emf.emfstore.internal.client.transaction.EMFStoreTransactionalCommandStack.execute(EMFStoreTransactionalCommandStack.java:48)
	at org.eclipse.emf.emfstore.internal.client.model.util.AbstractEMFStoreCommand.aRun(AbstractEMFStoreCommand.java:133)
	at org.eclipse.emf.emfstore.internal.client.model.util.EMFStoreCommandWithResult.run(EMFStoreCommandWithResult.java:73)
	at org.eclipse.emf.emfstore.client.util.RunESCommand.runWithResult(RunESCommand.java:350)
	at org.eclipse.emf.emfstore.internal.client.model.impl.api.ESLocalProjectImpl.runWithResult(ESLocalProjectImpl.java:864)
	at org.eclipse.emf.emfstore.client.test.common.util.ProjectUtil.branch(ProjectUtil.java:298)
	at org.eclipse.emf.emfstore.server.test.VersionSpecTests.before(VersionSpecTests.java:141)
	at sun.reflect.NativeMethodAccessorImpl.invoke0(Native Method)
	at sun.reflect.NativeMethodAccessorImpl.invoke(NativeMethodAccessorImpl.java:39)
	at sun.reflect.DelegatingMethodAccessorImpl.invoke(DelegatingMethodAccessorImpl.java:25)
	at java.lang.reflect.Method.invoke(Method.java:597)
	at org.junit.runners.model.FrameworkMethod$1.runReflectiveCall(FrameworkMethod.java:47)
	at org.junit.internal.runners.model.ReflectiveCallable.run(ReflectiveCallable.java:12)
	at org.junit.runners.model.FrameworkMethod.invokeExplosively(FrameworkMethod.java:44)
	at org.junit.internal.runners.statements.RunBefores.evaluate(RunBefores.java:24)
	at org.junit.internal.runners.statements.RunAfters.evaluate(RunAfters.java:27)
	at org.junit.runners.ParentRunner.runLeaf(ParentRunner.java:271)
	at org.junit.runners.BlockJUnit4ClassRunner.runChild(BlockJUnit4ClassRunner.java:70)
	at org.junit.runners.BlockJUnit4ClassRunner.runChild(BlockJUnit4ClassRunner.java:50)
	at org.junit.runners.ParentRunner$3.run(ParentRunner.java:238)
	at org.junit.runners.ParentRunner$1.schedule(ParentRunner.java:63)
	at org.junit.runners.ParentRunner.runChildren(ParentRunner.java:236)
	at org.junit.runners.ParentRunner.access$000(ParentRunner.java:53)
	at org.junit.runners.ParentRunner$2.evaluate(ParentRunner.java:229)
	at org.junit.internal.runners.statements.RunBefores.evaluate(RunBefores.java:26)
	at org.junit.internal.runners.statements.RunAfters.evaluate(RunAfters.java:27)
	at org.junit.runners.ParentRunner.run(ParentRunner.java:309)
	at org.junit.runners.Suite.runChild(Suite.java:127)
	at org.junit.runners.Suite.runChild(Suite.java:26)
	at org.junit.runners.ParentRunner$3.run(ParentRunner.java:238)
	at org.junit.runners.ParentRunner$1.schedule(ParentRunner.java:63)
	at org.junit.runners.ParentRunner.runChildren(ParentRunner.java:236)
	at org.junit.runners.ParentRunner.access$000(ParentRunner.java:53)
	at org.junit.runners.ParentRunner$2.evaluate(ParentRunner.java:229)
	at org.junit.runners.ParentRunner.run(ParentRunner.java:309)
	at org.apache.maven.surefire.junit4.JUnit4TestSet.execute(JUnit4TestSet.java:53)
	at org.apache.maven.surefire.junit4.JUnit4Provider.executeTestSet(JUnit4Provider.java:123)
	at org.apache.maven.surefire.junit4.JUnit4Provider.invoke(JUnit4Provider.java:104)
	at sun.reflect.NativeMethodAccessorImpl.invoke0(Native Method)
	at sun.reflect.NativeMethodAccessorImpl.invoke(NativeMethodAccessorImpl.java:39)
	at sun.reflect.DelegatingMethodAccessorImpl.invoke(DelegatingMethodAccessorImpl.java:25)
	at java.lang.reflect.Method.invoke(Method.java:597)
	at org.apache.maven.surefire.util.ReflectionUtils.invokeMethodWithArray(ReflectionUtils.java:164)
	at org.apache.maven.surefire.booter.ProviderFactory$ProviderProxy.invoke(ProviderFactory.java:110)
	at org.apache.maven.surefire.booter.SurefireStarter.invokeProvider(SurefireStarter.java:175)
	at org.apache.maven.surefire.booter.SurefireStarter.runSuitesInProcess(SurefireStarter.java:123)
	at org.eclipse.tycho.surefire.osgibooter.OsgiSurefireBooter.run(OsgiSurefireBooter.java:85)
	at org.eclipse.tycho.surefire.osgibooter.AbstractUITestApplication.runTests(AbstractUITestApplication.java:44)
	at org.eclipse.ui.internal.testing.WorkbenchTestable$1.run(WorkbenchTestable.java:71)
	at java.lang.Thread.run(Thread.java:662)
Caused by: org.eclipse.emf.emfstore.internal.server.exceptions.InvalidVersionSpecException: 
	at org.eclipse.emf.emfstore.internal.server.core.subinterfaces.VersionSubInterfaceImpl.resolveBranchVersionSpec(VersionSubInterfaceImpl.java:229)
	at org.eclipse.emf.emfstore.internal.server.core.subinterfaces.VersionSubInterfaceImpl.resolveVersionSpec(VersionSubInterfaceImpl.java:106)
	... 106 more

Total time for commit: 1
Total time for commit: 1
Total time for commit: 1
Total time for commit: 1
Total time for commit: 1
Total time for commit: 1
Exception on execution: java.lang.reflect.InvocationTargetException
	at sun.reflect.GeneratedMethodAccessor14.invoke(Unknown Source)
	at sun.reflect.DelegatingMethodAccessorImpl.invoke(DelegatingMethodAccessorImpl.java:25)
	at java.lang.reflect.Method.invoke(Method.java:597)
	at org.eclipse.emf.emfstore.internal.server.core.AbstractSubEmfstoreInterface.execute(AbstractSubEmfstoreInterface.java:140)
	at org.eclipse.emf.emfstore.internal.server.core.EMFStoreImpl.invoke(EMFStoreImpl.java:160)
	at com.sun.proxy.$Proxy20.resolveVersionSpec(Unknown Source)
	at org.eclipse.emf.emfstore.client.test.common.mocks.ConnectionMock.resolveVersionSpec(ConnectionMock.java:110)
	at org.eclipse.emf.emfstore.internal.client.model.impl.ProjectSpaceBase$4.run(ProjectSpaceBase.java:1182)
	at org.eclipse.emf.emfstore.internal.client.model.impl.ProjectSpaceBase$4.run(ProjectSpaceBase.java:1)
	at org.eclipse.emf.emfstore.internal.client.model.connectionmanager.ServerCall.run(ServerCall.java:249)
	at org.eclipse.emf.emfstore.internal.client.model.connectionmanager.SessionManager.executeCall(SessionManager.java:126)
	at org.eclipse.emf.emfstore.internal.client.model.connectionmanager.SessionManager.execute(SessionManager.java:65)
	at org.eclipse.emf.emfstore.internal.client.model.connectionmanager.ServerCall.execute(ServerCall.java:269)
	at org.eclipse.emf.emfstore.internal.client.model.impl.ProjectSpaceBase.resolveVersionSpec(ProjectSpaceBase.java:1187)
	at org.eclipse.emf.emfstore.internal.client.model.controller.CommitController.checkForCommitPreconditions(CommitController.java:274)
	at org.eclipse.emf.emfstore.internal.client.model.controller.CommitController.commit(CommitController.java:126)
	at org.eclipse.emf.emfstore.internal.client.model.controller.CommitController.run(CommitController.java:102)
	at org.eclipse.emf.emfstore.internal.client.model.controller.CommitController.run(CommitController.java:1)
	at org.eclipse.emf.emfstore.internal.client.model.connectionmanager.ServerCall.run(ServerCall.java:249)
	at org.eclipse.emf.emfstore.internal.client.model.connectionmanager.SessionManager.executeCall(SessionManager.java:126)
	at org.eclipse.emf.emfstore.internal.client.model.connectionmanager.SessionManager.execute(SessionManager.java:65)
	at org.eclipse.emf.emfstore.internal.client.model.connectionmanager.ServerCall.execute(ServerCall.java:269)
	at org.eclipse.emf.emfstore.internal.client.model.impl.ProjectSpaceBase.commitToBranch(ProjectSpaceBase.java:466)
	at org.eclipse.emf.emfstore.internal.client.model.impl.api.ESLocalProjectImpl$16.call(ESLocalProjectImpl.java:446)
	at org.eclipse.emf.emfstore.internal.client.model.impl.api.ESLocalProjectImpl$16.call(ESLocalProjectImpl.java:1)
	at org.eclipse.emf.emfstore.client.util.RunESCommand$WithException$2.doRun(RunESCommand.java:121)
	at org.eclipse.emf.emfstore.internal.client.model.util.EMFStoreCommandWithResult.commandBody(EMFStoreCommandWithResult.java:33)
	at org.eclipse.emf.emfstore.internal.client.model.util.AbstractEMFStoreCommand.execute(AbstractEMFStoreCommand.java:75)
	at org.eclipse.emf.emfstore.internal.client.transaction.EMFStoreTransactionalCommandStack$1.doExecute(EMFStoreTransactionalCommandStack.java:60)
	at org.eclipse.emf.transaction.RecordingCommand.execute(RecordingCommand.java:135)
	at org.eclipse.emf.common.command.BasicCommandStack.execute(BasicCommandStack.java:78)
	at org.eclipse.emf.transaction.impl.AbstractTransactionalCommandStack.basicExecute(AbstractTransactionalCommandStack.java:241)
	at org.eclipse.emf.emfstore.internal.client.transaction.EMFStoreTransactionalCommandStack.basicExecute(EMFStoreTransactionalCommandStack.java:162)
	at org.eclipse.emf.transaction.impl.TransactionalCommandStackImpl.doExecute(TransactionalCommandStackImpl.java:63)
	at org.eclipse.emf.transaction.impl.AbstractTransactionalCommandStack.execute(AbstractTransactionalCommandStack.java:165)
	at org.eclipse.emf.transaction.impl.AbstractTransactionalCommandStack.execute(AbstractTransactionalCommandStack.java:219)
	at org.eclipse.emf.emfstore.internal.client.transaction.EMFStoreTransactionalCommandStack.runEMFStoreCommand(EMFStoreTransactionalCommandStack.java:63)
	at org.eclipse.emf.emfstore.internal.client.transaction.EMFStoreTransactionalCommandStack.execute(EMFStoreTransactionalCommandStack.java:48)
	at org.eclipse.emf.emfstore.internal.client.model.util.AbstractEMFStoreCommand.aRun(AbstractEMFStoreCommand.java:133)
	at org.eclipse.emf.emfstore.internal.client.model.util.EMFStoreCommandWithResult.run(EMFStoreCommandWithResult.java:73)
	at org.eclipse.emf.emfstore.client.util.RunESCommand$WithException.runWithResult(RunESCommand.java:138)
	at org.eclipse.emf.emfstore.internal.client.model.impl.api.ESLocalProjectImpl.commitToBranch(ESLocalProjectImpl.java:434)
	at org.eclipse.emf.emfstore.client.test.common.util.ProjectUtil$13.call(ProjectUtil.java:300)
	at org.eclipse.emf.emfstore.client.test.common.util.ProjectUtil$13.call(ProjectUtil.java:1)
	at org.eclipse.emf.emfstore.client.util.RunESCommand$4.doRun(RunESCommand.java:342)
	at org.eclipse.emf.emfstore.internal.client.model.util.EMFStoreCommandWithResult.commandBody(EMFStoreCommandWithResult.java:33)
	at org.eclipse.emf.emfstore.internal.client.model.util.AbstractEMFStoreCommand.execute(AbstractEMFStoreCommand.java:75)
	at org.eclipse.emf.emfstore.internal.client.transaction.EMFStoreTransactionalCommandStack$1.doExecute(EMFStoreTransactionalCommandStack.java:60)
	at org.eclipse.emf.transaction.RecordingCommand.execute(RecordingCommand.java:135)
	at org.eclipse.emf.common.command.BasicCommandStack.execute(BasicCommandStack.java:78)
	at org.eclipse.emf.transaction.impl.AbstractTransactionalCommandStack.basicExecute(AbstractTransactionalCommandStack.java:241)
	at org.eclipse.emf.emfstore.internal.client.transaction.EMFStoreTransactionalCommandStack.basicExecute(EMFStoreTransactionalCommandStack.java:162)
	at org.eclipse.emf.transaction.impl.TransactionalCommandStackImpl.doExecute(TransactionalCommandStackImpl.java:63)
	at org.eclipse.emf.transaction.impl.AbstractTransactionalCommandStack.execute(AbstractTransactionalCommandStack.java:165)
	at org.eclipse.emf.transaction.impl.AbstractTransactionalCommandStack.execute(AbstractTransactionalCommandStack.java:219)
	at org.eclipse.emf.emfstore.internal.client.transaction.EMFStoreTransactionalCommandStack.runEMFStoreCommand(EMFStoreTransactionalCommandStack.java:63)
	at org.eclipse.emf.emfstore.internal.client.transaction.EMFStoreTransactionalCommandStack.execute(EMFStoreTransactionalCommandStack.java:48)
	at org.eclipse.emf.emfstore.internal.client.model.util.AbstractEMFStoreCommand.aRun(AbstractEMFStoreCommand.java:133)
	at org.eclipse.emf.emfstore.internal.client.model.util.EMFStoreCommandWithResult.run(EMFStoreCommandWithResult.java:73)
	at org.eclipse.emf.emfstore.client.util.RunESCommand.runWithResult(RunESCommand.java:350)
	at org.eclipse.emf.emfstore.internal.client.model.impl.api.ESLocalProjectImpl.runWithResult(ESLocalProjectImpl.java:864)
	at org.eclipse.emf.emfstore.client.test.common.util.ProjectUtil.branch(ProjectUtil.java:298)
	at org.eclipse.emf.emfstore.server.test.VersionSpecTests.before(VersionSpecTests.java:165)
	at sun.reflect.NativeMethodAccessorImpl.invoke0(Native Method)
	at sun.reflect.NativeMethodAccessorImpl.invoke(NativeMethodAccessorImpl.java:39)
	at sun.reflect.DelegatingMethodAccessorImpl.invoke(DelegatingMethodAccessorImpl.java:25)
	at java.lang.reflect.Method.invoke(Method.java:597)
	at org.junit.runners.model.FrameworkMethod$1.runReflectiveCall(FrameworkMethod.java:47)
	at org.junit.internal.runners.model.ReflectiveCallable.run(ReflectiveCallable.java:12)
	at org.junit.runners.model.FrameworkMethod.invokeExplosively(FrameworkMethod.java:44)
	at org.junit.internal.runners.statements.RunBefores.evaluate(RunBefores.java:24)
	at org.junit.internal.runners.statements.RunAfters.evaluate(RunAfters.java:27)
	at org.junit.runners.ParentRunner.runLeaf(ParentRunner.java:271)
	at org.junit.runners.BlockJUnit4ClassRunner.runChild(BlockJUnit4ClassRunner.java:70)
	at org.junit.runners.BlockJUnit4ClassRunner.runChild(BlockJUnit4ClassRunner.java:50)
	at org.junit.runners.ParentRunner$3.run(ParentRunner.java:238)
	at org.junit.runners.ParentRunner$1.schedule(ParentRunner.java:63)
	at org.junit.runners.ParentRunner.runChildren(ParentRunner.java:236)
	at org.junit.runners.ParentRunner.access$000(ParentRunner.java:53)
	at org.junit.runners.ParentRunner$2.evaluate(ParentRunner.java:229)
	at org.junit.internal.runners.statements.RunBefores.evaluate(RunBefores.java:26)
	at org.junit.internal.runners.statements.RunAfters.evaluate(RunAfters.java:27)
	at org.junit.runners.ParentRunner.run(ParentRunner.java:309)
	at org.junit.runners.Suite.runChild(Suite.java:127)
	at org.junit.runners.Suite.runChild(Suite.java:26)
	at org.junit.runners.ParentRunner$3.run(ParentRunner.java:238)
	at org.junit.runners.ParentRunner$1.schedule(ParentRunner.java:63)
	at org.junit.runners.ParentRunner.runChildren(ParentRunner.java:236)
	at org.junit.runners.ParentRunner.access$000(ParentRunner.java:53)
	at org.junit.runners.ParentRunner$2.evaluate(ParentRunner.java:229)
	at org.junit.runners.ParentRunner.run(ParentRunner.java:309)
	at org.apache.maven.surefire.junit4.JUnit4TestSet.execute(JUnit4TestSet.java:53)
	at org.apache.maven.surefire.junit4.JUnit4Provider.executeTestSet(JUnit4Provider.java:123)
	at org.apache.maven.surefire.junit4.JUnit4Provider.invoke(JUnit4Provider.java:104)
	at sun.reflect.NativeMethodAccessorImpl.invoke0(Native Method)
	at sun.reflect.NativeMethodAccessorImpl.invoke(NativeMethodAccessorImpl.java:39)
	at sun.reflect.DelegatingMethodAccessorImpl.invoke(DelegatingMethodAccessorImpl.java:25)
	at java.lang.reflect.Method.invoke(Method.java:597)
	at org.apache.maven.surefire.util.ReflectionUtils.invokeMethodWithArray(ReflectionUtils.java:164)
	at org.apache.maven.surefire.booter.ProviderFactory$ProviderProxy.invoke(ProviderFactory.java:110)
	at org.apache.maven.surefire.booter.SurefireStarter.invokeProvider(SurefireStarter.java:175)
	at org.apache.maven.surefire.booter.SurefireStarter.runSuitesInProcess(SurefireStarter.java:123)
	at org.eclipse.tycho.surefire.osgibooter.OsgiSurefireBooter.run(OsgiSurefireBooter.java:85)
	at org.eclipse.tycho.surefire.osgibooter.AbstractUITestApplication.runTests(AbstractUITestApplication.java:44)
	at org.eclipse.ui.internal.testing.WorkbenchTestable$1.run(WorkbenchTestable.java:71)
	at java.lang.Thread.run(Thread.java:662)
Caused by: org.eclipse.emf.emfstore.internal.server.exceptions.InvalidVersionSpecException: 
	at org.eclipse.emf.emfstore.internal.server.core.subinterfaces.VersionSubInterfaceImpl.resolveBranchVersionSpec(VersionSubInterfaceImpl.java:229)
	at org.eclipse.emf.emfstore.internal.server.core.subinterfaces.VersionSubInterfaceImpl.resolveVersionSpec(VersionSubInterfaceImpl.java:106)
	... 106 more

Exception on execution: java.lang.reflect.InvocationTargetException
	at sun.reflect.GeneratedMethodAccessor14.invoke(Unknown Source)
	at sun.reflect.DelegatingMethodAccessorImpl.invoke(DelegatingMethodAccessorImpl.java:25)
	at java.lang.reflect.Method.invoke(Method.java:597)
	at org.eclipse.emf.emfstore.internal.server.core.AbstractSubEmfstoreInterface.execute(AbstractSubEmfstoreInterface.java:140)
	at org.eclipse.emf.emfstore.internal.server.core.EMFStoreImpl.invoke(EMFStoreImpl.java:160)
	at com.sun.proxy.$Proxy20.resolveVersionSpec(Unknown Source)
	at org.eclipse.emf.emfstore.client.test.common.mocks.ConnectionMock.resolveVersionSpec(ConnectionMock.java:110)
	at org.eclipse.emf.emfstore.internal.client.model.impl.ProjectSpaceBase$4.run(ProjectSpaceBase.java:1182)
	at org.eclipse.emf.emfstore.internal.client.model.impl.ProjectSpaceBase$4.run(ProjectSpaceBase.java:1)
	at org.eclipse.emf.emfstore.internal.client.model.connectionmanager.ServerCall.run(ServerCall.java:249)
	at org.eclipse.emf.emfstore.internal.client.model.connectionmanager.SessionManager.executeCall(SessionManager.java:126)
	at org.eclipse.emf.emfstore.internal.client.model.connectionmanager.SessionManager.execute(SessionManager.java:65)
	at org.eclipse.emf.emfstore.internal.client.model.connectionmanager.ServerCall.execute(ServerCall.java:269)
	at org.eclipse.emf.emfstore.internal.client.model.impl.ProjectSpaceBase.resolveVersionSpec(ProjectSpaceBase.java:1187)
	at org.eclipse.emf.emfstore.internal.client.model.controller.CommitController.checkForCommitPreconditions(CommitController.java:274)
	at org.eclipse.emf.emfstore.internal.client.model.controller.CommitController.commit(CommitController.java:126)
	at org.eclipse.emf.emfstore.internal.client.model.controller.CommitController.run(CommitController.java:102)
	at org.eclipse.emf.emfstore.internal.client.model.controller.CommitController.run(CommitController.java:1)
	at org.eclipse.emf.emfstore.internal.client.model.connectionmanager.ServerCall.run(ServerCall.java:249)
	at org.eclipse.emf.emfstore.internal.client.model.connectionmanager.SessionManager.executeCall(SessionManager.java:126)
	at org.eclipse.emf.emfstore.internal.client.model.connectionmanager.SessionManager.execute(SessionManager.java:65)
	at org.eclipse.emf.emfstore.internal.client.model.connectionmanager.ServerCall.execute(ServerCall.java:269)
	at org.eclipse.emf.emfstore.internal.client.model.impl.ProjectSpaceBase.commitToBranch(ProjectSpaceBase.java:466)
	at org.eclipse.emf.emfstore.internal.client.model.impl.api.ESLocalProjectImpl$16.call(ESLocalProjectImpl.java:446)
	at org.eclipse.emf.emfstore.internal.client.model.impl.api.ESLocalProjectImpl$16.call(ESLocalProjectImpl.java:1)
	at org.eclipse.emf.emfstore.client.util.RunESCommand$WithException$2.doRun(RunESCommand.java:121)
	at org.eclipse.emf.emfstore.internal.client.model.util.EMFStoreCommandWithResult.commandBody(EMFStoreCommandWithResult.java:33)
	at org.eclipse.emf.emfstore.internal.client.model.util.AbstractEMFStoreCommand.execute(AbstractEMFStoreCommand.java:75)
	at org.eclipse.emf.emfstore.internal.client.transaction.EMFStoreTransactionalCommandStack$1.doExecute(EMFStoreTransactionalCommandStack.java:60)
	at org.eclipse.emf.transaction.RecordingCommand.execute(RecordingCommand.java:135)
	at org.eclipse.emf.common.command.BasicCommandStack.execute(BasicCommandStack.java:78)
	at org.eclipse.emf.transaction.impl.AbstractTransactionalCommandStack.basicExecute(AbstractTransactionalCommandStack.java:241)
	at org.eclipse.emf.emfstore.internal.client.transaction.EMFStoreTransactionalCommandStack.basicExecute(EMFStoreTransactionalCommandStack.java:162)
	at org.eclipse.emf.transaction.impl.TransactionalCommandStackImpl.doExecute(TransactionalCommandStackImpl.java:63)
	at org.eclipse.emf.transaction.impl.AbstractTransactionalCommandStack.execute(AbstractTransactionalCommandStack.java:165)
	at org.eclipse.emf.transaction.impl.AbstractTransactionalCommandStack.execute(AbstractTransactionalCommandStack.java:219)
	at org.eclipse.emf.emfstore.internal.client.transaction.EMFStoreTransactionalCommandStack.runEMFStoreCommand(EMFStoreTransactionalCommandStack.java:63)
	at org.eclipse.emf.emfstore.internal.client.transaction.EMFStoreTransactionalCommandStack.execute(EMFStoreTransactionalCommandStack.java:48)
	at org.eclipse.emf.emfstore.internal.client.model.util.AbstractEMFStoreCommand.aRun(AbstractEMFStoreCommand.java:133)
	at org.eclipse.emf.emfstore.internal.client.model.util.EMFStoreCommandWithResult.run(EMFStoreCommandWithResult.java:73)
	at org.eclipse.emf.emfstore.client.util.RunESCommand$WithException.runWithResult(RunESCommand.java:138)
	at org.eclipse.emf.emfstore.internal.client.model.impl.api.ESLocalProjectImpl.commitToBranch(ESLocalProjectImpl.java:434)
	at org.eclipse.emf.emfstore.client.test.common.util.ProjectUtil$13.call(ProjectUtil.java:300)
	at org.eclipse.emf.emfstore.client.test.common.util.ProjectUtil$13.call(ProjectUtil.java:1)
	at org.eclipse.emf.emfstore.client.util.RunESCommand$4.doRun(RunESCommand.java:342)
	at org.eclipse.emf.emfstore.internal.client.model.util.EMFStoreCommandWithResult.commandBody(EMFStoreCommandWithResult.java:33)
	at org.eclipse.emf.emfstore.internal.client.model.util.AbstractEMFStoreCommand.execute(AbstractEMFStoreCommand.java:75)
	at org.eclipse.emf.emfstore.internal.client.transaction.EMFStoreTransactionalCommandStack$1.doExecute(EMFStoreTransactionalCommandStack.java:60)
	at org.eclipse.emf.transaction.RecordingCommand.execute(RecordingCommand.java:135)
	at org.eclipse.emf.common.command.BasicCommandStack.execute(BasicCommandStack.java:78)
	at org.eclipse.emf.transaction.impl.AbstractTransactionalCommandStack.basicExecute(AbstractTransactionalCommandStack.java:241)
	at org.eclipse.emf.emfstore.internal.client.transaction.EMFStoreTransactionalCommandStack.basicExecute(EMFStoreTransactionalCommandStack.java:162)
	at org.eclipse.emf.transaction.impl.TransactionalCommandStackImpl.doExecute(TransactionalCommandStackImpl.java:63)
	at org.eclipse.emf.transaction.impl.AbstractTransactionalCommandStack.execute(AbstractTransactionalCommandStack.java:165)
	at org.eclipse.emf.transaction.impl.AbstractTransactionalCommandStack.execute(AbstractTransactionalCommandStack.java:219)
	at org.eclipse.emf.emfstore.internal.client.transaction.EMFStoreTransactionalCommandStack.runEMFStoreCommand(EMFStoreTransactionalCommandStack.java:63)
	at org.eclipse.emf.emfstore.internal.client.transaction.EMFStoreTransactionalCommandStack.execute(EMFStoreTransactionalCommandStack.java:48)
	at org.eclipse.emf.emfstore.internal.client.model.util.AbstractEMFStoreCommand.aRun(AbstractEMFStoreCommand.java:133)
	at org.eclipse.emf.emfstore.internal.client.model.util.EMFStoreCommandWithResult.run(EMFStoreCommandWithResult.java:73)
	at org.eclipse.emf.emfstore.client.util.RunESCommand.runWithResult(RunESCommand.java:350)
	at org.eclipse.emf.emfstore.internal.client.model.impl.api.ESLocalProjectImpl.runWithResult(ESLocalProjectImpl.java:864)
	at org.eclipse.emf.emfstore.client.test.common.util.ProjectUtil.branch(ProjectUtil.java:298)
	at org.eclipse.emf.emfstore.server.test.VersionSpecTests.before(VersionSpecTests.java:165)
	at sun.reflect.NativeMethodAccessorImpl.invoke0(Native Method)
	at sun.reflect.NativeMethodAccessorImpl.invoke(NativeMethodAccessorImpl.java:39)
	at sun.reflect.DelegatingMethodAccessorImpl.invoke(DelegatingMethodAccessorImpl.java:25)
	at java.lang.reflect.Method.invoke(Method.java:597)
	at org.junit.runners.model.FrameworkMethod$1.runReflectiveCall(FrameworkMethod.java:47)
	at org.junit.internal.runners.model.ReflectiveCallable.run(ReflectiveCallable.java:12)
	at org.junit.runners.model.FrameworkMethod.invokeExplosively(FrameworkMethod.java:44)
	at org.junit.internal.runners.statements.RunBefores.evaluate(RunBefores.java:24)
	at org.junit.internal.runners.statements.RunAfters.evaluate(RunAfters.java:27)
	at org.junit.runners.ParentRunner.runLeaf(ParentRunner.java:271)
	at org.junit.runners.BlockJUnit4ClassRunner.runChild(BlockJUnit4ClassRunner.java:70)
	at org.junit.runners.BlockJUnit4ClassRunner.runChild(BlockJUnit4ClassRunner.java:50)
	at org.junit.runners.ParentRunner$3.run(ParentRunner.java:238)
	at org.junit.runners.ParentRunner$1.schedule(ParentRunner.java:63)
	at org.junit.runners.ParentRunner.runChildren(ParentRunner.java:236)
	at org.junit.runners.ParentRunner.access$000(ParentRunner.java:53)
	at org.junit.runners.ParentRunner$2.evaluate(ParentRunner.java:229)
	at org.junit.internal.runners.statements.RunBefores.evaluate(RunBefores.java:26)
	at org.junit.internal.runners.statements.RunAfters.evaluate(RunAfters.java:27)
	at org.junit.runners.ParentRunner.run(ParentRunner.java:309)
	at org.junit.runners.Suite.runChild(Suite.java:127)
	at org.junit.runners.Suite.runChild(Suite.java:26)
	at org.junit.runners.ParentRunner$3.run(ParentRunner.java:238)
	at org.junit.runners.ParentRunner$1.schedule(ParentRunner.java:63)
	at org.junit.runners.ParentRunner.runChildren(ParentRunner.java:236)
	at org.junit.runners.ParentRunner.access$000(ParentRunner.java:53)
	at org.junit.runners.ParentRunner$2.evaluate(ParentRunner.java:229)
	at org.junit.runners.ParentRunner.run(ParentRunner.java:309)
	at org.apache.maven.surefire.junit4.JUnit4TestSet.execute(JUnit4TestSet.java:53)
	at org.apache.maven.surefire.junit4.JUnit4Provider.executeTestSet(JUnit4Provider.java:123)
	at org.apache.maven.surefire.junit4.JUnit4Provider.invoke(JUnit4Provider.java:104)
	at sun.reflect.NativeMethodAccessorImpl.invoke0(Native Method)
	at sun.reflect.NativeMethodAccessorImpl.invoke(NativeMethodAccessorImpl.java:39)
	at sun.reflect.DelegatingMethodAccessorImpl.invoke(DelegatingMethodAccessorImpl.java:25)
	at java.lang.reflect.Method.invoke(Method.java:597)
	at org.apache.maven.surefire.util.ReflectionUtils.invokeMethodWithArray(ReflectionUtils.java:164)
	at org.apache.maven.surefire.booter.ProviderFactory$ProviderProxy.invoke(ProviderFactory.java:110)
	at org.apache.maven.surefire.booter.SurefireStarter.invokeProvider(SurefireStarter.java:175)
	at org.apache.maven.surefire.booter.SurefireStarter.runSuitesInProcess(SurefireStarter.java:123)
	at org.eclipse.tycho.surefire.osgibooter.OsgiSurefireBooter.run(OsgiSurefireBooter.java:85)
	at org.eclipse.tycho.surefire.osgibooter.AbstractUITestApplication.runTests(AbstractUITestApplication.java:44)
	at org.eclipse.ui.internal.testing.WorkbenchTestable$1.run(WorkbenchTestable.java:71)
	at java.lang.Thread.run(Thread.java:662)
Caused by: org.eclipse.emf.emfstore.internal.server.exceptions.InvalidVersionSpecException: 
	at org.eclipse.emf.emfstore.internal.server.core.subinterfaces.VersionSubInterfaceImpl.resolveBranchVersionSpec(VersionSubInterfaceImpl.java:229)
	at org.eclipse.emf.emfstore.internal.server.core.subinterfaces.VersionSubInterfaceImpl.resolveVersionSpec(VersionSubInterfaceImpl.java:106)
	... 106 more

Exception on execution: java.lang.reflect.InvocationTargetException
	at sun.reflect.GeneratedMethodAccessor14.invoke(Unknown Source)
	at sun.reflect.DelegatingMethodAccessorImpl.invoke(DelegatingMethodAccessorImpl.java:25)
	at java.lang.reflect.Method.invoke(Method.java:597)
	at org.eclipse.emf.emfstore.internal.server.core.AbstractSubEmfstoreInterface.execute(AbstractSubEmfstoreInterface.java:140)
	at org.eclipse.emf.emfstore.internal.server.core.EMFStoreImpl.invoke(EMFStoreImpl.java:160)
	at com.sun.proxy.$Proxy20.resolveVersionSpec(Unknown Source)
	at org.eclipse.emf.emfstore.client.test.common.mocks.ConnectionMock.resolveVersionSpec(ConnectionMock.java:110)
	at org.eclipse.emf.emfstore.internal.client.model.impl.ProjectSpaceBase$4.run(ProjectSpaceBase.java:1182)
	at org.eclipse.emf.emfstore.internal.client.model.impl.ProjectSpaceBase$4.run(ProjectSpaceBase.java:1)
	at org.eclipse.emf.emfstore.internal.client.model.connectionmanager.ServerCall.run(ServerCall.java:249)
	at org.eclipse.emf.emfstore.internal.client.model.connectionmanager.SessionManager.executeCall(SessionManager.java:126)
	at org.eclipse.emf.emfstore.internal.client.model.connectionmanager.SessionManager.execute(SessionManager.java:65)
	at org.eclipse.emf.emfstore.internal.client.model.connectionmanager.ServerCall.execute(ServerCall.java:269)
	at org.eclipse.emf.emfstore.internal.client.model.impl.ProjectSpaceBase.resolveVersionSpec(ProjectSpaceBase.java:1187)
	at org.eclipse.emf.emfstore.internal.client.model.controller.CommitController.checkForCommitPreconditions(CommitController.java:274)
	at org.eclipse.emf.emfstore.internal.client.model.controller.CommitController.commit(CommitController.java:158)
	at org.eclipse.emf.emfstore.internal.client.model.controller.CommitController.run(CommitController.java:102)
	at org.eclipse.emf.emfstore.internal.client.model.controller.CommitController.run(CommitController.java:1)
	at org.eclipse.emf.emfstore.internal.client.model.connectionmanager.ServerCall.run(ServerCall.java:249)
	at org.eclipse.emf.emfstore.internal.client.model.connectionmanager.SessionManager.executeCall(SessionManager.java:126)
	at org.eclipse.emf.emfstore.internal.client.model.connectionmanager.SessionManager.execute(SessionManager.java:65)
	at org.eclipse.emf.emfstore.internal.client.model.connectionmanager.ServerCall.execute(ServerCall.java:269)
	at org.eclipse.emf.emfstore.internal.client.model.impl.ProjectSpaceBase.commitToBranch(ProjectSpaceBase.java:466)
	at org.eclipse.emf.emfstore.internal.client.model.impl.api.ESLocalProjectImpl$16.call(ESLocalProjectImpl.java:446)
	at org.eclipse.emf.emfstore.internal.client.model.impl.api.ESLocalProjectImpl$16.call(ESLocalProjectImpl.java:1)
	at org.eclipse.emf.emfstore.client.util.RunESCommand$WithException$2.doRun(RunESCommand.java:121)
	at org.eclipse.emf.emfstore.internal.client.model.util.EMFStoreCommandWithResult.commandBody(EMFStoreCommandWithResult.java:33)
	at org.eclipse.emf.emfstore.internal.client.model.util.AbstractEMFStoreCommand.execute(AbstractEMFStoreCommand.java:75)
	at org.eclipse.emf.emfstore.internal.client.transaction.EMFStoreTransactionalCommandStack$1.doExecute(EMFStoreTransactionalCommandStack.java:60)
	at org.eclipse.emf.transaction.RecordingCommand.execute(RecordingCommand.java:135)
	at org.eclipse.emf.common.command.BasicCommandStack.execute(BasicCommandStack.java:78)
	at org.eclipse.emf.transaction.impl.AbstractTransactionalCommandStack.basicExecute(AbstractTransactionalCommandStack.java:241)
	at org.eclipse.emf.emfstore.internal.client.transaction.EMFStoreTransactionalCommandStack.basicExecute(EMFStoreTransactionalCommandStack.java:162)
	at org.eclipse.emf.transaction.impl.TransactionalCommandStackImpl.doExecute(TransactionalCommandStackImpl.java:63)
	at org.eclipse.emf.transaction.impl.AbstractTransactionalCommandStack.execute(AbstractTransactionalCommandStack.java:165)
	at org.eclipse.emf.transaction.impl.AbstractTransactionalCommandStack.execute(AbstractTransactionalCommandStack.java:219)
	at org.eclipse.emf.emfstore.internal.client.transaction.EMFStoreTransactionalCommandStack.runEMFStoreCommand(EMFStoreTransactionalCommandStack.java:63)
	at org.eclipse.emf.emfstore.internal.client.transaction.EMFStoreTransactionalCommandStack.execute(EMFStoreTransactionalCommandStack.java:48)
	at org.eclipse.emf.emfstore.internal.client.model.util.AbstractEMFStoreCommand.aRun(AbstractEMFStoreCommand.java:133)
	at org.eclipse.emf.emfstore.internal.client.model.util.EMFStoreCommandWithResult.run(EMFStoreCommandWithResult.java:73)
	at org.eclipse.emf.emfstore.client.util.RunESCommand$WithException.runWithResult(RunESCommand.java:138)
	at org.eclipse.emf.emfstore.internal.client.model.impl.api.ESLocalProjectImpl.commitToBranch(ESLocalProjectImpl.java:434)
	at org.eclipse.emf.emfstore.client.test.common.util.ProjectUtil$13.call(ProjectUtil.java:300)
	at org.eclipse.emf.emfstore.client.test.common.util.ProjectUtil$13.call(ProjectUtil.java:1)
	at org.eclipse.emf.emfstore.client.util.RunESCommand$4.doRun(RunESCommand.java:342)
	at org.eclipse.emf.emfstore.internal.client.model.util.EMFStoreCommandWithResult.commandBody(EMFStoreCommandWithResult.java:33)
	at org.eclipse.emf.emfstore.internal.client.model.util.AbstractEMFStoreCommand.execute(AbstractEMFStoreCommand.java:75)
	at org.eclipse.emf.emfstore.internal.client.transaction.EMFStoreTransactionalCommandStack$1.doExecute(EMFStoreTransactionalCommandStack.java:60)
	at org.eclipse.emf.transaction.RecordingCommand.execute(RecordingCommand.java:135)
	at org.eclipse.emf.common.command.BasicCommandStack.execute(BasicCommandStack.java:78)
	at org.eclipse.emf.transaction.impl.AbstractTransactionalCommandStack.basicExecute(AbstractTransactionalCommandStack.java:241)
	at org.eclipse.emf.emfstore.internal.client.transaction.EMFStoreTransactionalCommandStack.basicExecute(EMFStoreTransactionalCommandStack.java:162)
	at org.eclipse.emf.transaction.impl.TransactionalCommandStackImpl.doExecute(TransactionalCommandStackImpl.java:63)
	at org.eclipse.emf.transaction.impl.AbstractTransactionalCommandStack.execute(AbstractTransactionalCommandStack.java:165)
	at org.eclipse.emf.transaction.impl.AbstractTransactionalCommandStack.execute(AbstractTransactionalCommandStack.java:219)
	at org.eclipse.emf.emfstore.internal.client.transaction.EMFStoreTransactionalCommandStack.runEMFStoreCommand(EMFStoreTransactionalCommandStack.java:63)
	at org.eclipse.emf.emfstore.internal.client.transaction.EMFStoreTransactionalCommandStack.execute(EMFStoreTransactionalCommandStack.java:48)
	at org.eclipse.emf.emfstore.internal.client.model.util.AbstractEMFStoreCommand.aRun(AbstractEMFStoreCommand.java:133)
	at org.eclipse.emf.emfstore.internal.client.model.util.EMFStoreCommandWithResult.run(EMFStoreCommandWithResult.java:73)
	at org.eclipse.emf.emfstore.client.util.RunESCommand.runWithResult(RunESCommand.java:350)
	at org.eclipse.emf.emfstore.internal.client.model.impl.api.ESLocalProjectImpl.runWithResult(ESLocalProjectImpl.java:864)
	at org.eclipse.emf.emfstore.client.test.common.util.ProjectUtil.branch(ProjectUtil.java:298)
	at org.eclipse.emf.emfstore.server.test.VersionSpecTests.before(VersionSpecTests.java:165)
	at sun.reflect.NativeMethodAccessorImpl.invoke0(Native Method)
	at sun.reflect.NativeMethodAccessorImpl.invoke(NativeMethodAccessorImpl.java:39)
	at sun.reflect.DelegatingMethodAccessorImpl.invoke(DelegatingMethodAccessorImpl.java:25)
	at java.lang.reflect.Method.invoke(Method.java:597)
	at org.junit.runners.model.FrameworkMethod$1.runReflectiveCall(FrameworkMethod.java:47)
	at org.junit.internal.runners.model.ReflectiveCallable.run(ReflectiveCallable.java:12)
	at org.junit.runners.model.FrameworkMethod.invokeExplosively(FrameworkMethod.java:44)
	at org.junit.internal.runners.statements.RunBefores.evaluate(RunBefores.java:24)
	at org.junit.internal.runners.statements.RunAfters.evaluate(RunAfters.java:27)
	at org.junit.runners.ParentRunner.runLeaf(ParentRunner.java:271)
	at org.junit.runners.BlockJUnit4ClassRunner.runChild(BlockJUnit4ClassRunner.java:70)
	at org.junit.runners.BlockJUnit4ClassRunner.runChild(BlockJUnit4ClassRunner.java:50)
	at org.junit.runners.ParentRunner$3.run(ParentRunner.java:238)
	at org.junit.runners.ParentRunner$1.schedule(ParentRunner.java:63)
	at org.junit.runners.ParentRunner.runChildren(ParentRunner.java:236)
	at org.junit.runners.ParentRunner.access$000(ParentRunner.java:53)
	at org.junit.runners.ParentRunner$2.evaluate(ParentRunner.java:229)
	at org.junit.internal.runners.statements.RunBefores.evaluate(RunBefores.java:26)
	at org.junit.internal.runners.statements.RunAfters.evaluate(RunAfters.java:27)
	at org.junit.runners.ParentRunner.run(ParentRunner.java:309)
	at org.junit.runners.Suite.runChild(Suite.java:127)
	at org.junit.runners.Suite.runChild(Suite.java:26)
	at org.junit.runners.ParentRunner$3.run(ParentRunner.java:238)
	at org.junit.runners.ParentRunner$1.schedule(ParentRunner.java:63)
	at org.junit.runners.ParentRunner.runChildren(ParentRunner.java:236)
	at org.junit.runners.ParentRunner.access$000(ParentRunner.java:53)
	at org.junit.runners.ParentRunner$2.evaluate(ParentRunner.java:229)
	at org.junit.runners.ParentRunner.run(ParentRunner.java:309)
	at org.apache.maven.surefire.junit4.JUnit4TestSet.execute(JUnit4TestSet.java:53)
	at org.apache.maven.surefire.junit4.JUnit4Provider.executeTestSet(JUnit4Provider.java:123)
	at org.apache.maven.surefire.junit4.JUnit4Provider.invoke(JUnit4Provider.java:104)
	at sun.reflect.NativeMethodAccessorImpl.invoke0(Native Method)
	at sun.reflect.NativeMethodAccessorImpl.invoke(NativeMethodAccessorImpl.java:39)
	at sun.reflect.DelegatingMethodAccessorImpl.invoke(DelegatingMethodAccessorImpl.java:25)
	at java.lang.reflect.Method.invoke(Method.java:597)
	at org.apache.maven.surefire.util.ReflectionUtils.invokeMethodWithArray(ReflectionUtils.java:164)
	at org.apache.maven.surefire.booter.ProviderFactory$ProviderProxy.invoke(ProviderFactory.java:110)
	at org.apache.maven.surefire.booter.SurefireStarter.invokeProvider(SurefireStarter.java:175)
	at org.apache.maven.surefire.booter.SurefireStarter.runSuitesInProcess(SurefireStarter.java:123)
	at org.eclipse.tycho.surefire.osgibooter.OsgiSurefireBooter.run(OsgiSurefireBooter.java:85)
	at org.eclipse.tycho.surefire.osgibooter.AbstractUITestApplication.runTests(AbstractUITestApplication.java:44)
	at org.eclipse.ui.internal.testing.WorkbenchTestable$1.run(WorkbenchTestable.java:71)
	at java.lang.Thread.run(Thread.java:662)
Caused by: org.eclipse.emf.emfstore.internal.server.exceptions.InvalidVersionSpecException: 
	at org.eclipse.emf.emfstore.internal.server.core.subinterfaces.VersionSubInterfaceImpl.resolveBranchVersionSpec(VersionSubInterfaceImpl.java:229)
	at org.eclipse.emf.emfstore.internal.server.core.subinterfaces.VersionSubInterfaceImpl.resolveVersionSpec(VersionSubInterfaceImpl.java:106)
	... 106 more

Exception on execution: java.lang.reflect.InvocationTargetException
	at sun.reflect.GeneratedMethodAccessor14.invoke(Unknown Source)
	at sun.reflect.DelegatingMethodAccessorImpl.invoke(DelegatingMethodAccessorImpl.java:25)
	at java.lang.reflect.Method.invoke(Method.java:597)
	at org.eclipse.emf.emfstore.internal.server.core.AbstractSubEmfstoreInterface.execute(AbstractSubEmfstoreInterface.java:140)
	at org.eclipse.emf.emfstore.internal.server.core.EMFStoreImpl.invoke(EMFStoreImpl.java:160)
	at com.sun.proxy.$Proxy20.resolveVersionSpec(Unknown Source)
	at org.eclipse.emf.emfstore.client.test.common.mocks.ConnectionMock.resolveVersionSpec(ConnectionMock.java:110)
	at org.eclipse.emf.emfstore.internal.client.model.impl.ProjectSpaceBase$4.run(ProjectSpaceBase.java:1182)
	at org.eclipse.emf.emfstore.internal.client.model.impl.ProjectSpaceBase$4.run(ProjectSpaceBase.java:1)
	at org.eclipse.emf.emfstore.internal.client.model.connectionmanager.ServerCall.run(ServerCall.java:249)
	at org.eclipse.emf.emfstore.internal.client.model.connectionmanager.SessionManager.executeCall(SessionManager.java:126)
	at org.eclipse.emf.emfstore.internal.client.model.connectionmanager.SessionManager.execute(SessionManager.java:65)
	at org.eclipse.emf.emfstore.internal.client.model.connectionmanager.ServerCall.execute(ServerCall.java:269)
	at org.eclipse.emf.emfstore.internal.client.model.impl.ProjectSpaceBase.resolveVersionSpec(ProjectSpaceBase.java:1187)
	at org.eclipse.emf.emfstore.internal.client.model.controller.CommitController.checkForCommitPreconditions(CommitController.java:274)
	at org.eclipse.emf.emfstore.internal.client.model.controller.CommitController.commit(CommitController.java:158)
	at org.eclipse.emf.emfstore.internal.client.model.controller.CommitController.run(CommitController.java:102)
	at org.eclipse.emf.emfstore.internal.client.model.controller.CommitController.run(CommitController.java:1)
	at org.eclipse.emf.emfstore.internal.client.model.connectionmanager.ServerCall.run(ServerCall.java:249)
	at org.eclipse.emf.emfstore.internal.client.model.connectionmanager.SessionManager.executeCall(SessionManager.java:126)
	at org.eclipse.emf.emfstore.internal.client.model.connectionmanager.SessionManager.execute(SessionManager.java:65)
	at org.eclipse.emf.emfstore.internal.client.model.connectionmanager.ServerCall.execute(ServerCall.java:269)
	at org.eclipse.emf.emfstore.internal.client.model.impl.ProjectSpaceBase.commitToBranch(ProjectSpaceBase.java:466)
	at org.eclipse.emf.emfstore.internal.client.model.impl.api.ESLocalProjectImpl$16.call(ESLocalProjectImpl.java:446)
	at org.eclipse.emf.emfstore.internal.client.model.impl.api.ESLocalProjectImpl$16.call(ESLocalProjectImpl.java:1)
	at org.eclipse.emf.emfstore.client.util.RunESCommand$WithException$2.doRun(RunESCommand.java:121)
	at org.eclipse.emf.emfstore.internal.client.model.util.EMFStoreCommandWithResult.commandBody(EMFStoreCommandWithResult.java:33)
	at org.eclipse.emf.emfstore.internal.client.model.util.AbstractEMFStoreCommand.execute(AbstractEMFStoreCommand.java:75)
	at org.eclipse.emf.emfstore.internal.client.transaction.EMFStoreTransactionalCommandStack$1.doExecute(EMFStoreTransactionalCommandStack.java:60)
	at org.eclipse.emf.transaction.RecordingCommand.execute(RecordingCommand.java:135)
	at org.eclipse.emf.common.command.BasicCommandStack.execute(BasicCommandStack.java:78)
	at org.eclipse.emf.transaction.impl.AbstractTransactionalCommandStack.basicExecute(AbstractTransactionalCommandStack.java:241)
	at org.eclipse.emf.emfstore.internal.client.transaction.EMFStoreTransactionalCommandStack.basicExecute(EMFStoreTransactionalCommandStack.java:162)
	at org.eclipse.emf.transaction.impl.TransactionalCommandStackImpl.doExecute(TransactionalCommandStackImpl.java:63)
	at org.eclipse.emf.transaction.impl.AbstractTransactionalCommandStack.execute(AbstractTransactionalCommandStack.java:165)
	at org.eclipse.emf.transaction.impl.AbstractTransactionalCommandStack.execute(AbstractTransactionalCommandStack.java:219)
	at org.eclipse.emf.emfstore.internal.client.transaction.EMFStoreTransactionalCommandStack.runEMFStoreCommand(EMFStoreTransactionalCommandStack.java:63)
	at org.eclipse.emf.emfstore.internal.client.transaction.EMFStoreTransactionalCommandStack.execute(EMFStoreTransactionalCommandStack.java:48)
	at org.eclipse.emf.emfstore.internal.client.model.util.AbstractEMFStoreCommand.aRun(AbstractEMFStoreCommand.java:133)
	at org.eclipse.emf.emfstore.internal.client.model.util.EMFStoreCommandWithResult.run(EMFStoreCommandWithResult.java:73)
	at org.eclipse.emf.emfstore.client.util.RunESCommand$WithException.runWithResult(RunESCommand.java:138)
	at org.eclipse.emf.emfstore.internal.client.model.impl.api.ESLocalProjectImpl.commitToBranch(ESLocalProjectImpl.java:434)
	at org.eclipse.emf.emfstore.client.test.common.util.ProjectUtil$13.call(ProjectUtil.java:300)
	at org.eclipse.emf.emfstore.client.test.common.util.ProjectUtil$13.call(ProjectUtil.java:1)
	at org.eclipse.emf.emfstore.client.util.RunESCommand$4.doRun(RunESCommand.java:342)
	at org.eclipse.emf.emfstore.internal.client.model.util.EMFStoreCommandWithResult.commandBody(EMFStoreCommandWithResult.java:33)
	at org.eclipse.emf.emfstore.internal.client.model.util.AbstractEMFStoreCommand.execute(AbstractEMFStoreCommand.java:75)
	at org.eclipse.emf.emfstore.internal.client.transaction.EMFStoreTransactionalCommandStack$1.doExecute(EMFStoreTransactionalCommandStack.java:60)
	at org.eclipse.emf.transaction.RecordingCommand.execute(RecordingCommand.java:135)
	at org.eclipse.emf.common.command.BasicCommandStack.execute(BasicCommandStack.java:78)
	at org.eclipse.emf.transaction.impl.AbstractTransactionalCommandStack.basicExecute(AbstractTransactionalCommandStack.java:241)
	at org.eclipse.emf.emfstore.internal.client.transaction.EMFStoreTransactionalCommandStack.basicExecute(EMFStoreTransactionalCommandStack.java:162)
	at org.eclipse.emf.transaction.impl.TransactionalCommandStackImpl.doExecute(TransactionalCommandStackImpl.java:63)
	at org.eclipse.emf.transaction.impl.AbstractTransactionalCommandStack.execute(AbstractTransactionalCommandStack.java:165)
	at org.eclipse.emf.transaction.impl.AbstractTransactionalCommandStack.execute(AbstractTransactionalCommandStack.java:219)
	at org.eclipse.emf.emfstore.internal.client.transaction.EMFStoreTransactionalCommandStack.runEMFStoreCommand(EMFStoreTransactionalCommandStack.java:63)
	at org.eclipse.emf.emfstore.internal.client.transaction.EMFStoreTransactionalCommandStack.execute(EMFStoreTransactionalCommandStack.java:48)
	at org.eclipse.emf.emfstore.internal.client.model.util.AbstractEMFStoreCommand.aRun(AbstractEMFStoreCommand.java:133)
	at org.eclipse.emf.emfstore.internal.client.model.util.EMFStoreCommandWithResult.run(EMFStoreCommandWithResult.java:73)
	at org.eclipse.emf.emfstore.client.util.RunESCommand.runWithResult(RunESCommand.java:350)
	at org.eclipse.emf.emfstore.internal.client.model.impl.api.ESLocalProjectImpl.runWithResult(ESLocalProjectImpl.java:864)
	at org.eclipse.emf.emfstore.client.test.common.util.ProjectUtil.branch(ProjectUtil.java:298)
	at org.eclipse.emf.emfstore.server.test.VersionSpecTests.before(VersionSpecTests.java:165)
	at sun.reflect.NativeMethodAccessorImpl.invoke0(Native Method)
	at sun.reflect.NativeMethodAccessorImpl.invoke(NativeMethodAccessorImpl.java:39)
	at sun.reflect.DelegatingMethodAccessorImpl.invoke(DelegatingMethodAccessorImpl.java:25)
	at java.lang.reflect.Method.invoke(Method.java:597)
	at org.junit.runners.model.FrameworkMethod$1.runReflectiveCall(FrameworkMethod.java:47)
	at org.junit.internal.runners.model.ReflectiveCallable.run(ReflectiveCallable.java:12)
	at org.junit.runners.model.FrameworkMethod.invokeExplosively(FrameworkMethod.java:44)
	at org.junit.internal.runners.statements.RunBefores.evaluate(RunBefores.java:24)
	at org.junit.internal.runners.statements.RunAfters.evaluate(RunAfters.java:27)
	at org.junit.runners.ParentRunner.runLeaf(ParentRunner.java:271)
	at org.junit.runners.BlockJUnit4ClassRunner.runChild(BlockJUnit4ClassRunner.java:70)
	at org.junit.runners.BlockJUnit4ClassRunner.runChild(BlockJUnit4ClassRunner.java:50)
	at org.junit.runners.ParentRunner$3.run(ParentRunner.java:238)
	at org.junit.runners.ParentRunner$1.schedule(ParentRunner.java:63)
	at org.junit.runners.ParentRunner.runChildren(ParentRunner.java:236)
	at org.junit.runners.ParentRunner.access$000(ParentRunner.java:53)
	at org.junit.runners.ParentRunner$2.evaluate(ParentRunner.java:229)
	at org.junit.internal.runners.statements.RunBefores.evaluate(RunBefores.java:26)
	at org.junit.internal.runners.statements.RunAfters.evaluate(RunAfters.java:27)
	at org.junit.runners.ParentRunner.run(ParentRunner.java:309)
	at org.junit.runners.Suite.runChild(Suite.java:127)
	at org.junit.runners.Suite.runChild(Suite.java:26)
	at org.junit.runners.ParentRunner$3.run(ParentRunner.java:238)
	at org.junit.runners.ParentRunner$1.schedule(ParentRunner.java:63)
	at org.junit.runners.ParentRunner.runChildren(ParentRunner.java:236)
	at org.junit.runners.ParentRunner.access$000(ParentRunner.java:53)
	at org.junit.runners.ParentRunner$2.evaluate(ParentRunner.java:229)
	at org.junit.runners.ParentRunner.run(ParentRunner.java:309)
	at org.apache.maven.surefire.junit4.JUnit4TestSet.execute(JUnit4TestSet.java:53)
	at org.apache.maven.surefire.junit4.JUnit4Provider.executeTestSet(JUnit4Provider.java:123)
	at org.apache.maven.surefire.junit4.JUnit4Provider.invoke(JUnit4Provider.java:104)
	at sun.reflect.NativeMethodAccessorImpl.invoke0(Native Method)
	at sun.reflect.NativeMethodAccessorImpl.invoke(NativeMethodAccessorImpl.java:39)
	at sun.reflect.DelegatingMethodAccessorImpl.invoke(DelegatingMethodAccessorImpl.java:25)
	at java.lang.reflect.Method.invoke(Method.java:597)
	at org.apache.maven.surefire.util.ReflectionUtils.invokeMethodWithArray(ReflectionUtils.java:164)
	at org.apache.maven.surefire.booter.ProviderFactory$ProviderProxy.invoke(ProviderFactory.java:110)
	at org.apache.maven.surefire.booter.SurefireStarter.invokeProvider(SurefireStarter.java:175)
	at org.apache.maven.surefire.booter.SurefireStarter.runSuitesInProcess(SurefireStarter.java:123)
	at org.eclipse.tycho.surefire.osgibooter.OsgiSurefireBooter.run(OsgiSurefireBooter.java:85)
	at org.eclipse.tycho.surefire.osgibooter.AbstractUITestApplication.runTests(AbstractUITestApplication.java:44)
	at org.eclipse.ui.internal.testing.WorkbenchTestable$1.run(WorkbenchTestable.java:71)
	at java.lang.Thread.run(Thread.java:662)
Caused by: org.eclipse.emf.emfstore.internal.server.exceptions.InvalidVersionSpecException: 
	at org.eclipse.emf.emfstore.internal.server.core.subinterfaces.VersionSubInterfaceImpl.resolveBranchVersionSpec(VersionSubInterfaceImpl.java:229)
	at org.eclipse.emf.emfstore.internal.server.core.subinterfaces.VersionSubInterfaceImpl.resolveVersionSpec(VersionSubInterfaceImpl.java:106)
	... 106 more

Total time for commit: 1
Total time for commit: 1
Total time for commit: 1
Total time for commit: 1
No server versions supplied
org.eclipse.emf.emfstore.internal.server.exceptions.ClientVersionOutOfDateException: No server versions supplied
	at org.eclipse.emf.emfstore.internal.server.accesscontrol.authentication.verifiers.VersionVerifier.verify(VersionVerifier.java:66)
	at org.eclipse.emf.emfstore.server.test.VersionVerifierTest.testSupplyNoVersions(VersionVerifierTest.java:50)
	at sun.reflect.NativeMethodAccessorImpl.invoke0(Native Method)
	at sun.reflect.NativeMethodAccessorImpl.invoke(NativeMethodAccessorImpl.java:39)
	at sun.reflect.DelegatingMethodAccessorImpl.invoke(DelegatingMethodAccessorImpl.java:25)
	at java.lang.reflect.Method.invoke(Method.java:597)
	at org.junit.runners.model.FrameworkMethod$1.runReflectiveCall(FrameworkMethod.java:47)
	at org.junit.internal.runners.model.ReflectiveCallable.run(ReflectiveCallable.java:12)
	at org.junit.runners.model.FrameworkMethod.invokeExplosively(FrameworkMethod.java:44)
	at org.junit.internal.runners.statements.InvokeMethod.evaluate(InvokeMethod.java:17)
	at org.junit.runners.ParentRunner.runLeaf(ParentRunner.java:271)
	at org.junit.runners.BlockJUnit4ClassRunner.runChild(BlockJUnit4ClassRunner.java:70)
	at org.junit.runners.BlockJUnit4ClassRunner.runChild(BlockJUnit4ClassRunner.java:50)
	at org.junit.runners.ParentRunner$3.run(ParentRunner.java:238)
	at org.junit.runners.ParentRunner$1.schedule(ParentRunner.java:63)
	at org.junit.runners.ParentRunner.runChildren(ParentRunner.java:236)
	at org.junit.runners.ParentRunner.access$000(ParentRunner.java:53)
	at org.junit.runners.ParentRunner$2.evaluate(ParentRunner.java:229)
	at org.junit.runners.ParentRunner.run(ParentRunner.java:309)
	at org.junit.runners.Suite.runChild(Suite.java:127)
	at org.junit.runners.Suite.runChild(Suite.java:26)
	at org.junit.runners.ParentRunner$3.run(ParentRunner.java:238)
	at org.junit.runners.ParentRunner$1.schedule(ParentRunner.java:63)
	at org.junit.runners.ParentRunner.runChildren(ParentRunner.java:236)
	at org.junit.runners.ParentRunner.access$000(ParentRunner.java:53)
	at org.junit.runners.ParentRunner$2.evaluate(ParentRunner.java:229)
	at org.junit.runners.ParentRunner.run(ParentRunner.java:309)
	at org.apache.maven.surefire.junit4.JUnit4TestSet.execute(JUnit4TestSet.java:53)
	at org.apache.maven.surefire.junit4.JUnit4Provider.executeTestSet(JUnit4Provider.java:123)
	at org.apache.maven.surefire.junit4.JUnit4Provider.invoke(JUnit4Provider.java:104)
	at sun.reflect.NativeMethodAccessorImpl.invoke0(Native Method)
	at sun.reflect.NativeMethodAccessorImpl.invoke(NativeMethodAccessorImpl.java:39)
	at sun.reflect.DelegatingMethodAccessorImpl.invoke(DelegatingMethodAccessorImpl.java:25)
	at java.lang.reflect.Method.invoke(Method.java:597)
	at org.apache.maven.surefire.util.ReflectionUtils.invokeMethodWithArray(ReflectionUtils.java:164)
	at org.apache.maven.surefire.booter.ProviderFactory$ProviderProxy.invoke(ProviderFactory.java:110)
	at org.apache.maven.surefire.booter.SurefireStarter.invokeProvider(SurefireStarter.java:175)
	at org.apache.maven.surefire.booter.SurefireStarter.runSuitesInProcess(SurefireStarter.java:123)
	at org.eclipse.tycho.surefire.osgibooter.OsgiSurefireBooter.run(OsgiSurefireBooter.java:85)
	at org.eclipse.tycho.surefire.osgibooter.AbstractUITestApplication.runTests(AbstractUITestApplication.java:44)
	at org.eclipse.ui.internal.testing.WorkbenchTestable$1.run(WorkbenchTestable.java:71)
	at java.lang.Thread.run(Thread.java:662)
No server versions supplied
org.eclipse.emf.emfstore.internal.server.exceptions.ClientVersionOutOfDateException: No server versions supplied
	at org.eclipse.emf.emfstore.internal.server.accesscontrol.authentication.verifiers.VersionVerifier.verify(VersionVerifier.java:66)
	at org.eclipse.emf.emfstore.server.test.VersionVerifierTest.testSupplyNoVersions(VersionVerifierTest.java:50)
	at sun.reflect.NativeMethodAccessorImpl.invoke0(Native Method)
	at sun.reflect.NativeMethodAccessorImpl.invoke(NativeMethodAccessorImpl.java:39)
	at sun.reflect.DelegatingMethodAccessorImpl.invoke(DelegatingMethodAccessorImpl.java:25)
	at java.lang.reflect.Method.invoke(Method.java:597)
	at org.junit.runners.model.FrameworkMethod$1.runReflectiveCall(FrameworkMethod.java:47)
	at org.junit.internal.runners.model.ReflectiveCallable.run(ReflectiveCallable.java:12)
	at org.junit.runners.model.FrameworkMethod.invokeExplosively(FrameworkMethod.java:44)
	at org.junit.internal.runners.statements.InvokeMethod.evaluate(InvokeMethod.java:17)
	at org.junit.runners.ParentRunner.runLeaf(ParentRunner.java:271)
	at org.junit.runners.BlockJUnit4ClassRunner.runChild(BlockJUnit4ClassRunner.java:70)
	at org.junit.runners.BlockJUnit4ClassRunner.runChild(BlockJUnit4ClassRunner.java:50)
	at org.junit.runners.ParentRunner$3.run(ParentRunner.java:238)
	at org.junit.runners.ParentRunner$1.schedule(ParentRunner.java:63)
	at org.junit.runners.ParentRunner.runChildren(ParentRunner.java:236)
	at org.junit.runners.ParentRunner.access$000(ParentRunner.java:53)
	at org.junit.runners.ParentRunner$2.evaluate(ParentRunner.java:229)
	at org.junit.runners.ParentRunner.run(ParentRunner.java:309)
	at org.junit.runners.Suite.runChild(Suite.java:127)
	at org.junit.runners.Suite.runChild(Suite.java:26)
	at org.junit.runners.ParentRunner$3.run(ParentRunner.java:238)
	at org.junit.runners.ParentRunner$1.schedule(ParentRunner.java:63)
	at org.junit.runners.ParentRunner.runChildren(ParentRunner.java:236)
	at org.junit.runners.ParentRunner.access$000(ParentRunner.java:53)
	at org.junit.runners.ParentRunner$2.evaluate(ParentRunner.java:229)
	at org.junit.runners.ParentRunner.run(ParentRunner.java:309)
	at org.apache.maven.surefire.junit4.JUnit4TestSet.execute(JUnit4TestSet.java:53)
	at org.apache.maven.surefire.junit4.JUnit4Provider.executeTestSet(JUnit4Provider.java:123)
	at org.apache.maven.surefire.junit4.JUnit4Provider.invoke(JUnit4Provider.java:104)
	at sun.reflect.NativeMethodAccessorImpl.invoke0(Native Method)
	at sun.reflect.NativeMethodAccessorImpl.invoke(NativeMethodAccessorImpl.java:39)
	at sun.reflect.DelegatingMethodAccessorImpl.invoke(DelegatingMethodAccessorImpl.java:25)
	at java.lang.reflect.Method.invoke(Method.java:597)
	at org.apache.maven.surefire.util.ReflectionUtils.invokeMethodWithArray(ReflectionUtils.java:164)
	at org.apache.maven.surefire.booter.ProviderFactory$ProviderProxy.invoke(ProviderFactory.java:110)
	at org.apache.maven.surefire.booter.SurefireStarter.invokeProvider(SurefireStarter.java:175)
	at org.apache.maven.surefire.booter.SurefireStarter.runSuitesInProcess(SurefireStarter.java:123)
	at org.eclipse.tycho.surefire.osgibooter.OsgiSurefireBooter.run(OsgiSurefireBooter.java:85)
	at org.eclipse.tycho.surefire.osgibooter.AbstractUITestApplication.runTests(AbstractUITestApplication.java:44)
	at org.eclipse.ui.internal.testing.WorkbenchTestable$1.run(WorkbenchTestable.java:71)
	at java.lang.Thread.run(Thread.java:662)
Tests run: 200, Failures: 2, Errors: 0, Skipped: 0, Time elapsed: 19.866 sec <<< FAILURE!

Results :

Failed tests:   updateFromBranch(org.eclipse.emf.emfstore.server.test.BranchTests): expected:<3> but was:<2>
  updateFromBranch(org.eclipse.emf.emfstore.server.test.BranchTests): expected:<3> but was:<2>

Tests run: 200, Failures: 2, Errors: 0, Skipped: 0

[ERROR] There are test failures.

Please refer to /jobs/genie.modeling.emfstore/feature_open-close/workspace/git/tests/org.eclipse.emf.emfstore.server.test/target/surefire-reports/transactional for the individual test results.
[INFO] 
[INFO] --- maven-install-plugin:2.3.1:install (default-install) @ org.eclipse.emf.emfstore.server.test ---
[INFO] Installing /jobs/genie.modeling.emfstore/feature_open-close/workspace/git/tests/org.eclipse.emf.emfstore.server.test/target/org.eclipse.emf.emfstore.server.test-1.2.0-SNAPSHOT.jar to /home/hudson/genie.modeling.emfstore/.hudson/jobs/feature_open-close/workspace/.maven/repo/org/eclipse/emf/emfstore/org.eclipse.emf.emfstore.server.test/1.2.0-SNAPSHOT/org.eclipse.emf.emfstore.server.test-1.2.0-SNAPSHOT.jar
[INFO] Installing /jobs/genie.modeling.emfstore/feature_open-close/workspace/git/tests/org.eclipse.emf.emfstore.server.test/pom.xml to /home/hudson/genie.modeling.emfstore/.hudson/jobs/feature_open-close/workspace/.maven/repo/org/eclipse/emf/emfstore/org.eclipse.emf.emfstore.server.test/1.2.0-SNAPSHOT/org.eclipse.emf.emfstore.server.test-1.2.0-SNAPSHOT.pom
[INFO] Installing /jobs/genie.modeling.emfstore/feature_open-close/workspace/git/tests/org.eclipse.emf.emfstore.server.test/target/org.eclipse.emf.emfstore.server.test-1.2.0-SNAPSHOT-sources.jar to /home/hudson/genie.modeling.emfstore/.hudson/jobs/feature_open-close/workspace/.maven/repo/org/eclipse/emf/emfstore/org.eclipse.emf.emfstore.server.test/1.2.0-SNAPSHOT/org.eclipse.emf.emfstore.server.test-1.2.0-SNAPSHOT-sources.jar
[INFO] Installing /jobs/genie.modeling.emfstore/feature_open-close/workspace/git/tests/org.eclipse.emf.emfstore.server.test/target/p2content.xml to /home/hudson/genie.modeling.emfstore/.hudson/jobs/feature_open-close/workspace/.maven/repo/org/eclipse/emf/emfstore/org.eclipse.emf.emfstore.server.test/1.2.0-SNAPSHOT/org.eclipse.emf.emfstore.server.test-1.2.0-SNAPSHOT-p2metadata.xml
[INFO] Installing /jobs/genie.modeling.emfstore/feature_open-close/workspace/git/tests/org.eclipse.emf.emfstore.server.test/target/p2artifacts.xml to /home/hudson/genie.modeling.emfstore/.hudson/jobs/feature_open-close/workspace/.maven/repo/org/eclipse/emf/emfstore/org.eclipse.emf.emfstore.server.test/1.2.0-SNAPSHOT/org.eclipse.emf.emfstore.server.test-1.2.0-SNAPSHOT-p2artifacts.xml
[INFO] 
[INFO] --- tycho-p2-plugin:0.18.0:update-local-index (default-update-local-index) @ org.eclipse.emf.emfstore.server.test ---
[INFO]                                                                         
[INFO] ------------------------------------------------------------------------
[INFO] Building org.eclipse.emf.emfstore.test.feature 1.2.0-SNAPSHOT
[INFO] ------------------------------------------------------------------------
[INFO] 
[INFO] --- maven-clean-plugin:2.4.1:clean (default-clean) @ org.eclipse.emf.emfstore.test.feature ---
[INFO] Deleting /jobs/genie.modeling.emfstore/feature_open-close/workspace/git/features/org.eclipse.emf.emfstore.test.feature/target
[INFO] 
[INFO] --- tycho-packaging-plugin:0.18.0:build-qualifier-aggregator (default-build-qualifier-aggregator) @ org.eclipse.emf.emfstore.test.feature ---
[INFO] 
[INFO] --- tycho-packaging-plugin:0.18.0:validate-id (default-validate-id) @ org.eclipse.emf.emfstore.test.feature ---
[INFO] 
[INFO] --- tycho-packaging-plugin:0.18.0:validate-version (default-validate-version) @ org.eclipse.emf.emfstore.test.feature ---
[INFO] 
[INFO] --- jacoco-maven-plugin:0.6.2.201302030002:prepare-agent (jacoco-initialize) @ org.eclipse.emf.emfstore.test.feature ---
[INFO] argLine set to -javaagent:/home/hudson/genie.modeling.emfstore/.hudson/jobs/feature_open-close/workspace/.maven/repo/org/jacoco/org.jacoco.agent/0.6.2.201302030002/org.jacoco.agent-0.6.2.201302030002-runtime.jar=destfile=/jobs/genie.modeling.emfstore/feature_open-close/workspace/git/tests/coverage/jacoco.exec,append=true
[INFO] 
[INFO] --- maven-checkstyle-plugin:2.10:check (checkstyle) @ org.eclipse.emf.emfstore.test.feature ---
[INFO] 
[INFO] --- tycho-source-plugin:0.18.0:plugin-source (plugin-source) @ org.eclipse.emf.emfstore.test.feature ---
[INFO] 
[INFO] --- tycho-packaging-plugin:0.18.0:package-feature (default-package-feature) @ org.eclipse.emf.emfstore.test.feature ---
[INFO] Building jar: /jobs/genie.modeling.emfstore/feature_open-close/workspace/git/features/org.eclipse.emf.emfstore.test.feature/target/org.eclipse.emf.emfstore.test.feature-1.2.0-SNAPSHOT.jar
[INFO] 
[INFO] --- tycho-p2-plugin:0.18.0:p2-metadata-default (default-p2-metadata-default) @ org.eclipse.emf.emfstore.test.feature ---
[INFO] 
[INFO] --- tycho-p2-plugin:0.18.0:feature-p2-metadata (default-feature-p2-metadata) @ org.eclipse.emf.emfstore.test.feature ---
[INFO] 
[INFO] --- eclipse-jarsigner-plugin:1.0.5:sign (sign) @ org.eclipse.emf.emfstore.test.feature ---
[INFO] Searching org.eclipse.emf.emfstore.test.feature-1.2.0-SNAPSHOT.jar for inner jars...
[INFO] Signed org.eclipse.emf.emfstore:org.eclipse.emf.emfstore.test.feature:eclipse-feature:1.2.0-SNAPSHOT in 1 seconds.
[INFO] 
[INFO] --- tycho-source-feature-plugin:0.18.0:source-feature (source-feature) @ org.eclipse.emf.emfstore.test.feature ---
[INFO] Building jar: /jobs/genie.modeling.emfstore/feature_open-close/workspace/git/features/org.eclipse.emf.emfstore.test.feature/target/org.eclipse.emf.emfstore.test.feature-sources-feature.jar
[INFO] 
[INFO] --- tycho-p2-plugin:0.18.0:p2-metadata (attach-p2-metadata) @ org.eclipse.emf.emfstore.test.feature ---
[INFO] 
[INFO] --- tycho-p2-plugin:0.18.0:p2-metadata (attached-p2-metadata) @ org.eclipse.emf.emfstore.test.feature ---
[WARNING] Artifact org.eclipse.emf.emfstore:org.eclipse.emf.emfstore.test.feature:xml:p2metadata:1.2.0-SNAPSHOT already attached to project, ignoring duplicate
[WARNING] Artifact org.eclipse.emf.emfstore:org.eclipse.emf.emfstore.test.feature:xml:p2artifacts:1.2.0-SNAPSHOT already attached to project, ignoring duplicate
[INFO] 
[INFO] --- maven-install-plugin:2.3.1:install (default-install) @ org.eclipse.emf.emfstore.test.feature ---
[INFO] Installing /jobs/genie.modeling.emfstore/feature_open-close/workspace/git/features/org.eclipse.emf.emfstore.test.feature/target/org.eclipse.emf.emfstore.test.feature-1.2.0-SNAPSHOT.jar to /home/hudson/genie.modeling.emfstore/.hudson/jobs/feature_open-close/workspace/.maven/repo/org/eclipse/emf/emfstore/org.eclipse.emf.emfstore.test.feature/1.2.0-SNAPSHOT/org.eclipse.emf.emfstore.test.feature-1.2.0-SNAPSHOT.jar
[INFO] Installing /jobs/genie.modeling.emfstore/feature_open-close/workspace/git/features/org.eclipse.emf.emfstore.test.feature/pom.xml to /home/hudson/genie.modeling.emfstore/.hudson/jobs/feature_open-close/workspace/.maven/repo/org/eclipse/emf/emfstore/org.eclipse.emf.emfstore.test.feature/1.2.0-SNAPSHOT/org.eclipse.emf.emfstore.test.feature-1.2.0-SNAPSHOT.pom
[INFO] Installing /jobs/genie.modeling.emfstore/feature_open-close/workspace/git/features/org.eclipse.emf.emfstore.test.feature/target/org.eclipse.emf.emfstore.test.feature-sources-feature.jar to /home/hudson/genie.modeling.emfstore/.hudson/jobs/feature_open-close/workspace/.maven/repo/org/eclipse/emf/emfstore/org.eclipse.emf.emfstore.test.feature/1.2.0-SNAPSHOT/org.eclipse.emf.emfstore.test.feature-1.2.0-SNAPSHOT-sources-feature.jar
[INFO] Installing /jobs/genie.modeling.emfstore/feature_open-close/workspace/git/features/org.eclipse.emf.emfstore.test.feature/target/p2content.xml to /home/hudson/genie.modeling.emfstore/.hudson/jobs/feature_open-close/workspace/.maven/repo/org/eclipse/emf/emfstore/org.eclipse.emf.emfstore.test.feature/1.2.0-SNAPSHOT/org.eclipse.emf.emfstore.test.feature-1.2.0-SNAPSHOT-p2metadata.xml
[INFO] Installing /jobs/genie.modeling.emfstore/feature_open-close/workspace/git/features/org.eclipse.emf.emfstore.test.feature/target/p2artifacts.xml to /home/hudson/genie.modeling.emfstore/.hudson/jobs/feature_open-close/workspace/.maven/repo/org/eclipse/emf/emfstore/org.eclipse.emf.emfstore.test.feature/1.2.0-SNAPSHOT/org.eclipse.emf.emfstore.test.feature-1.2.0-SNAPSHOT-p2artifacts.xml
[INFO] 
[INFO] --- tycho-p2-plugin:0.18.0:update-local-index (default-update-local-index) @ org.eclipse.emf.emfstore.test.feature ---
[INFO]                                                                         
[INFO] ------------------------------------------------------------------------
[INFO] Building org.eclipse.emf.emfstore.client.test.ui 1.2.0-SNAPSHOT
[INFO] ------------------------------------------------------------------------
[INFO] 
[INFO] --- maven-clean-plugin:2.4.1:clean (default-clean) @ org.eclipse.emf.emfstore.client.test.ui ---
[INFO] 
[INFO] --- tycho-packaging-plugin:0.18.0:build-qualifier (default-build-qualifier) @ org.eclipse.emf.emfstore.client.test.ui ---
[INFO] 
[INFO] --- tycho-packaging-plugin:0.18.0:validate-id (default-validate-id) @ org.eclipse.emf.emfstore.client.test.ui ---
[INFO] 
[INFO] --- tycho-packaging-plugin:0.18.0:validate-version (default-validate-version) @ org.eclipse.emf.emfstore.client.test.ui ---
[INFO] 
[INFO] --- jacoco-maven-plugin:0.6.2.201302030002:prepare-agent (jacoco-initialize) @ org.eclipse.emf.emfstore.client.test.ui ---
[INFO] tycho.testArgLine set to -javaagent:/home/hudson/genie.modeling.emfstore/.hudson/jobs/feature_open-close/workspace/.maven/repo/org/jacoco/org.jacoco.agent/0.6.2.201302030002/org.jacoco.agent-0.6.2.201302030002-runtime.jar=destfile=/jobs/genie.modeling.emfstore/feature_open-close/workspace/git/tests/coverage/jacoco.exec,append=true
[INFO] 
[INFO] --- maven-resources-plugin:2.4.3:resources (default-resources) @ org.eclipse.emf.emfstore.client.test.ui ---
[INFO] Using 'UTF-8' encoding to copy filtered resources.
[INFO] skip non existing resourceDirectory /jobs/genie.modeling.emfstore/feature_open-close/workspace/git/tests/org.eclipse.emf.emfstore.client.test.ui/src/main/resources
[INFO] 
[INFO] --- tycho-compiler-plugin:0.18.0:compile (default-compile) @ org.eclipse.emf.emfstore.client.test.ui ---
[INFO] Compiling 25 source files to /jobs/genie.modeling.emfstore/feature_open-close/workspace/git/tests/org.eclipse.emf.emfstore.client.test.ui/bin
[INFO] 
[INFO] --- maven-checkstyle-plugin:2.10:check (checkstyle) @ org.eclipse.emf.emfstore.client.test.ui ---
[INFO] 
[INFO] --- maven-resources-plugin:2.4.3:testResources (default-testResources) @ org.eclipse.emf.emfstore.client.test.ui ---
[INFO] Using 'UTF-8' encoding to copy filtered resources.
[INFO] skip non existing resourceDirectory /jobs/genie.modeling.emfstore/feature_open-close/workspace/git/tests/org.eclipse.emf.emfstore.client.test.ui/src/test/resources
[INFO] 
[INFO] --- tycho-source-plugin:0.18.0:plugin-source (plugin-source) @ org.eclipse.emf.emfstore.client.test.ui ---
[INFO] Building jar: /jobs/genie.modeling.emfstore/feature_open-close/workspace/git/tests/org.eclipse.emf.emfstore.client.test.ui/target/org.eclipse.emf.emfstore.client.test.ui-1.2.0-SNAPSHOT-sources.jar
[INFO] 
[INFO] --- tycho-packaging-plugin:0.18.0:package-plugin (default-package-plugin) @ org.eclipse.emf.emfstore.client.test.ui ---
[INFO] Building jar: /jobs/genie.modeling.emfstore/feature_open-close/workspace/git/tests/org.eclipse.emf.emfstore.client.test.ui/target/org.eclipse.emf.emfstore.client.test.ui-1.2.0-SNAPSHOT.jar
[INFO] 
[INFO] --- tycho-p2-plugin:0.18.0:p2-metadata-default (default-p2-metadata-default) @ org.eclipse.emf.emfstore.client.test.ui ---
[INFO] 
[INFO] --- tycho-surefire-plugin:0.18.0:test (default-test) @ org.eclipse.emf.emfstore.client.test.ui ---
[INFO] Expected eclipse log file: /jobs/genie.modeling.emfstore/feature_open-close/workspace/git/tests/org.eclipse.emf.emfstore.client.test.ui/target/work/data/.metadata/.log
[INFO] Command line:
	/bin/sh -c cd /jobs/genie.modeling.emfstore/feature_open-close/workspace/git/tests/org.eclipse.emf.emfstore.client.test.ui && /opt/public/common/jdk1.6.0_45/jre/bin/java -Dosgi.noShutdown=false -Dosgi.os=linux -Dosgi.ws=gtk -Dosgi.arch=x86_64 -javaagent:/home/hudson/genie.modeling.emfstore/.hudson/jobs/feature_open-close/workspace/.maven/repo/org/jacoco/org.jacoco.agent/0.6.2.201302030002/org.jacoco.agent-0.6.2.201302030002-runtime.jar=destfile=/jobs/genie.modeling.emfstore/feature_open-close/workspace/git/tests/coverage/jacoco.exec,append=true -Dorg.eclipse.swtbot.search.timeout=30000 -Dosgi.requiredJavaVersion=1.5 -Xms40m -Xmx512m -jar /jobs/genie.modeling.emfstore/feature_open-close/workspace/.maven/repo/p2/osgi/bundle/org.eclipse.equinox.launcher/1.3.0.v20120522-1813/org.eclipse.equinox.launcher-1.3.0.v20120522-1813.jar -data /jobs/genie.modeling.emfstore/feature_open-close/workspace/git/tests/org.eclipse.emf.emfstore.client.test.ui/target/work/data -install /jobs/genie.modeling.emfstore/feature_open-close/workspace/git/tests/org.eclipse.emf.emfstore.client.test.ui/target/work -configuration /jobs/genie.modeling.emfstore/feature_open-close/workspace/git/tests/org.eclipse.emf.emfstore.client.test.ui/target/work/configuration -application org.eclipse.tycho.surefire.osgibooter.uitest -testproperties /jobs/genie.modeling.emfstore/feature_open-close/workspace/git/tests/org.eclipse.emf.emfstore.client.test.ui/target/surefire.properties -nouithread
Xlib:  extension "RANDR" missing on display ":538.0".

-------------------------------------------------------
 T E S T S
-------------------------------------------------------
Running org.eclipse.emf.emfstore.client.test.ui.AllUITests
log4j:WARN No appenders could be found for logger (org.eclipse.swtbot.swt.finder.matchers.AbstractMatcher).
log4j:WARN Please initialize the log4j system properly.
Tests run: 19, Failures: 0, Errors: 0, Skipped: 0, Time elapsed: 39.904 sec

Results :

Tests run: 19, Failures: 0, Errors: 0, Skipped: 0

[INFO] All tests passed!
[INFO] 
[INFO] --- tycho-surefire-plugin:0.18.0:test (TransactionalEditingDomainTests) @ org.eclipse.emf.emfstore.client.test.ui ---
[INFO] Expected eclipse log file: /jobs/genie.modeling.emfstore/feature_open-close/workspace/git/tests/org.eclipse.emf.emfstore.client.test.ui/target/work/data/.metadata/.log
[INFO] Command line:
	/bin/sh -c cd /jobs/genie.modeling.emfstore/feature_open-close/workspace/git/tests/org.eclipse.emf.emfstore.client.test.ui && /opt/public/common/jdk1.6.0_45/jre/bin/java -Dosgi.noShutdown=false -Dosgi.os=linux -Dosgi.ws=gtk -Dosgi.arch=x86_64 -javaagent:/home/hudson/genie.modeling.emfstore/.hudson/jobs/feature_open-close/workspace/.maven/repo/org/jacoco/org.jacoco.agent/0.6.2.201302030002/org.jacoco.agent-0.6.2.201302030002-runtime.jar=destfile=/jobs/genie.modeling.emfstore/feature_open-close/workspace/git/tests/coverage/jacoco.exec,append=true -Dorg.eclipse.swtbot.search.timeout=30000 -Dosgi.requiredJavaVersion=1.5 -Xms40m -Xmx512m -jar /jobs/genie.modeling.emfstore/feature_open-close/workspace/.maven/repo/p2/osgi/bundle/org.eclipse.equinox.launcher/1.3.0.v20120522-1813/org.eclipse.equinox.launcher-1.3.0.v20120522-1813.jar -data /jobs/genie.modeling.emfstore/feature_open-close/workspace/git/tests/org.eclipse.emf.emfstore.client.test.ui/target/work/data -install /jobs/genie.modeling.emfstore/feature_open-close/workspace/git/tests/org.eclipse.emf.emfstore.client.test.ui/target/work -configuration /jobs/genie.modeling.emfstore/feature_open-close/workspace/git/tests/org.eclipse.emf.emfstore.client.test.ui/target/work/configuration -application org.eclipse.tycho.surefire.osgibooter.uitest -testproperties /jobs/genie.modeling.emfstore/feature_open-close/workspace/git/tests/org.eclipse.emf.emfstore.client.test.ui/target/surefire.properties -nouithread
Xlib:  extension "RANDR" missing on display ":538.0".

-------------------------------------------------------
 T E S T S
-------------------------------------------------------
Running org.eclipse.emf.emfstore.client.test.ui.AllUITests
log4j:WARN No appenders could be found for logger (org.eclipse.swtbot.swt.finder.matchers.AbstractMatcher).
log4j:WARN Please initialize the log4j system properly.
Tests run: 19, Failures: 1, Errors: 0, Skipped: 0, Time elapsed: 44.012 sec <<< FAILURE!

Results :

Failed tests:   testController(org.eclipse.emf.emfstore.client.test.ui.controllers.UIRevertCommitControllerTest2): expected:<2> but was:<1>

Tests run: 19, Failures: 1, Errors: 0, Skipped: 0

[ERROR] There are test failures.

Please refer to /jobs/genie.modeling.emfstore/feature_open-close/workspace/git/tests/org.eclipse.emf.emfstore.client.test.ui/target/surefire-reports for the individual test results.
[INFO] 
[INFO] --- maven-install-plugin:2.3.1:install (default-install) @ org.eclipse.emf.emfstore.client.test.ui ---
[INFO] Installing /jobs/genie.modeling.emfstore/feature_open-close/workspace/git/tests/org.eclipse.emf.emfstore.client.test.ui/target/org.eclipse.emf.emfstore.client.test.ui-1.2.0-SNAPSHOT.jar to /home/hudson/genie.modeling.emfstore/.hudson/jobs/feature_open-close/workspace/.maven/repo/org/eclipse/emf/emfstore/org.eclipse.emf.emfstore.client.test.ui/1.2.0-SNAPSHOT/org.eclipse.emf.emfstore.client.test.ui-1.2.0-SNAPSHOT.jar
[INFO] Installing /jobs/genie.modeling.emfstore/feature_open-close/workspace/git/tests/org.eclipse.emf.emfstore.client.test.ui/pom.xml to /home/hudson/genie.modeling.emfstore/.hudson/jobs/feature_open-close/workspace/.maven/repo/org/eclipse/emf/emfstore/org.eclipse.emf.emfstore.client.test.ui/1.2.0-SNAPSHOT/org.eclipse.emf.emfstore.client.test.ui-1.2.0-SNAPSHOT.pom
[INFO] Installing /jobs/genie.modeling.emfstore/feature_open-close/workspace/git/tests/org.eclipse.emf.emfstore.client.test.ui/target/org.eclipse.emf.emfstore.client.test.ui-1.2.0-SNAPSHOT-sources.jar to /home/hudson/genie.modeling.emfstore/.hudson/jobs/feature_open-close/workspace/.maven/repo/org/eclipse/emf/emfstore/org.eclipse.emf.emfstore.client.test.ui/1.2.0-SNAPSHOT/org.eclipse.emf.emfstore.client.test.ui-1.2.0-SNAPSHOT-sources.jar
[INFO] Installing /jobs/genie.modeling.emfstore/feature_open-close/workspace/git/tests/org.eclipse.emf.emfstore.client.test.ui/target/p2content.xml to /home/hudson/genie.modeling.emfstore/.hudson/jobs/feature_open-close/workspace/.maven/repo/org/eclipse/emf/emfstore/org.eclipse.emf.emfstore.client.test.ui/1.2.0-SNAPSHOT/org.eclipse.emf.emfstore.client.test.ui-1.2.0-SNAPSHOT-p2metadata.xml
[INFO] Installing /jobs/genie.modeling.emfstore/feature_open-close/workspace/git/tests/org.eclipse.emf.emfstore.client.test.ui/target/p2artifacts.xml to /home/hudson/genie.modeling.emfstore/.hudson/jobs/feature_open-close/workspace/.maven/repo/org/eclipse/emf/emfstore/org.eclipse.emf.emfstore.client.test.ui/1.2.0-SNAPSHOT/org.eclipse.emf.emfstore.client.test.ui-1.2.0-SNAPSHOT-p2artifacts.xml
[INFO] 
[INFO] --- tycho-p2-plugin:0.18.0:update-local-index (default-update-local-index) @ org.eclipse.emf.emfstore.client.test.ui ---
[INFO] ------------------------------------------------------------------------
[INFO] Reactor Summary:
[INFO] 
[INFO] emfstore-parent ................................... SUCCESS [50.731s]
[INFO] emfstore .......................................... SUCCESS [0.158s]
[INFO] emfstore-bundles-parent ........................... SUCCESS [10.506s]
[INFO] org.eclipse.emf.emfstore.common ................... SUCCESS [18.915s]
[INFO] org.eclipse.emf.emfstore.common.model ............. SUCCESS [6.765s]
[INFO] org.eclipse.emf.emfstore.migration ................ SUCCESS [4.325s]
[INFO] org.eclipse.emf.emfstore.server.model ............. SUCCESS [10.323s]
[INFO] org.eclipse.emf.emfstore.server ................... SUCCESS [17.551s]
[INFO] org.eclipse.emf.emfstore.client ................... SUCCESS [9.237s]
[INFO] emfstore-features-parent .......................... SUCCESS [0.050s]
[INFO] org.eclipse.emf.emfstore.client.feature ........... SUCCESS [2.049s]
[INFO] org.eclipse.emf.emfstore.common.model.edit ........ SUCCESS [4.438s]
[INFO] org.eclipse.emf.emfstore.server.model.edit ........ SUCCESS [8.302s]
[INFO] org.eclipse.emf.emfstore.client.model.edit ........ SUCCESS [4.981s]
[INFO] org.eclipse.emf.emfstore.client.transaction ....... SUCCESS [4.142s]
[INFO] org.eclipse.emf.emfstore.client.transaction.feature  SUCCESS [2.175s]
[INFO] org.eclipse.emf.emfstore.client.ui ................ SUCCESS [17.514s]
[INFO] org.eclipse.emf.emfstore.client.ui.feature ........ SUCCESS [2.258s]
[INFO] org.eclipse.emf.emfstore.client.ui.historybrowsercomparator  SUCCESS [4.374s]
[INFO] org.eclipse.emf.emfstore.client.ui.historybrowsercomparator.feature  SUCCESS [2.218s]
[INFO] org.eclipse.emf.emfstore.common.feature ........... SUCCESS [2.025s]
[INFO] org.eclipse.emf.emfstore.ecore .................... SUCCESS [4.372s]
[INFO] org.eclipse.emf.emfstore.ecore.feature ............ SUCCESS [2.008s]
[INFO] org.eclipse.emf.emfstore.examplemodel ............. SUCCESS [5.350s]
[INFO] org.eclipse.emf.emfstore.examplemodel.edit ........ SUCCESS [6.952s]
[INFO] org.eclipse.emf.emfstore.example.installer ........ SUCCESS [2.770s]
[INFO] org.eclipse.emf.emfstore.example.feature .......... SUCCESS [2.100s]
[INFO] org.eclipse.emf.emfstore.modelmutator ............. SUCCESS [5.450s]
[INFO] org.eclipse.emf.emfstore.modelmutator.feature ..... SUCCESS [1.901s]
[INFO] org.eclipse.emf.emfstore.mongodb .................. SUCCESS [4.474s]
[INFO] org.eclipse.emf.emfstore.mongodb.client ........... SUCCESS [4.346s]
[INFO] org.eclipse.emf.emfstore.mongodb.client.feature ... SUCCESS [1.780s]
[INFO] org.eclipse.emf.emfstore.mongodb.server ........... SUCCESS [4.389s]
[INFO] org.eclipse.emf.emfstore.mongodb.server.feature ... SUCCESS [1.762s]
[INFO] org.eclipse.emf.emfstore.server.feature ........... SUCCESS [1.869s]
[INFO] org.eclipse.emf.emfstore.sdk.feature .............. SUCCESS [1.702s]
[INFO] org.eclipse.emf.emfstore.p2repository ............. SUCCESS [17.947s]
[INFO] org.eclipse.emf.emfstore.products ................. SUCCESS [17.775s]
[INFO] org.eclipse.emf.emfstore.example.helloworld ....... SUCCESS [4.750s]
[INFO] org.eclipse.emf.emfstore.example.merging .......... SUCCESS [4.223s]
[INFO] org.eclipse.emf.emfstore.fuzzy .................... SUCCESS [4.419s]
[INFO] emfstore-tests-parent ............................. SUCCESS [0.058s]
[INFO] org.eclipse.emf.emfstore.test.model ............... SUCCESS [0.274s]
[INFO] org.eclipse.emf.emfstore.test.model.edit .......... SUCCESS [0.223s]
[INFO] org.eclipse.emf.emfstore.test.common .............. SUCCESS [0.384s]
[INFO] org.eclipse.emf.emfstore.client.test .............. SUCCESS [0.377s]
[INFO] org.eclipse.emf.emfstore.fuzzy.emf ................ SUCCESS [22.070s]
[INFO] org.eclipse.emf.emfstore.fuzzy.emf.edit ........... SUCCESS [5.554s]
[INFO] org.eclipse.emf.emfstore.fuzzy.emf.editor ......... SUCCESS [5.488s]
[INFO] org.eclipse.emf.emfstore.fuzzy.emf.example ........ SUCCESS [3.874s]
[INFO] org.eclipse.emf.emfstore.fuzzy.feature ............ SUCCESS [1.865s]
[INFO] org.eclipse.emf.emfstore.fuzzy.emf.test ........... SUCCESS [0.284s]
[INFO] org.eclipse.emf.emfstore.fuzzy.test.feature ....... SUCCESS [1.820s]
[INFO] org.eclipse.emf.emfstore.client.api.test .......... SUCCESS [31.971s]
[INFO] org.eclipse.emf.emfstore.client.changetracking.test  SUCCESS [25.397s]
[INFO] org.eclipse.emf.emfstore.client.conflictdetection.test  SUCCESS [20.608s]
[INFO] org.eclipse.emf.emfstore.client.recording.test .... SUCCESS [23.450s]
[INFO] org.eclipse.emf.emfstore.server.test .............. SUCCESS [55.504s]
[INFO] org.eclipse.emf.emfstore.test.feature ............. SUCCESS [1.758s]
[INFO] org.eclipse.emf.emfstore.client.test.ui ........... SUCCESS [1:46.625s]
[INFO] ------------------------------------------------------------------------
[INFO] BUILD SUCCESS
[INFO] ------------------------------------------------------------------------
[INFO] Total time: 13:16.591s
[INFO] Finished at: Thu Apr 17 00:19:56 EDT 2014
[INFO] Final Memory: 125M/376M
[INFO] ------------------------------------------------------------------------
[DEBUG] Closing connection to remote
[DEBUG] Waiting for process to finish
[DEBUG] Result: 0
Terminating xvnc.
[CHECKSTYLE] Collecting checkstyle analysis files...
[CHECKSTYLE] Finding all files that match the pattern **/checkstyle-result.xml
[CHECKSTYLE] Computing warning deltas based on reference build #38
Archiving artifacts
Recording test results
Sending e-mails to: jfaltermeier@eclipsesource.com
Finished: UNSTABLE